lucene-dev mailing list archives

Site index · List index
Message view « Date » · « Thread »
Top « Date » · « Thread »
From Policeman Jenkins Server <jenk...@sd-datasolutions.de>
Subject [JENKINS] Lucene-Solr-trunk-Linux (32bit/jdk1.8.0-ea-b49) - Build # 163 - Failure!
Date Sat, 04 Aug 2012 09:52:54 GMT
Build: http://jenkins.sd-datasolutions.de/job/Lucene-Solr-trunk-Linux/163/
Java: 32bit/jdk1.8.0-ea-b49 -server -XX:+UseConcMarkSweepGC

1 tests failed.
REGRESSION:  org.apache.solr.handler.component.DistributedQueryElevationComponentTest.testDistribSearch

Error Message:
.responseHeader.params.size()==9,9skipped=5,4

Stack Trace:
junit.framework.AssertionFailedError: .responseHeader.params.size()==9,9skipped=5,4
	at __randomizedtesting.SeedInfo.seed([4014CE423B109F4F:C1F2405A4C4FFF73]:0)
	at junit.framework.Assert.fail(Assert.java:50)
	at org.apache.solr.BaseDistributedSearchTestCase.compareResponses(BaseDistributedSearchTestCase.java:670)
	at org.apache.solr.BaseDistributedSearchTestCase.query(BaseDistributedSearchTestCase.java:392)
	at org.apache.solr.handler.component.DistributedQueryElevationComponentTest.doTest(DistributedQueryElevationComponentTest.java:81)
	at org.apache.solr.BaseDistributedSearchTestCase.testDistribSearch(BaseDistributedSearchTestCase.java:679)
	at sun.reflect.NativeMethodAccessorImpl.invoke0(Native Method)
	at sun.reflect.NativeMethodAccessorImpl.invoke(NativeMethodAccessorImpl.java:57)
	at sun.reflect.DelegatingMethodAccessorImpl.invoke(DelegatingMethodAccessorImpl.java:43)
	at java.lang.reflect.Method.invoke(Method.java:474)
	at com.carrotsearch.randomizedtesting.RandomizedRunner.invoke(RandomizedRunner.java:1995)
	at com.carrotsearch.randomizedtesting.RandomizedRunner.access$1100(RandomizedRunner.java:132)
	at com.carrotsearch.randomizedtesting.RandomizedRunner$6.evaluate(RandomizedRunner.java:818)
	at com.carrotsearch.randomizedtesting.RandomizedRunner$7.evaluate(RandomizedRunner.java:877)
	at com.carrotsearch.randomizedtesting.RandomizedRunner$8.evaluate(RandomizedRunner.java:891)
	at com.carrotsearch.randomizedtesting.rules.SystemPropertiesRestoreRule$1.evaluate(SystemPropertiesRestoreRule.java:53)
	at org.apache.lucene.util.TestRuleSetupTeardownChained$1.evaluate(TestRuleSetupTeardownChained.java:50)
	at org.apache.lucene.util.TestRuleFieldCacheSanity$1.evaluate(TestRuleFieldCacheSanity.java:32)
	at org.apache.lucene.util.AbstractBeforeAfterRule$1.evaluate(AbstractBeforeAfterRule.java:45)
	at com.carrotsearch.randomizedtesting.rules.SystemPropertiesInvariantRule$1.evaluate(SystemPropertiesInvariantRule.java:55)
	at org.apache.lucene.util.TestRuleReportUncaughtExceptions$1.evaluate(TestRuleReportUncaughtExceptions.java:68)
	at org.apache.lucene.util.TestRuleThreadAndTestName$1.evaluate(TestRuleThreadAndTestName.java:48)
	at org.apache.lucene.util.TestRuleIgnoreAfterMaxFailures$1.evaluate(TestRuleIgnoreAfterMaxFailures.java:70)
	at org.apache.lucene.util.TestRuleMarkFailure$1.evaluate(TestRuleMarkFailure.java:48)
	at com.carrotsearch.randomizedtesting.RandomizedRunner.runSingleTest(RandomizedRunner.java:825)
	at com.carrotsearch.randomizedtesting.RandomizedRunner.access$700(RandomizedRunner.java:132)
	at com.carrotsearch.randomizedtesting.RandomizedRunner$3$1.run(RandomizedRunner.java:671)
	at com.carrotsearch.randomizedtesting.RandomizedRunner$3.evaluate(RandomizedRunner.java:697)
	at com.carrotsearch.randomizedtesting.RandomizedRunner$4.evaluate(RandomizedRunner.java:736)
	at com.carrotsearch.randomizedtesting.RandomizedRunner$5.evaluate(RandomizedRunner.java:747)
	at com.carrotsearch.randomizedtesting.rules.SystemPropertiesRestoreRule$1.evaluate(SystemPropertiesRestoreRule.java:53)
	at org.apache.lucene.util.AbstractBeforeAfterRule$1.evaluate(AbstractBeforeAfterRule.java:45)
	at org.apache.lucene.util.TestRuleReportUncaughtExceptions$1.evaluate(TestRuleReportUncaughtExceptions.java:68)
	at org.apache.lucene.util.TestRuleStoreClassName$1.evaluate(TestRuleStoreClassName.java:38)
	at com.carrotsearch.randomizedtesting.rules.SystemPropertiesInvariantRule$1.evaluate(SystemPropertiesInvariantRule.java:55)
	at org.apache.lucene.util.TestRuleNoInstanceHooksOverrides$1.evaluate(TestRuleNoInstanceHooksOverrides.java:53)
	at org.apache.lucene.util.TestRuleNoStaticHooksShadowing$1.evaluate(TestRuleNoStaticHooksShadowing.java:52)
	at org.apache.lucene.util.TestRuleAssertionsRequired$1.evaluate(TestRuleAssertionsRequired.java:36)
	at org.apache.lucene.util.TestRuleMarkFailure$1.evaluate(TestRuleMarkFailure.java:48)
	at org.apache.lucene.util.TestRuleIgnoreAfterMaxFailures$1.evaluate(TestRuleIgnoreAfterMaxFailures.java:70)
	at org.apache.lucene.util.TestRuleIgnoreTestSuites$1.evaluate(TestRuleIgnoreTestSuites.java:55)
	at com.carrotsearch.randomizedtesting.RandomizedRunner.runSuite(RandomizedRunner.java:605)
	at com.carrotsearch.randomizedtesting.RandomizedRunner.access$400(RandomizedRunner.java:132)
	at com.carrotsearch.randomizedtesting.RandomizedRunner$2.run(RandomizedRunner.java:551)




Build Log:
[...truncated 7203 lines...]
[junit4:junit4] Suite: org.apache.solr.handler.component.DistributedQueryElevationComponentTest
[junit4:junit4] FAILURE 1.95s J1 | DistributedQueryElevationComponentTest.testDistribSearch
[junit4:junit4]    > Throwable #1: junit.framework.AssertionFailedError: .responseHeader.params.size()==9,9skipped=5,4
[junit4:junit4]    > 	at __randomizedtesting.SeedInfo.seed([4014CE423B109F4F:C1F2405A4C4FFF73]:0)
[junit4:junit4]    > 	at junit.framework.Assert.fail(Assert.java:50)
[junit4:junit4]    > 	at org.apache.solr.BaseDistributedSearchTestCase.compareResponses(BaseDistributedSearchTestCase.java:670)
[junit4:junit4]    > 	at org.apache.solr.BaseDistributedSearchTestCase.query(BaseDistributedSearchTestCase.java:392)
[junit4:junit4]    > 	at org.apache.solr.handler.component.DistributedQueryElevationComponentTest.doTest(DistributedQueryElevationComponentTest.java:81)
[junit4:junit4]    > 	at org.apache.solr.BaseDistributedSearchTestCase.testDistribSearch(BaseDistributedSearchTestCase.java:679)
[junit4:junit4]    > 	at sun.reflect.NativeMethodAccessorImpl.invoke0(Native Method)
[junit4:junit4]    > 	at sun.reflect.NativeMethodAccessorImpl.invoke(NativeMethodAccessorImpl.java:57)
[junit4:junit4]    > 	at sun.reflect.DelegatingMethodAccessorImpl.invoke(DelegatingMethodAccessorImpl.java:43)
[junit4:junit4]    > 	at java.lang.reflect.Method.invoke(Method.java:474)
[junit4:junit4]    > 	at com.carrotsearch.randomizedtesting.RandomizedRunner.invoke(RandomizedRunner.java:1995)
[junit4:junit4]    > 	at com.carrotsearch.randomizedtesting.RandomizedRunner.access$1100(RandomizedRunner.java:132)
[junit4:junit4]    > 	at com.carrotsearch.randomizedtesting.RandomizedRunner$6.evaluate(RandomizedRunner.java:818)
[junit4:junit4]    > 	at com.carrotsearch.randomizedtesting.RandomizedRunner$7.evaluate(RandomizedRunner.java:877)
[junit4:junit4]    > 	at com.carrotsearch.randomizedtesting.RandomizedRunner$8.evaluate(RandomizedRunner.java:891)
[junit4:junit4]    > 	at com.carrotsearch.randomizedtesting.rules.SystemPropertiesRestoreRule$1.evaluate(SystemPropertiesRestoreRule.java:53)
[junit4:junit4]    > 	at org.apache.lucene.util.TestRuleSetupTeardownChained$1.evaluate(TestRuleSetupTeardownChained.java:50)
[junit4:junit4]    > 	at org.apache.lucene.util.TestRuleFieldCacheSanity$1.evaluate(TestRuleFieldCacheSanity.java:32)
[junit4:junit4]    > 	at org.apache.lucene.util.AbstractBeforeAfterRule$1.evaluate(AbstractBeforeAfterRule.java:45)
[junit4:junit4]    > 	at com.carrotsearch.randomizedtesting.rules.SystemPropertiesInvariantRule$1.evaluate(SystemPropertiesInvariantRule.java:55)
[junit4:junit4]    > 	at org.apache.lucene.util.TestRuleReportUncaughtExceptions$1.evaluate(TestRuleReportUncaughtExceptions.java:68)
[junit4:junit4]    > 	at org.apache.lucene.util.TestRuleThreadAndTestName$1.evaluate(TestRuleThreadAndTestName.java:48)
[junit4:junit4]    > 	at org.apache.lucene.util.TestRuleIgnoreAfterMaxFailures$1.evaluate(TestRuleIgnoreAfterMaxFailures.java:70)
[junit4:junit4]    > 	at org.apache.lucene.util.TestRuleMarkFailure$1.evaluate(TestRuleMarkFailure.java:48)
[junit4:junit4]    > 	at com.carrotsearch.randomizedtesting.RandomizedRunner.runSingleTest(RandomizedRunner.java:825)
[junit4:junit4]    > 	at com.carrotsearch.randomizedtesting.RandomizedRunner.access$700(RandomizedRunner.java:132)
[junit4:junit4]    > 	at com.carrotsearch.randomizedtesting.RandomizedRunner$3$1.run(RandomizedRunner.java:671)
[junit4:junit4]    > 	at com.carrotsearch.randomizedtesting.RandomizedRunner$3.evaluate(RandomizedRunner.java:697)
[junit4:junit4]    > 	at com.carrotsearch.randomizedtesting.RandomizedRunner$4.evaluate(RandomizedRunner.java:736)
[junit4:junit4]    > 	at com.carrotsearch.randomizedtesting.RandomizedRunner$5.evaluate(RandomizedRunner.java:747)
[junit4:junit4]    > 	at com.carrotsearch.randomizedtesting.rules.SystemPropertiesRestoreRule$1.evaluate(SystemPropertiesRestoreRule.java:53)
[junit4:junit4]    > 	at org.apache.lucene.util.AbstractBeforeAfterRule$1.evaluate(AbstractBeforeAfterRule.java:45)
[junit4:junit4]    > 	at org.apache.lucene.util.TestRuleReportUncaughtExceptions$1.evaluate(TestRuleReportUncaughtExceptions.java:68)
[junit4:junit4]    > 	at org.apache.lucene.util.TestRuleStoreClassName$1.evaluate(TestRuleStoreClassName.java:38)
[junit4:junit4]    > 	at com.carrotsearch.randomizedtesting.rules.SystemPropertiesInvariantRule$1.evaluate(SystemPropertiesInvariantRule.java:55)
[junit4:junit4]    > 	at org.apache.lucene.util.TestRuleNoInstanceHooksOverrides$1.evaluate(TestRuleNoInstanceHooksOverrides.java:53)
[junit4:junit4]    > 	at org.apache.lucene.util.TestRuleNoStaticHooksShadowing$1.evaluate(TestRuleNoStaticHooksShadowing.java:52)
[junit4:junit4]    > 	at org.apache.lucene.util.TestRuleAssertionsRequired$1.evaluate(TestRuleAssertionsRequired.java:36)
[junit4:junit4]    > 	at org.apache.lucene.util.TestRuleMarkFailure$1.evaluate(TestRuleMarkFailure.java:48)
[junit4:junit4]    > 	at org.apache.lucene.util.TestRuleIgnoreAfterMaxFailures$1.evaluate(TestRuleIgnoreAfterMaxFailures.java:70)
[junit4:junit4]    > 	at org.apache.lucene.util.TestRuleIgnoreTestSuites$1.evaluate(TestRuleIgnoreTestSuites.java:55)
[junit4:junit4]    > 	at com.carrotsearch.randomizedtesting.RandomizedRunner.runSuite(RandomizedRunner.java:605)
[junit4:junit4]    > 	at com.carrotsearch.randomizedtesting.RandomizedRunner.access$400(RandomizedRunner.java:132)
[junit4:junit4]    > 	at com.carrotsearch.randomizedtesting.RandomizedRunner$2.run(RandomizedRunner.java:551)
[junit4:junit4]    > 
[junit4:junit4]   2> 2 T201 oas.SolrTestCaseJ4.setUp ###Starting testDistribSearch
[junit4:junit4]   2> 67 T201 oejs.Server.doStart jetty-8.1.2.v20120308
[junit4:junit4]   2> 121 T201 oejs.AbstractConnector.doStart Started SocketConnector@0.0.0.0:60204
[junit4:junit4]   2> 132 T201 oasc.SolrResourceLoader.locateSolrHome JNDI not configured for solr (NoInitialContextEx)
[junit4:junit4]   2> 133 T201 oasc.SolrResourceLoader.locateSolrHome using system property solr.solr.home: /mnt/ssd/jenkins/workspace/Lucene-Solr-trunk-Linux/checkout/solr/build/solr-core/test-files/solr
[junit4:junit4]   2> 134 T201 oasc.SolrResourceLoader.<init> new SolrResourceLoader for deduced Solr Home: '/mnt/ssd/jenkins/workspace/Lucene-Solr-trunk-Linux/checkout/solr/build/solr-core/test-files/solr/'
[junit4:junit4]   2> 153 T201 oass.SolrDispatchFilter.init SolrDispatchFilter.init()
[junit4:junit4]   2> 154 T201 oasc.SolrResourceLoader.locateSolrHome JNDI not configured for solr (NoInitialContextEx)
[junit4:junit4]   2> 154 T201 oasc.SolrResourceLoader.locateSolrHome using system property solr.solr.home: /mnt/ssd/jenkins/workspace/Lucene-Solr-trunk-Linux/checkout/solr/build/solr-core/test-files/solr
[junit4:junit4]   2> 155 T201 oasc.CoreContainer$Initializer.initialize looking for solr.xml: /mnt/ssd/jenkins/workspace/Lucene-Solr-trunk-Linux/checkout/solr/build/solr-core/test-files/solr/solr.xml
[junit4:junit4]   2> 155 T201 oasc.CoreContainer.<init> New CoreContainer 16910596
[junit4:junit4]   2> 156 T201 oasc.CoreContainer.load Loading CoreContainer using Solr Home: '/mnt/ssd/jenkins/workspace/Lucene-Solr-trunk-Linux/checkout/solr/build/solr-core/test-files/solr/'
[junit4:junit4]   2> 156 T201 oasc.SolrResourceLoader.<init> new SolrResourceLoader for directory: '/mnt/ssd/jenkins/workspace/Lucene-Solr-trunk-Linux/checkout/solr/build/solr-core/test-files/solr/'
[junit4:junit4]   2> 173 T201 oasc.CoreContainer.load Registering Log Listener
[junit4:junit4]   2> 192 T201 oasc.CoreContainer.create Creating SolrCore 'collection1' using instanceDir: /mnt/ssd/jenkins/workspace/Lucene-Solr-trunk-Linux/checkout/solr/build/solr-core/test-files/solr/collection1
[junit4:junit4]   2> 193 T201 oasc.SolrResourceLoader.<init> new SolrResourceLoader for directory: '/mnt/ssd/jenkins/workspace/Lucene-Solr-trunk-Linux/checkout/solr/build/solr-core/test-files/solr/collection1/'
[junit4:junit4]   2> 193 T201 oasc.SolrResourceLoader.replaceClassLoader Adding 'file:/mnt/ssd/jenkins/workspace/Lucene-Solr-trunk-Linux/checkout/solr/build/solr-core/test-files/solr/collection1/lib/README' to classloader
[junit4:junit4]   2> 193 T201 oasc.SolrResourceLoader.replaceClassLoader Adding 'file:/mnt/ssd/jenkins/workspace/Lucene-Solr-trunk-Linux/checkout/solr/build/solr-core/test-files/solr/collection1/lib/classes/' to classloader
[junit4:junit4]   2> 221 T201 oasc.SolrConfig.<init> Using Lucene MatchVersion: LUCENE_50
[junit4:junit4]   2> 260 T201 oasc.SolrConfig.<init> Loaded SolrConfig: solrconfig-elevate.xml
[junit4:junit4]   2> 260 T201 oass.IndexSchema.readSchema Reading Solr Schema
[junit4:junit4]   2> 262 T201 oass.IndexSchema.readSchema Schema name=example
[junit4:junit4]   2> 418 T201 oass.IndexSchema.readSchema default search field in schema is text
[junit4:junit4]   2> 420 T201 oass.IndexSchema.readSchema unique key field: id
[junit4:junit4]   2> 423 T201 oasc.SolrCore.<init> [collection1] Opening new SolrCore at /mnt/ssd/jenkins/workspace/Lucene-Solr-trunk-Linux/checkout/solr/build/solr-core/test-files/solr/collection1/, dataDir=./org.apache.solr.handler.component.DistributedQueryElevationComponentTest-1344073570221/control/data/
[junit4:junit4]   2> 424 T201 oasc.JmxMonitoredMap.<init> JMX monitoring is enabled. Adding Solr mbeans to JMX Server: com.sun.jmx.mbeanserver.JmxMBeanServer@16ca212
[junit4:junit4]   2> 424 T201 oasc.SolrCore.getNewIndexDir WARNING New index directory detected: old=null new=./org.apache.solr.handler.component.DistributedQueryElevationComponentTest-1344073570221/control/data/index/
[junit4:junit4]   2> 425 T201 oasc.SolrCore.initIndex WARNING [collection1] Solr index directory './org.apache.solr.handler.component.DistributedQueryElevationComponentTest-1344073570221/control/data/index' doesn't exist. Creating new index...
[junit4:junit4]   2> 426 T201 oasc.SolrDeletionPolicy.onCommit SolrDeletionPolicy.onCommit: commits:num=1
[junit4:junit4]   2> 		commit{dir=MockDirWrapper(org.apache.lucene.store.RAMDirectory@18c47a2 lockFactory=org.apache.lucene.store.SingleInstanceLockFactory@a61dc7),segFN=segments_1,generation=1,filenames=[segments_1]
[junit4:junit4]   2> 426 T201 oasc.SolrDeletionPolicy.updateCommits newest commit = 1
[junit4:junit4]   2> 433 T201 oasc.RequestHandlers.initHandlersFromConfig created /update: solr.UpdateRequestHandler
[junit4:junit4]   2> 433 T201 oasc.RequestHandlers.initHandlersFromConfig created /elevate: org.apache.solr.handler.component.SearchHandler
[junit4:junit4]   2> 434 T201 oasc.RequestHandlers.initHandlersFromConfig created /dataElevate: org.apache.solr.handler.component.SearchHandler
[junit4:junit4]   2> 435 T201 oashl.XMLLoader.init xsltCacheLifetimeSeconds=60
[junit4:junit4]   2> 435 T201 oasc.RequestHandlers.initHandlersFromConfig WARNING no default request handler is registered (either '/select' or 'standard')
[junit4:junit4]   2> 436 T201 oasc.SolrCore.initDeprecatedSupport WARNING solrconfig.xml uses deprecated <admin/gettableFiles>, Please update your config to use the ShowFileRequestHandler.
[junit4:junit4]   2> 437 T201 oasc.SolrCore.initDeprecatedSupport WARNING adding ShowFileRequestHandler with hidden files: [SCHEMA-REPLICATION1.XML, OLD_SYNONYMS.TXT, SCHEMA15.XML, SCHEMA-BM25.XML, DA_UTF8.XML, SCHEMA-LMJELINEKMERCER.XML, SOLRCONFIG-TERMINDEX.XML, BAD-SCHEMA-NOT-INDEXED-BUT-TF.XML, SCHEMA-REQUIRED-FIELDS.XML, MISSING.FUNCTIONS.UPDATEPROCESSOR.JS, SOLRCONFIG-LAZYWRITER.XML, SOLRCONFIG-TLOG.XML, SCHEMA-BINARYFIELD.XML, BAD-SCHEMA-OMIT-TF-BUT-NOT-POS.XML, SCHEMA12.XML, SOLRCONFIG-MASTER3.XML, BAD-SCHEMA-UNIQUEKEY-MULTIVALUED.XML, BAD-MP-SOLRCONFIG.XML, CURRENCY.XML, SOLRCONFIG-QUERYSENDER-NOQUERY.XML, SCHEMASURROUND.XML, SCHEMA-REPLICATION2.XML, SOLRCONFIG-SLAVE.XML, KEEP-1.TXT, SOLRCONFIG-MASTER2.XML, SOLRCONFIG-ALTDIRECTORY.XML, SOLRCONFIG-MERGEPOLICY.XML, KEEP-2.TXT, STOPTYPES-2.TXT, BAD-SCHEMA-NONTEXT-ANALYZER.XML, SOLRCONFIG-SPELLCHECKER.XML, SOLRCONFIG-NOCACHE.XML, TRIVIAL.UPDATEPROCESSOR1.JS, SCHEMA-MINIMAL.XML, SCHEMA-LUCENEMATCHVERSION.XML, SOLRCONFIG-PROPINJECT.XML, BAD-SCHEMA-DUP-FIELDTYPE.XML, BAD-SCHEMA-UNIQUEKEY-USES-DEFAULT.XML, BAD-SOLRCONFIG-MISSING-SCRIPTFILE.XML, SOLRCONFIG-SIMPLELOCK.XML, BAD-SCHEMA-NOT-INDEXED-BUT-POS.XML, BAD-SCHEMA-NOT-INDEXED-BUT-NORMS.XML, TRIVIAL.UPDATEPROCESSOR0.JS, SOLRCONFIG-SPELLCHECKCOMPONENT.XML, ADDFIELDS.UPDATEPROCESSOR.JS, SCHEMA-NUMERIC.XML, THROW.ERROR.ON.ADD.UPDATEPROCESSOR.JS, SOLRCONFIG_CODEC.XML, SCHEMA11.XML, STOP-1.TXT, COMPOUNDDICTIONARY.TXT, SYNONYMS.TXT, SOLRCONFIG-DELPOLICY2.XML, SCHEMA-FOLDING.XML, SCHEMA-TFIDF.XML, SCHEMA-DFR.XML, SOLRCONFIG-QUERYSENDER.XML, STOP-2.TXT, SOLRCONFIG-UPDATE-PROCESSOR-CHAINS.XML, HUNSPELL-TEST.DIC, SCHEMA-IB.XML, BAD-SOLRCONFIG-INVALID-SCRIPTFILE.XML, SCHEMA-REVERSED.XML, SOLRCONFIG-SOLR-749.XML, SOLRCONFIG-HIGHLIGHT.XML, STOPWITHBOM.TXT, SOLRCONFIG-REQHANDLER.INCL, SCHEMA-CHARFILTERS.XML, SOLRCONFIG-CACHING.XML, BAD-SCHEMA-DUP-DYNAMICFIELD.XML, SCHEMA-TRIE.XML, SOLRCONFIG-BASIC.XML, SOLRCONFIG-MASTER.XML, PROTWORDS.TXT, SOLRCONFIG-PROPINJECT-INDEXDEFAULT.XML, STOPWORDSWRONGENCODING.TXT, SCHEMA-NOT-REQUIRED-UNIQUE-KEY.XML, SCHEMA-SIM.XML, BAD-SOLRCONFIG-BOGUS-SCRIPTENGINE-NAME.XML, BAD-SCHEMA-SIM-GLOBAL-VS-FT-MISMATCH.XML, BAD_SOLRCONFIG.XML, SOLRCONFIG-SOLCOREPROPERTIES.XML, SOLRCONFIG-XINCLUDE.XML, CONDITIONAL.UPDATEPROCESSOR.JS, SCHEMA-COPYFIELD-TEST.XML, BAD-SCHEMA-DUP-FIELD.XML, SCHEMA.XML, BAD-SCHEMA-ANALYZER-CLASS-AND-NESTED.XML, STEMDICT.TXT, SCHEMA_CODEC.XML, MISSLEADING.EXTENSION.UPDATEPROCESSOR.JS.TXT, STOPTYPES-1.TXT, MAPPING-ISOLATIN1ACCENT.TXT, PHRASESUGGEST.TXT, HUNSPELL-TEST.AFF, SOLRCONFIG-SLAVE1.XML, SCHEMA-STOP-KEEP.XML, SOLRCONFIG-TRANSFORMERS.XML, SOLRCONFIG-MASTER1-KEEPONEBACKUP.XML, SOLRCONFIG-SCRIPT-UPDATEPROCESSOR.XML, SOLRCONFIG-MASTER1.XML, ELEVATE.XML, SOLRCONFIG-REPEATER.XML, SOLRCONFIG-PHRASESUGGEST.XML, OPEN-EXCHANGE-RATES.JSON, DA_COMPOUNDDICTIONARY.TXT, SCHEMA-SPELLCHECKER.XML, HYPHENATION.DTD, SCHEMA-PHRASESUGGEST.XML, WDFTYPES.TXT, STOPWORDS.TXT, SCHEMA-COLLATE.XML, BAD-SCHEMA-CODEC-GLOBAL-VS-FT-MISMATCH.XML, SOLRCONFIG-ENABLEPLUGIN.XML, SOLRCONFIG_PERF.XML, SOLRCONFIG-NATIVELOCK.XML, BAD-SCHEMA-UNIQUEKEY-IS-COPYFIELD-DEST.XML, XSLT, BAD-SCHEMA-EXTERNAL-FILEFIELD.XML, SOLRCONFIG-FUNCTIONQUERY.XML, STOP-SNOWBALL.TXT, SCHEMA-LMDIRICHLET.XML, SOLRCONFIG-DELPOLICY1.XML, SOLRCONFIG-ELEVATE.XML, FRENCHARTICLES.TXT]
[junit4:junit4]   2> 441 T201 oass.SolrIndexSearcher.<init> Opening Searcher@39d958 main
[junit4:junit4]   2> 441 T201 oass.SolrIndexSearcher.getIndexDir WARNING WARNING: Directory impl does not support setting indexDir: org.apache.lucene.store.MockDirectoryWrapper
[junit4:junit4]   2> 442 T201 oasu.CommitTracker.<init> Hard AutoCommit: disabled
[junit4:junit4]   2> 442 T201 oasu.CommitTracker.<init> Soft AutoCommit: disabled
[junit4:junit4]   2> 443 T201 oashc.QueryElevationComponent.inform Loading QueryElevation from: /mnt/ssd/jenkins/workspace/Lucene-Solr-trunk-Linux/checkout/solr/build/solr-core/test-files/solr/collection1/conf/elevate.xml
[junit4:junit4]   2> 451 T201 oashc.QueryElevationComponent.inform Loading QueryElevation from: /mnt/ssd/jenkins/workspace/Lucene-Solr-trunk-Linux/checkout/solr/build/solr-core/test-files/solr/collection1/conf/elevate.xml
[junit4:junit4]   2> 468 T201 oashc.HttpShardHandlerFactory.getParameter Setting socketTimeout to: 0
[junit4:junit4]   2> 468 T201 oashc.HttpShardHandlerFactory.getParameter Setting urlScheme to: http://
[junit4:junit4]   2> 468 T201 oashc.HttpShardHandlerFactory.getParameter Setting connTimeout to: 0
[junit4:junit4]   2> 469 T201 oashc.HttpShardHandlerFactory.getParameter Setting maxConnectionsPerHost to: 20
[junit4:junit4]   2> 469 T201 oashc.HttpShardHandlerFactory.getParameter Setting corePoolSize to: 0
[junit4:junit4]   2> 469 T201 oashc.HttpShardHandlerFactory.getParameter Setting maximumPoolSize to: 2147483647
[junit4:junit4]   2> 469 T201 oashc.HttpShardHandlerFactory.getParameter Setting maxThreadIdleTime to: 5
[junit4:junit4]   2> 469 T201 oashc.HttpShardHandlerFactory.getParameter Setting sizeOfQueue to: -1
[junit4:junit4]   2> 470 T201 oashc.HttpShardHandlerFactory.getParameter Setting fairnessPolicy to: false
[junit4:junit4]   2> 470 T201 oascsi.HttpClientUtil.createClient Creating new http client, config:maxConnectionsPerHost=20&maxConnections=10000&socketTimeout=0&connTimeout=0&retry=false
[junit4:junit4]   2> 472 T212 oasc.SolrCore.registerSearcher [collection1] Registered new searcher Searcher@39d958 main{StandardDirectoryReader(segments_1:1)}
[junit4:junit4]   2> 474 T201 oasc.CoreContainer.register registering core: collection1
[junit4:junit4]   2> 474 T201 oass.SolrDispatchFilter.init user.dir=/mnt/ssd/jenkins/workspace/Lucene-Solr-trunk-Linux/checkout/solr/build/solr-core/test/J1
[junit4:junit4]   2> 474 T201 oass.SolrDispatchFilter.init SolrDispatchFilter.init() done
[junit4:junit4]   2> 481 T201 oascsi.HttpClientUtil.createClient Creating new http client, config:maxConnections=128&maxConnectionsPerHost=32&followRedirects=false
[junit4:junit4]   2> 484 T201 oejs.Server.doStart jetty-8.1.2.v20120308
[junit4:junit4]   2> 486 T201 oejs.AbstractConnector.doStart Started SocketConnector@0.0.0.0:33581
[junit4:junit4]   2> 486 T201 oasc.SolrResourceLoader.locateSolrHome JNDI not configured for solr (NoInitialContextEx)
[junit4:junit4]   2> 486 T201 oasc.SolrResourceLoader.locateSolrHome using system property solr.solr.home: /mnt/ssd/jenkins/workspace/Lucene-Solr-trunk-Linux/checkout/solr/build/solr-core/test-files/solr
[junit4:junit4]   2> 486 T201 oasc.SolrResourceLoader.<init> new SolrResourceLoader for deduced Solr Home: '/mnt/ssd/jenkins/workspace/Lucene-Solr-trunk-Linux/checkout/solr/build/solr-core/test-files/solr/'
[junit4:junit4]   2> 492 T201 oass.SolrDispatchFilter.init SolrDispatchFilter.init()
[junit4:junit4]   2> 493 T201 oasc.SolrResourceLoader.locateSolrHome JNDI not configured for solr (NoInitialContextEx)
[junit4:junit4]   2> 493 T201 oasc.SolrResourceLoader.locateSolrHome using system property solr.solr.home: /mnt/ssd/jenkins/workspace/Lucene-Solr-trunk-Linux/checkout/solr/build/solr-core/test-files/solr
[junit4:junit4]   2> 493 T201 oasc.CoreContainer$Initializer.initialize looking for solr.xml: /mnt/ssd/jenkins/workspace/Lucene-Solr-trunk-Linux/checkout/solr/build/solr-core/test-files/solr/solr.xml
[junit4:junit4]   2> 493 T201 oasc.CoreContainer.<init> New CoreContainer 18754291
[junit4:junit4]   2> 494 T201 oasc.CoreContainer.load Loading CoreContainer using Solr Home: '/mnt/ssd/jenkins/workspace/Lucene-Solr-trunk-Linux/checkout/solr/build/solr-core/test-files/solr/'
[junit4:junit4]   2> 494 T201 oasc.SolrResourceLoader.<init> new SolrResourceLoader for directory: '/mnt/ssd/jenkins/workspace/Lucene-Solr-trunk-Linux/checkout/solr/build/solr-core/test-files/solr/'
[junit4:junit4]   2> 503 T201 oasc.CoreContainer.load Registering Log Listener
[junit4:junit4]   2> 520 T201 oasc.CoreContainer.create Creating SolrCore 'collection1' using instanceDir: /mnt/ssd/jenkins/workspace/Lucene-Solr-trunk-Linux/checkout/solr/build/solr-core/test-files/solr/collection1
[junit4:junit4]   2> 521 T201 oasc.SolrResourceLoader.<init> new SolrResourceLoader for directory: '/mnt/ssd/jenkins/workspace/Lucene-Solr-trunk-Linux/checkout/solr/build/solr-core/test-files/solr/collection1/'
[junit4:junit4]   2> 521 T201 oasc.SolrResourceLoader.replaceClassLoader Adding 'file:/mnt/ssd/jenkins/workspace/Lucene-Solr-trunk-Linux/checkout/solr/build/solr-core/test-files/solr/collection1/lib/README' to classloader
[junit4:junit4]   2> 522 T201 oasc.SolrResourceLoader.replaceClassLoader Adding 'file:/mnt/ssd/jenkins/workspace/Lucene-Solr-trunk-Linux/checkout/solr/build/solr-core/test-files/solr/collection1/lib/classes/' to classloader
[junit4:junit4]   2> 551 T201 oasc.SolrConfig.<init> Using Lucene MatchVersion: LUCENE_50
[junit4:junit4]   2> 593 T201 oasc.SolrConfig.<init> Loaded SolrConfig: solrconfig-elevate.xml
[junit4:junit4]   2> 593 T201 oass.IndexSchema.readSchema Reading Solr Schema
[junit4:junit4]   2> 596 T201 oass.IndexSchema.readSchema Schema name=example
[junit4:junit4]   2> 745 T201 oass.IndexSchema.readSchema default search field in schema is text
[junit4:junit4]   2> 746 T201 oass.IndexSchema.readSchema unique key field: id
[junit4:junit4]   2> 749 T201 oasc.SolrCore.<init> [collection1] Opening new SolrCore at /mnt/ssd/jenkins/workspace/Lucene-Solr-trunk-Linux/checkout/solr/build/solr-core/test-files/solr/collection1/, dataDir=./org.apache.solr.handler.component.DistributedQueryElevationComponentTest-1344073570221/shard0/data/
[junit4:junit4]   2> 749 T201 oasc.JmxMonitoredMap.<init> JMX monitoring is enabled. Adding Solr mbeans to JMX Server: com.sun.jmx.mbeanserver.JmxMBeanServer@16ca212
[junit4:junit4]   2> 749 T201 oasc.SolrCore.getNewIndexDir WARNING New index directory detected: old=null new=./org.apache.solr.handler.component.DistributedQueryElevationComponentTest-1344073570221/shard0/data/index/
[junit4:junit4]   2> 750 T201 oasc.SolrCore.initIndex WARNING [collection1] Solr index directory './org.apache.solr.handler.component.DistributedQueryElevationComponentTest-1344073570221/shard0/data/index' doesn't exist. Creating new index...
[junit4:junit4]   2> 751 T201 oasc.SolrDeletionPolicy.onCommit SolrDeletionPolicy.onCommit: commits:num=1
[junit4:junit4]   2> 		commit{dir=MockDirWrapper(org.apache.lucene.store.RAMDirectory@bc4cbb lockFactory=org.apache.lucene.store.SingleInstanceLockFactory@1db698c),segFN=segments_1,generation=1,filenames=[segments_1]
[junit4:junit4]   2> 751 T201 oasc.SolrDeletionPolicy.updateCommits newest commit = 1
[junit4:junit4]   2> 752 T201 oasc.RequestHandlers.initHandlersFromConfig created /update: solr.UpdateRequestHandler
[junit4:junit4]   2> 752 T201 oasc.RequestHandlers.initHandlersFromConfig created /elevate: org.apache.solr.handler.component.SearchHandler
[junit4:junit4]   2> 752 T201 oasc.RequestHandlers.initHandlersFromConfig created /dataElevate: org.apache.solr.handler.component.SearchHandler
[junit4:junit4]   2> 759 T201 oashl.XMLLoader.init xsltCacheLifetimeSeconds=60
[junit4:junit4]   2> 759 T201 oasc.RequestHandlers.initHandlersFromConfig WARNING no default request handler is registered (either '/select' or 'standard')
[junit4:junit4]   2> 760 T201 oasc.SolrCore.initDeprecatedSupport WARNING solrconfig.xml uses deprecated <admin/gettableFiles>, Please update your config to use the ShowFileRequestHandler.
[junit4:junit4]   2> 760 T201 oasc.SolrCore.initDeprecatedSupport WARNING adding ShowFileRequestHandler with hidden files: [SCHEMA-REPLICATION1.XML, OLD_SYNONYMS.TXT, SCHEMA15.XML, SCHEMA-BM25.XML, DA_UTF8.XML, SCHEMA-LMJELINEKMERCER.XML, SOLRCONFIG-TERMINDEX.XML, BAD-SCHEMA-NOT-INDEXED-BUT-TF.XML, SCHEMA-REQUIRED-FIELDS.XML, MISSING.FUNCTIONS.UPDATEPROCESSOR.JS, SOLRCONFIG-LAZYWRITER.XML, SOLRCONFIG-TLOG.XML, SCHEMA-BINARYFIELD.XML, BAD-SCHEMA-OMIT-TF-BUT-NOT-POS.XML, SCHEMA12.XML, SOLRCONFIG-MASTER3.XML, BAD-SCHEMA-UNIQUEKEY-MULTIVALUED.XML, BAD-MP-SOLRCONFIG.XML, CURRENCY.XML, SOLRCONFIG-QUERYSENDER-NOQUERY.XML, SCHEMASURROUND.XML, SCHEMA-REPLICATION2.XML, SOLRCONFIG-SLAVE.XML, KEEP-1.TXT, SOLRCONFIG-MASTER2.XML, SOLRCONFIG-ALTDIRECTORY.XML, SOLRCONFIG-MERGEPOLICY.XML, KEEP-2.TXT, STOPTYPES-2.TXT, BAD-SCHEMA-NONTEXT-ANALYZER.XML, SOLRCONFIG-SPELLCHECKER.XML, SOLRCONFIG-NOCACHE.XML, TRIVIAL.UPDATEPROCESSOR1.JS, SCHEMA-MINIMAL.XML, SCHEMA-LUCENEMATCHVERSION.XML, SOLRCONFIG-PROPINJECT.XML, BAD-SCHEMA-DUP-FIELDTYPE.XML, BAD-SCHEMA-UNIQUEKEY-USES-DEFAULT.XML, BAD-SOLRCONFIG-MISSING-SCRIPTFILE.XML, SOLRCONFIG-SIMPLELOCK.XML, BAD-SCHEMA-NOT-INDEXED-BUT-POS.XML, BAD-SCHEMA-NOT-INDEXED-BUT-NORMS.XML, TRIVIAL.UPDATEPROCESSOR0.JS, SOLRCONFIG-SPELLCHECKCOMPONENT.XML, ADDFIELDS.UPDATEPROCESSOR.JS, SCHEMA-NUMERIC.XML, THROW.ERROR.ON.ADD.UPDATEPROCESSOR.JS, SOLRCONFIG_CODEC.XML, SCHEMA11.XML, STOP-1.TXT, COMPOUNDDICTIONARY.TXT, SYNONYMS.TXT, SOLRCONFIG-DELPOLICY2.XML, SCHEMA-FOLDING.XML, SCHEMA-TFIDF.XML, SCHEMA-DFR.XML, SOLRCONFIG-QUERYSENDER.XML, STOP-2.TXT, SOLRCONFIG-UPDATE-PROCESSOR-CHAINS.XML, HUNSPELL-TEST.DIC, SCHEMA-IB.XML, BAD-SOLRCONFIG-INVALID-SCRIPTFILE.XML, SCHEMA-REVERSED.XML, SOLRCONFIG-SOLR-749.XML, SOLRCONFIG-HIGHLIGHT.XML, STOPWITHBOM.TXT, SOLRCONFIG-REQHANDLER.INCL, SCHEMA-CHARFILTERS.XML, SOLRCONFIG-CACHING.XML, BAD-SCHEMA-DUP-DYNAMICFIELD.XML, SCHEMA-TRIE.XML, SOLRCONFIG-BASIC.XML, SOLRCONFIG-MASTER.XML, PROTWORDS.TXT, SOLRCONFIG-PROPINJECT-INDEXDEFAULT.XML, STOPWORDSWRONGENCODING.TXT, SCHEMA-NOT-REQUIRED-UNIQUE-KEY.XML, SCHEMA-SIM.XML, BAD-SOLRCONFIG-BOGUS-SCRIPTENGINE-NAME.XML, BAD-SCHEMA-SIM-GLOBAL-VS-FT-MISMATCH.XML, BAD_SOLRCONFIG.XML, SOLRCONFIG-SOLCOREPROPERTIES.XML, SOLRCONFIG-XINCLUDE.XML, CONDITIONAL.UPDATEPROCESSOR.JS, SCHEMA-COPYFIELD-TEST.XML, BAD-SCHEMA-DUP-FIELD.XML, SCHEMA.XML, BAD-SCHEMA-ANALYZER-CLASS-AND-NESTED.XML, STEMDICT.TXT, SCHEMA_CODEC.XML, MISSLEADING.EXTENSION.UPDATEPROCESSOR.JS.TXT, STOPTYPES-1.TXT, MAPPING-ISOLATIN1ACCENT.TXT, PHRASESUGGEST.TXT, HUNSPELL-TEST.AFF, SOLRCONFIG-SLAVE1.XML, SCHEMA-STOP-KEEP.XML, SOLRCONFIG-TRANSFORMERS.XML, SOLRCONFIG-MASTER1-KEEPONEBACKUP.XML, SOLRCONFIG-SCRIPT-UPDATEPROCESSOR.XML, SOLRCONFIG-MASTER1.XML, ELEVATE.XML, SOLRCONFIG-REPEATER.XML, SOLRCONFIG-PHRASESUGGEST.XML, OPEN-EXCHANGE-RATES.JSON, DA_COMPOUNDDICTIONARY.TXT, SCHEMA-SPELLCHECKER.XML, HYPHENATION.DTD, SCHEMA-PHRASESUGGEST.XML, WDFTYPES.TXT, STOPWORDS.TXT, SCHEMA-COLLATE.XML, BAD-SCHEMA-CODEC-GLOBAL-VS-FT-MISMATCH.XML, SOLRCONFIG-ENABLEPLUGIN.XML, SOLRCONFIG_PERF.XML, SOLRCONFIG-NATIVELOCK.XML, BAD-SCHEMA-UNIQUEKEY-IS-COPYFIELD-DEST.XML, XSLT, BAD-SCHEMA-EXTERNAL-FILEFIELD.XML, SOLRCONFIG-FUNCTIONQUERY.XML, STOP-SNOWBALL.TXT, SCHEMA-LMDIRICHLET.XML, SOLRCONFIG-DELPOLICY1.XML, SOLRCONFIG-ELEVATE.XML, FRENCHARTICLES.TXT]
[junit4:junit4]   2> 762 T201 oass.SolrIndexSearcher.<init> Opening Searcher@1dd98e main
[junit4:junit4]   2> 762 T201 oass.SolrIndexSearcher.getIndexDir WARNING WARNING: Directory impl does not support setting indexDir: org.apache.lucene.store.MockDirectoryWrapper
[junit4:junit4]   2> 763 T201 oasu.CommitTracker.<init> Hard AutoCommit: disabled
[junit4:junit4]   2> 763 T201 oasu.CommitTracker.<init> Soft AutoCommit: disabled
[junit4:junit4]   2> 763 T201 oashc.QueryElevationComponent.inform Loading QueryElevation from: /mnt/ssd/jenkins/workspace/Lucene-Solr-trunk-Linux/checkout/solr/build/solr-core/test-files/solr/collection1/conf/elevate.xml
[junit4:junit4]   2> 768 T201 oashc.QueryElevationComponent.inform Loading QueryElevation from: /mnt/ssd/jenkins/workspace/Lucene-Solr-trunk-Linux/checkout/solr/build/solr-core/test-files/solr/collection1/conf/elevate.xml
[junit4:junit4]   2> 773 T201 oashc.HttpShardHandlerFactory.getParameter Setting socketTimeout to: 0
[junit4:junit4]   2> 774 T201 oashc.HttpShardHandlerFactory.getParameter Setting urlScheme to: http://
[junit4:junit4]   2> 774 T201 oashc.HttpShardHandlerFactory.getParameter Setting connTimeout to: 0
[junit4:junit4]   2> 774 T201 oashc.HttpShardHandlerFactory.getParameter Setting maxConnectionsPerHost to: 20
[junit4:junit4]   2> 774 T201 oashc.HttpShardHandlerFactory.getParameter Setting corePoolSize to: 0
[junit4:junit4]   2> 774 T201 oashc.HttpShardHandlerFactory.getParameter Setting maximumPoolSize to: 2147483647
[junit4:junit4]   2> 775 T201 oashc.HttpShardHandlerFactory.getParameter Setting maxThreadIdleTime to: 5
[junit4:junit4]   2> 775 T201 oashc.HttpShardHandlerFactory.getParameter Setting sizeOfQueue to: -1
[junit4:junit4]   2> 775 T201 oashc.HttpShardHandlerFactory.getParameter Setting fairnessPolicy to: false
[junit4:junit4]   2> 775 T201 oascsi.HttpClientUtil.createClient Creating new http client, config:maxConnectionsPerHost=20&maxConnections=10000&socketTimeout=0&connTimeout=0&retry=false
[junit4:junit4]   2> 778 T222 oasc.SolrCore.registerSearcher [collection1] Registered new searcher Searcher@1dd98e main{StandardDirectoryReader(segments_1:1)}
[junit4:junit4]   2> 778 T201 oasc.CoreContainer.register registering core: collection1
[junit4:junit4]   2> 778 T201 oass.SolrDispatchFilter.init user.dir=/mnt/ssd/jenkins/workspace/Lucene-Solr-trunk-Linux/checkout/solr/build/solr-core/test/J1
[junit4:junit4]   2> 778 T201 oass.SolrDispatchFilter.init SolrDispatchFilter.init() done
[junit4:junit4]   2> 778 T201 oascsi.HttpClientUtil.createClient Creating new http client, config:maxConnections=128&maxConnectionsPerHost=32&followRedirects=false
[junit4:junit4]   2> 780 T201 oejs.Server.doStart jetty-8.1.2.v20120308
[junit4:junit4]   2> 782 T201 oejs.AbstractConnector.doStart Started SocketConnector@0.0.0.0:46351
[junit4:junit4]   2> 782 T201 oasc.SolrResourceLoader.locateSolrHome JNDI not configured for solr (NoInitialContextEx)
[junit4:junit4]   2> 782 T201 oasc.SolrResourceLoader.locateSolrHome using system property solr.solr.home: /mnt/ssd/jenkins/workspace/Lucene-Solr-trunk-Linux/checkout/solr/build/solr-core/test-files/solr
[junit4:junit4]   2> 783 T201 oasc.SolrResourceLoader.<init> new SolrResourceLoader for deduced Solr Home: '/mnt/ssd/jenkins/workspace/Lucene-Solr-trunk-Linux/checkout/solr/build/solr-core/test-files/solr/'
[junit4:junit4]   2> 788 T201 oass.SolrDispatchFilter.init SolrDispatchFilter.init()
[junit4:junit4]   2> 789 T201 oasc.SolrResourceLoader.locateSolrHome JNDI not configured for solr (NoInitialContextEx)
[junit4:junit4]   2> 789 T201 oasc.SolrResourceLoader.locateSolrHome using system property solr.solr.home: /mnt/ssd/jenkins/workspace/Lucene-Solr-trunk-Linux/checkout/solr/build/solr-core/test-files/solr
[junit4:junit4]   2> 789 T201 oasc.CoreContainer$Initializer.initialize looking for solr.xml: /mnt/ssd/jenkins/workspace/Lucene-Solr-trunk-Linux/checkout/solr/build/solr-core/test-files/solr/solr.xml
[junit4:junit4]   2> 789 T201 oasc.CoreContainer.<init> New CoreContainer 28080747
[junit4:junit4]   2> 790 T201 oasc.CoreContainer.load Loading CoreContainer using Solr Home: '/mnt/ssd/jenkins/workspace/Lucene-Solr-trunk-Linux/checkout/solr/build/solr-core/test-files/solr/'
[junit4:junit4]   2> 790 T201 oasc.SolrResourceLoader.<init> new SolrResourceLoader for directory: '/mnt/ssd/jenkins/workspace/Lucene-Solr-trunk-Linux/checkout/solr/build/solr-core/test-files/solr/'
[junit4:junit4]   2> 804 T201 oasc.CoreContainer.load Registering Log Listener
[junit4:junit4]   2> 812 T201 oasc.CoreContainer.create Creating SolrCore 'collection1' using instanceDir: /mnt/ssd/jenkins/workspace/Lucene-Solr-trunk-Linux/checkout/solr/build/solr-core/test-files/solr/collection1
[junit4:junit4]   2> 812 T201 oasc.SolrResourceLoader.<init> new SolrResourceLoader for directory: '/mnt/ssd/jenkins/workspace/Lucene-Solr-trunk-Linux/checkout/solr/build/solr-core/test-files/solr/collection1/'
[junit4:junit4]   2> 813 T201 oasc.SolrResourceLoader.replaceClassLoader Adding 'file:/mnt/ssd/jenkins/workspace/Lucene-Solr-trunk-Linux/checkout/solr/build/solr-core/test-files/solr/collection1/lib/README' to classloader
[junit4:junit4]   2> 813 T201 oasc.SolrResourceLoader.replaceClassLoader Adding 'file:/mnt/ssd/jenkins/workspace/Lucene-Solr-trunk-Linux/checkout/solr/build/solr-core/test-files/solr/collection1/lib/classes/' to classloader
[junit4:junit4]   2> 836 T201 oasc.SolrConfig.<init> Using Lucene MatchVersion: LUCENE_50
[junit4:junit4]   2> 871 T201 oasc.SolrConfig.<init> Loaded SolrConfig: solrconfig-elevate.xml
[junit4:junit4]   2> 871 T201 oass.IndexSchema.readSchema Reading Solr Schema
[junit4:junit4]   2> 873 T201 oass.IndexSchema.readSchema Schema name=example
[junit4:junit4]   2> 1016 T201 oass.IndexSchema.readSchema default search field in schema is text
[junit4:junit4]   2> 1018 T201 oass.IndexSchema.readSchema unique key field: id
[junit4:junit4]   2> 1020 T201 oasc.SolrCore.<init> [collection1] Opening new SolrCore at /mnt/ssd/jenkins/workspace/Lucene-Solr-trunk-Linux/checkout/solr/build/solr-core/test-files/solr/collection1/, dataDir=./org.apache.solr.handler.component.DistributedQueryElevationComponentTest-1344073570221/shard1/data/
[junit4:junit4]   2> 1020 T201 oasc.JmxMonitoredMap.<init> JMX monitoring is enabled. Adding Solr mbeans to JMX Server: com.sun.jmx.mbeanserver.JmxMBeanServer@16ca212
[junit4:junit4]   2> 1021 T201 oasc.SolrCore.getNewIndexDir WARNING New index directory detected: old=null new=./org.apache.solr.handler.component.DistributedQueryElevationComponentTest-1344073570221/shard1/data/index/
[junit4:junit4]   2> 1021 T201 oasc.SolrCore.initIndex WARNING [collection1] Solr index directory './org.apache.solr.handler.component.DistributedQueryElevationComponentTest-1344073570221/shard1/data/index' doesn't exist. Creating new index...
[junit4:junit4]   2> 1022 T201 oasc.SolrDeletionPolicy.onCommit SolrDeletionPolicy.onCommit: commits:num=1
[junit4:junit4]   2> 		commit{dir=MockDirWrapper(org.apache.lucene.store.RAMDirectory@1b05b78 lockFactory=org.apache.lucene.store.SingleInstanceLockFactory@c112af),segFN=segments_1,generation=1,filenames=[segments_1]
[junit4:junit4]   2> 1022 T201 oasc.SolrDeletionPolicy.updateCommits newest commit = 1
[junit4:junit4]   2> 1023 T201 oasc.RequestHandlers.initHandlersFromConfig created /update: solr.UpdateRequestHandler
[junit4:junit4]   2> 1024 T201 oasc.RequestHandlers.initHandlersFromConfig created /elevate: org.apache.solr.handler.component.SearchHandler
[junit4:junit4]   2> 1024 T201 oasc.RequestHandlers.initHandlersFromConfig created /dataElevate: org.apache.solr.handler.component.SearchHandler
[junit4:junit4]   2> 1024 T201 oashl.XMLLoader.init xsltCacheLifetimeSeconds=60
[junit4:junit4]   2> 1025 T201 oasc.RequestHandlers.initHandlersFromConfig WARNING no default request handler is registered (either '/select' or 'standard')
[junit4:junit4]   2> 1026 T201 oasc.SolrCore.initDeprecatedSupport WARNING solrconfig.xml uses deprecated <admin/gettableFiles>, Please update your config to use the ShowFileRequestHandler.
[junit4:junit4]   2> 1027 T201 oasc.SolrCore.initDeprecatedSupport WARNING adding ShowFileRequestHandler with hidden files: [SCHEMA-REPLICATION1.XML, OLD_SYNONYMS.TXT, SCHEMA15.XML, SCHEMA-BM25.XML, DA_UTF8.XML, SCHEMA-LMJELINEKMERCER.XML, SOLRCONFIG-TERMINDEX.XML, BAD-SCHEMA-NOT-INDEXED-BUT-TF.XML, SCHEMA-REQUIRED-FIELDS.XML, MISSING.FUNCTIONS.UPDATEPROCESSOR.JS, SOLRCONFIG-LAZYWRITER.XML, SOLRCONFIG-TLOG.XML, SCHEMA-BINARYFIELD.XML, BAD-SCHEMA-OMIT-TF-BUT-NOT-POS.XML, SCHEMA12.XML, SOLRCONFIG-MASTER3.XML, BAD-SCHEMA-UNIQUEKEY-MULTIVALUED.XML, BAD-MP-SOLRCONFIG.XML, CURRENCY.XML, SOLRCONFIG-QUERYSENDER-NOQUERY.XML, SCHEMASURROUND.XML, SCHEMA-REPLICATION2.XML, SOLRCONFIG-SLAVE.XML, KEEP-1.TXT, SOLRCONFIG-MASTER2.XML, SOLRCONFIG-ALTDIRECTORY.XML, SOLRCONFIG-MERGEPOLICY.XML, KEEP-2.TXT, STOPTYPES-2.TXT, BAD-SCHEMA-NONTEXT-ANALYZER.XML, SOLRCONFIG-SPELLCHECKER.XML, SOLRCONFIG-NOCACHE.XML, TRIVIAL.UPDATEPROCESSOR1.JS, SCHEMA-MINIMAL.XML, SCHEMA-LUCENEMATCHVERSION.XML, SOLRCONFIG-PROPINJECT.XML, BAD-SCHEMA-DUP-FIELDTYPE.XML, BAD-SCHEMA-UNIQUEKEY-USES-DEFAULT.XML, BAD-SOLRCONFIG-MISSING-SCRIPTFILE.XML, SOLRCONFIG-SIMPLELOCK.XML, BAD-SCHEMA-NOT-INDEXED-BUT-POS.XML, BAD-SCHEMA-NOT-INDEXED-BUT-NORMS.XML, TRIVIAL.UPDATEPROCESSOR0.JS, SOLRCONFIG-SPELLCHECKCOMPONENT.XML, ADDFIELDS.UPDATEPROCESSOR.JS, SCHEMA-NUMERIC.XML, THROW.ERROR.ON.ADD.UPDATEPROCESSOR.JS, SOLRCONFIG_CODEC.XML, SCHEMA11.XML, STOP-1.TXT, COMPOUNDDICTIONARY.TXT, SYNONYMS.TXT, SOLRCONFIG-DELPOLICY2.XML, SCHEMA-FOLDING.XML, SCHEMA-TFIDF.XML, SCHEMA-DFR.XML, SOLRCONFIG-QUERYSENDER.XML, STOP-2.TXT, SOLRCONFIG-UPDATE-PROCESSOR-CHAINS.XML, HUNSPELL-TEST.DIC, SCHEMA-IB.XML, BAD-SOLRCONFIG-INVALID-SCRIPTFILE.XML, SCHEMA-REVERSED.XML, SOLRCONFIG-SOLR-749.XML, SOLRCONFIG-HIGHLIGHT.XML, STOPWITHBOM.TXT, SOLRCONFIG-REQHANDLER.INCL, SCHEMA-CHARFILTERS.XML, SOLRCONFIG-CACHING.XML, BAD-SCHEMA-DUP-DYNAMICFIELD.XML, SCHEMA-TRIE.XML, SOLRCONFIG-BASIC.XML, SOLRCONFIG-MASTER.XML, PROTWORDS.TXT, SOLRCONFIG-PROPINJECT-INDEXDEFAULT.XML, STOPWORDSWRONGENCODING.TXT, SCHEMA-NOT-REQUIRED-UNIQUE-KEY.XML, SCHEMA-SIM.XML, BAD-SOLRCONFIG-BOGUS-SCRIPTENGINE-NAME.XML, BAD-SCHEMA-SIM-GLOBAL-VS-FT-MISMATCH.XML, BAD_SOLRCONFIG.XML, SOLRCONFIG-SOLCOREPROPERTIES.XML, SOLRCONFIG-XINCLUDE.XML, CONDITIONAL.UPDATEPROCESSOR.JS, SCHEMA-COPYFIELD-TEST.XML, BAD-SCHEMA-DUP-FIELD.XML, SCHEMA.XML, BAD-SCHEMA-ANALYZER-CLASS-AND-NESTED.XML, STEMDICT.TXT, SCHEMA_CODEC.XML, MISSLEADING.EXTENSION.UPDATEPROCESSOR.JS.TXT, STOPTYPES-1.TXT, MAPPING-ISOLATIN1ACCENT.TXT, PHRASESUGGEST.TXT, HUNSPELL-TEST.AFF, SOLRCONFIG-SLAVE1.XML, SCHEMA-STOP-KEEP.XML, SOLRCONFIG-TRANSFORMERS.XML, SOLRCONFIG-MASTER1-KEEPONEBACKUP.XML, SOLRCONFIG-SCRIPT-UPDATEPROCESSOR.XML, SOLRCONFIG-MASTER1.XML, ELEVATE.XML, SOLRCONFIG-REPEATER.XML, SOLRCONFIG-PHRASESUGGEST.XML, OPEN-EXCHANGE-RATES.JSON, DA_COMPOUNDDICTIONARY.TXT, SCHEMA-SPELLCHECKER.XML, HYPHENATION.DTD, SCHEMA-PHRASESUGGEST.XML, WDFTYPES.TXT, STOPWORDS.TXT, SCHEMA-COLLATE.XML, BAD-SCHEMA-CODEC-GLOBAL-VS-FT-MISMATCH.XML, SOLRCONFIG-ENABLEPLUGIN.XML, SOLRCONFIG_PERF.XML, SOLRCONFIG-NATIVELOCK.XML, BAD-SCHEMA-UNIQUEKEY-IS-COPYFIELD-DEST.XML, XSLT, BAD-SCHEMA-EXTERNAL-FILEFIELD.XML, SOLRCONFIG-FUNCTIONQUERY.XML, STOP-SNOWBALL.TXT, SCHEMA-LMDIRICHLET.XML, SOLRCONFIG-DELPOLICY1.XML, SOLRCONFIG-ELEVATE.XML, FRENCHARTICLES.TXT]
[junit4:junit4]   2> 1029 T201 oass.SolrIndexSearcher.<init> Opening Searcher@1f9bcfa main
[junit4:junit4]   2> 1030 T201 oass.SolrIndexSearcher.getIndexDir WARNING WARNING: Directory impl does not support setting indexDir: org.apache.lucene.store.MockDirectoryWrapper
[junit4:junit4]   2> 1030 T201 oasu.CommitTracker.<init> Hard AutoCommit: disabled
[junit4:junit4]   2> 1030 T201 oasu.CommitTracker.<init> Soft AutoCommit: disabled
[junit4:junit4]   2> 1031 T201 oashc.QueryElevationComponent.inform Loading QueryElevation from: /mnt/ssd/jenkins/workspace/Lucene-Solr-trunk-Linux/checkout/solr/build/solr-core/test-files/solr/collection1/conf/elevate.xml
[junit4:junit4]   2> 1038 T201 oashc.QueryElevationComponent.inform Loading QueryElevation from: /mnt/ssd/jenkins/workspace/Lucene-Solr-trunk-Linux/checkout/solr/build/solr-core/test-files/solr/collection1/conf/elevate.xml
[junit4:junit4]   2> 1049 T201 oashc.HttpShardHandlerFactory.getParameter Setting socketTimeout to: 0
[junit4:junit4]   2> 1049 T201 oashc.HttpShardHandlerFactory.getParameter Setting urlScheme to: http://
[junit4:junit4]   2> 1050 T201 oashc.HttpShardHandlerFactory.getParameter Setting connTimeout to: 0
[junit4:junit4]   2> 1050 T201 oashc.HttpShardHandlerFactory.getParameter Setting maxConnectionsPerHost to: 20
[junit4:junit4]   2> 1050 T201 oashc.HttpShardHandlerFactory.getParameter Setting corePoolSize to: 0
[junit4:junit4]   2> 1050 T201 oashc.HttpShardHandlerFactory.getParameter Setting maximumPoolSize to: 2147483647
[junit4:junit4]   2> 1050 T201 oashc.HttpShardHandlerFactory.getParameter Setting maxThreadIdleTime to: 5
[junit4:junit4]   2> 1051 T201 oashc.HttpShardHandlerFactory.getParameter Setting sizeOfQueue to: -1
[junit4:junit4]   2> 1051 T201 oashc.HttpShardHandlerFactory.getParameter Setting fairnessPolicy to: false
[junit4:junit4]   2> 1051 T201 oascsi.HttpClientUtil.createClient Creating new http client, config:maxConnectionsPerHost=20&maxConnections=10000&socketTimeout=0&connTimeout=0&retry=false
[junit4:junit4]   2> 1053 T232 oasc.SolrCore.registerSearcher [collection1] Registered new searcher Searcher@1f9bcfa main{StandardDirectoryReader(segments_1:1)}
[junit4:junit4]   2> 1053 T201 oasc.CoreContainer.register registering core: collection1
[junit4:junit4]   2> 1054 T201 oass.SolrDispatchFilter.init user.dir=/mnt/ssd/jenkins/workspace/Lucene-Solr-trunk-Linux/checkout/solr/build/solr-core/test/J1
[junit4:junit4]   2> 1054 T201 oass.SolrDispatchFilter.init SolrDispatchFilter.init() done
[junit4:junit4]   2> 1054 T201 oascsi.HttpClientUtil.createClient Creating new http client, config:maxConnections=128&maxConnectionsPerHost=32&followRedirects=false
[junit4:junit4]   2> 1056 T201 oejs.Server.doStart jetty-8.1.2.v20120308
[junit4:junit4]   2> 1058 T201 oejs.AbstractConnector.doStart Started SocketConnector@0.0.0.0:37806
[junit4:junit4]   2> 1058 T201 oasc.SolrResourceLoader.locateSolrHome JNDI not configured for solr (NoInitialContextEx)
[junit4:junit4]   2> 1058 T201 oasc.SolrResourceLoader.locateSolrHome using system property solr.solr.home: /mnt/ssd/jenkins/workspace/Lucene-Solr-trunk-Linux/checkout/solr/build/solr-core/test-files/solr
[junit4:junit4]   2> 1059 T201 oasc.SolrResourceLoader.<init> new SolrResourceLoader for deduced Solr Home: '/mnt/ssd/jenkins/workspace/Lucene-Solr-trunk-Linux/checkout/solr/build/solr-core/test-files/solr/'
[junit4:junit4]   2> 1073 T201 oass.SolrDispatchFilter.init SolrDispatchFilter.init()
[junit4:junit4]   2> 1074 T201 oasc.SolrResourceLoader.locateSolrHome JNDI not configured for solr (NoInitialContextEx)
[junit4:junit4]   2> 1074 T201 oasc.SolrResourceLoader.locateSolrHome using system property solr.solr.home: /mnt/ssd/jenkins/workspace/Lucene-Solr-trunk-Linux/checkout/solr/build/solr-core/test-files/solr
[junit4:junit4]   2> 1074 T201 oasc.CoreContainer$Initializer.initialize looking for solr.xml: /mnt/ssd/jenkins/workspace/Lucene-Solr-trunk-Linux/checkout/solr/build/solr-core/test-files/solr/solr.xml
[junit4:junit4]   2> 1075 T201 oasc.CoreContainer.<init> New CoreContainer 25086162
[junit4:junit4]   2> 1075 T201 oasc.CoreContainer.load Loading CoreContainer using Solr Home: '/mnt/ssd/jenkins/workspace/Lucene-Solr-trunk-Linux/checkout/solr/build/solr-core/test-files/solr/'
[junit4:junit4]   2> 1075 T201 oasc.SolrResourceLoader.<init> new SolrResourceLoader for directory: '/mnt/ssd/jenkins/workspace/Lucene-Solr-trunk-Linux/checkout/solr/build/solr-core/test-files/solr/'
[junit4:junit4]   2> 1085 T201 oasc.CoreContainer.load Registering Log Listener
[junit4:junit4]   2> 1099 T201 oasc.CoreContainer.create Creating SolrCore 'collection1' using instanceDir: /mnt/ssd/jenkins/workspace/Lucene-Solr-trunk-Linux/checkout/solr/build/solr-core/test-files/solr/collection1
[junit4:junit4]   2> 1099 T201 oasc.SolrResourceLoader.<init> new SolrResourceLoader for directory: '/mnt/ssd/jenkins/workspace/Lucene-Solr-trunk-Linux/checkout/solr/build/solr-core/test-files/solr/collection1/'
[junit4:junit4]   2> 1100 T201 oasc.SolrResourceLoader.replaceClassLoader Adding 'file:/mnt/ssd/jenkins/workspace/Lucene-Solr-trunk-Linux/checkout/solr/build/solr-core/test-files/solr/collection1/lib/README' to classloader
[junit4:junit4]   2> 1100 T201 oasc.SolrResourceLoader.replaceClassLoader Adding 'file:/mnt/ssd/jenkins/workspace/Lucene-Solr-trunk-Linux/checkout/solr/build/solr-core/test-files/solr/collection1/lib/classes/' to classloader
[junit4:junit4]   2> 1123 T201 oasc.SolrConfig.<init> Using Lucene MatchVersion: LUCENE_50
[junit4:junit4]   2> 1185 T201 oasc.SolrConfig.<init> Loaded SolrConfig: solrconfig-elevate.xml
[junit4:junit4]   2> 1185 T201 oass.IndexSchema.readSchema Reading Solr Schema
[junit4:junit4]   2> 1189 T201 oass.IndexSchema.readSchema Schema name=example
[junit4:junit4]   2> 1358 T201 oass.IndexSchema.readSchema default search field in schema is text
[junit4:junit4]   2> 1360 T201 oass.IndexSchema.readSchema unique key field: id
[junit4:junit4]   2> 1362 T201 oasc.SolrCore.<init> [collection1] Opening new SolrCore at /mnt/ssd/jenkins/workspace/Lucene-Solr-trunk-Linux/checkout/solr/build/solr-core/test-files/solr/collection1/, dataDir=./org.apache.solr.handler.component.DistributedQueryElevationComponentTest-1344073570221/shard2/data/
[junit4:junit4]   2> 1363 T201 oasc.JmxMonitoredMap.<init> JMX monitoring is enabled. Adding Solr mbeans to JMX Server: com.sun.jmx.mbeanserver.JmxMBeanServer@16ca212
[junit4:junit4]   2> 1364 T201 oasc.SolrCore.getNewIndexDir WARNING New index directory detected: old=null new=./org.apache.solr.handler.component.DistributedQueryElevationComponentTest-1344073570221/shard2/data/index/
[junit4:junit4]   2> 1364 T201 oasc.SolrCore.initIndex WARNING [collection1] Solr index directory './org.apache.solr.handler.component.DistributedQueryElevationComponentTest-1344073570221/shard2/data/index' doesn't exist. Creating new index...
[junit4:junit4]   2> 1365 T201 oasc.SolrDeletionPolicy.onCommit SolrDeletionPolicy.onCommit: commits:num=1
[junit4:junit4]   2> 		commit{dir=MockDirWrapper(org.apache.lucene.store.RAMDirectory@8923ff lockFactory=org.apache.lucene.store.SingleInstanceLockFactory@1fc5cb),segFN=segments_1,generation=1,filenames=[segments_1]
[junit4:junit4]   2> 1365 T201 oasc.SolrDeletionPolicy.updateCommits newest commit = 1
[junit4:junit4]   2> 1366 T201 oasc.RequestHandlers.initHandlersFromConfig created /update: solr.UpdateRequestHandler
[junit4:junit4]   2> 1367 T201 oasc.RequestHandlers.initHandlersFromConfig created /elevate: org.apache.solr.handler.component.SearchHandler
[junit4:junit4]   2> 1367 T201 oasc.RequestHandlers.initHandlersFromConfig created /dataElevate: org.apache.solr.handler.component.SearchHandler
[junit4:junit4]   2> 1367 T201 oashl.XMLLoader.init xsltCacheLifetimeSeconds=60
[junit4:junit4]   2> 1367 T201 oasc.RequestHandlers.initHandlersFromConfig WARNING no default request handler is registered (either '/select' or 'standard')
[junit4:junit4]   2> 1368 T201 oasc.SolrCore.initDeprecatedSupport WARNING solrconfig.xml uses deprecated <admin/gettableFiles>, Please update your config to use the ShowFileRequestHandler.
[junit4:junit4]   2> 1369 T201 oasc.SolrCore.initDeprecatedSupport WARNING adding ShowFileRequestHandler with hidden files: [SCHEMA-REPLICATION1.XML, OLD_SYNONYMS.TXT, SCHEMA15.XML, SCHEMA-BM25.XML, DA_UTF8.XML, SCHEMA-LMJELINEKMERCER.XML, SOLRCONFIG-TERMINDEX.XML, BAD-SCHEMA-NOT-INDEXED-BUT-TF.XML, SCHEMA-REQUIRED-FIELDS.XML, MISSING.FUNCTIONS.UPDATEPROCESSOR.JS, SOLRCONFIG-LAZYWRITER.XML, SOLRCONFIG-TLOG.XML, SCHEMA-BINARYFIELD.XML, BAD-SCHEMA-OMIT-TF-BUT-NOT-POS.XML, SCHEMA12.XML, SOLRCONFIG-MASTER3.XML, BAD-SCHEMA-UNIQUEKEY-MULTIVALUED.XML, BAD-MP-SOLRCONFIG.XML, CURRENCY.XML, SOLRCONFIG-QUERYSENDER-NOQUERY.XML, SCHEMASURROUND.XML, SCHEMA-REPLICATION2.XML, SOLRCONFIG-SLAVE.XML, KEEP-1.TXT, SOLRCONFIG-MASTER2.XML, SOLRCONFIG-ALTDIRECTORY.XML, SOLRCONFIG-MERGEPOLICY.XML, KEEP-2.TXT, STOPTYPES-2.TXT, BAD-SCHEMA-NONTEXT-ANALYZER.XML, SOLRCONFIG-SPELLCHECKER.XML, SOLRCONFIG-NOCACHE.XML, TRIVIAL.UPDATEPROCESSOR1.JS, SCHEMA-MINIMAL.XML, SCHEMA-LUCENEMATCHVERSION.XML, SOLRCONFIG-PROPINJECT.XML, BAD-SCHEMA-DUP-FIELDTYPE.XML, BAD-SCHEMA-UNIQUEKEY-USES-DEFAULT.XML, BAD-SOLRCONFIG-MISSING-SCRIPTFILE.XML, SOLRCONFIG-SIMPLELOCK.XML, BAD-SCHEMA-NOT-INDEXED-BUT-POS.XML, BAD-SCHEMA-NOT-INDEXED-BUT-NORMS.XML, TRIVIAL.UPDATEPROCESSOR0.JS, SOLRCONFIG-SPELLCHECKCOMPONENT.XML, ADDFIELDS.UPDATEPROCESSOR.JS, SCHEMA-NUMERIC.XML, THROW.ERROR.ON.ADD.UPDATEPROCESSOR.JS, SOLRCONFIG_CODEC.XML, SCHEMA11.XML, STOP-1.TXT, COMPOUNDDICTIONARY.TXT, SYNONYMS.TXT, SOLRCONFIG-DELPOLICY2.XML, SCHEMA-FOLDING.XML, SCHEMA-TFIDF.XML, SCHEMA-DFR.XML, SOLRCONFIG-QUERYSENDER.XML, STOP-2.TXT, SOLRCONFIG-UPDATE-PROCESSOR-CHAINS.XML, HUNSPELL-TEST.DIC, SCHEMA-IB.XML, BAD-SOLRCONFIG-INVALID-SCRIPTFILE.XML, SCHEMA-REVERSED.XML, SOLRCONFIG-SOLR-749.XML, SOLRCONFIG-HIGHLIGHT.XML, STOPWITHBOM.TXT, SOLRCONFIG-REQHANDLER.INCL, SCHEMA-CHARFILTERS.XML, SOLRCONFIG-CACHING.XML, BAD-SCHEMA-DUP-DYNAMICFIELD.XML, SCHEMA-TRIE.XML, SOLRCONFIG-BASIC.XML, SOLRCONFIG-MASTER.XML, PROTWORDS.TXT, SOLRCONFIG-PROPINJECT-INDEXDEFAULT.XML, STOPWORDSWRONGENCODING.TXT, SCHEMA-NOT-REQUIRED-UNIQUE-KEY.XML, SCHEMA-SIM.XML, BAD-SOLRCONFIG-BOGUS-SCRIPTENGINE-NAME.XML, BAD-SCHEMA-SIM-GLOBAL-VS-FT-MISMATCH.XML, BAD_SOLRCONFIG.XML, SOLRCONFIG-SOLCOREPROPERTIES.XML, SOLRCONFIG-XINCLUDE.XML, CONDITIONAL.UPDATEPROCESSOR.JS, SCHEMA-COPYFIELD-TEST.XML, BAD-SCHEMA-DUP-FIELD.XML, SCHEMA.XML, BAD-SCHEMA-ANALYZER-CLASS-AND-NESTED.XML, STEMDICT.TXT, SCHEMA_CODEC.XML, MISSLEADING.EXTENSION.UPDATEPROCESSOR.JS.TXT, STOPTYPES-1.TXT, MAPPING-ISOLATIN1ACCENT.TXT, PHRASESUGGEST.TXT, HUNSPELL-TEST.AFF, SOLRCONFIG-SLAVE1.XML, SCHEMA-STOP-KEEP.XML, SOLRCONFIG-TRANSFORMERS.XML, SOLRCONFIG-MASTER1-KEEPONEBACKUP.XML, SOLRCONFIG-SCRIPT-UPDATEPROCESSOR.XML, SOLRCONFIG-MASTER1.XML, ELEVATE.XML, SOLRCONFIG-REPEATER.XML, SOLRCONFIG-PHRASESUGGEST.XML, OPEN-EXCHANGE-RATES.JSON, DA_COMPOUNDDICTIONARY.TXT, SCHEMA-SPELLCHECKER.XML, HYPHENATION.DTD, SCHEMA-PHRASESUGGEST.XML, WDFTYPES.TXT, STOPWORDS.TXT, SCHEMA-COLLATE.XML, BAD-SCHEMA-CODEC-GLOBAL-VS-FT-MISMATCH.XML, SOLRCONFIG-ENABLEPLUGIN.XML, SOLRCONFIG_PERF.XML, SOLRCONFIG-NATIVELOCK.XML, BAD-SCHEMA-UNIQUEKEY-IS-COPYFIELD-DEST.XML, XSLT, BAD-SCHEMA-EXTERNAL-FILEFIELD.XML, SOLRCONFIG-FUNCTIONQUERY.XML, STOP-SNOWBALL.TXT, SCHEMA-LMDIRICHLET.XML, SOLRCONFIG-DELPOLICY1.XML, SOLRCONFIG-ELEVATE.XML, FRENCHARTICLES.TXT]
[junit4:junit4]   2> 1371 T201 oass.SolrIndexSearcher.<init> Opening Searcher@13725fd main
[junit4:junit4]   2> 1371 T201 oass.SolrIndexSearcher.getIndexDir WARNING WARNING: Directory impl does not support setting indexDir: org.apache.lucene.store.MockDirectoryWrapper
[junit4:junit4]   2> 1371 T201 oasu.CommitTracker.<init> Hard AutoCommit: disabled
[junit4:junit4]   2> 1371 T201 oasu.CommitTracker.<init> Soft AutoCommit: disabled
[junit4:junit4]   2> 1372 T201 oashc.QueryElevationComponent.inform Loading QueryElevation from: /mnt/ssd/jenkins/workspace/Lucene-Solr-trunk-Linux/checkout/solr/build/solr-core/test-files/solr/collection1/conf/elevate.xml
[junit4:junit4]   2> 1390 T201 oashc.QueryElevationComponent.inform Loading QueryElevation from: /mnt/ssd/jenkins/workspace/Lucene-Solr-trunk-Linux/checkout/solr/build/solr-core/test-files/solr/collection1/conf/elevate.xml
[junit4:junit4]   2> 1395 T201 oashc.HttpShardHandlerFactory.getParameter Setting socketTimeout to: 0
[junit4:junit4]   2> 1395 T201 oashc.HttpShardHandlerFactory.getParameter Setting urlScheme to: http://
[junit4:junit4]   2> 1396 T201 oashc.HttpShardHandlerFactory.getParameter Setting connTimeout to: 0
[junit4:junit4]   2> 1396 T201 oashc.HttpShardHandlerFactory.getParameter Setting maxConnectionsPerHost to: 20
[junit4:junit4]   2> 1396 T201 oashc.HttpShardHandlerFactory.getParameter Setting corePoolSize to: 0
[junit4:junit4]   2> 1396 T201 oashc.HttpShardHandlerFactory.getParameter Setting maximumPoolSize to: 2147483647
[junit4:junit4]   2> 1396 T201 oashc.HttpShardHandlerFactory.getParameter Setting maxThreadIdleTime to: 5
[junit4:junit4]   2> 1397 T201 oashc.HttpShardHandlerFactory.getParameter Setting sizeOfQueue to: -1
[junit4:junit4]   2> 1397 T201 oashc.HttpShardHandlerFactory.getParameter Setting fairnessPolicy to: false
[junit4:junit4]   2> 1397 T201 oascsi.HttpClientUtil.createClient Creating new http client, config:maxConnectionsPerHost=20&maxConnections=10000&socketTimeout=0&connTimeout=0&retry=false
[junit4:junit4]   2> 1400 T242 oasc.SolrCore.registerSearcher [collection1] Registered new searcher Searcher@13725fd main{StandardDirectoryReader(segments_1:1)}
[junit4:junit4]   2> 1400 T201 oasc.CoreContainer.register registering core: collection1
[junit4:junit4]   2> 1401 T201 oass.SolrDispatchFilter.init user.dir=/mnt/ssd/jenkins/workspace/Lucene-Solr-trunk-Linux/checkout/solr/build/solr-core/test/J1
[junit4:junit4]   2> 1401 T201 oass.SolrDispatchFilter.init SolrDispatchFilter.init() done
[junit4:junit4]   2> 1401 T201 oascsi.HttpClientUtil.createClient Creating new http client, config:maxConnections=128&maxConnectionsPerHost=32&followRedirects=false
[junit4:junit4]   2> ASYNC  NEW_CORE C12 name=collection1 org.apache.solr.core.SolrCore@17473ed
[junit4:junit4]   2> 1518 T206 C12 oasu.DirectUpdateHandler2.deleteAll [collection1] REMOVING ALL DOCUMENTS FROM INDEX
[junit4:junit4]   2> 1519 T206 C12 oasc.SolrDeletionPolicy.onInit SolrDeletionPolicy.onInit: commits:num=1
[junit4:junit4]   2> 		commit{dir=MockDirWrapper(org.apache.lucene.store.RAMDirectory@18c47a2 lockFactory=org.apache.lucene.store.SingleInstanceLockFactory@a61dc7),segFN=segments_1,generation=1,filenames=[segments_1]
[junit4:junit4]   2> 1519 T206 C12 oasc.SolrDeletionPolicy.updateCommits newest commit = 1
[junit4:junit4]   2> 1520 T206 C12 UPDATE [collection1] webapp=/solr path=/update params={version=2&wt=javabin} {deleteByQuery=*:*} 0 7
[junit4:junit4]   2> ASYNC  NEW_CORE C13 name=collection1 org.apache.solr.core.SolrCore@126af43
[junit4:junit4]   2> 1534 T215 C13 oasu.DirectUpdateHandler2.deleteAll [collection1] REMOVING ALL DOCUMENTS FROM INDEX
[junit4:junit4]   2> 1535 T215 C13 oasc.SolrDeletionPolicy.onInit SolrDeletionPolicy.onInit: commits:num=1
[junit4:junit4]   2> 		commit{dir=MockDirWrapper(org.apache.lucene.store.RAMDirectory@bc4cbb lockFactory=org.apache.lucene.store.SingleInstanceLockFactory@1db698c),segFN=segments_1,generation=1,filenames=[segments_1]
[junit4:junit4]   2> 1536 T215 C13 oasc.SolrDeletionPolicy.updateCommits newest commit = 1
[junit4:junit4]   2> 1536 T215 C13 UPDATE [collection1] webapp=/solr path=/update params={version=2&wt=javabin} {deleteByQuery=*:*} 0 2
[junit4:junit4]   2> ASYNC  NEW_CORE C14 name=collection1 org.apache.solr.core.SolrCore@1020d32
[junit4:junit4]   2> 1541 T225 C14 oasu.DirectUpdateHandler2.deleteAll [collection1] REMOVING ALL DOCUMENTS FROM INDEX
[junit4:junit4]   2> 1542 T225 C14 oasc.SolrDeletionPolicy.onInit SolrDeletionPolicy.onInit: commits:num=1
[junit4:junit4]   2> 		commit{dir=MockDirWrapper(org.apache.lucene.store.RAMDirectory@1b05b78 lockFactory=org.apache.lucene.store.SingleInstanceLockFactory@c112af),segFN=segments_1,generation=1,filenames=[segments_1]
[junit4:junit4]   2> 1543 T225 C14 oasc.SolrDeletionPolicy.updateCommits newest commit = 1
[junit4:junit4]   2> 1543 T225 C14 UPDATE [collection1] webapp=/solr path=/update params={version=2&wt=javabin} {deleteByQuery=*:*} 0 2
[junit4:junit4]   2> ASYNC  NEW_CORE C15 name=collection1 org.apache.solr.core.SolrCore@1c3a1cb
[junit4:junit4]   2> 1548 T235 C15 oasu.DirectUpdateHandler2.deleteAll [collection1] REMOVING ALL DOCUMENTS FROM INDEX
[junit4:junit4]   2> 1549 T235 C15 oasc.SolrDeletionPolicy.onInit SolrDeletionPolicy.onInit: commits:num=1
[junit4:junit4]   2> 		commit{dir=MockDirWrapper(org.apache.lucene.store.RAMDirectory@8923ff lockFactory=org.apache.lucene.store.SingleInstanceLockFactory@1fc5cb),segFN=segments_1,generation=1,filenames=[segments_1]
[junit4:junit4]   2> 1550 T235 C15 oasc.SolrDeletionPolicy.updateCommits newest commit = 1
[junit4:junit4]   2> 1550 T235 C15 UPDATE [collection1] webapp=/solr path=/update params={version=2&wt=javabin} {deleteByQuery=*:*} 0 2
[junit4:junit4]   2> 1555 T206 C12 UPDATE [collection1] webapp=/solr path=/update params={version=2&wt=javabin} {add=[1]} 0 2
[junit4:junit4]   2> 1559 T215 C13 UPDATE [collection1] webapp=/solr path=/update params={version=2&wt=javabin} {add=[1]} 0 2
[junit4:junit4]   2> 1563 T206 C12 UPDATE [collection1] webapp=/solr path=/update params={version=2&wt=javabin} {add=[2]} 0 1
[junit4:junit4]   2> 1566 T225 C14 UPDATE [collection1] webapp=/solr path=/update params={version=2&wt=javabin} {add=[2]} 0 1
[junit4:junit4]   2> 1569 T206 C12 UPDATE [collection1] webapp=/solr path=/update params={version=2&wt=javabin} {add=[3]} 0 1
[junit4:junit4]   2> 1572 T235 C15 UPDATE [collection1] webapp=/solr path=/update params={version=2&wt=javabin} {add=[3]} 0 1
[junit4:junit4]   2> 1576 T206 C12 UPDATE [collection1] webapp=/solr path=/update params={version=2&wt=javabin} {add=[4]} 0 2
[junit4:junit4]   2> 1579 T215 C13 UPDATE [collection1] webapp=/solr path=/update params={version=2&wt=javabin} {add=[4]} 0 1
[junit4:junit4]   2> 1581 T206 C12 UPDATE [collection1] webapp=/solr path=/update params={version=2&wt=javabin} {add=[5]} 0 0
[junit4:junit4]   2> 1584 T225 C14 UPDATE [collection1] webapp=/solr path=/update params={version=2&wt=javabin} {add=[5]} 0 0
[junit4:junit4]   2> 1587 T206 C12 UPDATE [collection1] webapp=/solr path=/update params={version=2&wt=javabin} {add=[6]} 0 1
[junit4:junit4]   2> 1589 T235 C15 UPDATE [collection1] webapp=/solr path=/update params={version=2&wt=javabin} {add=[6]} 0 0
[junit4:junit4]   2> 1592 T206 C12 UPDATE [collection1] webapp=/solr path=/update params={version=2&wt=javabin} {add=[7]} 0 1
[junit4:junit4]   2> 1595 T235 C15 UPDATE [collection1] webapp=/solr path=/update params={version=2&wt=javabin} {add=[7]} 0 0
[junit4:junit4]   2> 1603 T206 C12 oasu.DirectUpdateHandler2.commit start commit{flags=0,_version_=0,optimize=false,openSearcher=true,waitSearcher=true,expungeDeletes=false,softCommit=false}
[junit4:junit4]   2> 1605 T206 C12 oasc.SolrDeletionPolicy.onCommit SolrDeletionPolicy.onCommit: commits:num=2
[junit4:junit4]   2> 		commit{dir=MockDirWrapper(org.apache.lucene.store.RAMDirectory@18c47a2 lockFactory=org.apache.lucene.store.SingleInstanceLockFactory@a61dc7),segFN=segments_1,generation=1,filenames=[segments_1]
[junit4:junit4]   2> 		commit{dir=MockDirWrapper(org.apache.lucene.store.RAMDirectory@18c47a2 lockFactory=org.apache.lucene.store.SingleInstanceLockFactory@a61dc7),segFN=segments_2,generation=2,filenames=[_0.frq, _0.prx, _0.fnm, _0.fdx, _0_nrm.cfe, _0.fdt, _0_nrm.cfs, _0.tim, _0.tip, _0.si, segments_2]
[junit4:junit4]   2> 1606 T206 C12 oasc.SolrDeletionPolicy.updateCommits newest commit = 2
[junit4:junit4]   2> 1607 T206 C12 oass.SolrIndexSearcher.<init> Opening Searcher@1673724 main
[junit4:junit4]   2> 1607 T206 C12 oass.SolrIndexSearcher.getIndexDir WARNING WARNING: Directory impl does not support setting indexDir: org.apache.lucene.store.MockDirectoryWrapper
[junit4:junit4]   2> 1608 T206 C12 oasu.DirectUpdateHandler2.commit end_commit_flush
[junit4:junit4]   2> 1608 T212 oasc.SolrCore.registerSearcher [collection1] Registered new searcher Searcher@1673724 main{StandardDirectoryReader(segments_2:4 _0(5.0):C7)}
[junit4:junit4]   2> 1608 T206 C12 UPDATE [collection1] webapp=/solr path=/update params={commit=true&version=2&softCommit=false&waitSearcher=true&wt=javabin} {commit=} 0 5
[junit4:junit4]   2> 1611 T215 C13 oasu.DirectUpdateHandler2.commit start commit{flags=0,_version_=0,optimize=false,openSearcher=true,waitSearcher=true,expungeDeletes=false,softCommit=false}
[junit4:junit4]   2> 1613 T215 C13 oasc.SolrDeletionPolicy.onCommit SolrDeletionPolicy.onCommit: commits:num=2
[junit4:junit4]   2> 		commit{dir=MockDirWrapper(org.apache.lucene.store.RAMDirectory@bc4cbb lockFactory=org.apache.lucene.store.SingleInstanceLockFactory@1db698c),segFN=segments_1,generation=1,filenames=[segments_1]
[junit4:junit4]   2> 		commit{dir=MockDirWrapper(org.apache.lucene.store.RAMDirectory@bc4cbb lockFactory=org.apache.lucene.store.SingleInstanceLockFactory@1db698c),segFN=segments_2,generation=2,filenames=[_0.frq, _0.prx, _0.fnm, _0.fdx, _0_nrm.cfe, _0.fdt, _0_nrm.cfs, _0.tim, _0.tip, _0.si, segments_2]
[junit4:junit4]   2> 1613 T215 C13 oasc.SolrDeletionPolicy.updateCommits newest commit = 2
[junit4:junit4]   2> 1614 T215 C13 oass.SolrIndexSearcher.<init> Opening Searcher@1e84058 main
[junit4:junit4]   2> 1614 T215 C13 oass.SolrIndexSearcher.getIndexDir WARNING WARNING: Directory impl does not support setting indexDir: org.apache.lucene.store.MockDirectoryWrapper
[junit4:junit4]   2> 1614 T215 C13 oasu.DirectUpdateHandler2.commit end_commit_flush
[junit4:junit4]   2> 1615 T222 oasc.SolrCore.registerSearcher [collection1] Registered new searcher Searcher@1e84058 main{StandardDirectoryReader(segments_2:4 _0(5.0):C2)}
[junit4:junit4]   2> 1615 T215 C13 UPDATE [collection1] webapp=/solr path=/update params={commit=true&version=2&softCommit=false&waitSearcher=true&wt=javabin} {commit=} 0 4
[junit4:junit4]   2> 1618 T225 C14 oasu.DirectUpdateHandler2.commit start commit{flags=0,_version_=0,optimize=false,openSearcher=true,waitSearcher=true,expungeDeletes=false,softCommit=false}
[junit4:junit4]   2> 1619 T225 C14 oasc.SolrDeletionPolicy.onCommit SolrDeletionPolicy.onCommit: commits:num=2
[junit4:junit4]   2> 		commit{dir=MockDirWrapper(org.apache.lucene.store.RAMDirectory@1b05b78 lockFactory=org.apache.lucene.store.SingleInstanceLockFactory@c112af),segFN=segments_1,generation=1,filenames=[segments_1]
[junit4:junit4]   2> 		commit{dir=MockDirWrapper(org.apache.lucene.store.RAMDirectory@1b05b78 lockFactory=org.apache.lucene.store.SingleInstanceLockFactory@c112af),segFN=segments_2,generation=2,filenames=[_0.frq, _0.prx, _0.fnm, _0.fdx, _0_nrm.cfe, _0.fdt, _0_nrm.cfs, _0.tim, _0.tip, _0.si, segments_2]
[junit4:junit4]   2> 1619 T225 C14 oasc.SolrDeletionPolicy.updateCommits newest commit = 2
[junit4:junit4]   2> 1620 T225 C14 oass.SolrIndexSearcher.<init> Opening Searcher@12b186e main
[junit4:junit4]   2> 1620 T225 C14 oass.SolrIndexSearcher.getIndexDir WARNING WARNING: Directory impl does not support setting indexDir: org.apache.lucene.store.MockDirectoryWrapper
[junit4:junit4]   2> 1620 T225 C14 oasu.DirectUpdateHandler2.commit end_commit_flush
[junit4:junit4]   2> 1620 T232 oasc.SolrCore.registerSearcher [collection1] Registered new searcher Searcher@12b186e main{StandardDirectoryReader(segments_2:4 _0(5.0):C2)}
[junit4:junit4]   2> 1621 T225 C14 UPDATE [collection1] webapp=/solr path=/update params={commit=true&version=2&softCommit=false&waitSearcher=true&wt=javabin} {commit=} 0 4
[junit4:junit4]   2> 1623 T235 C15 oasu.DirectUpdateHandler2.commit start commit{flags=0,_version_=0,optimize=false,openSearcher=true,waitSearcher=true,expungeDeletes=false,softCommit=false}
[junit4:junit4]   2> 1625 T235 C15 oasc.SolrDeletionPolicy.onCommit SolrDeletionPolicy.onCommit: commits:num=2
[junit4:junit4]   2> 		commit{dir=MockDirWrapper(org.apache.lucene.store.RAMDirectory@8923ff lockFactory=org.apache.lucene.store.SingleInstanceLockFactory@1fc5cb),segFN=segments_1,generation=1,filenames=[segments_1]
[junit4:junit4]   2> 		commit{dir=MockDirWrapper(org.apache.lucene.store.RAMDirectory@8923ff lockFactory=org.apache.lucene.store.SingleInstanceLockFactory@1fc5cb),segFN=segments_2,generation=2,filenames=[_0.frq, _0.prx, _0.fnm, _0.fdx, _0_nrm.cfe, _0.fdt, _0_nrm.cfs, _0.tim, _0.tip, _0.si, segments_2]
[junit4:junit4]   2> 1625 T235 C15 oasc.SolrDeletionPolicy.updateCommits newest commit = 2
[junit4:junit4]   2> 1625 T235 C15 oass.SolrIndexSearcher.<init> Opening Searcher@45b26c main
[junit4:junit4]   2> 1626 T235 C15 oass.SolrIndexSearcher.getIndexDir WARNING WARNING: Directory impl does not support setting indexDir: org.apache.lucene.store.MockDirectoryWrapper
[junit4:junit4]   2> 1626 T235 C15 oasu.DirectUpdateHandler2.commit end_commit_flush
[junit4:junit4]   2> 1626 T242 oasc.SolrCore.registerSearcher [collection1] Registered new searcher Searcher@45b26c main{StandardDirectoryReader(segments_2:4 _0(5.0):C3)}
[junit4:junit4]   2> 1627 T235 C15 UPDATE [collection1] webapp=/solr path=/update params={commit=true&version=2&softCommit=false&waitSearcher=true&wt=javabin} {commit=} 0 4
[junit4:junit4]   2> 1657 T206 C12 REQ [collection1] webapp=/solr path=/elevate params={qt=/elevate&fl=id,+score,+[elevated]&version=2&sort=id+desc&wt=javabin&shards.qt=/elevate&q=*:*&rows=500&distrib=false} hits=7 status=0 QTime=23 
[junit4:junit4]   2> 1677 T216 C13 REQ [collection1] webapp=/solr path=/elevate params={version=2&sort=id+desc&wt=javabin&shards.qt=/elevate&q=*:*&start=0&fsv=true&fl=id,score&qt=/elevate&NOW=1344073571881&shard.url=[::1]:33332/solr|localhost:33581/solr&isShard=true&rows=500&distrib=false} hits=2 status=0 QTime=4 
[junit4:junit4]   2> 1677 T236 C15 REQ [collection1] webapp=/solr path=/elevate params={version=2&sort=id+desc&wt=javabin&shards.qt=/elevate&q=*:*&start=0&fsv=true&fl=id,score&qt=/elevate&NOW=1344073571881&shard.url=localhost:37806/solr&isShard=true&rows=500&distrib=false} hits=3 status=0 QTime=2 
[junit4:junit4]   2> 1681 T226 C14 REQ [collection1] webapp=/solr path=/elevate params={version=2&sort=id+desc&wt=javabin&shards.qt=/elevate&q=*:*&start=0&fsv=true&fl=id,score&qt=/elevate&NOW=1344073571881&shard.url=[::1]:33332/solr|localhost:46351/solr&isShard=true&rows=500&distrib=false} hits=2 status=0 QTime=1 
[junit4:junit4]   2> 1689 T236 C15 REQ [collection1] webapp=/solr path=/elevate params={version=2&wt=javabin&shards.qt=/elevate&q=*:*&qt=/elevate&fl=id,+score,+[elevated]&NOW=1344073571881&shard.url=localhost:37806/solr&isShard=true&rows=500&ids=3.0,7.0,6.0&distrib=false} status=0 QTime=0 
[junit4:junit4]   2> 1689 T226 C14 REQ [collection1] webapp=/solr path=/elevate params={version=2&wt=javabin&shards.qt=/elevate&q=*:*&qt=/elevate&fl=id,+score,+[elevated]&NOW=1344073571881&shard.url=[::1]:33332/solr|localhost:46351/solr&isShard=true&rows=500&ids=2.0,5.0&distrib=false} status=0 QTime=0 
[junit4:junit4]   2> 1691 T216 C13 REQ [collection1] webapp=/solr path=/elevate params={version=2&wt=javabin&shards.qt=/elevate&q=*:*&qt=/elevate&fl=id,+score,+[elevated]&NOW=1344073571881&shard.url=[::1]:33332/solr|localhost:33581/solr&isShard=true&rows=500&ids=1.0,4.0&distrib=false} status=0 QTime=0 
[junit4:junit4]   2> 1691 T235 C15 REQ [collection1] webapp=/solr path=/elevate params={qt=/elevate&fl=id,+score,+[elevated]&version=2&sort=id+desc&wt=javabin&shards.qt=/elevate&shards=[::1]:33332/solr|localhost:33581/solr,[::1]:33332/solr|localhost:46351/solr,localhost:37806/solr&q=*:*&rows=500} status=0 QTime=28 
[junit4:junit4]   2> 1693 T201 oas.BaseDistributedSearchTestCase.compareResponses SEVERE Mismatched responses:
[junit4:junit4]   2> 	{responseHeader={status=0,QTime=28,params={qt=/elevate,fl=id, score, [elevated],version=2,sort=id desc,wt=javabin,shards.qt=/elevate,shards=[::1]:33332/solr|localhost:33581/solr,[::1]:33332/solr|localhost:46351/solr,localhost:37806/solr,q=*:*,rows=500}},response={numFound=7,start=0,maxScore=1.0,docs=[SolrDocument{id=7.0, [elevated]=false, score=1.0}, SolrDocument{id=6.0, [elevated]=false, score=1.0}, SolrDocument{id=5.0, [elevated]=false, score=1.0}, SolrDocument{id=4.0, [elevated]=false, score=1.0}, SolrDocument{id=3.0, [elevated]=false, score=1.0}, SolrDocument{id=2.0, [elevated]=false, score=1.0}, SolrDocument{id=1.0, [elevated]=false, score=1.0}]}}
[junit4:junit4]   2> 	{responseHeader={status=0,QTime=23,params={qt=/elevate,fl=id, score, [elevated],version=2,sort=id desc,wt=javabin,shards.qt=/elevate,q=*:*,rows=500,distrib=false}},response={numFound=7,start=0,maxScore=1.0,docs=[SolrDocument{id=7.0, score=1.0, [elevated]=false}, SolrDocument{id=6.0, score=1.0, [elevated]=false}, SolrDocument{id=5.0, score=1.0, [elevated]=false}, SolrDocument{id=4.0, score=1.0, [elevated]=false}, SolrDocument{id=3.0, score=1.0, [elevated]=false}, SolrDocument{id=2.0, score=1.0, [elevated]=false}, SolrDocument{id=1.0, score=1.0, [elevated]=false}]}}
[junit4:junit4]   2> 1694 T201 oasc.CoreContainer.shutdown Shutting down CoreContainer instance=16910596
[junit4:junit4]   2> 1695 T201 oasc.SolrCore.close [collection1]  CLOSING SolrCore org.apache.solr.core.SolrCore@17473ed
[junit4:junit4]   2> 1696 T201 oasc.SolrCore.closeSearcher [collection1] Closing main searcher on request.
[junit4:junit4]   2> 1696 T201 oasu.DirectUpdateHandler2.close closing DirectUpdateHandler2{commits=1,autocommits=0,soft autocommits=0,optimizes=0,rollbacks=0,expungeDeletes=0,docsPending=0,adds=0,deletesById=0,deletesByQuery=0,errors=0,cumulative_adds=7,cumulative_deletesById=0,cumulative_deletesByQuery=1,cumulative_errors=0}
[junit4:junit4]   2> 1700 T201 oejsh.ContextHandler.doStop stopped o.e.j.s.ServletContextHandler{/solr,null}
[junit4:junit4]   2> 1754 T201 oasc.CoreContainer.shutdown Shutting down CoreContainer instance=18754291
[junit4:junit4]   2> 1754 T201 oasc.SolrCore.close [collection1]  CLOSING SolrCore org.apache.solr.core.SolrCore@126af43
[junit4:junit4]   2> 1755 T201 oasc.SolrCore.closeSearcher [collection1] Closing main searcher on request.
[junit4:junit4]   2> 1756 T201 oasu.DirectUpdateHandler2.close closing DirectUpdateHandler2{commits=1,autocommits=0,soft autocommits=0,optimizes=0,rollbacks=0,expungeDeletes=0,docsPending=0,adds=0,deletesById=0,deletesByQuery=0,errors=0,cumulative_adds=2,cumulative_deletesById=0,cumulative_deletesByQuery=1,cumulative_errors=0}
[junit4:junit4]   2> 1758 T201 oejsh.ContextHandler.doStop stopped o.e.j.s.ServletContextHandler{/solr,null}
[junit4:junit4]   2> 1811 T201 oasc.CoreContainer.shutdown Shutting down CoreContainer instance=28080747
[junit4:junit4]   2> 1811 T201 oasc.SolrCore.close [collection1]  CLOSING SolrCore org.apache.solr.core.SolrCore@1020d32
[junit4:junit4]   2> 1812 T201 oasc.SolrCore.closeSearcher [collection1] Closing main searcher on request.
[junit4:junit4]   2> 1812 T201 oasu.DirectUpdateHandler2.close closing DirectUpdateHandler2{commits=1,autocommits=0,soft autocommits=0,optimizes=0,rollbacks=0,expungeDeletes=0,docsPending=0,adds=0,deletesById=0,deletesByQuery=0,errors=0,cumulative_adds=2,cumulative_deletesById=0,cumulative_deletesByQuery=1,cumulative_errors=0}
[junit4:junit4]   2> 1814 T201 oejsh.ContextHandler.doStop stopped o.e.j.s.ServletContextHandler{/solr,null}
[junit4:junit4]   2> 1867 T201 oasc.CoreContainer.shutdown Shutting down CoreContainer instance=25086162
[junit4:junit4]   2> 1867 T201 oasc.SolrCore.close [collection1]  CLOSING SolrCore org.apache.solr.core.SolrCore@1c3a1cb
[junit4:junit4]   2> 1868 T201 oasc.SolrCore.closeSearcher [collection1] Closing main searcher on request.
[junit4:junit4]   2> 1868 T201 oasu.DirectUpdateHandler2.close closing DirectUpdateHandler2{commits=1,autocommits=0,soft autocommits=0,optimizes=0,rollbacks=0,expungeDeletes=0,docsPending=0,adds=0,deletesById=0,deletesByQuery=0,errors=0,cumulative_adds=3,cumulative_deletesById=0,cumulative_deletesByQuery=1,cumulative_errors=0}
[junit4:junit4]   2> 1871 T201 oejsh.ContextHandler.doStop stopped o.e.j.s.ServletContextHandler{/solr,null}
[junit4:junit4]   2> 1923 T201 oas.SolrTestCaseJ4.tearDown ###Ending testDistribSearch
[junit4:junit4]   2> NOTE: reproduce with: ant test  -Dtestcase=DistributedQueryElevationComponentTest -Dtests.method=testDistribSearch -Dtests.seed=4014CE423B109F4F -Dtests.multiplier=3 -Dtests.slow=true -Dtests.locale=hu -Dtests.timezone=PRC -Dtests.file.encoding=UTF-8
[junit4:junit4]   2>
[junit4:junit4]    > (@AfterClass output)
[junit4:junit4]   2> 1955 T201 oas.SolrTestCaseJ4.deleteCore ###deleteCore
[junit4:junit4]   2> NOTE: test params are: codec=Asserting, sim=RandomSimilarityProvider(queryNorm=false,coord=false): {}, locale=hu, timezone=PRC
[junit4:junit4]   2> NOTE: Linux 3.2.0-27-generic i386/Oracle Corporation 1.8.0-ea (32-bit)/cpus=8,threads=1,free=33133840,total=76140544
[junit4:junit4]   2> NOTE: All tests run in this JVM: [OutputWriterTest, TestPluginEnable, TimeZoneUtilsTest, TestSolrDeletionPolicy1, TestStressVersions, TestQueryTypes, TestFunctionQuery, TestStressRecovery, DebugComponentTest, ZkControllerTest, TestCSVLoader, TestQuerySenderListener, TestCharFilters, LegacyHTMLStripCharFilterTest, FieldAnalysisRequestHandlerTest, TestFiltering, ZkNodePropsTest, TestBinaryResponseWriter, DistributedQueryElevationComponentTest]
[junit4:junit4]   2> 
[junit4:junit4] Completed on J1 in 1.96s, 1 test, 1 failure <<< FAILURES!

[...truncated 547 lines...]
BUILD FAILED
/mnt/ssd/jenkins/workspace/Lucene-Solr-trunk-Linux/checkout/build.xml:29: The following error occurred while executing this line:
/mnt/ssd/jenkins/workspace/Lucene-Solr-trunk-Linux/checkout/solr/build.xml:144: The following error occurred while executing this line:
/mnt/ssd/jenkins/workspace/Lucene-Solr-trunk-Linux/checkout/lucene/module-build.xml:62: The following error occurred while executing this line:
/mnt/ssd/jenkins/workspace/Lucene-Solr-trunk-Linux/checkout/lucene/common-build.xml:1095: The following error occurred while executing this line:
/mnt/ssd/jenkins/workspace/Lucene-Solr-trunk-Linux/checkout/lucene/common-build.xml:790: There were test failures: 223 suites, 899 tests, 1 failure, 5 ignored

Total time: 21 minutes 42 seconds
Build step 'Execute shell' marked build as failure
Archiving artifacts
Recording test results
Email was triggered for: Failure
Sending email for trigger: Failure



Mime
View raw message