lucene-dev mailing list archives

Site index · List index
Message view « Date » · « Thread »
Top « Date » · « Thread »
From Policeman Jenkins Server <jenk...@sd-datasolutions.de>
Subject [JENKINS] Lucene-Solr-trunk-Linux (32bit/jdk1.8.0-ea-b49) - Build # 116 - Failure!
Date Thu, 02 Aug 2012 17:32:13 GMT
Build: http://jenkins.sd-datasolutions.de/job/Lucene-Solr-trunk-Linux/116/
Java: 32bit/jdk1.8.0-ea-b49 -server -XX:+UseSerialGC

1 tests failed.
REGRESSION:  org.apache.solr.handler.component.DistributedQueryElevationComponentTest.testDistribSearch

Error Message:
.responseHeader.params.qt:/elevate!=false

Stack Trace:
junit.framework.AssertionFailedError: .responseHeader.params.qt:/elevate!=false
	at __randomizedtesting.SeedInfo.seed([BE69250BC12A53A7:3F8FAB13B675339B]:0)
	at junit.framework.Assert.fail(Assert.java:50)
	at org.apache.solr.BaseDistributedSearchTestCase.compareResponses(BaseDistributedSearchTestCase.java:670)
	at org.apache.solr.BaseDistributedSearchTestCase.query(BaseDistributedSearchTestCase.java:392)
	at org.apache.solr.handler.component.DistributedQueryElevationComponentTest.doTest(DistributedQueryElevationComponentTest.java:81)
	at org.apache.solr.BaseDistributedSearchTestCase.testDistribSearch(BaseDistributedSearchTestCase.java:679)
	at sun.reflect.NativeMethodAccessorImpl.invoke0(Native Method)
	at sun.reflect.NativeMethodAccessorImpl.invoke(NativeMethodAccessorImpl.java:57)
	at sun.reflect.DelegatingMethodAccessorImpl.invoke(DelegatingMethodAccessorImpl.java:43)
	at java.lang.reflect.Method.invoke(Method.java:474)
	at com.carrotsearch.randomizedtesting.RandomizedRunner.invoke(RandomizedRunner.java:1995)
	at com.carrotsearch.randomizedtesting.RandomizedRunner.access$1100(RandomizedRunner.java:132)
	at com.carrotsearch.randomizedtesting.RandomizedRunner$6.evaluate(RandomizedRunner.java:818)
	at com.carrotsearch.randomizedtesting.RandomizedRunner$7.evaluate(RandomizedRunner.java:877)
	at com.carrotsearch.randomizedtesting.RandomizedRunner$8.evaluate(RandomizedRunner.java:891)
	at com.carrotsearch.randomizedtesting.rules.SystemPropertiesRestoreRule$1.evaluate(SystemPropertiesRestoreRule.java:53)
	at org.apache.lucene.util.TestRuleSetupTeardownChained$1.evaluate(TestRuleSetupTeardownChained.java:50)
	at org.apache.lucene.util.TestRuleFieldCacheSanity$1.evaluate(TestRuleFieldCacheSanity.java:32)
	at org.apache.lucene.util.AbstractBeforeAfterRule$1.evaluate(AbstractBeforeAfterRule.java:45)
	at com.carrotsearch.randomizedtesting.rules.SystemPropertiesInvariantRule$1.evaluate(SystemPropertiesInvariantRule.java:55)
	at org.apache.lucene.util.TestRuleReportUncaughtExceptions$1.evaluate(TestRuleReportUncaughtExceptions.java:68)
	at org.apache.lucene.util.TestRuleThreadAndTestName$1.evaluate(TestRuleThreadAndTestName.java:48)
	at org.apache.lucene.util.TestRuleIgnoreAfterMaxFailures$1.evaluate(TestRuleIgnoreAfterMaxFailures.java:70)
	at org.apache.lucene.util.TestRuleMarkFailure$1.evaluate(TestRuleMarkFailure.java:48)
	at com.carrotsearch.randomizedtesting.RandomizedRunner.runSingleTest(RandomizedRunner.java:825)
	at com.carrotsearch.randomizedtesting.RandomizedRunner.access$700(RandomizedRunner.java:132)
	at com.carrotsearch.randomizedtesting.RandomizedRunner$3$1.run(RandomizedRunner.java:671)
	at com.carrotsearch.randomizedtesting.RandomizedRunner$3.evaluate(RandomizedRunner.java:697)
	at com.carrotsearch.randomizedtesting.RandomizedRunner$4.evaluate(RandomizedRunner.java:736)
	at com.carrotsearch.randomizedtesting.RandomizedRunner$5.evaluate(RandomizedRunner.java:747)
	at com.carrotsearch.randomizedtesting.rules.SystemPropertiesRestoreRule$1.evaluate(SystemPropertiesRestoreRule.java:53)
	at org.apache.lucene.util.AbstractBeforeAfterRule$1.evaluate(AbstractBeforeAfterRule.java:45)
	at org.apache.lucene.util.TestRuleReportUncaughtExceptions$1.evaluate(TestRuleReportUncaughtExceptions.java:68)
	at org.apache.lucene.util.TestRuleStoreClassName$1.evaluate(TestRuleStoreClassName.java:38)
	at com.carrotsearch.randomizedtesting.rules.SystemPropertiesInvariantRule$1.evaluate(SystemPropertiesInvariantRule.java:55)
	at org.apache.lucene.util.TestRuleNoInstanceHooksOverrides$1.evaluate(TestRuleNoInstanceHooksOverrides.java:53)
	at org.apache.lucene.util.TestRuleNoStaticHooksShadowing$1.evaluate(TestRuleNoStaticHooksShadowing.java:52)
	at org.apache.lucene.util.TestRuleAssertionsRequired$1.evaluate(TestRuleAssertionsRequired.java:36)
	at org.apache.lucene.util.TestRuleMarkFailure$1.evaluate(TestRuleMarkFailure.java:48)
	at org.apache.lucene.util.TestRuleIgnoreAfterMaxFailures$1.evaluate(TestRuleIgnoreAfterMaxFailures.java:70)
	at org.apache.lucene.util.TestRuleIgnoreTestSuites$1.evaluate(TestRuleIgnoreTestSuites.java:55)
	at com.carrotsearch.randomizedtesting.RandomizedRunner.runSuite(RandomizedRunner.java:605)
	at com.carrotsearch.randomizedtesting.RandomizedRunner.access$400(RandomizedRunner.java:132)
	at com.carrotsearch.randomizedtesting.RandomizedRunner$2.run(RandomizedRunner.java:551)




Build Log:
[...truncated 7536 lines...]
[junit4:junit4] Suite: org.apache.solr.handler.component.DistributedQueryElevationComponentTest
[junit4:junit4] FAILURE 1.47s J1 | DistributedQueryElevationComponentTest.testDistribSearch
[junit4:junit4]    > Throwable #1: junit.framework.AssertionFailedError: .responseHeader.params.qt:/elevate!=false
[junit4:junit4]    > 	at __randomizedtesting.SeedInfo.seed([BE69250BC12A53A7:3F8FAB13B675339B]:0)
[junit4:junit4]    > 	at junit.framework.Assert.fail(Assert.java:50)
[junit4:junit4]    > 	at org.apache.solr.BaseDistributedSearchTestCase.compareResponses(BaseDistributedSearchTestCase.java:670)
[junit4:junit4]    > 	at org.apache.solr.BaseDistributedSearchTestCase.query(BaseDistributedSearchTestCase.java:392)
[junit4:junit4]    > 	at org.apache.solr.handler.component.DistributedQueryElevationComponentTest.doTest(DistributedQueryElevationComponentTest.java:81)
[junit4:junit4]    > 	at org.apache.solr.BaseDistributedSearchTestCase.testDistribSearch(BaseDistributedSearchTestCase.java:679)
[junit4:junit4]    > 	at sun.reflect.NativeMethodAccessorImpl.invoke0(Native Method)
[junit4:junit4]    > 	at sun.reflect.NativeMethodAccessorImpl.invoke(NativeMethodAccessorImpl.java:57)
[junit4:junit4]    > 	at sun.reflect.DelegatingMethodAccessorImpl.invoke(DelegatingMethodAccessorImpl.java:43)
[junit4:junit4]    > 	at java.lang.reflect.Method.invoke(Method.java:474)
[junit4:junit4]    > 	at com.carrotsearch.randomizedtesting.RandomizedRunner.invoke(RandomizedRunner.java:1995)
[junit4:junit4]    > 	at com.carrotsearch.randomizedtesting.RandomizedRunner.access$1100(RandomizedRunner.java:132)
[junit4:junit4]    > 	at com.carrotsearch.randomizedtesting.RandomizedRunner$6.evaluate(RandomizedRunner.java:818)
[junit4:junit4]    > 	at com.carrotsearch.randomizedtesting.RandomizedRunner$7.evaluate(RandomizedRunner.java:877)
[junit4:junit4]    > 	at com.carrotsearch.randomizedtesting.RandomizedRunner$8.evaluate(RandomizedRunner.java:891)
[junit4:junit4]    > 	at com.carrotsearch.randomizedtesting.rules.SystemPropertiesRestoreRule$1.evaluate(SystemPropertiesRestoreRule.java:53)
[junit4:junit4]    > 	at org.apache.lucene.util.TestRuleSetupTeardownChained$1.evaluate(TestRuleSetupTeardownChained.java:50)
[junit4:junit4]    > 	at org.apache.lucene.util.TestRuleFieldCacheSanity$1.evaluate(TestRuleFieldCacheSanity.java:32)
[junit4:junit4]    > 	at org.apache.lucene.util.AbstractBeforeAfterRule$1.evaluate(AbstractBeforeAfterRule.java:45)
[junit4:junit4]    > 	at com.carrotsearch.randomizedtesting.rules.SystemPropertiesInvariantRule$1.evaluate(SystemPropertiesInvariantRule.java:55)
[junit4:junit4]    > 	at org.apache.lucene.util.TestRuleReportUncaughtExceptions$1.evaluate(TestRuleReportUncaughtExceptions.java:68)
[junit4:junit4]    > 	at org.apache.lucene.util.TestRuleThreadAndTestName$1.evaluate(TestRuleThreadAndTestName.java:48)
[junit4:junit4]    > 	at org.apache.lucene.util.TestRuleIgnoreAfterMaxFailures$1.evaluate(TestRuleIgnoreAfterMaxFailures.java:70)
[junit4:junit4]    > 	at org.apache.lucene.util.TestRuleMarkFailure$1.evaluate(TestRuleMarkFailure.java:48)
[junit4:junit4]    > 	at com.carrotsearch.randomizedtesting.RandomizedRunner.runSingleTest(RandomizedRunner.java:825)
[junit4:junit4]    > 	at com.carrotsearch.randomizedtesting.RandomizedRunner.access$700(RandomizedRunner.java:132)
[junit4:junit4]    > 	at com.carrotsearch.randomizedtesting.RandomizedRunner$3$1.run(RandomizedRunner.java:671)
[junit4:junit4]    > 	at com.carrotsearch.randomizedtesting.RandomizedRunner$3.evaluate(RandomizedRunner.java:697)
[junit4:junit4]    > 	at com.carrotsearch.randomizedtesting.RandomizedRunner$4.evaluate(RandomizedRunner.java:736)
[junit4:junit4]    > 	at com.carrotsearch.randomizedtesting.RandomizedRunner$5.evaluate(RandomizedRunner.java:747)
[junit4:junit4]    > 	at com.carrotsearch.randomizedtesting.rules.SystemPropertiesRestoreRule$1.evaluate(SystemPropertiesRestoreRule.java:53)
[junit4:junit4]    > 	at org.apache.lucene.util.AbstractBeforeAfterRule$1.evaluate(AbstractBeforeAfterRule.java:45)
[junit4:junit4]    > 	at org.apache.lucene.util.TestRuleReportUncaughtExceptions$1.evaluate(TestRuleReportUncaughtExceptions.java:68)
[junit4:junit4]    > 	at org.apache.lucene.util.TestRuleStoreClassName$1.evaluate(TestRuleStoreClassName.java:38)
[junit4:junit4]    > 	at com.carrotsearch.randomizedtesting.rules.SystemPropertiesInvariantRule$1.evaluate(SystemPropertiesInvariantRule.java:55)
[junit4:junit4]    > 	at org.apache.lucene.util.TestRuleNoInstanceHooksOverrides$1.evaluate(TestRuleNoInstanceHooksOverrides.java:53)
[junit4:junit4]    > 	at org.apache.lucene.util.TestRuleNoStaticHooksShadowing$1.evaluate(TestRuleNoStaticHooksShadowing.java:52)
[junit4:junit4]    > 	at org.apache.lucene.util.TestRuleAssertionsRequired$1.evaluate(TestRuleAssertionsRequired.java:36)
[junit4:junit4]    > 	at org.apache.lucene.util.TestRuleMarkFailure$1.evaluate(TestRuleMarkFailure.java:48)
[junit4:junit4]    > 	at org.apache.lucene.util.TestRuleIgnoreAfterMaxFailures$1.evaluate(TestRuleIgnoreAfterMaxFailures.java:70)
[junit4:junit4]    > 	at org.apache.lucene.util.TestRuleIgnoreTestSuites$1.evaluate(TestRuleIgnoreTestSuites.java:55)
[junit4:junit4]    > 	at com.carrotsearch.randomizedtesting.RandomizedRunner.runSuite(RandomizedRunner.java:605)
[junit4:junit4]    > 	at com.carrotsearch.randomizedtesting.RandomizedRunner.access$400(RandomizedRunner.java:132)
[junit4:junit4]    > 	at com.carrotsearch.randomizedtesting.RandomizedRunner$2.run(RandomizedRunner.java:551)
[junit4:junit4]    > 
[junit4:junit4]   2> 1 T2908 oas.SolrTestCaseJ4.setUp ###Starting testDistribSearch
[junit4:junit4]   2> 2 T2908 oejs.Server.doStart jetty-8.1.2.v20120308
[junit4:junit4]   2> 4 T2908 oejs.AbstractConnector.doStart Started SocketConnector@0.0.0.0:35638
[junit4:junit4]   2> 5 T2908 oasc.SolrResourceLoader.locateSolrHome JNDI not configured for solr (NoInitialContextEx)
[junit4:junit4]   2> 5 T2908 oasc.SolrResourceLoader.locateSolrHome using system property solr.solr.home: /mnt/ssd/jenkins/workspace/Lucene-Solr-trunk-Linux/checkout/solr/build/solr-core/test-files/solr
[junit4:junit4]   2> 5 T2908 oasc.SolrResourceLoader.<init> new SolrResourceLoader for deduced Solr Home: '/mnt/ssd/jenkins/workspace/Lucene-Solr-trunk-Linux/checkout/solr/build/solr-core/test-files/solr/'
[junit4:junit4]   2> 15 T2908 oass.SolrDispatchFilter.init SolrDispatchFilter.init()
[junit4:junit4]   2> 15 T2908 oasc.SolrResourceLoader.locateSolrHome JNDI not configured for solr (NoInitialContextEx)
[junit4:junit4]   2> 15 T2908 oasc.SolrResourceLoader.locateSolrHome using system property solr.solr.home: /mnt/ssd/jenkins/workspace/Lucene-Solr-trunk-Linux/checkout/solr/build/solr-core/test-files/solr
[junit4:junit4]   2> 16 T2908 oasc.CoreContainer$Initializer.initialize looking for solr.xml: /mnt/ssd/jenkins/workspace/Lucene-Solr-trunk-Linux/checkout/solr/build/solr-core/test-files/solr/solr.xml
[junit4:junit4]   2> 16 T2908 oasc.CoreContainer.<init> New CoreContainer 15286775
[junit4:junit4]   2> 16 T2908 oasc.CoreContainer.load Loading CoreContainer using Solr Home: '/mnt/ssd/jenkins/workspace/Lucene-Solr-trunk-Linux/checkout/solr/build/solr-core/test-files/solr/'
[junit4:junit4]   2> 17 T2908 oasc.SolrResourceLoader.<init> new SolrResourceLoader for directory: '/mnt/ssd/jenkins/workspace/Lucene-Solr-trunk-Linux/checkout/solr/build/solr-core/test-files/solr/'
[junit4:junit4]   2> 25 T2908 oasc.CoreContainer.load Registering Log Listener
[junit4:junit4]   2> 41 T2908 oasc.CoreContainer.create Creating SolrCore 'collection1' using instanceDir: /mnt/ssd/jenkins/workspace/Lucene-Solr-trunk-Linux/checkout/solr/build/solr-core/test-files/solr/collection1
[junit4:junit4]   2> 41 T2908 oasc.SolrResourceLoader.<init> new SolrResourceLoader for directory: '/mnt/ssd/jenkins/workspace/Lucene-Solr-trunk-Linux/checkout/solr/build/solr-core/test-files/solr/collection1/'
[junit4:junit4]   2> 41 T2908 oasc.SolrResourceLoader.replaceClassLoader Adding 'file:/mnt/ssd/jenkins/workspace/Lucene-Solr-trunk-Linux/checkout/solr/build/solr-core/test-files/solr/collection1/lib/README' to classloader
[junit4:junit4]   2> 42 T2908 oasc.SolrResourceLoader.replaceClassLoader Adding 'file:/mnt/ssd/jenkins/workspace/Lucene-Solr-trunk-Linux/checkout/solr/build/solr-core/test-files/solr/collection1/lib/classes/' to classloader
[junit4:junit4]   2> 58 T2908 oasc.SolrConfig.<init> Using Lucene MatchVersion: LUCENE_50
[junit4:junit4]   2> 84 T2908 oasc.SolrConfig.<init> Loaded SolrConfig: solrconfig-elevate.xml
[junit4:junit4]   2> 84 T2908 oass.IndexSchema.readSchema Reading Solr Schema
[junit4:junit4]   2> 86 T2908 oass.IndexSchema.readSchema Schema name=example
[junit4:junit4]   2> 223 T2908 oass.IndexSchema.readSchema default search field in schema is text
[junit4:junit4]   2> 225 T2908 oass.IndexSchema.readSchema unique key field: id
[junit4:junit4]   2> 226 T2908 oasc.SolrCore.<init> [collection1] Opening new SolrCore at /mnt/ssd/jenkins/workspace/Lucene-Solr-trunk-Linux/checkout/solr/build/solr-core/test-files/solr/collection1/, dataDir=./org.apache.solr.handler.component.DistributedQueryElevationComponentTest-1343928688090/control/data/
[junit4:junit4]   2> 227 T2908 oasc.JmxMonitoredMap.<init> JMX monitoring is enabled. Adding Solr mbeans to JMX Server: com.sun.jmx.mbeanserver.JmxMBeanServer@d5f50d
[junit4:junit4]   2> 227 T2908 oasc.SolrCore.getNewIndexDir WARNING New index directory detected: old=null new=./org.apache.solr.handler.component.DistributedQueryElevationComponentTest-1343928688090/control/data/index/
[junit4:junit4]   2> 227 T2908 oasc.SolrCore.initIndex WARNING [collection1] Solr index directory './org.apache.solr.handler.component.DistributedQueryElevationComponentTest-1343928688090/control/data/index' doesn't exist. Creating new index...
[junit4:junit4]   2> 228 T2908 oasc.SolrDeletionPolicy.onCommit SolrDeletionPolicy.onCommit: commits:num=1
[junit4:junit4]   2> 		commit{dir=MockDirWrapper(org.apache.lucene.store.RAMDirectory@11164e5 lockFactory=org.apache.lucene.store.SingleInstanceLockFactory@11dc35e),segFN=segments_1,generation=1,filenames=[segments_1]
[junit4:junit4]   2> 228 T2908 oasc.SolrDeletionPolicy.updateCommits newest commit = 1
[junit4:junit4]   2> 229 T2908 oasc.RequestHandlers.initHandlersFromConfig created /update: solr.UpdateRequestHandler
[junit4:junit4]   2> 229 T2908 oasc.RequestHandlers.initHandlersFromConfig created /elevate: org.apache.solr.handler.component.SearchHandler
[junit4:junit4]   2> 230 T2908 oasc.RequestHandlers.initHandlersFromConfig created /dataElevate: org.apache.solr.handler.component.SearchHandler
[junit4:junit4]   2> 230 T2908 oashl.XMLLoader.init xsltCacheLifetimeSeconds=60
[junit4:junit4]   2> 230 T2908 oasc.RequestHandlers.initHandlersFromConfig WARNING no default request handler is registered (either '/select' or 'standard')
[junit4:junit4]   2> 231 T2908 oasc.SolrCore.initDeprecatedSupport WARNING solrconfig.xml uses deprecated <admin/gettableFiles>, Please update your config to use the ShowFileRequestHandler.
[junit4:junit4]   2> 232 T2908 oasc.SolrCore.initDeprecatedSupport WARNING adding ShowFileRequestHandler with hidden files: [SCHEMA-SPELLCHECKER.XML, SOLRCONFIG-DELPOLICY1.XML, BAD-SCHEMA-DUP-DYNAMICFIELD.XML, SCHEMA-BINARYFIELD.XML, BAD-SOLRCONFIG-MISSING-SCRIPTFILE.XML, TRIVIAL.UPDATEPROCESSOR0.JS, SOLRCONFIG-MASTER3.XML, BAD_SOLRCONFIG.XML, BAD-SCHEMA-EXTERNAL-FILEFIELD.XML, SCHEMA-LMDIRICHLET.XML, SCHEMA12.XML, SOLRCONFIG-HIGHLIGHT.XML, SOLRCONFIG-QUERYSENDER-NOQUERY.XML, ADDFIELDS.UPDATEPROCESSOR.JS, SOLRCONFIG-TRANSFORMERS.XML, SYNONYMS.TXT, SCHEMA.XML, SOLRCONFIG-MASTER1.XML, SCHEMA-COPYFIELD-TEST.XML, SCHEMA-REPLICATION2.XML, STOP-2.TXT, BAD-SCHEMA-CODEC-GLOBAL-VS-FT-MISMATCH.XML, BAD-SCHEMA-ANALYZER-CLASS-AND-NESTED.XML, SCHEMA-MINIMAL.XML, SOLRCONFIG-NOCACHE.XML, BAD-SOLRCONFIG-BOGUS-SCRIPTENGINE-NAME.XML, SOLRCONFIG-SLAVE1.XML, SOLRCONFIG-MASTER.XML, SCHEMA-FOLDING.XML, SOLRCONFIG-TLOG.XML, MISSING.FUNCTIONS.UPDATEPROCESSOR.JS, SCHEMA-REPLICATION1.XML, CURRENCY.XML, SOLRCONFIG-LAZYWRITER.XML, PHRASESUGGEST.TXT, SOLRCONFIG-SLAVE.XML, DA_COMPOUNDDICTIONARY.TXT, BAD-SOLRCONFIG-INVALID-SCRIPTFILE.XML, SOLRCONFIG-ELEVATE.XML, SOLRCONFIG-CACHING.XML, BAD-SCHEMA-UNIQUEKEY-USES-DEFAULT.XML, SOLRCONFIG-NATIVELOCK.XML, BAD-SCHEMA-SIM-GLOBAL-VS-FT-MISMATCH.XML, SCHEMA-COLLATE.XML, KEEP-1.TXT, TRIVIAL.UPDATEPROCESSOR1.JS, SOLRCONFIG-REPEATER.XML, SOLRCONFIG-SIMPLELOCK.XML, SCHEMA-REVERSED.XML, SOLRCONFIG-REQHANDLER.INCL, SCHEMA-NOT-REQUIRED-UNIQUE-KEY.XML, SOLRCONFIG-ALTDIRECTORY.XML, SCHEMA-TFIDF.XML, STOP-SNOWBALL.TXT, SOLRCONFIG-XINCLUDE.XML, OPEN-EXCHANGE-RATES.JSON, SCHEMA-REQUIRED-FIELDS.XML, SCHEMA-NUMERIC.XML, SOLRCONFIG_CODEC.XML, SCHEMA-CHARFILTERS.XML, SOLRCONFIG-ENABLEPLUGIN.XML, SOLRCONFIG-BASIC.XML, SOLRCONFIG-TERMINDEX.XML, SOLRCONFIG-PROPINJECT.XML, HUNSPELL-TEST.AFF, SCHEMA-BM25.XML, CONDITIONAL.UPDATEPROCESSOR.JS, SOLRCONFIG-PROPINJECT-INDEXDEFAULT.XML, SOLRCONFIG-PHRASESUGGEST.XML, BAD-SCHEMA-OMIT-TF-BUT-NOT-POS.XML, SCHEMA-PHRASESUGGEST.XML, STOP-1.TXT, PROTWORDS.TXT, DA_UTF8.XML, SCHEMA-IB.XML, BAD-SCHEMA-DUP-FIELDTYPE.XML, OLD_SYNONYMS.TXT, HYPHENATION.DTD, SOLRCONFIG-SPELLCHECKCOMPONENT.XML, MISSLEADING.EXTENSION.UPDATEPROCESSOR.JS.TXT, SOLRCONFIG-UPDATE-PROCESSOR-CHAINS.XML, SOLRCONFIG-SPELLCHECKER.XML, SCHEMA_CODEC.XML, STOPWITHBOM.TXT, ELEVATE.XML, BAD-SCHEMA-NONTEXT-ANALYZER.XML, BAD-MP-SOLRCONFIG.XML, MAPPING-ISOLATIN1ACCENT.TXT, BAD-SCHEMA-DUP-FIELD.XML, STOPWORDSWRONGENCODING.TXT, SOLRCONFIG-MERGEPOLICY.XML, SOLRCONFIG-MASTER1-KEEPONEBACKUP.XML, SOLRCONFIG-QUERYSENDER.XML, COMPOUNDDICTIONARY.TXT, STOPTYPES-1.TXT, XSLT, SOLRCONFIG-DELPOLICY2.XML, SOLRCONFIG-SCRIPT-UPDATEPROCESSOR.XML, SOLRCONFIG-FUNCTIONQUERY.XML, SCHEMA-LUCENEMATCHVERSION.XML, SOLRCONFIG-SOLCOREPROPERTIES.XML, BAD-SCHEMA-UNIQUEKEY-MULTIVALUED.XML, SCHEMA-DFR.XML, BAD-SCHEMA-UNIQUEKEY-IS-COPYFIELD-DEST.XML, SOLRCONFIG-SOLR-749.XML, THROW.ERROR.ON.ADD.UPDATEPROCESSOR.JS, SCHEMA11.XML, WDFTYPES.TXT, SCHEMA15.XML, FRENCHARTICLES.TXT, HUNSPELL-TEST.DIC, SCHEMA-LMJELINEKMERCER.XML, SCHEMA-STOP-KEEP.XML, BAD-SCHEMA-NOT-INDEXED-BUT-TF.XML, SCHEMASURROUND.XML, SOLRCONFIG-MASTER2.XML, BAD-SCHEMA-NOT-INDEXED-BUT-NORMS.XML, STEMDICT.TXT, SCHEMA-SIM.XML, KEEP-2.TXT, SCHEMA-TRIE.XML, SOLRCONFIG_PERF.XML, STOPTYPES-2.TXT, BAD-SCHEMA-NOT-INDEXED-BUT-POS.XML, STOPWORDS.TXT]
[junit4:junit4]   2> 233 T2908 oass.SolrIndexSearcher.<init> Opening Searcher@fe90ef main
[junit4:junit4]   2> 234 T2908 oass.SolrIndexSearcher.getIndexDir WARNING WARNING: Directory impl does not support setting indexDir: org.apache.lucene.store.MockDirectoryWrapper
[junit4:junit4]   2> 234 T2908 oasu.CommitTracker.<init> Hard AutoCommit: disabled
[junit4:junit4]   2> 234 T2908 oasu.CommitTracker.<init> Soft AutoCommit: disabled
[junit4:junit4]   2> 234 T2908 oashc.QueryElevationComponent.inform Loading QueryElevation from: /mnt/ssd/jenkins/workspace/Lucene-Solr-trunk-Linux/checkout/solr/build/solr-core/test-files/solr/collection1/conf/elevate.xml
[junit4:junit4]   2> 239 T2908 oashc.QueryElevationComponent.inform Loading QueryElevation from: /mnt/ssd/jenkins/workspace/Lucene-Solr-trunk-Linux/checkout/solr/build/solr-core/test-files/solr/collection1/conf/elevate.xml
[junit4:junit4]   2> 244 T2908 oashc.HttpShardHandlerFactory.getParameter Setting socketTimeout to: 0
[junit4:junit4]   2> 245 T2908 oashc.HttpShardHandlerFactory.getParameter Setting urlScheme to: http://
[junit4:junit4]   2> 245 T2908 oashc.HttpShardHandlerFactory.getParameter Setting connTimeout to: 0
[junit4:junit4]   2> 245 T2908 oashc.HttpShardHandlerFactory.getParameter Setting maxConnectionsPerHost to: 20
[junit4:junit4]   2> 245 T2908 oashc.HttpShardHandlerFactory.getParameter Setting corePoolSize to: 0
[junit4:junit4]   2> 246 T2908 oashc.HttpShardHandlerFactory.getParameter Setting maximumPoolSize to: 2147483647
[junit4:junit4]   2> 246 T2908 oashc.HttpShardHandlerFactory.getParameter Setting maxThreadIdleTime to: 5
[junit4:junit4]   2> 246 T2908 oashc.HttpShardHandlerFactory.getParameter Setting sizeOfQueue to: -1
[junit4:junit4]   2> 246 T2908 oashc.HttpShardHandlerFactory.getParameter Setting fairnessPolicy to: false
[junit4:junit4]   2> 246 T2908 oascsi.HttpClientUtil.createClient Creating new http client, config:maxConnectionsPerHost=20&maxConnections=10000&socketTimeout=0&connTimeout=0&retry=false
[junit4:junit4]   2> 249 T2918 oasc.SolrCore.registerSearcher [collection1] Registered new searcher Searcher@fe90ef main{StandardDirectoryReader(segments_1:1)}
[junit4:junit4]   2> 249 T2908 oasc.CoreContainer.register registering core: collection1
[junit4:junit4]   2> 249 T2908 oass.SolrDispatchFilter.init user.dir=/mnt/ssd/jenkins/workspace/Lucene-Solr-trunk-Linux/checkout/solr/build/solr-core/test/J1
[junit4:junit4]   2> 249 T2908 oass.SolrDispatchFilter.init SolrDispatchFilter.init() done
[junit4:junit4]   2> 249 T2908 oascsi.HttpClientUtil.createClient Creating new http client, config:maxConnections=128&maxConnectionsPerHost=32&followRedirects=false
[junit4:junit4]   2> 251 T2908 oejs.Server.doStart jetty-8.1.2.v20120308
[junit4:junit4]   2> 253 T2908 oejs.AbstractConnector.doStart Started SocketConnector@0.0.0.0:56933
[junit4:junit4]   2> 255 T2908 oasc.SolrResourceLoader.locateSolrHome JNDI not configured for solr (NoInitialContextEx)
[junit4:junit4]   2> 255 T2908 oasc.SolrResourceLoader.locateSolrHome using system property solr.solr.home: /mnt/ssd/jenkins/workspace/Lucene-Solr-trunk-Linux/checkout/solr/build/solr-core/test-files/solr
[junit4:junit4]   2> 255 T2908 oasc.SolrResourceLoader.<init> new SolrResourceLoader for deduced Solr Home: '/mnt/ssd/jenkins/workspace/Lucene-Solr-trunk-Linux/checkout/solr/build/solr-core/test-files/solr/'
[junit4:junit4]   2> 262 T2908 oass.SolrDispatchFilter.init SolrDispatchFilter.init()
[junit4:junit4]   2> 263 T2908 oasc.SolrResourceLoader.locateSolrHome JNDI not configured for solr (NoInitialContextEx)
[junit4:junit4]   2> 263 T2908 oasc.SolrResourceLoader.locateSolrHome using system property solr.solr.home: /mnt/ssd/jenkins/workspace/Lucene-Solr-trunk-Linux/checkout/solr/build/solr-core/test-files/solr
[junit4:junit4]   2> 263 T2908 oasc.CoreContainer$Initializer.initialize looking for solr.xml: /mnt/ssd/jenkins/workspace/Lucene-Solr-trunk-Linux/checkout/solr/build/solr-core/test-files/solr/solr.xml
[junit4:junit4]   2> 263 T2908 oasc.CoreContainer.<init> New CoreContainer 33527018
[junit4:junit4]   2> 264 T2908 oasc.CoreContainer.load Loading CoreContainer using Solr Home: '/mnt/ssd/jenkins/workspace/Lucene-Solr-trunk-Linux/checkout/solr/build/solr-core/test-files/solr/'
[junit4:junit4]   2> 264 T2908 oasc.SolrResourceLoader.<init> new SolrResourceLoader for directory: '/mnt/ssd/jenkins/workspace/Lucene-Solr-trunk-Linux/checkout/solr/build/solr-core/test-files/solr/'
[junit4:junit4]   2> 281 T2908 oasc.CoreContainer.load Registering Log Listener
[junit4:junit4]   2> 291 T2908 oasc.CoreContainer.create Creating SolrCore 'collection1' using instanceDir: /mnt/ssd/jenkins/workspace/Lucene-Solr-trunk-Linux/checkout/solr/build/solr-core/test-files/solr/collection1
[junit4:junit4]   2> 291 T2908 oasc.SolrResourceLoader.<init> new SolrResourceLoader for directory: '/mnt/ssd/jenkins/workspace/Lucene-Solr-trunk-Linux/checkout/solr/build/solr-core/test-files/solr/collection1/'
[junit4:junit4]   2> 292 T2908 oasc.SolrResourceLoader.replaceClassLoader Adding 'file:/mnt/ssd/jenkins/workspace/Lucene-Solr-trunk-Linux/checkout/solr/build/solr-core/test-files/solr/collection1/lib/README' to classloader
[junit4:junit4]   2> 292 T2908 oasc.SolrResourceLoader.replaceClassLoader Adding 'file:/mnt/ssd/jenkins/workspace/Lucene-Solr-trunk-Linux/checkout/solr/build/solr-core/test-files/solr/collection1/lib/classes/' to classloader
[junit4:junit4]   2> 311 T2908 oasc.SolrConfig.<init> Using Lucene MatchVersion: LUCENE_50
[junit4:junit4]   2> 343 T2908 oasc.SolrConfig.<init> Loaded SolrConfig: solrconfig-elevate.xml
[junit4:junit4]   2> 343 T2908 oass.IndexSchema.readSchema Reading Solr Schema
[junit4:junit4]   2> 346 T2908 oass.IndexSchema.readSchema Schema name=example
[junit4:junit4]   2> 473 T2908 oass.IndexSchema.readSchema default search field in schema is text
[junit4:junit4]   2> 475 T2908 oass.IndexSchema.readSchema unique key field: id
[junit4:junit4]   2> 476 T2908 oasc.SolrCore.<init> [collection1] Opening new SolrCore at /mnt/ssd/jenkins/workspace/Lucene-Solr-trunk-Linux/checkout/solr/build/solr-core/test-files/solr/collection1/, dataDir=./org.apache.solr.handler.component.DistributedQueryElevationComponentTest-1343928688090/shard0/data/
[junit4:junit4]   2> 477 T2908 oasc.JmxMonitoredMap.<init> JMX monitoring is enabled. Adding Solr mbeans to JMX Server: com.sun.jmx.mbeanserver.JmxMBeanServer@d5f50d
[junit4:junit4]   2> 477 T2908 oasc.SolrCore.getNewIndexDir WARNING New index directory detected: old=null new=./org.apache.solr.handler.component.DistributedQueryElevationComponentTest-1343928688090/shard0/data/index/
[junit4:junit4]   2> 477 T2908 oasc.SolrCore.initIndex WARNING [collection1] Solr index directory './org.apache.solr.handler.component.DistributedQueryElevationComponentTest-1343928688090/shard0/data/index' doesn't exist. Creating new index...
[junit4:junit4]   2> 478 T2908 oasc.SolrDeletionPolicy.onCommit SolrDeletionPolicy.onCommit: commits:num=1
[junit4:junit4]   2> 		commit{dir=MockDirWrapper(NRTCachingDirectory(org.apache.lucene.store.RAMDirectory@1ffb93f lockFactory=org.apache.lucene.store.SingleInstanceLockFactory@1624ae8; maxCacheMB=0.23828125 maxMergeSizeMB=0.7294921875)),segFN=segments_1,generation=1,filenames=[segments_1]
[junit4:junit4]   2> 478 T2908 oasc.SolrDeletionPolicy.updateCommits newest commit = 1
[junit4:junit4]   2> 479 T2908 oasc.RequestHandlers.initHandlersFromConfig created /update: solr.UpdateRequestHandler
[junit4:junit4]   2> 479 T2908 oasc.RequestHandlers.initHandlersFromConfig created /elevate: org.apache.solr.handler.component.SearchHandler
[junit4:junit4]   2> 480 T2908 oasc.RequestHandlers.initHandlersFromConfig created /dataElevate: org.apache.solr.handler.component.SearchHandler
[junit4:junit4]   2> 480 T2908 oashl.XMLLoader.init xsltCacheLifetimeSeconds=60
[junit4:junit4]   2> 480 T2908 oasc.RequestHandlers.initHandlersFromConfig WARNING no default request handler is registered (either '/select' or 'standard')
[junit4:junit4]   2> 481 T2908 oasc.SolrCore.initDeprecatedSupport WARNING solrconfig.xml uses deprecated <admin/gettableFiles>, Please update your config to use the ShowFileRequestHandler.
[junit4:junit4]   2> 482 T2908 oasc.SolrCore.initDeprecatedSupport WARNING adding ShowFileRequestHandler with hidden files: [SCHEMA-SPELLCHECKER.XML, SOLRCONFIG-DELPOLICY1.XML, BAD-SCHEMA-DUP-DYNAMICFIELD.XML, SCHEMA-BINARYFIELD.XML, BAD-SOLRCONFIG-MISSING-SCRIPTFILE.XML, TRIVIAL.UPDATEPROCESSOR0.JS, SOLRCONFIG-MASTER3.XML, BAD_SOLRCONFIG.XML, BAD-SCHEMA-EXTERNAL-FILEFIELD.XML, SCHEMA-LMDIRICHLET.XML, SCHEMA12.XML, SOLRCONFIG-HIGHLIGHT.XML, SOLRCONFIG-QUERYSENDER-NOQUERY.XML, ADDFIELDS.UPDATEPROCESSOR.JS, SOLRCONFIG-TRANSFORMERS.XML, SYNONYMS.TXT, SCHEMA.XML, SOLRCONFIG-MASTER1.XML, SCHEMA-COPYFIELD-TEST.XML, SCHEMA-REPLICATION2.XML, STOP-2.TXT, BAD-SCHEMA-CODEC-GLOBAL-VS-FT-MISMATCH.XML, BAD-SCHEMA-ANALYZER-CLASS-AND-NESTED.XML, SCHEMA-MINIMAL.XML, SOLRCONFIG-NOCACHE.XML, BAD-SOLRCONFIG-BOGUS-SCRIPTENGINE-NAME.XML, SOLRCONFIG-SLAVE1.XML, SOLRCONFIG-MASTER.XML, SCHEMA-FOLDING.XML, SOLRCONFIG-TLOG.XML, MISSING.FUNCTIONS.UPDATEPROCESSOR.JS, SCHEMA-REPLICATION1.XML, CURRENCY.XML, SOLRCONFIG-LAZYWRITER.XML, PHRASESUGGEST.TXT, SOLRCONFIG-SLAVE.XML, DA_COMPOUNDDICTIONARY.TXT, BAD-SOLRCONFIG-INVALID-SCRIPTFILE.XML, SOLRCONFIG-ELEVATE.XML, SOLRCONFIG-CACHING.XML, BAD-SCHEMA-UNIQUEKEY-USES-DEFAULT.XML, SOLRCONFIG-NATIVELOCK.XML, BAD-SCHEMA-SIM-GLOBAL-VS-FT-MISMATCH.XML, SCHEMA-COLLATE.XML, KEEP-1.TXT, TRIVIAL.UPDATEPROCESSOR1.JS, SOLRCONFIG-REPEATER.XML, SOLRCONFIG-SIMPLELOCK.XML, SCHEMA-REVERSED.XML, SOLRCONFIG-REQHANDLER.INCL, SCHEMA-NOT-REQUIRED-UNIQUE-KEY.XML, SOLRCONFIG-ALTDIRECTORY.XML, SCHEMA-TFIDF.XML, STOP-SNOWBALL.TXT, SOLRCONFIG-XINCLUDE.XML, OPEN-EXCHANGE-RATES.JSON, SCHEMA-REQUIRED-FIELDS.XML, SCHEMA-NUMERIC.XML, SOLRCONFIG_CODEC.XML, SCHEMA-CHARFILTERS.XML, SOLRCONFIG-ENABLEPLUGIN.XML, SOLRCONFIG-BASIC.XML, SOLRCONFIG-TERMINDEX.XML, SOLRCONFIG-PROPINJECT.XML, HUNSPELL-TEST.AFF, SCHEMA-BM25.XML, CONDITIONAL.UPDATEPROCESSOR.JS, SOLRCONFIG-PROPINJECT-INDEXDEFAULT.XML, SOLRCONFIG-PHRASESUGGEST.XML, BAD-SCHEMA-OMIT-TF-BUT-NOT-POS.XML, SCHEMA-PHRASESUGGEST.XML, STOP-1.TXT, PROTWORDS.TXT, DA_UTF8.XML, SCHEMA-IB.XML, BAD-SCHEMA-DUP-FIELDTYPE.XML, OLD_SYNONYMS.TXT, HYPHENATION.DTD, SOLRCONFIG-SPELLCHECKCOMPONENT.XML, MISSLEADING.EXTENSION.UPDATEPROCESSOR.JS.TXT, SOLRCONFIG-UPDATE-PROCESSOR-CHAINS.XML, SOLRCONFIG-SPELLCHECKER.XML, SCHEMA_CODEC.XML, STOPWITHBOM.TXT, ELEVATE.XML, BAD-SCHEMA-NONTEXT-ANALYZER.XML, BAD-MP-SOLRCONFIG.XML, MAPPING-ISOLATIN1ACCENT.TXT, BAD-SCHEMA-DUP-FIELD.XML, STOPWORDSWRONGENCODING.TXT, SOLRCONFIG-MERGEPOLICY.XML, SOLRCONFIG-MASTER1-KEEPONEBACKUP.XML, SOLRCONFIG-QUERYSENDER.XML, COMPOUNDDICTIONARY.TXT, STOPTYPES-1.TXT, XSLT, SOLRCONFIG-DELPOLICY2.XML, SOLRCONFIG-SCRIPT-UPDATEPROCESSOR.XML, SOLRCONFIG-FUNCTIONQUERY.XML, SCHEMA-LUCENEMATCHVERSION.XML, SOLRCONFIG-SOLCOREPROPERTIES.XML, BAD-SCHEMA-UNIQUEKEY-MULTIVALUED.XML, SCHEMA-DFR.XML, BAD-SCHEMA-UNIQUEKEY-IS-COPYFIELD-DEST.XML, SOLRCONFIG-SOLR-749.XML, THROW.ERROR.ON.ADD.UPDATEPROCESSOR.JS, SCHEMA11.XML, WDFTYPES.TXT, SCHEMA15.XML, FRENCHARTICLES.TXT, HUNSPELL-TEST.DIC, SCHEMA-LMJELINEKMERCER.XML, SCHEMA-STOP-KEEP.XML, BAD-SCHEMA-NOT-INDEXED-BUT-TF.XML, SCHEMASURROUND.XML, SOLRCONFIG-MASTER2.XML, BAD-SCHEMA-NOT-INDEXED-BUT-NORMS.XML, STEMDICT.TXT, SCHEMA-SIM.XML, KEEP-2.TXT, SCHEMA-TRIE.XML, SOLRCONFIG_PERF.XML, STOPTYPES-2.TXT, BAD-SCHEMA-NOT-INDEXED-BUT-POS.XML, STOPWORDS.TXT]
[junit4:junit4]   2> 483 T2908 oass.SolrIndexSearcher.<init> Opening Searcher@117c889 main
[junit4:junit4]   2> 484 T2908 oass.SolrIndexSearcher.getIndexDir WARNING WARNING: Directory impl does not support setting indexDir: org.apache.lucene.store.MockDirectoryWrapper
[junit4:junit4]   2> 484 T2908 oasu.CommitTracker.<init> Hard AutoCommit: disabled
[junit4:junit4]   2> 484 T2908 oasu.CommitTracker.<init> Soft AutoCommit: disabled
[junit4:junit4]   2> 485 T2908 oashc.QueryElevationComponent.inform Loading QueryElevation from: /mnt/ssd/jenkins/workspace/Lucene-Solr-trunk-Linux/checkout/solr/build/solr-core/test-files/solr/collection1/conf/elevate.xml
[junit4:junit4]   2> 489 T2908 oashc.QueryElevationComponent.inform Loading QueryElevation from: /mnt/ssd/jenkins/workspace/Lucene-Solr-trunk-Linux/checkout/solr/build/solr-core/test-files/solr/collection1/conf/elevate.xml
[junit4:junit4]   2> 495 T2908 oashc.HttpShardHandlerFactory.getParameter Setting socketTimeout to: 0
[junit4:junit4]   2> 495 T2908 oashc.HttpShardHandlerFactory.getParameter Setting urlScheme to: http://
[junit4:junit4]   2> 495 T2908 oashc.HttpShardHandlerFactory.getParameter Setting connTimeout to: 0
[junit4:junit4]   2> 495 T2908 oashc.HttpShardHandlerFactory.getParameter Setting maxConnectionsPerHost to: 20
[junit4:junit4]   2> 495 T2908 oashc.HttpShardHandlerFactory.getParameter Setting corePoolSize to: 0
[junit4:junit4]   2> 496 T2908 oashc.HttpShardHandlerFactory.getParameter Setting maximumPoolSize to: 2147483647
[junit4:junit4]   2> 496 T2908 oashc.HttpShardHandlerFactory.getParameter Setting maxThreadIdleTime to: 5
[junit4:junit4]   2> 496 T2908 oashc.HttpShardHandlerFactory.getParameter Setting sizeOfQueue to: -1
[junit4:junit4]   2> 496 T2908 oashc.HttpShardHandlerFactory.getParameter Setting fairnessPolicy to: false
[junit4:junit4]   2> 496 T2908 oascsi.HttpClientUtil.createClient Creating new http client, config:maxConnectionsPerHost=20&maxConnections=10000&socketTimeout=0&connTimeout=0&retry=false
[junit4:junit4]   2> 498 T2928 oasc.SolrCore.registerSearcher [collection1] Registered new searcher Searcher@117c889 main{StandardDirectoryReader(segments_1:1)}
[junit4:junit4]   2> 498 T2908 oasc.CoreContainer.register registering core: collection1
[junit4:junit4]   2> 499 T2908 oass.SolrDispatchFilter.init user.dir=/mnt/ssd/jenkins/workspace/Lucene-Solr-trunk-Linux/checkout/solr/build/solr-core/test/J1
[junit4:junit4]   2> 499 T2908 oass.SolrDispatchFilter.init SolrDispatchFilter.init() done
[junit4:junit4]   2> 499 T2908 oascsi.HttpClientUtil.createClient Creating new http client, config:maxConnections=128&maxConnectionsPerHost=32&followRedirects=false
[junit4:junit4]   2> 501 T2908 oejs.Server.doStart jetty-8.1.2.v20120308
[junit4:junit4]   2> 510 T2908 oejs.AbstractConnector.doStart Started SocketConnector@0.0.0.0:60840
[junit4:junit4]   2> 511 T2908 oasc.SolrResourceLoader.locateSolrHome JNDI not configured for solr (NoInitialContextEx)
[junit4:junit4]   2> 511 T2908 oasc.SolrResourceLoader.locateSolrHome using system property solr.solr.home: /mnt/ssd/jenkins/workspace/Lucene-Solr-trunk-Linux/checkout/solr/build/solr-core/test-files/solr
[junit4:junit4]   2> 511 T2908 oasc.SolrResourceLoader.<init> new SolrResourceLoader for deduced Solr Home: '/mnt/ssd/jenkins/workspace/Lucene-Solr-trunk-Linux/checkout/solr/build/solr-core/test-files/solr/'
[junit4:junit4]   2> 519 T2908 oass.SolrDispatchFilter.init SolrDispatchFilter.init()
[junit4:junit4]   2> 519 T2908 oasc.SolrResourceLoader.locateSolrHome JNDI not configured for solr (NoInitialContextEx)
[junit4:junit4]   2> 520 T2908 oasc.SolrResourceLoader.locateSolrHome using system property solr.solr.home: /mnt/ssd/jenkins/workspace/Lucene-Solr-trunk-Linux/checkout/solr/build/solr-core/test-files/solr
[junit4:junit4]   2> 520 T2908 oasc.CoreContainer$Initializer.initialize looking for solr.xml: /mnt/ssd/jenkins/workspace/Lucene-Solr-trunk-Linux/checkout/solr/build/solr-core/test-files/solr/solr.xml
[junit4:junit4]   2> 520 T2908 oasc.CoreContainer.<init> New CoreContainer 26150195
[junit4:junit4]   2> 520 T2908 oasc.CoreContainer.load Loading CoreContainer using Solr Home: '/mnt/ssd/jenkins/workspace/Lucene-Solr-trunk-Linux/checkout/solr/build/solr-core/test-files/solr/'
[junit4:junit4]   2> 520 T2908 oasc.SolrResourceLoader.<init> new SolrResourceLoader for directory: '/mnt/ssd/jenkins/workspace/Lucene-Solr-trunk-Linux/checkout/solr/build/solr-core/test-files/solr/'
[junit4:junit4]   2> 530 T2908 oasc.CoreContainer.load Registering Log Listener
[junit4:junit4]   2> 534 T2436 oaz.ClientCnxn$SendThread.startConnect Opening socket connection to server localhost.localdomain/127.0.0.1:51978
[junit4:junit4]   2> 534 T2436 oaz.ClientCnxn$SendThread.run WARNING Session 0x138e86278240010 for server null, unexpected error, closing socket connection and attempting reconnect java.net.ConnectException: Connection refused
[junit4:junit4]   2> 	at sun.nio.ch.SocketChannelImpl.checkConnect(Native Method)
[junit4:junit4]   2> 	at sun.nio.ch.SocketChannelImpl.finishConnect(SocketChannelImpl.java:692)
[junit4:junit4]   2> 	at org.apache.zookeeper.ClientCnxn$SendThread.run(ClientCnxn.java:1143)
[junit4:junit4]   2> 
[junit4:junit4]   2> 541 T2908 oasc.CoreContainer.create Creating SolrCore 'collection1' using instanceDir: /mnt/ssd/jenkins/workspace/Lucene-Solr-trunk-Linux/checkout/solr/build/solr-core/test-files/solr/collection1
[junit4:junit4]   2> 541 T2908 oasc.SolrResourceLoader.<init> new SolrResourceLoader for directory: '/mnt/ssd/jenkins/workspace/Lucene-Solr-trunk-Linux/checkout/solr/build/solr-core/test-files/solr/collection1/'
[junit4:junit4]   2> 542 T2908 oasc.SolrResourceLoader.replaceClassLoader Adding 'file:/mnt/ssd/jenkins/workspace/Lucene-Solr-trunk-Linux/checkout/solr/build/solr-core/test-files/solr/collection1/lib/README' to classloader
[junit4:junit4]   2> 542 T2908 oasc.SolrResourceLoader.replaceClassLoader Adding 'file:/mnt/ssd/jenkins/workspace/Lucene-Solr-trunk-Linux/checkout/solr/build/solr-core/test-files/solr/collection1/lib/classes/' to classloader
[junit4:junit4]   2> 563 T2908 oasc.SolrConfig.<init> Using Lucene MatchVersion: LUCENE_50
[junit4:junit4]   2> 598 T2908 oasc.SolrConfig.<init> Loaded SolrConfig: solrconfig-elevate.xml
[junit4:junit4]   2> 598 T2908 oass.IndexSchema.readSchema Reading Solr Schema
[junit4:junit4]   2> 601 T2908 oass.IndexSchema.readSchema Schema name=example
[junit4:junit4]   2> 736 T2908 oass.IndexSchema.readSchema default search field in schema is text
[junit4:junit4]   2> 738 T2908 oass.IndexSchema.readSchema unique key field: id
[junit4:junit4]   2> 740 T2908 oasc.SolrCore.<init> [collection1] Opening new SolrCore at /mnt/ssd/jenkins/workspace/Lucene-Solr-trunk-Linux/checkout/solr/build/solr-core/test-files/solr/collection1/, dataDir=./org.apache.solr.handler.component.DistributedQueryElevationComponentTest-1343928688090/shard1/data/
[junit4:junit4]   2> 741 T2908 oasc.JmxMonitoredMap.<init> JMX monitoring is enabled. Adding Solr mbeans to JMX Server: com.sun.jmx.mbeanserver.JmxMBeanServer@d5f50d
[junit4:junit4]   2> 741 T2908 oasc.SolrCore.getNewIndexDir WARNING New index directory detected: old=null new=./org.apache.solr.handler.component.DistributedQueryElevationComponentTest-1343928688090/shard1/data/index/
[junit4:junit4]   2> 741 T2908 oasc.SolrCore.initIndex WARNING [collection1] Solr index directory './org.apache.solr.handler.component.DistributedQueryElevationComponentTest-1343928688090/shard1/data/index' doesn't exist. Creating new index...
[junit4:junit4]   2> 742 T2908 oasc.SolrDeletionPolicy.onCommit SolrDeletionPolicy.onCommit: commits:num=1
[junit4:junit4]   2> 		commit{dir=MockDirWrapper(org.apache.lucene.store.RAMDirectory@b948fe lockFactory=org.apache.lucene.store.SingleInstanceLockFactory@b45ef3),segFN=segments_1,generation=1,filenames=[segments_1]
[junit4:junit4]   2> 743 T2908 oasc.SolrDeletionPolicy.updateCommits newest commit = 1
[junit4:junit4]   2> 743 T2908 oasc.RequestHandlers.initHandlersFromConfig created /update: solr.UpdateRequestHandler
[junit4:junit4]   2> 744 T2908 oasc.RequestHandlers.initHandlersFromConfig created /elevate: org.apache.solr.handler.component.SearchHandler
[junit4:junit4]   2> 744 T2908 oasc.RequestHandlers.initHandlersFromConfig created /dataElevate: org.apache.solr.handler.component.SearchHandler
[junit4:junit4]   2> 745 T2908 oashl.XMLLoader.init xsltCacheLifetimeSeconds=60
[junit4:junit4]   2> 745 T2908 oasc.RequestHandlers.initHandlersFromConfig WARNING no default request handler is registered (either '/select' or 'standard')
[junit4:junit4]   2> 746 T2908 oasc.SolrCore.initDeprecatedSupport WARNING solrconfig.xml uses deprecated <admin/gettableFiles>, Please update your config to use the ShowFileRequestHandler.
[junit4:junit4]   2> 747 T2908 oasc.SolrCore.initDeprecatedSupport WARNING adding ShowFileRequestHandler with hidden files: [SCHEMA-SPELLCHECKER.XML, SOLRCONFIG-DELPOLICY1.XML, BAD-SCHEMA-DUP-DYNAMICFIELD.XML, SCHEMA-BINARYFIELD.XML, BAD-SOLRCONFIG-MISSING-SCRIPTFILE.XML, TRIVIAL.UPDATEPROCESSOR0.JS, SOLRCONFIG-MASTER3.XML, BAD_SOLRCONFIG.XML, BAD-SCHEMA-EXTERNAL-FILEFIELD.XML, SCHEMA-LMDIRICHLET.XML, SCHEMA12.XML, SOLRCONFIG-HIGHLIGHT.XML, SOLRCONFIG-QUERYSENDER-NOQUERY.XML, ADDFIELDS.UPDATEPROCESSOR.JS, SOLRCONFIG-TRANSFORMERS.XML, SYNONYMS.TXT, SCHEMA.XML, SOLRCONFIG-MASTER1.XML, SCHEMA-COPYFIELD-TEST.XML, SCHEMA-REPLICATION2.XML, STOP-2.TXT, BAD-SCHEMA-CODEC-GLOBAL-VS-FT-MISMATCH.XML, BAD-SCHEMA-ANALYZER-CLASS-AND-NESTED.XML, SCHEMA-MINIMAL.XML, SOLRCONFIG-NOCACHE.XML, BAD-SOLRCONFIG-BOGUS-SCRIPTENGINE-NAME.XML, SOLRCONFIG-SLAVE1.XML, SOLRCONFIG-MASTER.XML, SCHEMA-FOLDING.XML, SOLRCONFIG-TLOG.XML, MISSING.FUNCTIONS.UPDATEPROCESSOR.JS, SCHEMA-REPLICATION1.XML, CURRENCY.XML, SOLRCONFIG-LAZYWRITER.XML, PHRASESUGGEST.TXT, SOLRCONFIG-SLAVE.XML, DA_COMPOUNDDICTIONARY.TXT, BAD-SOLRCONFIG-INVALID-SCRIPTFILE.XML, SOLRCONFIG-ELEVATE.XML, SOLRCONFIG-CACHING.XML, BAD-SCHEMA-UNIQUEKEY-USES-DEFAULT.XML, SOLRCONFIG-NATIVELOCK.XML, BAD-SCHEMA-SIM-GLOBAL-VS-FT-MISMATCH.XML, SCHEMA-COLLATE.XML, KEEP-1.TXT, TRIVIAL.UPDATEPROCESSOR1.JS, SOLRCONFIG-REPEATER.XML, SOLRCONFIG-SIMPLELOCK.XML, SCHEMA-REVERSED.XML, SOLRCONFIG-REQHANDLER.INCL, SCHEMA-NOT-REQUIRED-UNIQUE-KEY.XML, SOLRCONFIG-ALTDIRECTORY.XML, SCHEMA-TFIDF.XML, STOP-SNOWBALL.TXT, SOLRCONFIG-XINCLUDE.XML, OPEN-EXCHANGE-RATES.JSON, SCHEMA-REQUIRED-FIELDS.XML, SCHEMA-NUMERIC.XML, SOLRCONFIG_CODEC.XML, SCHEMA-CHARFILTERS.XML, SOLRCONFIG-ENABLEPLUGIN.XML, SOLRCONFIG-BASIC.XML, SOLRCONFIG-TERMINDEX.XML, SOLRCONFIG-PROPINJECT.XML, HUNSPELL-TEST.AFF, SCHEMA-BM25.XML, CONDITIONAL.UPDATEPROCESSOR.JS, SOLRCONFIG-PROPINJECT-INDEXDEFAULT.XML, SOLRCONFIG-PHRASESUGGEST.XML, BAD-SCHEMA-OMIT-TF-BUT-NOT-POS.XML, SCHEMA-PHRASESUGGEST.XML, STOP-1.TXT, PROTWORDS.TXT, DA_UTF8.XML, SCHEMA-IB.XML, BAD-SCHEMA-DUP-FIELDTYPE.XML, OLD_SYNONYMS.TXT, HYPHENATION.DTD, SOLRCONFIG-SPELLCHECKCOMPONENT.XML, MISSLEADING.EXTENSION.UPDATEPROCESSOR.JS.TXT, SOLRCONFIG-UPDATE-PROCESSOR-CHAINS.XML, SOLRCONFIG-SPELLCHECKER.XML, SCHEMA_CODEC.XML, STOPWITHBOM.TXT, ELEVATE.XML, BAD-SCHEMA-NONTEXT-ANALYZER.XML, BAD-MP-SOLRCONFIG.XML, MAPPING-ISOLATIN1ACCENT.TXT, BAD-SCHEMA-DUP-FIELD.XML, STOPWORDSWRONGENCODING.TXT, SOLRCONFIG-MERGEPOLICY.XML, SOLRCONFIG-MASTER1-KEEPONEBACKUP.XML, SOLRCONFIG-QUERYSENDER.XML, COMPOUNDDICTIONARY.TXT, STOPTYPES-1.TXT, XSLT, SOLRCONFIG-DELPOLICY2.XML, SOLRCONFIG-SCRIPT-UPDATEPROCESSOR.XML, SOLRCONFIG-FUNCTIONQUERY.XML, SCHEMA-LUCENEMATCHVERSION.XML, SOLRCONFIG-SOLCOREPROPERTIES.XML, BAD-SCHEMA-UNIQUEKEY-MULTIVALUED.XML, SCHEMA-DFR.XML, BAD-SCHEMA-UNIQUEKEY-IS-COPYFIELD-DEST.XML, SOLRCONFIG-SOLR-749.XML, THROW.ERROR.ON.ADD.UPDATEPROCESSOR.JS, SCHEMA11.XML, WDFTYPES.TXT, SCHEMA15.XML, FRENCHARTICLES.TXT, HUNSPELL-TEST.DIC, SCHEMA-LMJELINEKMERCER.XML, SCHEMA-STOP-KEEP.XML, BAD-SCHEMA-NOT-INDEXED-BUT-TF.XML, SCHEMASURROUND.XML, SOLRCONFIG-MASTER2.XML, BAD-SCHEMA-NOT-INDEXED-BUT-NORMS.XML, STEMDICT.TXT, SCHEMA-SIM.XML, KEEP-2.TXT, SCHEMA-TRIE.XML, SOLRCONFIG_PERF.XML, STOPTYPES-2.TXT, BAD-SCHEMA-NOT-INDEXED-BUT-POS.XML, STOPWORDS.TXT]
[junit4:junit4]   2> 749 T2908 oass.SolrIndexSearcher.<init> Opening Searcher@1489be7 main
[junit4:junit4]   2> 749 T2908 oass.SolrIndexSearcher.getIndexDir WARNING WARNING: Directory impl does not support setting indexDir: org.apache.lucene.store.MockDirectoryWrapper
[junit4:junit4]   2> 749 T2908 oasu.CommitTracker.<init> Hard AutoCommit: disabled
[junit4:junit4]   2> 750 T2908 oasu.CommitTracker.<init> Soft AutoCommit: disabled
[junit4:junit4]   2> 750 T2908 oashc.QueryElevationComponent.inform Loading QueryElevation from: /mnt/ssd/jenkins/workspace/Lucene-Solr-trunk-Linux/checkout/solr/build/solr-core/test-files/solr/collection1/conf/elevate.xml
[junit4:junit4]   2> 763 T2908 oashc.QueryElevationComponent.inform Loading QueryElevation from: /mnt/ssd/jenkins/workspace/Lucene-Solr-trunk-Linux/checkout/solr/build/solr-core/test-files/solr/collection1/conf/elevate.xml
[junit4:junit4]   2> 769 T2908 oashc.HttpShardHandlerFactory.getParameter Setting socketTimeout to: 0
[junit4:junit4]   2> 769 T2908 oashc.HttpShardHandlerFactory.getParameter Setting urlScheme to: http://
[junit4:junit4]   2> 769 T2908 oashc.HttpShardHandlerFactory.getParameter Setting connTimeout to: 0
[junit4:junit4]   2> 770 T2908 oashc.HttpShardHandlerFactory.getParameter Setting maxConnectionsPerHost to: 20
[junit4:junit4]   2> 770 T2908 oashc.HttpShardHandlerFactory.getParameter Setting corePoolSize to: 0
[junit4:junit4]   2> 770 T2908 oashc.HttpShardHandlerFactory.getParameter Setting maximumPoolSize to: 2147483647
[junit4:junit4]   2> 770 T2908 oashc.HttpShardHandlerFactory.getParameter Setting maxThreadIdleTime to: 5
[junit4:junit4]   2> 770 T2908 oashc.HttpShardHandlerFactory.getParameter Setting sizeOfQueue to: -1
[junit4:junit4]   2> 771 T2908 oashc.HttpShardHandlerFactory.getParameter Setting fairnessPolicy to: false
[junit4:junit4]   2> 771 T2908 oascsi.HttpClientUtil.createClient Creating new http client, config:maxConnectionsPerHost=20&maxConnections=10000&socketTimeout=0&connTimeout=0&retry=false
[junit4:junit4]   2> 773 T2938 oasc.SolrCore.registerSearcher [collection1] Registered new searcher Searcher@1489be7 main{StandardDirectoryReader(segments_1:1)}
[junit4:junit4]   2> 773 T2908 oasc.CoreContainer.register registering core: collection1
[junit4:junit4]   2> 774 T2908 oass.SolrDispatchFilter.init user.dir=/mnt/ssd/jenkins/workspace/Lucene-Solr-trunk-Linux/checkout/solr/build/solr-core/test/J1
[junit4:junit4]   2> 774 T2908 oass.SolrDispatchFilter.init SolrDispatchFilter.init() done
[junit4:junit4]   2> 774 T2908 oascsi.HttpClientUtil.createClient Creating new http client, config:maxConnections=128&maxConnectionsPerHost=32&followRedirects=false
[junit4:junit4]   2> 776 T2908 oejs.Server.doStart jetty-8.1.2.v20120308
[junit4:junit4]   2> 784 T2908 oejs.AbstractConnector.doStart Started SocketConnector@0.0.0.0:43194
[junit4:junit4]   2> 785 T2908 oasc.SolrResourceLoader.locateSolrHome JNDI not configured for solr (NoInitialContextEx)
[junit4:junit4]   2> 787 T2908 oasc.SolrResourceLoader.locateSolrHome using system property solr.solr.home: /mnt/ssd/jenkins/workspace/Lucene-Solr-trunk-Linux/checkout/solr/build/solr-core/test-files/solr
[junit4:junit4]   2> 787 T2908 oasc.SolrResourceLoader.<init> new SolrResourceLoader for deduced Solr Home: '/mnt/ssd/jenkins/workspace/Lucene-Solr-trunk-Linux/checkout/solr/build/solr-core/test-files/solr/'
[junit4:junit4]   2> 793 T2908 oass.SolrDispatchFilter.init SolrDispatchFilter.init()
[junit4:junit4]   2> 794 T2908 oasc.SolrResourceLoader.locateSolrHome JNDI not configured for solr (NoInitialContextEx)
[junit4:junit4]   2> 794 T2908 oasc.SolrResourceLoader.locateSolrHome using system property solr.solr.home: /mnt/ssd/jenkins/workspace/Lucene-Solr-trunk-Linux/checkout/solr/build/solr-core/test-files/solr
[junit4:junit4]   2> 794 T2908 oasc.CoreContainer$Initializer.initialize looking for solr.xml: /mnt/ssd/jenkins/workspace/Lucene-Solr-trunk-Linux/checkout/solr/build/solr-core/test-files/solr/solr.xml
[junit4:junit4]   2> 794 T2908 oasc.CoreContainer.<init> New CoreContainer 21512083
[junit4:junit4]   2> 795 T2908 oasc.CoreContainer.load Loading CoreContainer using Solr Home: '/mnt/ssd/jenkins/workspace/Lucene-Solr-trunk-Linux/checkout/solr/build/solr-core/test-files/solr/'
[junit4:junit4]   2> 795 T2908 oasc.SolrResourceLoader.<init> new SolrResourceLoader for directory: '/mnt/ssd/jenkins/workspace/Lucene-Solr-trunk-Linux/checkout/solr/build/solr-core/test-files/solr/'
[junit4:junit4]   2> 803 T2908 oasc.CoreContainer.load Registering Log Listener
[junit4:junit4]   2> 812 T2908 oasc.CoreContainer.create Creating SolrCore 'collection1' using instanceDir: /mnt/ssd/jenkins/workspace/Lucene-Solr-trunk-Linux/checkout/solr/build/solr-core/test-files/solr/collection1
[junit4:junit4]   2> 813 T2908 oasc.SolrResourceLoader.<init> new SolrResourceLoader for directory: '/mnt/ssd/jenkins/workspace/Lucene-Solr-trunk-Linux/checkout/solr/build/solr-core/test-files/solr/collection1/'
[junit4:junit4]   2> 813 T2908 oasc.SolrResourceLoader.replaceClassLoader Adding 'file:/mnt/ssd/jenkins/workspace/Lucene-Solr-trunk-Linux/checkout/solr/build/solr-core/test-files/solr/collection1/lib/README' to classloader
[junit4:junit4]   2> 813 T2908 oasc.SolrResourceLoader.replaceClassLoader Adding 'file:/mnt/ssd/jenkins/workspace/Lucene-Solr-trunk-Linux/checkout/solr/build/solr-core/test-files/solr/collection1/lib/classes/' to classloader
[junit4:junit4]   2> 834 T2908 oasc.SolrConfig.<init> Using Lucene MatchVersion: LUCENE_50
[junit4:junit4]   2> 875 T2908 oasc.SolrConfig.<init> Loaded SolrConfig: solrconfig-elevate.xml
[junit4:junit4]   2> 875 T2908 oass.IndexSchema.readSchema Reading Solr Schema
[junit4:junit4]   2> 878 T2908 oass.IndexSchema.readSchema Schema name=example
[junit4:junit4]   2> 1018 T2908 oass.IndexSchema.readSchema default search field in schema is text
[junit4:junit4]   2> 1020 T2908 oass.IndexSchema.readSchema unique key field: id
[junit4:junit4]   2> 1031 T2908 oasc.SolrCore.<init> [collection1] Opening new SolrCore at /mnt/ssd/jenkins/workspace/Lucene-Solr-trunk-Linux/checkout/solr/build/solr-core/test-files/solr/collection1/, dataDir=./org.apache.solr.handler.component.DistributedQueryElevationComponentTest-1343928688090/shard2/data/
[junit4:junit4]   2> 1032 T2908 oasc.JmxMonitoredMap.<init> JMX monitoring is enabled. Adding Solr mbeans to JMX Server: com.sun.jmx.mbeanserver.JmxMBeanServer@d5f50d
[junit4:junit4]   2> 1032 T2908 oasc.SolrCore.getNewIndexDir WARNING New index directory detected: old=null new=./org.apache.solr.handler.component.DistributedQueryElevationComponentTest-1343928688090/shard2/data/index/
[junit4:junit4]   2> 1033 T2908 oasc.SolrCore.initIndex WARNING [collection1] Solr index directory './org.apache.solr.handler.component.DistributedQueryElevationComponentTest-1343928688090/shard2/data/index' doesn't exist. Creating new index...
[junit4:junit4]   2> 1034 T2908 oasc.SolrDeletionPolicy.onCommit SolrDeletionPolicy.onCommit: commits:num=1
[junit4:junit4]   2> 		commit{dir=BaseDirectoryWrapper(org.apache.lucene.store.RAMDirectory@16e163e lockFactory=org.apache.lucene.store.SingleInstanceLockFactory@766b3c),segFN=segments_1,generation=1,filenames=[segments_1]
[junit4:junit4]   2> 1034 T2908 oasc.SolrDeletionPolicy.updateCommits newest commit = 1
[junit4:junit4]   2> 1035 T2908 oasc.RequestHandlers.initHandlersFromConfig created /update: solr.UpdateRequestHandler
[junit4:junit4]   2> 1036 T2908 oasc.RequestHandlers.initHandlersFromConfig created /elevate: org.apache.solr.handler.component.SearchHandler
[junit4:junit4]   2> 1036 T2908 oasc.RequestHandlers.initHandlersFromConfig created /dataElevate: org.apache.solr.handler.component.SearchHandler
[junit4:junit4]   2> 1037 T2908 oashl.XMLLoader.init xsltCacheLifetimeSeconds=60
[junit4:junit4]   2> 1037 T2908 oasc.RequestHandlers.initHandlersFromConfig WARNING no default request handler is registered (either '/select' or 'standard')
[junit4:junit4]   2> 1038 T2908 oasc.SolrCore.initDeprecatedSupport WARNING solrconfig.xml uses deprecated <admin/gettableFiles>, Please update your config to use the ShowFileRequestHandler.
[junit4:junit4]   2> 1039 T2908 oasc.SolrCore.initDeprecatedSupport WARNING adding ShowFileRequestHandler with hidden files: [SCHEMA-SPELLCHECKER.XML, SOLRCONFIG-DELPOLICY1.XML, BAD-SCHEMA-DUP-DYNAMICFIELD.XML, SCHEMA-BINARYFIELD.XML, BAD-SOLRCONFIG-MISSING-SCRIPTFILE.XML, TRIVIAL.UPDATEPROCESSOR0.JS, SOLRCONFIG-MASTER3.XML, BAD_SOLRCONFIG.XML, BAD-SCHEMA-EXTERNAL-FILEFIELD.XML, SCHEMA-LMDIRICHLET.XML, SCHEMA12.XML, SOLRCONFIG-HIGHLIGHT.XML, SOLRCONFIG-QUERYSENDER-NOQUERY.XML, ADDFIELDS.UPDATEPROCESSOR.JS, SOLRCONFIG-TRANSFORMERS.XML, SYNONYMS.TXT, SCHEMA.XML, SOLRCONFIG-MASTER1.XML, SCHEMA-COPYFIELD-TEST.XML, SCHEMA-REPLICATION2.XML, STOP-2.TXT, BAD-SCHEMA-CODEC-GLOBAL-VS-FT-MISMATCH.XML, BAD-SCHEMA-ANALYZER-CLASS-AND-NESTED.XML, SCHEMA-MINIMAL.XML, SOLRCONFIG-NOCACHE.XML, BAD-SOLRCONFIG-BOGUS-SCRIPTENGINE-NAME.XML, SOLRCONFIG-SLAVE1.XML, SOLRCONFIG-MASTER.XML, SCHEMA-FOLDING.XML, SOLRCONFIG-TLOG.XML, MISSING.FUNCTIONS.UPDATEPROCESSOR.JS, SCHEMA-REPLICATION1.XML, CURRENCY.XML, SOLRCONFIG-LAZYWRITER.XML, PHRASESUGGEST.TXT, SOLRCONFIG-SLAVE.XML, DA_COMPOUNDDICTIONARY.TXT, BAD-SOLRCONFIG-INVALID-SCRIPTFILE.XML, SOLRCONFIG-ELEVATE.XML, SOLRCONFIG-CACHING.XML, BAD-SCHEMA-UNIQUEKEY-USES-DEFAULT.XML, SOLRCONFIG-NATIVELOCK.XML, BAD-SCHEMA-SIM-GLOBAL-VS-FT-MISMATCH.XML, SCHEMA-COLLATE.XML, KEEP-1.TXT, TRIVIAL.UPDATEPROCESSOR1.JS, SOLRCONFIG-REPEATER.XML, SOLRCONFIG-SIMPLELOCK.XML, SCHEMA-REVERSED.XML, SOLRCONFIG-REQHANDLER.INCL, SCHEMA-NOT-REQUIRED-UNIQUE-KEY.XML, SOLRCONFIG-ALTDIRECTORY.XML, SCHEMA-TFIDF.XML, STOP-SNOWBALL.TXT, SOLRCONFIG-XINCLUDE.XML, OPEN-EXCHANGE-RATES.JSON, SCHEMA-REQUIRED-FIELDS.XML, SCHEMA-NUMERIC.XML, SOLRCONFIG_CODEC.XML, SCHEMA-CHARFILTERS.XML, SOLRCONFIG-ENABLEPLUGIN.XML, SOLRCONFIG-BASIC.XML, SOLRCONFIG-TERMINDEX.XML, SOLRCONFIG-PROPINJECT.XML, HUNSPELL-TEST.AFF, SCHEMA-BM25.XML, CONDITIONAL.UPDATEPROCESSOR.JS, SOLRCONFIG-PROPINJECT-INDEXDEFAULT.XML, SOLRCONFIG-PHRASESUGGEST.XML, BAD-SCHEMA-OMIT-TF-BUT-NOT-POS.XML, SCHEMA-PHRASESUGGEST.XML, STOP-1.TXT, PROTWORDS.TXT, DA_UTF8.XML, SCHEMA-IB.XML, BAD-SCHEMA-DUP-FIELDTYPE.XML, OLD_SYNONYMS.TXT, HYPHENATION.DTD, SOLRCONFIG-SPELLCHECKCOMPONENT.XML, MISSLEADING.EXTENSION.UPDATEPROCESSOR.JS.TXT, SOLRCONFIG-UPDATE-PROCESSOR-CHAINS.XML, SOLRCONFIG-SPELLCHECKER.XML, SCHEMA_CODEC.XML, STOPWITHBOM.TXT, ELEVATE.XML, BAD-SCHEMA-NONTEXT-ANALYZER.XML, BAD-MP-SOLRCONFIG.XML, MAPPING-ISOLATIN1ACCENT.TXT, BAD-SCHEMA-DUP-FIELD.XML, STOPWORDSWRONGENCODING.TXT, SOLRCONFIG-MERGEPOLICY.XML, SOLRCONFIG-MASTER1-KEEPONEBACKUP.XML, SOLRCONFIG-QUERYSENDER.XML, COMPOUNDDICTIONARY.TXT, STOPTYPES-1.TXT, XSLT, SOLRCONFIG-DELPOLICY2.XML, SOLRCONFIG-SCRIPT-UPDATEPROCESSOR.XML, SOLRCONFIG-FUNCTIONQUERY.XML, SCHEMA-LUCENEMATCHVERSION.XML, SOLRCONFIG-SOLCOREPROPERTIES.XML, BAD-SCHEMA-UNIQUEKEY-MULTIVALUED.XML, SCHEMA-DFR.XML, BAD-SCHEMA-UNIQUEKEY-IS-COPYFIELD-DEST.XML, SOLRCONFIG-SOLR-749.XML, THROW.ERROR.ON.ADD.UPDATEPROCESSOR.JS, SCHEMA11.XML, WDFTYPES.TXT, SCHEMA15.XML, FRENCHARTICLES.TXT, HUNSPELL-TEST.DIC, SCHEMA-LMJELINEKMERCER.XML, SCHEMA-STOP-KEEP.XML, BAD-SCHEMA-NOT-INDEXED-BUT-TF.XML, SCHEMASURROUND.XML, SOLRCONFIG-MASTER2.XML, BAD-SCHEMA-NOT-INDEXED-BUT-NORMS.XML, STEMDICT.TXT, SCHEMA-SIM.XML, KEEP-2.TXT, SCHEMA-TRIE.XML, SOLRCONFIG_PERF.XML, STOPTYPES-2.TXT, BAD-SCHEMA-NOT-INDEXED-BUT-POS.XML, STOPWORDS.TXT]
[junit4:junit4]   2> 1041 T2908 oass.SolrIndexSearcher.<init> Opening Searcher@21a806 main
[junit4:junit4]   2> 1042 T2908 oass.SolrIndexSearcher.getIndexDir WARNING WARNING: Directory impl does not support setting indexDir: org.apache.lucene.store.BaseDirectoryWrapper
[junit4:junit4]   2> 1042 T2908 oasu.CommitTracker.<init> Hard AutoCommit: disabled
[junit4:junit4]   2> 1043 T2908 oasu.CommitTracker.<init> Soft AutoCommit: disabled
[junit4:junit4]   2> 1043 T2908 oashc.QueryElevationComponent.inform Loading QueryElevation from: /mnt/ssd/jenkins/workspace/Lucene-Solr-trunk-Linux/checkout/solr/build/solr-core/test-files/solr/collection1/conf/elevate.xml
[junit4:junit4]   2> 1050 T2908 oashc.QueryElevationComponent.inform Loading QueryElevation from: /mnt/ssd/jenkins/workspace/Lucene-Solr-trunk-Linux/checkout/solr/build/solr-core/test-files/solr/collection1/conf/elevate.xml
[junit4:junit4]   2> 1057 T2908 oashc.HttpShardHandlerFactory.getParameter Setting socketTimeout to: 0
[junit4:junit4]   2> 1058 T2908 oashc.HttpShardHandlerFactory.getParameter Setting urlScheme to: http://
[junit4:junit4]   2> 1058 T2908 oashc.HttpShardHandlerFactory.getParameter Setting connTimeout to: 0
[junit4:junit4]   2> 1058 T2908 oashc.HttpShardHandlerFactory.getParameter Setting maxConnectionsPerHost to: 20
[junit4:junit4]   2> 1058 T2908 oashc.HttpShardHandlerFactory.getParameter Setting corePoolSize to: 0
[junit4:junit4]   2> 1059 T2908 oashc.HttpShardHandlerFactory.getParameter Setting maximumPoolSize to: 2147483647
[junit4:junit4]   2> 1059 T2908 oashc.HttpShardHandlerFactory.getParameter Setting maxThreadIdleTime to: 5
[junit4:junit4]   2> 1059 T2908 oashc.HttpShardHandlerFactory.getParameter Setting sizeOfQueue to: -1
[junit4:junit4]   2> 1059 T2908 oashc.HttpShardHandlerFactory.getParameter Setting fairnessPolicy to: false
[junit4:junit4]   2> 1059 T2908 oascsi.HttpClientUtil.createClient Creating new http client, config:maxConnectionsPerHost=20&maxConnections=10000&socketTimeout=0&connTimeout=0&retry=false
[junit4:junit4]   2> 1061 T2948 oasc.SolrCore.registerSearcher [collection1] Registered new searcher Searcher@21a806 main{StandardDirectoryReader(segments_1:1)}
[junit4:junit4]   2> 1061 T2908 oasc.CoreContainer.register registering core: collection1
[junit4:junit4]   2> 1062 T2908 oass.SolrDispatchFilter.init user.dir=/mnt/ssd/jenkins/workspace/Lucene-Solr-trunk-Linux/checkout/solr/build/solr-core/test/J1
[junit4:junit4]   2> 1062 T2908 oass.SolrDispatchFilter.init SolrDispatchFilter.init() done
[junit4:junit4]   2> 1062 T2908 oascsi.HttpClientUtil.createClient Creating new http client, config:maxConnections=128&maxConnectionsPerHost=32&followRedirects=false
[junit4:junit4]   2> ASYNC  NEW_CORE C148 name=collection1 org.apache.solr.core.SolrCore@8810f5
[junit4:junit4]   2> 1068 T2911 C148 oasu.DirectUpdateHandler2.deleteAll [collection1] REMOVING ALL DOCUMENTS FROM INDEX
[junit4:junit4]   2> 1069 T2911 C148 oasc.SolrDeletionPolicy.onInit SolrDeletionPolicy.onInit: commits:num=1
[junit4:junit4]   2> 		commit{dir=MockDirWrapper(org.apache.lucene.store.RAMDirectory@11164e5 lockFactory=org.apache.lucene.store.SingleInstanceLockFactory@11dc35e),segFN=segments_1,generation=1,filenames=[segments_1]
[junit4:junit4]   2> 1070 T2911 C148 oasc.SolrDeletionPolicy.updateCommits newest commit = 1
[junit4:junit4]   2> 1070 T2911 C148 UPDATE [collection1] webapp=/solr path=/update params={wt=javabin&version=2} {deleteByQuery=*:*} 0 2
[junit4:junit4]   2> ASYNC  NEW_CORE C149 name=collection1 org.apache.solr.core.SolrCore@14cb8e8
[junit4:junit4]   2> 1074 T2921 C149 oasu.DirectUpdateHandler2.deleteAll [collection1] REMOVING ALL DOCUMENTS FROM INDEX
[junit4:junit4]   2> 1076 T2921 C149 oasc.SolrDeletionPolicy.onInit SolrDeletionPolicy.onInit: commits:num=1
[junit4:junit4]   2> 		commit{dir=MockDirWrapper(NRTCachingDirectory(org.apache.lucene.store.RAMDirectory@1ffb93f lockFactory=org.apache.lucene.store.SingleInstanceLockFactory@1624ae8; maxCacheMB=0.23828125 maxMergeSizeMB=0.7294921875)),segFN=segments_1,generation=1,filenames=[segments_1]
[junit4:junit4]   2> 1077 T2921 C149 oasc.SolrDeletionPolicy.updateCommits newest commit = 1
[junit4:junit4]   2> 1077 T2921 C149 UPDATE [collection1] webapp=/solr path=/update params={wt=javabin&version=2} {deleteByQuery=*:*} 0 3
[junit4:junit4]   2> ASYNC  NEW_CORE C150 name=collection1 org.apache.solr.core.SolrCore@d72cb9
[junit4:junit4]   2> 1081 T2931 C150 oasu.DirectUpdateHandler2.deleteAll [collection1] REMOVING ALL DOCUMENTS FROM INDEX
[junit4:junit4]   2> 1082 T2931 C150 oasc.SolrDeletionPolicy.onInit SolrDeletionPolicy.onInit: commits:num=1
[junit4:junit4]   2> 		commit{dir=MockDirWrapper(org.apache.lucene.store.RAMDirectory@b948fe lockFactory=org.apache.lucene.store.SingleInstanceLockFactory@b45ef3),segFN=segments_1,generation=1,filenames=[segments_1]
[junit4:junit4]   2> 1083 T2931 C150 oasc.SolrDeletionPolicy.updateCommits newest commit = 1
[junit4:junit4]   2> 1083 T2931 C150 UPDATE [collection1] webapp=/solr path=/update params={wt=javabin&version=2} {deleteByQuery=*:*} 0 2
[junit4:junit4]   2> ASYNC  NEW_CORE C151 name=collection1 org.apache.solr.core.SolrCore@1801b05
[junit4:junit4]   2> 1087 T2942 C151 oasu.DirectUpdateHandler2.deleteAll [collection1] REMOVING ALL DOCUMENTS FROM INDEX
[junit4:junit4]   2> 1087 T2942 C151 oasc.SolrDeletionPolicy.onInit SolrDeletionPolicy.onInit: commits:num=1
[junit4:junit4]   2> 		commit{dir=BaseDirectoryWrapper(org.apache.lucene.store.RAMDirectory@16e163e lockFactory=org.apache.lucene.store.SingleInstanceLockFactory@766b3c),segFN=segments_1,generation=1,filenames=[segments_1]
[junit4:junit4]   2> 1088 T2942 C151 oasc.SolrDeletionPolicy.updateCommits newest commit = 1
[junit4:junit4]   2> 1088 T2942 C151 UPDATE [collection1] webapp=/solr path=/update params={wt=javabin&version=2} {deleteByQuery=*:*} 0 2
[junit4:junit4]   2> 1090 T2911 C148 UPDATE [collection1] webapp=/solr path=/update params={wt=javabin&version=2} {add=[1]} 0 0
[junit4:junit4]   2> 1093 T2921 C149 UPDATE [collection1] webapp=/solr path=/update params={wt=javabin&version=2} {add=[1]} 0 1
[junit4:junit4]   2> 1095 T2911 C148 UPDATE [collection1] webapp=/solr path=/update params={wt=javabin&version=2} {add=[2]} 0 1
[junit4:junit4]   2> 1097 T2931 C150 UPDATE [collection1] webapp=/solr path=/update params={wt=javabin&version=2} {add=[2]} 0 1
[junit4:junit4]   2> 1099 T2911 C148 UPDATE [collection1] webapp=/solr path=/update params={wt=javabin&version=2} {add=[3]} 0 0
[junit4:junit4]   2> 1101 T2942 C151 UPDATE [collection1] webapp=/solr path=/update params={wt=javabin&version=2} {add=[3]} 0 0
[junit4:junit4]   2> 1103 T2911 C148 UPDATE [collection1] webapp=/solr path=/update params={wt=javabin&version=2} {add=[4]} 0 0
[junit4:junit4]   2> 1105 T2921 C149 UPDATE [collection1] webapp=/solr path=/update params={wt=javabin&version=2} {add=[4]} 0 0
[junit4:junit4]   2> 1111 T2911 C148 UPDATE [collection1] webapp=/solr path=/update params={wt=javabin&version=2} {add=[5]} 0 1
[junit4:junit4]   2> 1113 T2931 C150 UPDATE [collection1] webapp=/solr path=/update params={wt=javabin&version=2} {add=[5]} 0 0
[junit4:junit4]   2> 1115 T2911 C148 UPDATE [collection1] webapp=/solr path=/update params={wt=javabin&version=2} {add=[6]} 0 0
[junit4:junit4]   2> 1118 T2942 C151 UPDATE [collection1] webapp=/solr path=/update params={wt=javabin&version=2} {add=[6]} 0 1
[junit4:junit4]   2> 1120 T2911 C148 UPDATE [collection1] webapp=/solr path=/update params={wt=javabin&version=2} {add=[7]} 0 0
[junit4:junit4]   2> 1123 T2942 C151 UPDATE [collection1] webapp=/solr path=/update params={wt=javabin&version=2} {add=[7]} 0 1
[junit4:junit4]   2> 1126 T2911 C148 oasu.DirectUpdateHandler2.commit start commit{flags=0,_version_=0,optimize=false,openSearcher=true,waitSearcher=true,expungeDeletes=false,softCommit=false}
[junit4:junit4]   2> 1127 T2911 C148 oasc.SolrDeletionPolicy.onCommit SolrDeletionPolicy.onCommit: commits:num=2
[junit4:junit4]   2> 		commit{dir=MockDirWrapper(org.apache.lucene.store.RAMDirectory@11164e5 lockFactory=org.apache.lucene.store.SingleInstanceLockFactory@11dc35e),segFN=segments_1,generation=1,filenames=[segments_1]
[junit4:junit4]   2> 		commit{dir=MockDirWrapper(org.apache.lucene.store.RAMDirectory@11164e5 lockFactory=org.apache.lucene.store.SingleInstanceLockFactory@11dc35e),segFN=segments_2,generation=2,filenames=[_0_TestBloomFilteredLucene40Postings_0.blm, _0_Asserting_0.tim, _0_TestBloomFilteredLucene40Postings_0.tim, _0.fdt, _0_Asserting_0.frq, _0_Asserting_0.prx, _0.si, _0_nrm.cfs, _0_nrm.cfe, _0_Asserting_0.tip, _0_TestBloomFilteredLucene40Postings_0.frq, segments_2, _0_TestBloomFilteredLucene40Postings_0.tip, _0.fnm, _0.fdx, _0_TestBloomFilteredLucene40Postings_0.prx]
[junit4:junit4]   2> 1127 T2911 C148 oasc.SolrDeletionPolicy.updateCommits newest commit = 2
[junit4:junit4]   2> 1128 T2911 C148 oass.SolrIndexSearcher.<init> Opening Searcher@17aa59f main
[junit4:junit4]   2> 1129 T2911 C148 oass.SolrIndexSearcher.getIndexDir WARNING WARNING: Directory impl does not support setting indexDir: org.apache.lucene.store.MockDirectoryWrapper
[junit4:junit4]   2> 1129 T2911 C148 oasu.DirectUpdateHandler2.commit end_commit_flush
[junit4:junit4]   2> 1129 T2918 oasc.SolrCore.registerSearcher [collection1] Registered new searcher Searcher@17aa59f main{StandardDirectoryReader(segments_2:4 _0(5.0):C7)}
[junit4:junit4]   2> 1130 T2911 C148 UPDATE [collection1] webapp=/solr path=/update params={waitSearcher=true&softCommit=false&wt=javabin&commit=true&version=2} {commit=} 0 4
[junit4:junit4]   2> 1132 T2921 C149 oasu.DirectUpdateHandler2.commit start commit{flags=0,_version_=0,optimize=false,openSearcher=true,waitSearcher=true,expungeDeletes=false,softCommit=false}
[junit4:junit4]   2> 1133 T2921 C149 oasc.SolrDeletionPolicy.onCommit SolrDeletionPolicy.onCommit: commits:num=2
[junit4:junit4]   2> 		commit{dir=MockDirWrapper(NRTCachingDirectory(org.apache.lucene.store.RAMDirectory@1ffb93f lockFactory=org.apache.lucene.store.SingleInstanceLockFactory@1624ae8; maxCacheMB=0.23828125 maxMergeSizeMB=0.7294921875)),segFN=segments_1,generation=1,filenames=[segments_1]
[junit4:junit4]   2> 		commit{dir=MockDirWrapper(NRTCachingDirectory(org.apache.lucene.store.RAMDirectory@1ffb93f lockFactory=org.apache.lucene.store.SingleInstanceLockFactory@1624ae8; maxCacheMB=0.23828125 maxMergeSizeMB=0.7294921875)),segFN=segments_2,generation=2,filenames=[_0_TestBloomFilteredLucene40Postings_0.blm, _0_Asserting_0.tim, _0_TestBloomFilteredLucene40Postings_0.tim, _0.fdt, _0_Asserting_0.frq, _0_Asserting_0.prx, _0.si, _0_nrm.cfs, _0_nrm.cfe, _0_Asserting_0.tip, _0_TestBloomFilteredLucene40Postings_0.frq, segments_2, _0_TestBloomFilteredLucene40Postings_0.tip, _0.fnm, _0.fdx, _0_TestBloomFilteredLucene40Postings_0.prx]
[junit4:junit4]   2> 1134 T2921 C149 oasc.SolrDeletionPolicy.updateCommits newest commit = 2
[junit4:junit4]   2> 1135 T2921 C149 oass.SolrIndexSearcher.<init> Opening Searcher@19f53ba main
[junit4:junit4]   2> 1135 T2921 C149 oass.SolrIndexSearcher.getIndexDir WARNING WARNING: Directory impl does not support setting indexDir: org.apache.lucene.store.MockDirectoryWrapper
[junit4:junit4]   2> 1136 T2921 C149 oasu.DirectUpdateHandler2.commit end_commit_flush
[junit4:junit4]   2> 1136 T2928 oasc.SolrCore.registerSearcher [collection1] Registered new searcher Searcher@19f53ba main{StandardDirectoryReader(segments_2:4 _0(5.0):C2)}
[junit4:junit4]   2> 1136 T2921 C149 UPDATE [collection1] webapp=/solr path=/update params={waitSearcher=true&softCommit=false&wt=javabin&commit=true&version=2} {commit=} 0 4
[junit4:junit4]   2> 1138 T2931 C150 oasu.DirectUpdateHandler2.commit start commit{flags=0,_version_=0,optimize=false,openSearcher=true,waitSearcher=true,expungeDeletes=false,softCommit=false}
[junit4:junit4]   2> 1139 T2931 C150 oasc.SolrDeletionPolicy.onCommit SolrDeletionPolicy.onCommit: commits:num=2
[junit4:junit4]   2> 		commit{dir=MockDirWrapper(org.apache.lucene.store.RAMDirectory@b948fe lockFactory=org.apache.lucene.store.SingleInstanceLockFactory@b45ef3),segFN=segments_1,generation=1,filenames=[segments_1]
[junit4:junit4]   2> 		commit{dir=MockDirWrapper(org.apache.lucene.store.RAMDirectory@b948fe lockFactory=org.apache.lucene.store.SingleInstanceLockFactory@b45ef3),segFN=segments_2,generation=2,filenames=[_0_TestBloomFilteredLucene40Postings_0.blm, _0_Asserting_0.tim, _0_TestBloomFilteredLucene40Postings_0.tim, _0.fdt, _0_Asserting_0.frq, _0_Asserting_0.prx, _0.si, _0_nrm.cfs, _0_nrm.cfe, _0_Asserting_0.tip, _0_TestBloomFilteredLucene40Postings_0.frq, segments_2, _0_TestBloomFilteredLucene40Postings_0.tip, _0.fnm, _0.fdx, _0_TestBloomFilteredLucene40Postings_0.prx]
[junit4:junit4]   2> 1140 T2931 C150 oasc.SolrDeletionPolicy.updateCommits newest commit = 2
[junit4:junit4]   2> 1140 T2931 C150 oass.SolrIndexSearcher.<init> Opening Searcher@1cd6bd5 main
[junit4:junit4]   2> 1141 T2931 C150 oass.SolrIndexSearcher.getIndexDir WARNING WARNING: Directory impl does not support setting indexDir: org.apache.lucene.store.MockDirectoryWrapper
[junit4:junit4]   2> 1141 T2931 C150 oasu.DirectUpdateHandler2.commit end_commit_flush
[junit4:junit4]   2> 1141 T2938 oasc.SolrCore.registerSearcher [collection1] Registered new searcher Searcher@1cd6bd5 main{StandardDirectoryReader(segments_2:4 _0(5.0):C2)}
[junit4:junit4]   2> 1141 T2931 C150 UPDATE [collection1] webapp=/solr path=/update params={waitSearcher=true&softCommit=false&wt=javabin&commit=true&version=2} {commit=} 0 3
[junit4:junit4]   2> 1143 T2942 C151 oasu.DirectUpdateHandler2.commit start commit{flags=0,_version_=0,optimize=false,openSearcher=true,waitSearcher=true,expungeDeletes=false,softCommit=false}
[junit4:junit4]   2> 1144 T2942 C151 oasc.SolrDeletionPolicy.onCommit SolrDeletionPolicy.onCommit: commits:num=2
[junit4:junit4]   2> 		commit{dir=BaseDirectoryWrapper(org.apache.lucene.store.RAMDirectory@16e163e lockFactory=org.apache.lucene.store.SingleInstanceLockFactory@766b3c),segFN=segments_1,generation=1,filenames=[segments_1]
[junit4:junit4]   2> 		commit{dir=BaseDirectoryWrapper(org.apache.lucene.store.RAMDirectory@16e163e lockFactory=org.apache.lucene.store.SingleInstanceLockFactory@766b3c),segFN=segments_2,generation=2,filenames=[_0_TestBloomFilteredLucene40Postings_0.blm, _0_Asserting_0.tim, _0_TestBloomFilteredLucene40Postings_0.tim, _0.fdt, _0_Asserting_0.frq, _0_Asserting_0.prx, _0.si, _0_nrm.cfs, _0_nrm.cfe, _0_Asserting_0.tip, _0_TestBloomFilteredLucene40Postings_0.frq, segments_2, _0_TestBloomFilteredLucene40Postings_0.tip, _0.fnm, _0.fdx, _0_TestBloomFilteredLucene40Postings_0.prx]
[junit4:junit4]   2> 1145 T2942 C151 oasc.SolrDeletionPolicy.updateCommits newest commit = 2
[junit4:junit4]   2> 1145 T2942 C151 oass.SolrIndexSearcher.<init> Opening Searcher@6d0045 main
[junit4:junit4]   2> 1145 T2942 C151 oass.SolrIndexSearcher.getIndexDir WARNING WARNING: Directory impl does not support setting indexDir: org.apache.lucene.store.BaseDirectoryWrapper
[junit4:junit4]   2> 1146 T2942 C151 oasu.DirectUpdateHandler2.commit end_commit_flush
[junit4:junit4]   2> 1146 T2948 oasc.SolrCore.registerSearcher [collection1] Registered new searcher Searcher@6d0045 main{StandardDirectoryReader(segments_2:4 _0(5.0):C3)}
[junit4:junit4]   2> 1146 T2942 C151 UPDATE [collection1] webapp=/solr path=/update params={waitSearcher=true&softCommit=false&wt=javabin&commit=true&version=2} {commit=} 0 3
[junit4:junit4]   2> 1149 T2911 C148 REQ [collection1] webapp=/solr path=/elevate params={wt=javabin&q=*:*&shards.qt=/elevate&rows=500&sort=id+desc&fl=id,+score,+[elevated]&version=2&qt=/elevate&distrib=false} hits=7 status=0 QTime=1 
[junit4:junit4]   2> 1168 T2932 C150 REQ [collection1] webapp=/solr path=/elevate params={wt=javabin&fsv=true&start=0&isShard=true&fl=id,score&version=2&qt=/elevate&q=*:*&shard.url=localhost:60840/solr&shards.qt=/elevate&sort=id+desc&rows=500&NOW=1343928689239&distrib=false} hits=2 status=0 QTime=1 
[junit4:junit4]   2> 1168 T2943 C151 REQ [collection1] webapp=/solr path=/elevate params={wt=javabin&fsv=true&start=0&isShard=true&fl=id,score&version=2&qt=/elevate&q=*:*&shard.url=[::1]:33332/solr|localhost:43194/solr&shards.qt=/elevate&sort=id+desc&rows=500&NOW=1343928689239&distrib=false} hits=3 status=0 QTime=1 
[junit4:junit4]   2> 1173 T2922 C149 REQ [collection1] webapp=/solr path=/elevate params={wt=javabin&fsv=true&start=0&isShard=true&fl=id,score&version=2&qt=/elevate&q=*:*&shard.url=[::1]:33332/solr|localhost:56933/solr&shards.qt=/elevate&sort=id+desc&rows=500&NOW=1343928689239&distrib=false} hits=2 status=0 QTime=0 
[junit4:junit4]   2> 1176 T2932 C150 REQ [collection1] webapp=/solr path=/elevate params={wt=javabin&isShard=true&fl=id,+score,+[elevated]&version=2&qt=/elevate&q=*:*&ids=2.0,5.0&shards.qt=/elevate&shard.url=localhost:60840/solr&rows=500&NOW=1343928689239&distrib=false} status=0 QTime=0 
[junit4:junit4]   2> 1176 T2922 C149 REQ [collection1] webapp=/solr path=/elevate params={wt=javabin&isShard=true&fl=id,+score,+[elevated]&version=2&qt=/elevate&q=*:*&ids=4.0,1.0&shards.qt=/elevate&shard.url=[::1]:33332/solr|localhost:56933/solr&rows=500&NOW=1343928689239&distrib=false} status=0 QTime=0 
[junit4:junit4]   2> 1177 T2943 C151 REQ [collection1] webapp=/solr path=/elevate params={wt=javabin&isShard=true&fl=id,+score,+[elevated]&version=2&qt=/elevate&q=*:*&ids=3.0,6.0,7.0&shards.qt=/elevate&shard.url=[::1]:33332/solr|localhost:43194/solr&rows=500&NOW=1343928689239&distrib=false} status=0 QTime=1 
[junit4:junit4]   2> 1177 T2942 C151 REQ [collection1] webapp=/solr path=/elevate params={wt=javabin&q=*:*&shards=[::1]:33332/solr|localhost:56933/solr,localhost:60840/solr,[::1]:33332/solr|localhost:43194/solr&shards.qt=/elevate&rows=500&sort=id+desc&fl=id,+score,+[elevated]&version=2&qt=/elevate} status=0 QTime=26 
[junit4:junit4]   2> 1181 T2908 oas.BaseDistributedSearchTestCase.compareResponses SEVERE Mismatched responses:
[junit4:junit4]   2> 	{responseHeader={status=0,QTime=26,params={wt=javabin,q=*:*,shards=[::1]:33332/solr|localhost:56933/solr,localhost:60840/solr,[::1]:33332/solr|localhost:43194/solr,shards.qt=/elevate,rows=500,sort=id desc,fl=id, score, [elevated],version=2,qt=/elevate}},response={numFound=7,start=0,maxScore=1.0,docs=[SolrDocument{id=7.0, [elevated]=false, score=1.0}, SolrDocument{id=6.0, [elevated]=false, score=1.0}, SolrDocument{id=5.0, [elevated]=false, score=1.0}, SolrDocument{id=4.0, [elevated]=false, score=1.0}, SolrDocument{id=3.0, [elevated]=false, score=1.0}, SolrDocument{id=2.0, [elevated]=false, score=1.0}, SolrDocument{id=1.0, [elevated]=false, score=1.0}]}}
[junit4:junit4]   2> 	{responseHeader={status=0,QTime=1,params={wt=javabin,q=*:*,shards.qt=/elevate,rows=500,sort=id desc,fl=id, score, [elevated],version=2,qt=/elevate,distrib=false}},response={numFound=7,start=0,maxScore=1.0,docs=[SolrDocument{id=7.0, score=1.0, [elevated]=false}, SolrDocument{id=6.0, score=1.0, [elevated]=false}, SolrDocument{id=5.0, score=1.0, [elevated]=false}, SolrDocument{id=4.0, score=1.0, [elevated]=false}, SolrDocument{id=3.0, score=1.0, [elevated]=false}, SolrDocument{id=2.0, score=1.0, [elevated]=false}, SolrDocument{id=1.0, score=1.0, [elevated]=false}]}}
[junit4:junit4]   2> 1182 T2908 oasc.CoreContainer.shutdown Shutting down CoreContainer instance=15286775
[junit4:junit4]   2> 1182 T2908 oasc.SolrCore.close [collection1]  CLOSING SolrCore org.apache.solr.core.SolrCore@8810f5
[junit4:junit4]   2> 1183 T2908 oasc.SolrCore.closeSearcher [collection1] Closing main searcher on request.
[junit4:junit4]   2> 1183 T2908 oasu.DirectUpdateHandler2.close closing DirectUpdateHandler2{commits=1,autocommits=0,soft autocommits=0,optimizes=0,rollbacks=0,expungeDeletes=0,docsPending=0,adds=0,deletesById=0,deletesByQuery=0,errors=0,cumulative_adds=7,cumulative_deletesById=0,cumulative_deletesByQuery=1,cumulative_errors=0}
[junit4:junit4]   2> 1187 T2908 oejsh.ContextHandler.doStop stopped o.e.j.s.ServletContextHandler{/solr,null}
[junit4:junit4]   2> 1245 T2908 oasc.CoreContainer.shutdown Shutting down CoreContainer instance=33527018
[junit4:junit4]   2> 1246 T2908 oasc.SolrCore.close [collection1]  CLOSING SolrCore org.apache.solr.core.SolrCore@14cb8e8
[junit4:junit4]   2> 1246 T2908 oasc.SolrCore.closeSearcher [collection1] Closing main searcher on request.
[junit4:junit4]   2> 1247 T2908 oasu.DirectUpdateHandler2.close closing DirectUpdateHandler2{commits=1,autocommits=0,soft autocommits=0,optimizes=0,rollbacks=0,expungeDeletes=0,docsPending=0,adds=0,deletesById=0,deletesByQuery=0,errors=0,cumulative_adds=2,cumulative_deletesById=0,cumulative_deletesByQuery=1,cumulative_errors=0}
[junit4:junit4]   2> 1250 T2908 oejsh.ContextHandler.doStop stopped o.e.j.s.ServletContextHandler{/solr,null}
[junit4:junit4]   2> 1303 T2908 oasc.CoreContainer.shutdown Shutting down CoreContainer instance=26150195
[junit4:junit4]   2> 1303 T2908 oasc.SolrCore.close [collection1]  CLOSING SolrCore org.apache.solr.core.SolrCore@d72cb9
[junit4:junit4]   2> 1303 T2908 oasc.SolrCore.closeSearcher [collection1] Closing main searcher on request.
[junit4:junit4]   2> 1304 T2908 oasu.DirectUpdateHandler2.close closing DirectUpdateHandler2{commits=1,autocommits=0,soft autocommits=0,optimizes=0,rollbacks=0,expungeDeletes=0,docsPending=0,adds=0,deletesById=0,deletesByQuery=0,errors=0,cumulative_adds=2,cumulative_deletesById=0,cumulative_deletesByQuery=1,cumulative_errors=0}
[junit4:junit4]   2> 1307 T2908 oejsh.ContextHandler.doStop stopped o.e.j.s.ServletContextHandler{/solr,null}
[junit4:junit4]   2> 1359 T2908 oasc.CoreContainer.shutdown Shutting down CoreContainer instance=21512083
[junit4:junit4]   2> 1360 T2908 oasc.SolrCore.close [collection1]  CLOSING SolrCore org.apache.solr.core.SolrCore@1801b05
[junit4:junit4]   2> 1360 T2908 oasc.SolrCore.closeSearcher [collection1] Closing main searcher on request.
[junit4:junit4]   2> 1361 T2908 oasu.DirectUpdateHandler2.close closing DirectUpdateHandler2{commits=1,autocommits=0,soft autocommits=0,optimizes=0,rollbacks=0,expungeDeletes=0,docsPending=0,adds=0,deletesById=0,deletesByQuery=0,errors=0,cumulative_adds=3,cumulative_deletesById=0,cumulative_deletesByQuery=1,cumulative_errors=0}
[junit4:junit4]   2> 1363 T2908 oejsh.ContextHandler.doStop stopped o.e.j.s.ServletContextHandler{/solr,null}
[junit4:junit4]   2> 1414 T2908 oas.SolrTestCaseJ4.tearDown ###Ending testDistribSearch
[junit4:junit4]   2> NOTE: reproduce with: ant test  -Dtestcase=DistributedQueryElevationComponentTest -Dtests.method=testDistribSearch -Dtests.seed=BE69250BC12A53A7 -Dtests.multiplier=3 -Dtests.slow=true -Dtests.locale=sr_BA_#Latn -Dtests.timezone=Asia/Dhaka -Dtests.file.encoding=UTF-8
[junit4:junit4]   2>
[junit4:junit4]    > (@AfterClass output)
[junit4:junit4]   2> 1467 T2908 oas.SolrTestCaseJ4.deleteCore ###deleteCore
[junit4:junit4]   2> NOTE: test params are: codec=Lucene40: {field_t=PostingsFormat(name=TestBloomFilteredLucene40Postings), id=PostingsFormat(name=TestBloomFilteredLucene40Postings), plow_t=PostingsFormat(name=Asserting), text=PostingsFormat(name=Asserting), int_i=PostingsFormat(name=Asserting)}, sim=RandomSimilarityProvider(queryNorm=true,coord=true): {}, locale=sr_BA_#Latn, timezone=Asia/Dhaka
[junit4:junit4]   2> NOTE: Linux 3.2.0-27-generic i386/Oracle Corporation 1.8.0-ea (32-bit)/cpus=8,threads=1,free=62024552,total=195133440
[junit4:junit4]   2> NOTE: All tests run in this JVM: [DisMaxRequestHandlerTest, TestOmitPositions, BadIndexSchemaTest, FieldAnalysisRequestHandlerTest, TestPhraseSuggestions, RequiredFieldsTest, BasicZkTest, TestDFRSimilarityFactory, DocumentBuilderTest, SuggesterTest, LegacyHTMLStripCharFilterTest, TestSolrCoreProperties, TestBinaryField, TestSuggestSpellingConverter, TestCSVLoader, TestFoldingMultitermQuery, PrimitiveFieldTypeTest, SolrIndexConfigTest, DirectUpdateHandlerTest, TestTrie, TestRealTimeGet, SuggesterTSTTest, TestRTGBase, TestPluginEnable, SpellingQueryConverterTest, FileUtilsTest, SolrInfoMBeanTest, PrimUtilsTest, TestLRUCache, SuggesterWFSTTest, SystemInfoHandlerTest, TestCodecSupport, ReturnFieldsTest, TestGroupingSearch, XsltUpdateRequestHandlerTest, TestUpdate, TestSolrXMLSerializer, CircularListTest, TimeZoneUtilsTest, ZkCLITest, ShowFileRequestHandlerTest, TestStressRecovery, FieldMutatingUpdateProcessorTest, SolrPluginUtilsTest, QueryParsingTest, StatsComponentTest, SoftAutoCommitTest, UUIDFieldTest, TestQuerySenderListener, TestJoin, TestFunctionQuery, TestSolrDeletionPolicy2, IndexReaderFactoryTest, BasicDistributedZkTest, OverseerTest, FullSolrCloudTest, LeaderElectionTest, CloudStateUpdateTest, AutoCommitTest, DistributedTermsComponentTest, IndexBasedSpellCheckerTest, TestRangeQuery, SimpleFacetsTest, ConvertedLegacyTest, PeerSyncTest, QueryElevationComponentTest, BasicFunctionalityTest, SignatureUpdateProcessorFactoryTest, TestBinaryResponseWriter, TestJmxIntegration, SampleTest, HighlighterTest, TestRemoteStreaming, CacheHeaderTest, QueryEqualityTest, PolyFieldTest, SpatialFilterTest, TestCSVResponseWriter, MoreLikeThisHandlerTest, DistributedQueryElevationComponentTest]
[junit4:junit4]   2> 
[junit4:junit4] Completed on J1 in 1.52s, 1 test, 1 failure <<< FAILURES!

[...truncated 223 lines...]
BUILD FAILED
/mnt/ssd/jenkins/workspace/Lucene-Solr-trunk-Linux/checkout/build.xml:29: The following error occurred while executing this line:
/mnt/ssd/jenkins/workspace/Lucene-Solr-trunk-Linux/checkout/solr/build.xml:144: The following error occurred while executing this line:
/mnt/ssd/jenkins/workspace/Lucene-Solr-trunk-Linux/checkout/lucene/module-build.xml:62: The following error occurred while executing this line:
/mnt/ssd/jenkins/workspace/Lucene-Solr-trunk-Linux/checkout/lucene/common-build.xml:1095: The following error occurred while executing this line:
/mnt/ssd/jenkins/workspace/Lucene-Solr-trunk-Linux/checkout/lucene/common-build.xml:790: There were test failures: 223 suites, 899 tests, 1 failure, 6 ignored (1 assumption)

Total time: 19 minutes 41 seconds
Build step 'Execute shell' marked build as failure
Archiving artifacts
Recording test results
Email was triggered for: Failure
Sending email for trigger: Failure



Mime
View raw message