lucene-dev mailing list archives

Site index · List index
Message view « Date » · « Thread »
Top « Date » · « Thread »
From Policeman Jenkins Server <jenk...@sd-datasolutions.de>
Subject [JENKINS] Lucene-Solr-4.x-Linux (32bit/jdk1.8.0-ea-b49) - Build # 94 - Failure!
Date Thu, 02 Aug 2012 02:54:10 GMT
Build: http://jenkins.sd-datasolutions.de/job/Lucene-Solr-4.x-Linux/94/
Java: 32bit/jdk1.8.0-ea-b49 -client -XX:+UseSerialGC

1 tests failed.
REGRESSION:  org.apache.solr.handler.component.DistributedQueryElevationComponentTest.testDistribSearch

Error Message:
.responseHeader.params.shards.qt:/elevate!=false

Stack Trace:
junit.framework.AssertionFailedError: .responseHeader.params.shards.qt:/elevate!=false
	at __randomizedtesting.SeedInfo.seed([74254ECA031050A7:F5C3C0D2744F309B]:0)
	at junit.framework.Assert.fail(Assert.java:50)
	at org.apache.solr.BaseDistributedSearchTestCase.compareResponses(BaseDistributedSearchTestCase.java:670)
	at org.apache.solr.BaseDistributedSearchTestCase.query(BaseDistributedSearchTestCase.java:392)
	at org.apache.solr.handler.component.DistributedQueryElevationComponentTest.doTest(DistributedQueryElevationComponentTest.java:81)
	at org.apache.solr.BaseDistributedSearchTestCase.testDistribSearch(BaseDistributedSearchTestCase.java:679)
	at sun.reflect.NativeMethodAccessorImpl.invoke0(Native Method)
	at sun.reflect.NativeMethodAccessorImpl.invoke(NativeMethodAccessorImpl.java:57)
	at sun.reflect.DelegatingMethodAccessorImpl.invoke(DelegatingMethodAccessorImpl.java:43)
	at java.lang.reflect.Method.invoke(Method.java:474)
	at com.carrotsearch.randomizedtesting.RandomizedRunner.invoke(RandomizedRunner.java:1995)
	at com.carrotsearch.randomizedtesting.RandomizedRunner.access$1100(RandomizedRunner.java:132)
	at com.carrotsearch.randomizedtesting.RandomizedRunner$6.evaluate(RandomizedRunner.java:818)
	at com.carrotsearch.randomizedtesting.RandomizedRunner$7.evaluate(RandomizedRunner.java:877)
	at com.carrotsearch.randomizedtesting.RandomizedRunner$8.evaluate(RandomizedRunner.java:891)
	at com.carrotsearch.randomizedtesting.rules.SystemPropertiesRestoreRule$1.evaluate(SystemPropertiesRestoreRule.java:53)
	at org.apache.lucene.util.TestRuleSetupTeardownChained$1.evaluate(TestRuleSetupTeardownChained.java:50)
	at org.apache.lucene.util.TestRuleFieldCacheSanity$1.evaluate(TestRuleFieldCacheSanity.java:32)
	at org.apache.lucene.util.AbstractBeforeAfterRule$1.evaluate(AbstractBeforeAfterRule.java:45)
	at com.carrotsearch.randomizedtesting.rules.SystemPropertiesInvariantRule$1.evaluate(SystemPropertiesInvariantRule.java:55)
	at org.apache.lucene.util.TestRuleReportUncaughtExceptions$1.evaluate(TestRuleReportUncaughtExceptions.java:68)
	at org.apache.lucene.util.TestRuleThreadAndTestName$1.evaluate(TestRuleThreadAndTestName.java:48)
	at org.apache.lucene.util.TestRuleIgnoreAfterMaxFailures$1.evaluate(TestRuleIgnoreAfterMaxFailures.java:70)
	at org.apache.lucene.util.TestRuleMarkFailure$1.evaluate(TestRuleMarkFailure.java:48)
	at com.carrotsearch.randomizedtesting.RandomizedRunner.runSingleTest(RandomizedRunner.java:825)
	at com.carrotsearch.randomizedtesting.RandomizedRunner.access$700(RandomizedRunner.java:132)
	at com.carrotsearch.randomizedtesting.RandomizedRunner$3$1.run(RandomizedRunner.java:671)
	at com.carrotsearch.randomizedtesting.RandomizedRunner$3.evaluate(RandomizedRunner.java:697)
	at com.carrotsearch.randomizedtesting.RandomizedRunner$4.evaluate(RandomizedRunner.java:736)
	at com.carrotsearch.randomizedtesting.RandomizedRunner$5.evaluate(RandomizedRunner.java:747)
	at com.carrotsearch.randomizedtesting.rules.SystemPropertiesRestoreRule$1.evaluate(SystemPropertiesRestoreRule.java:53)
	at org.apache.lucene.util.AbstractBeforeAfterRule$1.evaluate(AbstractBeforeAfterRule.java:45)
	at org.apache.lucene.util.TestRuleReportUncaughtExceptions$1.evaluate(TestRuleReportUncaughtExceptions.java:68)
	at org.apache.lucene.util.TestRuleStoreClassName$1.evaluate(TestRuleStoreClassName.java:38)
	at com.carrotsearch.randomizedtesting.rules.SystemPropertiesInvariantRule$1.evaluate(SystemPropertiesInvariantRule.java:55)
	at org.apache.lucene.util.TestRuleNoInstanceHooksOverrides$1.evaluate(TestRuleNoInstanceHooksOverrides.java:53)
	at org.apache.lucene.util.TestRuleNoStaticHooksShadowing$1.evaluate(TestRuleNoStaticHooksShadowing.java:52)
	at org.apache.lucene.util.TestRuleAssertionsRequired$1.evaluate(TestRuleAssertionsRequired.java:36)
	at org.apache.lucene.util.TestRuleMarkFailure$1.evaluate(TestRuleMarkFailure.java:48)
	at org.apache.lucene.util.TestRuleIgnoreAfterMaxFailures$1.evaluate(TestRuleIgnoreAfterMaxFailures.java:70)
	at org.apache.lucene.util.TestRuleIgnoreTestSuites$1.evaluate(TestRuleIgnoreTestSuites.java:55)
	at com.carrotsearch.randomizedtesting.RandomizedRunner.runSuite(RandomizedRunner.java:605)
	at com.carrotsearch.randomizedtesting.RandomizedRunner.access$400(RandomizedRunner.java:132)
	at com.carrotsearch.randomizedtesting.RandomizedRunner$2.run(RandomizedRunner.java:551)




Build Log:
[...truncated 7579 lines...]
[junit4:junit4] Suite: org.apache.solr.handler.component.DistributedQueryElevationComponentTest
[junit4:junit4] FAILURE 1.50s J0 | DistributedQueryElevationComponentTest.testDistribSearch
[junit4:junit4]    > Throwable #1: junit.framework.AssertionFailedError: .responseHeader.params.shards.qt:/elevate!=false
[junit4:junit4]    > 	at __randomizedtesting.SeedInfo.seed([74254ECA031050A7:F5C3C0D2744F309B]:0)
[junit4:junit4]    > 	at junit.framework.Assert.fail(Assert.java:50)
[junit4:junit4]    > 	at org.apache.solr.BaseDistributedSearchTestCase.compareResponses(BaseDistributedSearchTestCase.java:670)
[junit4:junit4]    > 	at org.apache.solr.BaseDistributedSearchTestCase.query(BaseDistributedSearchTestCase.java:392)
[junit4:junit4]    > 	at org.apache.solr.handler.component.DistributedQueryElevationComponentTest.doTest(DistributedQueryElevationComponentTest.java:81)
[junit4:junit4]    > 	at org.apache.solr.BaseDistributedSearchTestCase.testDistribSearch(BaseDistributedSearchTestCase.java:679)
[junit4:junit4]    > 	at sun.reflect.NativeMethodAccessorImpl.invoke0(Native Method)
[junit4:junit4]    > 	at sun.reflect.NativeMethodAccessorImpl.invoke(NativeMethodAccessorImpl.java:57)
[junit4:junit4]    > 	at sun.reflect.DelegatingMethodAccessorImpl.invoke(DelegatingMethodAccessorImpl.java:43)
[junit4:junit4]    > 	at java.lang.reflect.Method.invoke(Method.java:474)
[junit4:junit4]    > 	at com.carrotsearch.randomizedtesting.RandomizedRunner.invoke(RandomizedRunner.java:1995)
[junit4:junit4]    > 	at com.carrotsearch.randomizedtesting.RandomizedRunner.access$1100(RandomizedRunner.java:132)
[junit4:junit4]    > 	at com.carrotsearch.randomizedtesting.RandomizedRunner$6.evaluate(RandomizedRunner.java:818)
[junit4:junit4]    > 	at com.carrotsearch.randomizedtesting.RandomizedRunner$7.evaluate(RandomizedRunner.java:877)
[junit4:junit4]    > 	at com.carrotsearch.randomizedtesting.RandomizedRunner$8.evaluate(RandomizedRunner.java:891)
[junit4:junit4]    > 	at com.carrotsearch.randomizedtesting.rules.SystemPropertiesRestoreRule$1.evaluate(SystemPropertiesRestoreRule.java:53)
[junit4:junit4]    > 	at org.apache.lucene.util.TestRuleSetupTeardownChained$1.evaluate(TestRuleSetupTeardownChained.java:50)
[junit4:junit4]    > 	at org.apache.lucene.util.TestRuleFieldCacheSanity$1.evaluate(TestRuleFieldCacheSanity.java:32)
[junit4:junit4]    > 	at org.apache.lucene.util.AbstractBeforeAfterRule$1.evaluate(AbstractBeforeAfterRule.java:45)
[junit4:junit4]    > 	at com.carrotsearch.randomizedtesting.rules.SystemPropertiesInvariantRule$1.evaluate(SystemPropertiesInvariantRule.java:55)
[junit4:junit4]    > 	at org.apache.lucene.util.TestRuleReportUncaughtExceptions$1.evaluate(TestRuleReportUncaughtExceptions.java:68)
[junit4:junit4]    > 	at org.apache.lucene.util.TestRuleThreadAndTestName$1.evaluate(TestRuleThreadAndTestName.java:48)
[junit4:junit4]    > 	at org.apache.lucene.util.TestRuleIgnoreAfterMaxFailures$1.evaluate(TestRuleIgnoreAfterMaxFailures.java:70)
[junit4:junit4]    > 	at org.apache.lucene.util.TestRuleMarkFailure$1.evaluate(TestRuleMarkFailure.java:48)
[junit4:junit4]    > 	at com.carrotsearch.randomizedtesting.RandomizedRunner.runSingleTest(RandomizedRunner.java:825)
[junit4:junit4]    > 	at com.carrotsearch.randomizedtesting.RandomizedRunner.access$700(RandomizedRunner.java:132)
[junit4:junit4]    > 	at com.carrotsearch.randomizedtesting.RandomizedRunner$3$1.run(RandomizedRunner.java:671)
[junit4:junit4]    > 	at com.carrotsearch.randomizedtesting.RandomizedRunner$3.evaluate(RandomizedRunner.java:697)
[junit4:junit4]    > 	at com.carrotsearch.randomizedtesting.RandomizedRunner$4.evaluate(RandomizedRunner.java:736)
[junit4:junit4]    > 	at com.carrotsearch.randomizedtesting.RandomizedRunner$5.evaluate(RandomizedRunner.java:747)
[junit4:junit4]    > 	at com.carrotsearch.randomizedtesting.rules.SystemPropertiesRestoreRule$1.evaluate(SystemPropertiesRestoreRule.java:53)
[junit4:junit4]    > 	at org.apache.lucene.util.AbstractBeforeAfterRule$1.evaluate(AbstractBeforeAfterRule.java:45)
[junit4:junit4]    > 	at org.apache.lucene.util.TestRuleReportUncaughtExceptions$1.evaluate(TestRuleReportUncaughtExceptions.java:68)
[junit4:junit4]    > 	at org.apache.lucene.util.TestRuleStoreClassName$1.evaluate(TestRuleStoreClassName.java:38)
[junit4:junit4]    > 	at com.carrotsearch.randomizedtesting.rules.SystemPropertiesInvariantRule$1.evaluate(SystemPropertiesInvariantRule.java:55)
[junit4:junit4]    > 	at org.apache.lucene.util.TestRuleNoInstanceHooksOverrides$1.evaluate(TestRuleNoInstanceHooksOverrides.java:53)
[junit4:junit4]    > 	at org.apache.lucene.util.TestRuleNoStaticHooksShadowing$1.evaluate(TestRuleNoStaticHooksShadowing.java:52)
[junit4:junit4]    > 	at org.apache.lucene.util.TestRuleAssertionsRequired$1.evaluate(TestRuleAssertionsRequired.java:36)
[junit4:junit4]    > 	at org.apache.lucene.util.TestRuleMarkFailure$1.evaluate(TestRuleMarkFailure.java:48)
[junit4:junit4]    > 	at org.apache.lucene.util.TestRuleIgnoreAfterMaxFailures$1.evaluate(TestRuleIgnoreAfterMaxFailures.java:70)
[junit4:junit4]    > 	at org.apache.lucene.util.TestRuleIgnoreTestSuites$1.evaluate(TestRuleIgnoreTestSuites.java:55)
[junit4:junit4]    > 	at com.carrotsearch.randomizedtesting.RandomizedRunner.runSuite(RandomizedRunner.java:605)
[junit4:junit4]    > 	at com.carrotsearch.randomizedtesting.RandomizedRunner.access$400(RandomizedRunner.java:132)
[junit4:junit4]    > 	at com.carrotsearch.randomizedtesting.RandomizedRunner$2.run(RandomizedRunner.java:551)
[junit4:junit4]    > 
[junit4:junit4]   2> 1 T2903 oas.SolrTestCaseJ4.setUp ###Starting testDistribSearch
[junit4:junit4]   2> 2 T2903 oejs.Server.doStart jetty-8.1.2.v20120308
[junit4:junit4]   2> 5 T2903 oejs.AbstractConnector.doStart Started SocketConnector@0.0.0.0:49588
[junit4:junit4]   2> 5 T2903 oasc.SolrResourceLoader.locateSolrHome JNDI not configured for solr (NoInitialContextEx)
[junit4:junit4]   2> 6 T2903 oasc.SolrResourceLoader.locateSolrHome using system property solr.solr.home: /mnt/ssd/jenkins/workspace/Lucene-Solr-4.x-Linux/checkout/solr/build/solr-core/test-files/solr
[junit4:junit4]   2> 6 T2903 oasc.SolrResourceLoader.<init> new SolrResourceLoader for deduced Solr Home: '/mnt/ssd/jenkins/workspace/Lucene-Solr-4.x-Linux/checkout/solr/build/solr-core/test-files/solr/'
[junit4:junit4]   2> 13 T2903 oass.SolrDispatchFilter.init SolrDispatchFilter.init()
[junit4:junit4]   2> 13 T2903 oasc.SolrResourceLoader.locateSolrHome JNDI not configured for solr (NoInitialContextEx)
[junit4:junit4]   2> 13 T2903 oasc.SolrResourceLoader.locateSolrHome using system property solr.solr.home: /mnt/ssd/jenkins/workspace/Lucene-Solr-4.x-Linux/checkout/solr/build/solr-core/test-files/solr
[junit4:junit4]   2> 14 T2903 oasc.CoreContainer$Initializer.initialize looking for solr.xml: /mnt/ssd/jenkins/workspace/Lucene-Solr-4.x-Linux/checkout/solr/build/solr-core/test-files/solr/solr.xml
[junit4:junit4]   2> 14 T2903 oasc.CoreContainer.<init> New CoreContainer 16272607
[junit4:junit4]   2> 14 T2903 oasc.CoreContainer.load Loading CoreContainer using Solr Home: '/mnt/ssd/jenkins/workspace/Lucene-Solr-4.x-Linux/checkout/solr/build/solr-core/test-files/solr/'
[junit4:junit4]   2> 14 T2903 oasc.SolrResourceLoader.<init> new SolrResourceLoader for directory: '/mnt/ssd/jenkins/workspace/Lucene-Solr-4.x-Linux/checkout/solr/build/solr-core/test-files/solr/'
[junit4:junit4]   2> 23 T2903 oasc.CoreContainer.load Registering Log Listener
[junit4:junit4]   2> 34 T2903 oasc.CoreContainer.create Creating SolrCore 'collection1' using instanceDir: /mnt/ssd/jenkins/workspace/Lucene-Solr-4.x-Linux/checkout/solr/build/solr-core/test-files/solr/collection1
[junit4:junit4]   2> 35 T2903 oasc.SolrResourceLoader.<init> new SolrResourceLoader for directory: '/mnt/ssd/jenkins/workspace/Lucene-Solr-4.x-Linux/checkout/solr/build/solr-core/test-files/solr/collection1/'
[junit4:junit4]   2> 35 T2903 oasc.SolrResourceLoader.replaceClassLoader Adding 'file:/mnt/ssd/jenkins/workspace/Lucene-Solr-4.x-Linux/checkout/solr/build/solr-core/test-files/solr/collection1/lib/README' to classloader
[junit4:junit4]   2> 35 T2903 oasc.SolrResourceLoader.replaceClassLoader Adding 'file:/mnt/ssd/jenkins/workspace/Lucene-Solr-4.x-Linux/checkout/solr/build/solr-core/test-files/solr/collection1/lib/classes/' to classloader
[junit4:junit4]   2> 62 T2903 oasc.SolrConfig.<init> Using Lucene MatchVersion: LUCENE_40
[junit4:junit4]   2> 95 T2903 oasc.SolrConfig.<init> Loaded SolrConfig: solrconfig-elevate.xml
[junit4:junit4]   2> 95 T2903 oass.IndexSchema.readSchema Reading Solr Schema
[junit4:junit4]   2> 98 T2903 oass.IndexSchema.readSchema Schema name=example
[junit4:junit4]   2> 240 T2903 oass.IndexSchema.readSchema default search field in schema is text
[junit4:junit4]   2> 242 T2903 oass.IndexSchema.readSchema unique key field: id
[junit4:junit4]   2> 245 T2903 oasc.SolrCore.<init> [collection1] Opening new SolrCore at /mnt/ssd/jenkins/workspace/Lucene-Solr-4.x-Linux/checkout/solr/build/solr-core/test-files/solr/collection1/, dataDir=./org.apache.solr.handler.component.DistributedQueryElevationComponentTest-1343876012186/control/data/
[junit4:junit4]   2> 246 T2903 oasc.JmxMonitoredMap.<init> JMX monitoring is enabled. Adding Solr mbeans to JMX Server: com.sun.jmx.mbeanserver.JmxMBeanServer@d9b971
[junit4:junit4]   2> 246 T2903 oasc.SolrCore.getNewIndexDir WARNING New index directory detected: old=null new=./org.apache.solr.handler.component.DistributedQueryElevationComponentTest-1343876012186/control/data/index/
[junit4:junit4]   2> 246 T2903 oasc.SolrCore.initIndex WARNING [collection1] Solr index directory './org.apache.solr.handler.component.DistributedQueryElevationComponentTest-1343876012186/control/data/index' doesn't exist. Creating new index...
[junit4:junit4]   2> 247 T2903 oasc.SolrDeletionPolicy.onCommit SolrDeletionPolicy.onCommit: commits:num=1
[junit4:junit4]   2> 		commit{dir=BaseDirectoryWrapper(org.apache.lucene.store.RAMDirectory@bc4bb7 lockFactory=org.apache.lucene.store.SingleInstanceLockFactory@efea2),segFN=segments_1,generation=1,filenames=[segments_1]
[junit4:junit4]   2> 248 T2903 oasc.SolrDeletionPolicy.updateCommits newest commit = 1
[junit4:junit4]   2> 249 T2903 oasc.RequestHandlers.initHandlersFromConfig created /update: solr.UpdateRequestHandler
[junit4:junit4]   2> 249 T2903 oasc.RequestHandlers.initHandlersFromConfig created /elevate: org.apache.solr.handler.component.SearchHandler
[junit4:junit4]   2> 249 T2903 oasc.RequestHandlers.initHandlersFromConfig created /dataElevate: org.apache.solr.handler.component.SearchHandler
[junit4:junit4]   2> 250 T2903 oashl.XMLLoader.init xsltCacheLifetimeSeconds=60
[junit4:junit4]   2> 250 T2903 oasc.RequestHandlers.initHandlersFromConfig WARNING no default request handler is registered (either '/select' or 'standard')
[junit4:junit4]   2> 255 T2903 oasc.SolrCore.initDeprecatedSupport WARNING solrconfig.xml uses deprecated <admin/gettableFiles>, Please update your config to use the ShowFileRequestHandler.
[junit4:junit4]   2> 256 T2903 oasc.SolrCore.initDeprecatedSupport WARNING adding ShowFileRequestHandler with hidden files: [SCHEMA-COPYFIELD-TEST.XML, SOLRCONFIG-DELPOLICY1.XML, BAD-SCHEMA-NOT-INDEXED-BUT-NORMS.XML, BAD-SOLRCONFIG-INVALID-SCRIPTFILE.XML, SCHEMA-BM25.XML, SOLRCONFIG-DELPOLICY2.XML, OPEN-EXCHANGE-RATES.JSON, SCHEMA15.XML, XSLT, STOPTYPES-2.TXT, HUNSPELL-TEST.DIC, STOPTYPES-1.TXT, BAD-SCHEMA-NONTEXT-ANALYZER.XML, SCHEMA-SIM.XML, SCHEMA.XML, SOLRCONFIG-UPDATE-PROCESSOR-CHAINS.XML, THROW.ERROR.ON.ADD.UPDATEPROCESSOR.JS, SOLRCONFIG-MASTER.XML, STOPWORDS.TXT, SCHEMA12.XML, BAD-SCHEMA-NOT-INDEXED-BUT-TF.XML, STOP-SNOWBALL.TXT, CURRENCY.XML, SOLRCONFIG-MERGEPOLICY.XML, SCHEMA-SPELLCHECKER.XML, SOLRCONFIG-PROPINJECT.XML, SCHEMA-LMJELINEKMERCER.XML, SOLRCONFIG-MASTER2.XML, SCHEMA-REPLICATION1.XML, SOLRCONFIG-NATIVELOCK.XML, SCHEMA-FOLDING.XML, STOP-2.TXT, SCHEMA-REPLICATION2.XML, SOLRCONFIG-REQHANDLER.INCL, SOLRCONFIG-SPELLCHECKCOMPONENT.XML, DA_COMPOUNDDICTIONARY.TXT, COMPOUNDDICTIONARY.TXT, SOLRCONFIG-XINCLUDE.XML, SOLRCONFIG-TLOG.XML, BAD-SCHEMA-EXTERNAL-FILEFIELD.XML, SOLRCONFIG-ELEVATE.XML, HUNSPELL-TEST.AFF, MISSLEADING.EXTENSION.UPDATEPROCESSOR.JS.TXT, SOLRCONFIG-QUERYSENDER.XML, SCHEMA-TFIDF.XML, ADDFIELDS.UPDATEPROCESSOR.JS, SOLRCONFIG-TERMINDEX.XML, SOLRCONFIG-BASIC.XML, BAD-SCHEMA-ANALYZER-CLASS-AND-NESTED.XML, WDFTYPES.TXT, MAPPING-ISOLATIN1ACCENT.TXT, BAD-SOLRCONFIG-MISSING-SCRIPTFILE.XML, OLD_SYNONYMS.TXT, BAD-SCHEMA-SIM-GLOBAL-VS-FT-MISMATCH.XML, SCHEMA-STOP-KEEP.XML, SCHEMA-REVERSED.XML, SCHEMA-CHARFILTERS.XML, STOP-1.TXT, SOLRCONFIG-SCRIPT-UPDATEPROCESSOR.XML, STEMDICT.TXT, BAD-SCHEMA-DUP-DYNAMICFIELD.XML, SOLRCONFIG-SOLR-749.XML, BAD-SOLRCONFIG-BOGUS-SCRIPTENGINE-NAME.XML, BAD_SOLRCONFIG.XML, BAD-SCHEMA-UNIQUEKEY-MULTIVALUED.XML, SOLRCONFIG-SIMPLELOCK.XML, SOLRCONFIG-SLAVE1.XML, SCHEMA11.XML, PROTWORDS.TXT, SCHEMA-PHRASESUGGEST.XML, CONDITIONAL.UPDATEPROCESSOR.JS, BAD-SCHEMA-DUP-FIELDTYPE.XML, SCHEMASURROUND.XML, MISSING.FUNCTIONS.UPDATEPROCESSOR.JS, SOLRCONFIG_PERF.XML, SOLRCONFIG-NOCACHE.XML, SCHEMA-COLLATE.XML, BAD-MP-SOLRCONFIG.XML, BAD-SCHEMA-UNIQUEKEY-USES-DEFAULT.XML, SCHEMA-TRIE.XML, SOLRCONFIG-PHRASESUGGEST.XML, TRIVIAL.UPDATEPROCESSOR0.JS, SOLRCONFIG-BASIC-LUCENEVERSION31.XML, KEEP-2.TXT, SOLRCONFIG-FUNCTIONQUERY.XML, SCHEMA-LMDIRICHLET.XML, STOPWORDSWRONGENCODING.TXT, SCHEMA-NUMERIC.XML, SOLRCONFIG-ENABLEPLUGIN.XML, PHRASESUGGEST.TXT, SYNONYMS.TXT, HYPHENATION.DTD, SOLRCONFIG-QUERYSENDER-NOQUERY.XML, BAD-SCHEMA-UNIQUEKEY-IS-COPYFIELD-DEST.XML, SOLRCONFIG-MASTER3.XML, SOLRCONFIG-SPELLCHECKER.XML, SOLRCONFIG-HIGHLIGHT.XML, SOLRCONFIG-REPEATER.XML, SOLRCONFIG-MASTER1.XML, SOLRCONFIG-LAZYWRITER.XML, SOLRCONFIG-SLAVE.XML, SOLRCONFIG_CODEC.XML, DA_UTF8.XML, ELEVATE.XML, BAD-SCHEMA-CODEC-GLOBAL-VS-FT-MISMATCH.XML, TRIVIAL.UPDATEPROCESSOR1.JS, BAD-SCHEMA-OMIT-TF-BUT-NOT-POS.XML, SOLRCONFIG-SOLCOREPROPERTIES.XML, FRENCHARTICLES.TXT, SCHEMA-IB.XML, SCHEMA-COLLATEFILTER.XML, SOLRCONFIG-MASTER1-KEEPONEBACKUP.XML, SOLRCONFIG-TRANSFORMERS.XML, BAD-SCHEMA-DUP-FIELD.XML, SOLRCONFIG-CACHING.XML, SCHEMA-LUCENEMATCHVERSION.XML, STOPWITHBOM.TXT, KEEP-1.TXT, BAD-SCHEMA-NOT-INDEXED-BUT-POS.XML, SOLRCONFIG-PROPINJECT-INDEXDEFAULT.XML, SOLRCONFIG-ALTDIRECTORY.XML, SCHEMA-BINARYFIELD.XML, SCHEMA_CODEC.XML, SCHEMA-MINIMAL.XML, SCHEMA-NOT-REQUIRED-UNIQUE-KEY.XML, SCHEMA-REQUIRED-FIELDS.XML, SCHEMA-DFR.XML]
[junit4:junit4]   2> 258 T2903 oass.SolrIndexSearcher.<init> Opening Searcher@ba3700 main
[junit4:junit4]   2> 259 T2903 oass.SolrIndexSearcher.getIndexDir WARNING WARNING: Directory impl does not support setting indexDir: org.apache.lucene.store.BaseDirectoryWrapper
[junit4:junit4]   2> 259 T2903 oasu.CommitTracker.<init> Hard AutoCommit: disabled
[junit4:junit4]   2> 259 T2903 oasu.CommitTracker.<init> Soft AutoCommit: disabled
[junit4:junit4]   2> 260 T2903 oashc.QueryElevationComponent.inform Loading QueryElevation from: /mnt/ssd/jenkins/workspace/Lucene-Solr-4.x-Linux/checkout/solr/build/solr-core/test-files/solr/collection1/conf/elevate.xml
[junit4:junit4]   2> 266 T2903 oashc.QueryElevationComponent.inform Loading QueryElevation from: /mnt/ssd/jenkins/workspace/Lucene-Solr-4.x-Linux/checkout/solr/build/solr-core/test-files/solr/collection1/conf/elevate.xml
[junit4:junit4]   2> 272 T2903 oashc.HttpShardHandlerFactory.getParameter Setting socketTimeout to: 0
[junit4:junit4]   2> 273 T2903 oashc.HttpShardHandlerFactory.getParameter Setting urlScheme to: http://
[junit4:junit4]   2> 273 T2903 oashc.HttpShardHandlerFactory.getParameter Setting connTimeout to: 0
[junit4:junit4]   2> 273 T2903 oashc.HttpShardHandlerFactory.getParameter Setting maxConnectionsPerHost to: 20
[junit4:junit4]   2> 274 T2903 oashc.HttpShardHandlerFactory.getParameter Setting corePoolSize to: 0
[junit4:junit4]   2> 274 T2903 oashc.HttpShardHandlerFactory.getParameter Setting maximumPoolSize to: 2147483647
[junit4:junit4]   2> 274 T2903 oashc.HttpShardHandlerFactory.getParameter Setting maxThreadIdleTime to: 5
[junit4:junit4]   2> 274 T2903 oashc.HttpShardHandlerFactory.getParameter Setting sizeOfQueue to: -1
[junit4:junit4]   2> 274 T2903 oashc.HttpShardHandlerFactory.getParameter Setting fairnessPolicy to: false
[junit4:junit4]   2> 275 T2903 oascsi.HttpClientUtil.createClient Creating new http client, config:maxConnectionsPerHost=20&maxConnections=10000&socketTimeout=0&connTimeout=0&retry=false
[junit4:junit4]   2> 277 T2903 oasc.CoreContainer.register registering core: collection1
[junit4:junit4]   2> 277 T2913 oasc.SolrCore.registerSearcher [collection1] Registered new searcher Searcher@ba3700 main{StandardDirectoryReader(segments_1:1)}
[junit4:junit4]   2> 277 T2903 oass.SolrDispatchFilter.init user.dir=/mnt/ssd/jenkins/workspace/Lucene-Solr-4.x-Linux/checkout/solr/build/solr-core/test/J0
[junit4:junit4]   2> 278 T2903 oass.SolrDispatchFilter.init SolrDispatchFilter.init() done
[junit4:junit4]   2> 278 T2903 oascsi.HttpClientUtil.createClient Creating new http client, config:maxConnections=128&maxConnectionsPerHost=32&followRedirects=false
[junit4:junit4]   2> 280 T2903 oejs.Server.doStart jetty-8.1.2.v20120308
[junit4:junit4]   2> 282 T2903 oejs.AbstractConnector.doStart Started SocketConnector@0.0.0.0:57569
[junit4:junit4]   2> 282 T2903 oasc.SolrResourceLoader.locateSolrHome JNDI not configured for solr (NoInitialContextEx)
[junit4:junit4]   2> 282 T2903 oasc.SolrResourceLoader.locateSolrHome using system property solr.solr.home: /mnt/ssd/jenkins/workspace/Lucene-Solr-4.x-Linux/checkout/solr/build/solr-core/test-files/solr
[junit4:junit4]   2> 282 T2903 oasc.SolrResourceLoader.<init> new SolrResourceLoader for deduced Solr Home: '/mnt/ssd/jenkins/workspace/Lucene-Solr-4.x-Linux/checkout/solr/build/solr-core/test-files/solr/'
[junit4:junit4]   2> 289 T2903 oass.SolrDispatchFilter.init SolrDispatchFilter.init()
[junit4:junit4]   2> 290 T2903 oasc.SolrResourceLoader.locateSolrHome JNDI not configured for solr (NoInitialContextEx)
[junit4:junit4]   2> 290 T2903 oasc.SolrResourceLoader.locateSolrHome using system property solr.solr.home: /mnt/ssd/jenkins/workspace/Lucene-Solr-4.x-Linux/checkout/solr/build/solr-core/test-files/solr
[junit4:junit4]   2> 290 T2903 oasc.CoreContainer$Initializer.initialize looking for solr.xml: /mnt/ssd/jenkins/workspace/Lucene-Solr-4.x-Linux/checkout/solr/build/solr-core/test-files/solr/solr.xml
[junit4:junit4]   2> 290 T2903 oasc.CoreContainer.<init> New CoreContainer 11375514
[junit4:junit4]   2> 291 T2903 oasc.CoreContainer.load Loading CoreContainer using Solr Home: '/mnt/ssd/jenkins/workspace/Lucene-Solr-4.x-Linux/checkout/solr/build/solr-core/test-files/solr/'
[junit4:junit4]   2> 291 T2903 oasc.SolrResourceLoader.<init> new SolrResourceLoader for directory: '/mnt/ssd/jenkins/workspace/Lucene-Solr-4.x-Linux/checkout/solr/build/solr-core/test-files/solr/'
[junit4:junit4]   2> 300 T2903 oasc.CoreContainer.load Registering Log Listener
[junit4:junit4]   2> 311 T2903 oasc.CoreContainer.create Creating SolrCore 'collection1' using instanceDir: /mnt/ssd/jenkins/workspace/Lucene-Solr-4.x-Linux/checkout/solr/build/solr-core/test-files/solr/collection1
[junit4:junit4]   2> 311 T2903 oasc.SolrResourceLoader.<init> new SolrResourceLoader for directory: '/mnt/ssd/jenkins/workspace/Lucene-Solr-4.x-Linux/checkout/solr/build/solr-core/test-files/solr/collection1/'
[junit4:junit4]   2> 312 T2903 oasc.SolrResourceLoader.replaceClassLoader Adding 'file:/mnt/ssd/jenkins/workspace/Lucene-Solr-4.x-Linux/checkout/solr/build/solr-core/test-files/solr/collection1/lib/README' to classloader
[junit4:junit4]   2> 312 T2903 oasc.SolrResourceLoader.replaceClassLoader Adding 'file:/mnt/ssd/jenkins/workspace/Lucene-Solr-4.x-Linux/checkout/solr/build/solr-core/test-files/solr/collection1/lib/classes/' to classloader
[junit4:junit4]   2> 332 T2903 oasc.SolrConfig.<init> Using Lucene MatchVersion: LUCENE_40
[junit4:junit4]   2> 371 T2903 oasc.SolrConfig.<init> Loaded SolrConfig: solrconfig-elevate.xml
[junit4:junit4]   2> 372 T2903 oass.IndexSchema.readSchema Reading Solr Schema
[junit4:junit4]   2> 374 T2903 oass.IndexSchema.readSchema Schema name=example
[junit4:junit4]   2> 524 T2903 oass.IndexSchema.readSchema default search field in schema is text
[junit4:junit4]   2> 526 T2903 oass.IndexSchema.readSchema unique key field: id
[junit4:junit4]   2> 529 T2903 oasc.SolrCore.<init> [collection1] Opening new SolrCore at /mnt/ssd/jenkins/workspace/Lucene-Solr-4.x-Linux/checkout/solr/build/solr-core/test-files/solr/collection1/, dataDir=./org.apache.solr.handler.component.DistributedQueryElevationComponentTest-1343876012186/shard0/data/
[junit4:junit4]   2> 529 T2903 oasc.JmxMonitoredMap.<init> JMX monitoring is enabled. Adding Solr mbeans to JMX Server: com.sun.jmx.mbeanserver.JmxMBeanServer@d9b971
[junit4:junit4]   2> 529 T2903 oasc.SolrCore.getNewIndexDir WARNING New index directory detected: old=null new=./org.apache.solr.handler.component.DistributedQueryElevationComponentTest-1343876012186/shard0/data/index/
[junit4:junit4]   2> 530 T2903 oasc.SolrCore.initIndex WARNING [collection1] Solr index directory './org.apache.solr.handler.component.DistributedQueryElevationComponentTest-1343876012186/shard0/data/index' doesn't exist. Creating new index...
[junit4:junit4]   2> 531 T2903 oasc.SolrDeletionPolicy.onCommit SolrDeletionPolicy.onCommit: commits:num=1
[junit4:junit4]   2> 		commit{dir=MockDirWrapper(org.apache.lucene.store.RAMDirectory@ddad57 lockFactory=org.apache.lucene.store.SingleInstanceLockFactory@11d63b0),segFN=segments_1,generation=1,filenames=[segments_1]
[junit4:junit4]   2> 531 T2903 oasc.SolrDeletionPolicy.updateCommits newest commit = 1
[junit4:junit4]   2> 532 T2903 oasc.RequestHandlers.initHandlersFromConfig created /update: solr.UpdateRequestHandler
[junit4:junit4]   2> 532 T2903 oasc.RequestHandlers.initHandlersFromConfig created /elevate: org.apache.solr.handler.component.SearchHandler
[junit4:junit4]   2> 532 T2903 oasc.RequestHandlers.initHandlersFromConfig created /dataElevate: org.apache.solr.handler.component.SearchHandler
[junit4:junit4]   2> 533 T2903 oashl.XMLLoader.init xsltCacheLifetimeSeconds=60
[junit4:junit4]   2> 533 T2903 oasc.RequestHandlers.initHandlersFromConfig WARNING no default request handler is registered (either '/select' or 'standard')
[junit4:junit4]   2> 534 T2903 oasc.SolrCore.initDeprecatedSupport WARNING solrconfig.xml uses deprecated <admin/gettableFiles>, Please update your config to use the ShowFileRequestHandler.
[junit4:junit4]   2> 535 T2903 oasc.SolrCore.initDeprecatedSupport WARNING adding ShowFileRequestHandler with hidden files: [SCHEMA-COPYFIELD-TEST.XML, SOLRCONFIG-DELPOLICY1.XML, BAD-SCHEMA-NOT-INDEXED-BUT-NORMS.XML, BAD-SOLRCONFIG-INVALID-SCRIPTFILE.XML, SCHEMA-BM25.XML, SOLRCONFIG-DELPOLICY2.XML, OPEN-EXCHANGE-RATES.JSON, SCHEMA15.XML, XSLT, STOPTYPES-2.TXT, HUNSPELL-TEST.DIC, STOPTYPES-1.TXT, BAD-SCHEMA-NONTEXT-ANALYZER.XML, SCHEMA-SIM.XML, SCHEMA.XML, SOLRCONFIG-UPDATE-PROCESSOR-CHAINS.XML, THROW.ERROR.ON.ADD.UPDATEPROCESSOR.JS, SOLRCONFIG-MASTER.XML, STOPWORDS.TXT, SCHEMA12.XML, BAD-SCHEMA-NOT-INDEXED-BUT-TF.XML, STOP-SNOWBALL.TXT, CURRENCY.XML, SOLRCONFIG-MERGEPOLICY.XML, SCHEMA-SPELLCHECKER.XML, SOLRCONFIG-PROPINJECT.XML, SCHEMA-LMJELINEKMERCER.XML, SOLRCONFIG-MASTER2.XML, SCHEMA-REPLICATION1.XML, SOLRCONFIG-NATIVELOCK.XML, SCHEMA-FOLDING.XML, STOP-2.TXT, SCHEMA-REPLICATION2.XML, SOLRCONFIG-REQHANDLER.INCL, SOLRCONFIG-SPELLCHECKCOMPONENT.XML, DA_COMPOUNDDICTIONARY.TXT, COMPOUNDDICTIONARY.TXT, SOLRCONFIG-XINCLUDE.XML, SOLRCONFIG-TLOG.XML, BAD-SCHEMA-EXTERNAL-FILEFIELD.XML, SOLRCONFIG-ELEVATE.XML, HUNSPELL-TEST.AFF, MISSLEADING.EXTENSION.UPDATEPROCESSOR.JS.TXT, SOLRCONFIG-QUERYSENDER.XML, SCHEMA-TFIDF.XML, ADDFIELDS.UPDATEPROCESSOR.JS, SOLRCONFIG-TERMINDEX.XML, SOLRCONFIG-BASIC.XML, BAD-SCHEMA-ANALYZER-CLASS-AND-NESTED.XML, WDFTYPES.TXT, MAPPING-ISOLATIN1ACCENT.TXT, BAD-SOLRCONFIG-MISSING-SCRIPTFILE.XML, OLD_SYNONYMS.TXT, BAD-SCHEMA-SIM-GLOBAL-VS-FT-MISMATCH.XML, SCHEMA-STOP-KEEP.XML, SCHEMA-REVERSED.XML, SCHEMA-CHARFILTERS.XML, STOP-1.TXT, SOLRCONFIG-SCRIPT-UPDATEPROCESSOR.XML, STEMDICT.TXT, BAD-SCHEMA-DUP-DYNAMICFIELD.XML, SOLRCONFIG-SOLR-749.XML, BAD-SOLRCONFIG-BOGUS-SCRIPTENGINE-NAME.XML, BAD_SOLRCONFIG.XML, BAD-SCHEMA-UNIQUEKEY-MULTIVALUED.XML, SOLRCONFIG-SIMPLELOCK.XML, SOLRCONFIG-SLAVE1.XML, SCHEMA11.XML, PROTWORDS.TXT, SCHEMA-PHRASESUGGEST.XML, CONDITIONAL.UPDATEPROCESSOR.JS, BAD-SCHEMA-DUP-FIELDTYPE.XML, SCHEMASURROUND.XML, MISSING.FUNCTIONS.UPDATEPROCESSOR.JS, SOLRCONFIG_PERF.XML, SOLRCONFIG-NOCACHE.XML, SCHEMA-COLLATE.XML, BAD-MP-SOLRCONFIG.XML, BAD-SCHEMA-UNIQUEKEY-USES-DEFAULT.XML, SCHEMA-TRIE.XML, SOLRCONFIG-PHRASESUGGEST.XML, TRIVIAL.UPDATEPROCESSOR0.JS, SOLRCONFIG-BASIC-LUCENEVERSION31.XML, KEEP-2.TXT, SOLRCONFIG-FUNCTIONQUERY.XML, SCHEMA-LMDIRICHLET.XML, STOPWORDSWRONGENCODING.TXT, SCHEMA-NUMERIC.XML, SOLRCONFIG-ENABLEPLUGIN.XML, PHRASESUGGEST.TXT, SYNONYMS.TXT, HYPHENATION.DTD, SOLRCONFIG-QUERYSENDER-NOQUERY.XML, BAD-SCHEMA-UNIQUEKEY-IS-COPYFIELD-DEST.XML, SOLRCONFIG-MASTER3.XML, SOLRCONFIG-SPELLCHECKER.XML, SOLRCONFIG-HIGHLIGHT.XML, SOLRCONFIG-REPEATER.XML, SOLRCONFIG-MASTER1.XML, SOLRCONFIG-LAZYWRITER.XML, SOLRCONFIG-SLAVE.XML, SOLRCONFIG_CODEC.XML, DA_UTF8.XML, ELEVATE.XML, BAD-SCHEMA-CODEC-GLOBAL-VS-FT-MISMATCH.XML, TRIVIAL.UPDATEPROCESSOR1.JS, BAD-SCHEMA-OMIT-TF-BUT-NOT-POS.XML, SOLRCONFIG-SOLCOREPROPERTIES.XML, FRENCHARTICLES.TXT, SCHEMA-IB.XML, SCHEMA-COLLATEFILTER.XML, SOLRCONFIG-MASTER1-KEEPONEBACKUP.XML, SOLRCONFIG-TRANSFORMERS.XML, BAD-SCHEMA-DUP-FIELD.XML, SOLRCONFIG-CACHING.XML, SCHEMA-LUCENEMATCHVERSION.XML, STOPWITHBOM.TXT, KEEP-1.TXT, BAD-SCHEMA-NOT-INDEXED-BUT-POS.XML, SOLRCONFIG-PROPINJECT-INDEXDEFAULT.XML, SOLRCONFIG-ALTDIRECTORY.XML, SCHEMA-BINARYFIELD.XML, SCHEMA_CODEC.XML, SCHEMA-MINIMAL.XML, SCHEMA-NOT-REQUIRED-UNIQUE-KEY.XML, SCHEMA-REQUIRED-FIELDS.XML, SCHEMA-DFR.XML]
[junit4:junit4]   2> 537 T2903 oass.SolrIndexSearcher.<init> Opening Searcher@26ce82 main
[junit4:junit4]   2> 538 T2903 oass.SolrIndexSearcher.getIndexDir WARNING WARNING: Directory impl does not support setting indexDir: org.apache.lucene.store.MockDirectoryWrapper
[junit4:junit4]   2> 538 T2903 oasu.CommitTracker.<init> Hard AutoCommit: disabled
[junit4:junit4]   2> 538 T2903 oasu.CommitTracker.<init> Soft AutoCommit: disabled
[junit4:junit4]   2> 539 T2903 oashc.QueryElevationComponent.inform Loading QueryElevation from: /mnt/ssd/jenkins/workspace/Lucene-Solr-4.x-Linux/checkout/solr/build/solr-core/test-files/solr/collection1/conf/elevate.xml
[junit4:junit4]   2> 545 T2903 oashc.QueryElevationComponent.inform Loading QueryElevation from: /mnt/ssd/jenkins/workspace/Lucene-Solr-4.x-Linux/checkout/solr/build/solr-core/test-files/solr/collection1/conf/elevate.xml
[junit4:junit4]   2> 551 T2903 oashc.HttpShardHandlerFactory.getParameter Setting socketTimeout to: 0
[junit4:junit4]   2> 552 T2903 oashc.HttpShardHandlerFactory.getParameter Setting urlScheme to: http://
[junit4:junit4]   2> 552 T2903 oashc.HttpShardHandlerFactory.getParameter Setting connTimeout to: 0
[junit4:junit4]   2> 552 T2903 oashc.HttpShardHandlerFactory.getParameter Setting maxConnectionsPerHost to: 20
[junit4:junit4]   2> 552 T2903 oashc.HttpShardHandlerFactory.getParameter Setting corePoolSize to: 0
[junit4:junit4]   2> 553 T2903 oashc.HttpShardHandlerFactory.getParameter Setting maximumPoolSize to: 2147483647
[junit4:junit4]   2> 553 T2903 oashc.HttpShardHandlerFactory.getParameter Setting maxThreadIdleTime to: 5
[junit4:junit4]   2> 553 T2903 oashc.HttpShardHandlerFactory.getParameter Setting sizeOfQueue to: -1
[junit4:junit4]   2> 553 T2903 oashc.HttpShardHandlerFactory.getParameter Setting fairnessPolicy to: false
[junit4:junit4]   2> 554 T2903 oascsi.HttpClientUtil.createClient Creating new http client, config:maxConnectionsPerHost=20&maxConnections=10000&socketTimeout=0&connTimeout=0&retry=false
[junit4:junit4]   2> 556 T2903 oasc.CoreContainer.register registering core: collection1
[junit4:junit4]   2> 556 T2923 oasc.SolrCore.registerSearcher [collection1] Registered new searcher Searcher@26ce82 main{StandardDirectoryReader(segments_1:1)}
[junit4:junit4]   2> 556 T2903 oass.SolrDispatchFilter.init user.dir=/mnt/ssd/jenkins/workspace/Lucene-Solr-4.x-Linux/checkout/solr/build/solr-core/test/J0
[junit4:junit4]   2> 557 T2903 oass.SolrDispatchFilter.init SolrDispatchFilter.init() done
[junit4:junit4]   2> 557 T2903 oascsi.HttpClientUtil.createClient Creating new http client, config:maxConnections=128&maxConnectionsPerHost=32&followRedirects=false
[junit4:junit4]   2> 559 T2903 oejs.Server.doStart jetty-8.1.2.v20120308
[junit4:junit4]   2> 561 T2903 oejs.AbstractConnector.doStart Started SocketConnector@0.0.0.0:38747
[junit4:junit4]   2> 561 T2903 oasc.SolrResourceLoader.locateSolrHome JNDI not configured for solr (NoInitialContextEx)
[junit4:junit4]   2> 561 T2903 oasc.SolrResourceLoader.locateSolrHome using system property solr.solr.home: /mnt/ssd/jenkins/workspace/Lucene-Solr-4.x-Linux/checkout/solr/build/solr-core/test-files/solr
[junit4:junit4]   2> 562 T2903 oasc.SolrResourceLoader.<init> new SolrResourceLoader for deduced Solr Home: '/mnt/ssd/jenkins/workspace/Lucene-Solr-4.x-Linux/checkout/solr/build/solr-core/test-files/solr/'
[junit4:junit4]   2> 575 T2903 oass.SolrDispatchFilter.init SolrDispatchFilter.init()
[junit4:junit4]   2> 576 T2903 oasc.SolrResourceLoader.locateSolrHome JNDI not configured for solr (NoInitialContextEx)
[junit4:junit4]   2> 576 T2903 oasc.SolrResourceLoader.locateSolrHome using system property solr.solr.home: /mnt/ssd/jenkins/workspace/Lucene-Solr-4.x-Linux/checkout/solr/build/solr-core/test-files/solr
[junit4:junit4]   2> 576 T2903 oasc.CoreContainer$Initializer.initialize looking for solr.xml: /mnt/ssd/jenkins/workspace/Lucene-Solr-4.x-Linux/checkout/solr/build/solr-core/test-files/solr/solr.xml
[junit4:junit4]   2> 576 T2903 oasc.CoreContainer.<init> New CoreContainer 446285
[junit4:junit4]   2> 577 T2903 oasc.CoreContainer.load Loading CoreContainer using Solr Home: '/mnt/ssd/jenkins/workspace/Lucene-Solr-4.x-Linux/checkout/solr/build/solr-core/test-files/solr/'
[junit4:junit4]   2> 577 T2903 oasc.SolrResourceLoader.<init> new SolrResourceLoader for directory: '/mnt/ssd/jenkins/workspace/Lucene-Solr-4.x-Linux/checkout/solr/build/solr-core/test-files/solr/'
[junit4:junit4]   2> 586 T2903 oasc.CoreContainer.load Registering Log Listener
[junit4:junit4]   2> 598 T2903 oasc.CoreContainer.create Creating SolrCore 'collection1' using instanceDir: /mnt/ssd/jenkins/workspace/Lucene-Solr-4.x-Linux/checkout/solr/build/solr-core/test-files/solr/collection1
[junit4:junit4]   2> 598 T2903 oasc.SolrResourceLoader.<init> new SolrResourceLoader for directory: '/mnt/ssd/jenkins/workspace/Lucene-Solr-4.x-Linux/checkout/solr/build/solr-core/test-files/solr/collection1/'
[junit4:junit4]   2> 598 T2903 oasc.SolrResourceLoader.replaceClassLoader Adding 'file:/mnt/ssd/jenkins/workspace/Lucene-Solr-4.x-Linux/checkout/solr/build/solr-core/test-files/solr/collection1/lib/README' to classloader
[junit4:junit4]   2> 599 T2903 oasc.SolrResourceLoader.replaceClassLoader Adding 'file:/mnt/ssd/jenkins/workspace/Lucene-Solr-4.x-Linux/checkout/solr/build/solr-core/test-files/solr/collection1/lib/classes/' to classloader
[junit4:junit4]   2> 620 T2903 oasc.SolrConfig.<init> Using Lucene MatchVersion: LUCENE_40
[junit4:junit4]   2> 661 T2903 oasc.SolrConfig.<init> Loaded SolrConfig: solrconfig-elevate.xml
[junit4:junit4]   2> 662 T2903 oass.IndexSchema.readSchema Reading Solr Schema
[junit4:junit4]   2> 664 T2903 oass.IndexSchema.readSchema Schema name=example
[junit4:junit4]   2> 814 T2903 oass.IndexSchema.readSchema default search field in schema is text
[junit4:junit4]   2> 816 T2903 oass.IndexSchema.readSchema unique key field: id
[junit4:junit4]   2> 818 T2903 oasc.SolrCore.<init> [collection1] Opening new SolrCore at /mnt/ssd/jenkins/workspace/Lucene-Solr-4.x-Linux/checkout/solr/build/solr-core/test-files/solr/collection1/, dataDir=./org.apache.solr.handler.component.DistributedQueryElevationComponentTest-1343876012186/shard1/data/
[junit4:junit4]   2> 819 T2903 oasc.JmxMonitoredMap.<init> JMX monitoring is enabled. Adding Solr mbeans to JMX Server: com.sun.jmx.mbeanserver.JmxMBeanServer@d9b971
[junit4:junit4]   2> 819 T2903 oasc.SolrCore.getNewIndexDir WARNING New index directory detected: old=null new=./org.apache.solr.handler.component.DistributedQueryElevationComponentTest-1343876012186/shard1/data/index/
[junit4:junit4]   2> 819 T2903 oasc.SolrCore.initIndex WARNING [collection1] Solr index directory './org.apache.solr.handler.component.DistributedQueryElevationComponentTest-1343876012186/shard1/data/index' doesn't exist. Creating new index...
[junit4:junit4]   2> 820 T2903 oasc.SolrDeletionPolicy.onCommit SolrDeletionPolicy.onCommit: commits:num=1
[junit4:junit4]   2> 		commit{dir=MockDirWrapper(org.apache.lucene.store.RAMDirectory@1cf4ee8 lockFactory=org.apache.lucene.store.SingleInstanceLockFactory@1ca1238),segFN=segments_1,generation=1,filenames=[segments_1]
[junit4:junit4]   2> 821 T2903 oasc.SolrDeletionPolicy.updateCommits newest commit = 1
[junit4:junit4]   2> 821 T2903 oasc.RequestHandlers.initHandlersFromConfig created /update: solr.UpdateRequestHandler
[junit4:junit4]   2> 822 T2903 oasc.RequestHandlers.initHandlersFromConfig created /elevate: org.apache.solr.handler.component.SearchHandler
[junit4:junit4]   2> 822 T2903 oasc.RequestHandlers.initHandlersFromConfig created /dataElevate: org.apache.solr.handler.component.SearchHandler
[junit4:junit4]   2> 823 T2903 oashl.XMLLoader.init xsltCacheLifetimeSeconds=60
[junit4:junit4]   2> 823 T2903 oasc.RequestHandlers.initHandlersFromConfig WARNING no default request handler is registered (either '/select' or 'standard')
[junit4:junit4]   2> 824 T2903 oasc.SolrCore.initDeprecatedSupport WARNING solrconfig.xml uses deprecated <admin/gettableFiles>, Please update your config to use the ShowFileRequestHandler.
[junit4:junit4]   2> 825 T2903 oasc.SolrCore.initDeprecatedSupport WARNING adding ShowFileRequestHandler with hidden files: [SCHEMA-COPYFIELD-TEST.XML, SOLRCONFIG-DELPOLICY1.XML, BAD-SCHEMA-NOT-INDEXED-BUT-NORMS.XML, BAD-SOLRCONFIG-INVALID-SCRIPTFILE.XML, SCHEMA-BM25.XML, SOLRCONFIG-DELPOLICY2.XML, OPEN-EXCHANGE-RATES.JSON, SCHEMA15.XML, XSLT, STOPTYPES-2.TXT, HUNSPELL-TEST.DIC, STOPTYPES-1.TXT, BAD-SCHEMA-NONTEXT-ANALYZER.XML, SCHEMA-SIM.XML, SCHEMA.XML, SOLRCONFIG-UPDATE-PROCESSOR-CHAINS.XML, THROW.ERROR.ON.ADD.UPDATEPROCESSOR.JS, SOLRCONFIG-MASTER.XML, STOPWORDS.TXT, SCHEMA12.XML, BAD-SCHEMA-NOT-INDEXED-BUT-TF.XML, STOP-SNOWBALL.TXT, CURRENCY.XML, SOLRCONFIG-MERGEPOLICY.XML, SCHEMA-SPELLCHECKER.XML, SOLRCONFIG-PROPINJECT.XML, SCHEMA-LMJELINEKMERCER.XML, SOLRCONFIG-MASTER2.XML, SCHEMA-REPLICATION1.XML, SOLRCONFIG-NATIVELOCK.XML, SCHEMA-FOLDING.XML, STOP-2.TXT, SCHEMA-REPLICATION2.XML, SOLRCONFIG-REQHANDLER.INCL, SOLRCONFIG-SPELLCHECKCOMPONENT.XML, DA_COMPOUNDDICTIONARY.TXT, COMPOUNDDICTIONARY.TXT, SOLRCONFIG-XINCLUDE.XML, SOLRCONFIG-TLOG.XML, BAD-SCHEMA-EXTERNAL-FILEFIELD.XML, SOLRCONFIG-ELEVATE.XML, HUNSPELL-TEST.AFF, MISSLEADING.EXTENSION.UPDATEPROCESSOR.JS.TXT, SOLRCONFIG-QUERYSENDER.XML, SCHEMA-TFIDF.XML, ADDFIELDS.UPDATEPROCESSOR.JS, SOLRCONFIG-TERMINDEX.XML, SOLRCONFIG-BASIC.XML, BAD-SCHEMA-ANALYZER-CLASS-AND-NESTED.XML, WDFTYPES.TXT, MAPPING-ISOLATIN1ACCENT.TXT, BAD-SOLRCONFIG-MISSING-SCRIPTFILE.XML, OLD_SYNONYMS.TXT, BAD-SCHEMA-SIM-GLOBAL-VS-FT-MISMATCH.XML, SCHEMA-STOP-KEEP.XML, SCHEMA-REVERSED.XML, SCHEMA-CHARFILTERS.XML, STOP-1.TXT, SOLRCONFIG-SCRIPT-UPDATEPROCESSOR.XML, STEMDICT.TXT, BAD-SCHEMA-DUP-DYNAMICFIELD.XML, SOLRCONFIG-SOLR-749.XML, BAD-SOLRCONFIG-BOGUS-SCRIPTENGINE-NAME.XML, BAD_SOLRCONFIG.XML, BAD-SCHEMA-UNIQUEKEY-MULTIVALUED.XML, SOLRCONFIG-SIMPLELOCK.XML, SOLRCONFIG-SLAVE1.XML, SCHEMA11.XML, PROTWORDS.TXT, SCHEMA-PHRASESUGGEST.XML, CONDITIONAL.UPDATEPROCESSOR.JS, BAD-SCHEMA-DUP-FIELDTYPE.XML, SCHEMASURROUND.XML, MISSING.FUNCTIONS.UPDATEPROCESSOR.JS, SOLRCONFIG_PERF.XML, SOLRCONFIG-NOCACHE.XML, SCHEMA-COLLATE.XML, BAD-MP-SOLRCONFIG.XML, BAD-SCHEMA-UNIQUEKEY-USES-DEFAULT.XML, SCHEMA-TRIE.XML, SOLRCONFIG-PHRASESUGGEST.XML, TRIVIAL.UPDATEPROCESSOR0.JS, SOLRCONFIG-BASIC-LUCENEVERSION31.XML, KEEP-2.TXT, SOLRCONFIG-FUNCTIONQUERY.XML, SCHEMA-LMDIRICHLET.XML, STOPWORDSWRONGENCODING.TXT, SCHEMA-NUMERIC.XML, SOLRCONFIG-ENABLEPLUGIN.XML, PHRASESUGGEST.TXT, SYNONYMS.TXT, HYPHENATION.DTD, SOLRCONFIG-QUERYSENDER-NOQUERY.XML, BAD-SCHEMA-UNIQUEKEY-IS-COPYFIELD-DEST.XML, SOLRCONFIG-MASTER3.XML, SOLRCONFIG-SPELLCHECKER.XML, SOLRCONFIG-HIGHLIGHT.XML, SOLRCONFIG-REPEATER.XML, SOLRCONFIG-MASTER1.XML, SOLRCONFIG-LAZYWRITER.XML, SOLRCONFIG-SLAVE.XML, SOLRCONFIG_CODEC.XML, DA_UTF8.XML, ELEVATE.XML, BAD-SCHEMA-CODEC-GLOBAL-VS-FT-MISMATCH.XML, TRIVIAL.UPDATEPROCESSOR1.JS, BAD-SCHEMA-OMIT-TF-BUT-NOT-POS.XML, SOLRCONFIG-SOLCOREPROPERTIES.XML, FRENCHARTICLES.TXT, SCHEMA-IB.XML, SCHEMA-COLLATEFILTER.XML, SOLRCONFIG-MASTER1-KEEPONEBACKUP.XML, SOLRCONFIG-TRANSFORMERS.XML, BAD-SCHEMA-DUP-FIELD.XML, SOLRCONFIG-CACHING.XML, SCHEMA-LUCENEMATCHVERSION.XML, STOPWITHBOM.TXT, KEEP-1.TXT, BAD-SCHEMA-NOT-INDEXED-BUT-POS.XML, SOLRCONFIG-PROPINJECT-INDEXDEFAULT.XML, SOLRCONFIG-ALTDIRECTORY.XML, SCHEMA-BINARYFIELD.XML, SCHEMA_CODEC.XML, SCHEMA-MINIMAL.XML, SCHEMA-NOT-REQUIRED-UNIQUE-KEY.XML, SCHEMA-REQUIRED-FIELDS.XML, SCHEMA-DFR.XML]
[junit4:junit4]   2> 827 T2903 oass.SolrIndexSearcher.<init> Opening Searcher@b8590c main
[junit4:junit4]   2> 827 T2903 oass.SolrIndexSearcher.getIndexDir WARNING WARNING: Directory impl does not support setting indexDir: org.apache.lucene.store.MockDirectoryWrapper
[junit4:junit4]   2> 827 T2903 oasu.CommitTracker.<init> Hard AutoCommit: disabled
[junit4:junit4]   2> 828 T2903 oasu.CommitTracker.<init> Soft AutoCommit: disabled
[junit4:junit4]   2> 828 T2903 oashc.QueryElevationComponent.inform Loading QueryElevation from: /mnt/ssd/jenkins/workspace/Lucene-Solr-4.x-Linux/checkout/solr/build/solr-core/test-files/solr/collection1/conf/elevate.xml
[junit4:junit4]   2> 834 T2903 oashc.QueryElevationComponent.inform Loading QueryElevation from: /mnt/ssd/jenkins/workspace/Lucene-Solr-4.x-Linux/checkout/solr/build/solr-core/test-files/solr/collection1/conf/elevate.xml
[junit4:junit4]   2> 841 T2903 oashc.HttpShardHandlerFactory.getParameter Setting socketTimeout to: 0
[junit4:junit4]   2> 841 T2903 oashc.HttpShardHandlerFactory.getParameter Setting urlScheme to: http://
[junit4:junit4]   2> 841 T2903 oashc.HttpShardHandlerFactory.getParameter Setting connTimeout to: 0
[junit4:junit4]   2> 842 T2903 oashc.HttpShardHandlerFactory.getParameter Setting maxConnectionsPerHost to: 20
[junit4:junit4]   2> 842 T2903 oashc.HttpShardHandlerFactory.getParameter Setting corePoolSize to: 0
[junit4:junit4]   2> 842 T2903 oashc.HttpShardHandlerFactory.getParameter Setting maximumPoolSize to: 2147483647
[junit4:junit4]   2> 842 T2903 oashc.HttpShardHandlerFactory.getParameter Setting maxThreadIdleTime to: 5
[junit4:junit4]   2> 842 T2903 oashc.HttpShardHandlerFactory.getParameter Setting sizeOfQueue to: -1
[junit4:junit4]   2> 843 T2903 oashc.HttpShardHandlerFactory.getParameter Setting fairnessPolicy to: false
[junit4:junit4]   2> 843 T2903 oascsi.HttpClientUtil.createClient Creating new http client, config:maxConnectionsPerHost=20&maxConnections=10000&socketTimeout=0&connTimeout=0&retry=false
[junit4:junit4]   2> 845 T2903 oasc.CoreContainer.register registering core: collection1
[junit4:junit4]   2> 846 T2933 oasc.SolrCore.registerSearcher [collection1] Registered new searcher Searcher@b8590c main{StandardDirectoryReader(segments_1:1)}
[junit4:junit4]   2> 846 T2903 oass.SolrDispatchFilter.init user.dir=/mnt/ssd/jenkins/workspace/Lucene-Solr-4.x-Linux/checkout/solr/build/solr-core/test/J0
[junit4:junit4]   2> 846 T2903 oass.SolrDispatchFilter.init SolrDispatchFilter.init() done
[junit4:junit4]   2> 846 T2903 oascsi.HttpClientUtil.createClient Creating new http client, config:maxConnections=128&maxConnectionsPerHost=32&followRedirects=false
[junit4:junit4]   2> 848 T2903 oejs.Server.doStart jetty-8.1.2.v20120308
[junit4:junit4]   2> 850 T2903 oejs.AbstractConnector.doStart Started SocketConnector@0.0.0.0:44884
[junit4:junit4]   2> 850 T2903 oasc.SolrResourceLoader.locateSolrHome JNDI not configured for solr (NoInitialContextEx)
[junit4:junit4]   2> 850 T2903 oasc.SolrResourceLoader.locateSolrHome using system property solr.solr.home: /mnt/ssd/jenkins/workspace/Lucene-Solr-4.x-Linux/checkout/solr/build/solr-core/test-files/solr
[junit4:junit4]   2> 851 T2903 oasc.SolrResourceLoader.<init> new SolrResourceLoader for deduced Solr Home: '/mnt/ssd/jenkins/workspace/Lucene-Solr-4.x-Linux/checkout/solr/build/solr-core/test-files/solr/'
[junit4:junit4]   2> 858 T2903 oass.SolrDispatchFilter.init SolrDispatchFilter.init()
[junit4:junit4]   2> 858 T2903 oasc.SolrResourceLoader.locateSolrHome JNDI not configured for solr (NoInitialContextEx)
[junit4:junit4]   2> 858 T2903 oasc.SolrResourceLoader.locateSolrHome using system property solr.solr.home: /mnt/ssd/jenkins/workspace/Lucene-Solr-4.x-Linux/checkout/solr/build/solr-core/test-files/solr
[junit4:junit4]   2> 858 T2903 oasc.CoreContainer$Initializer.initialize looking for solr.xml: /mnt/ssd/jenkins/workspace/Lucene-Solr-4.x-Linux/checkout/solr/build/solr-core/test-files/solr/solr.xml
[junit4:junit4]   2> 859 T2903 oasc.CoreContainer.<init> New CoreContainer 14254935
[junit4:junit4]   2> 859 T2903 oasc.CoreContainer.load Loading CoreContainer using Solr Home: '/mnt/ssd/jenkins/workspace/Lucene-Solr-4.x-Linux/checkout/solr/build/solr-core/test-files/solr/'
[junit4:junit4]   2> 859 T2903 oasc.SolrResourceLoader.<init> new SolrResourceLoader for directory: '/mnt/ssd/jenkins/workspace/Lucene-Solr-4.x-Linux/checkout/solr/build/solr-core/test-files/solr/'
[junit4:junit4]   2> 868 T2903 oasc.CoreContainer.load Registering Log Listener
[junit4:junit4]   2> 881 T2903 oasc.CoreContainer.create Creating SolrCore 'collection1' using instanceDir: /mnt/ssd/jenkins/workspace/Lucene-Solr-4.x-Linux/checkout/solr/build/solr-core/test-files/solr/collection1
[junit4:junit4]   2> 881 T2903 oasc.SolrResourceLoader.<init> new SolrResourceLoader for directory: '/mnt/ssd/jenkins/workspace/Lucene-Solr-4.x-Linux/checkout/solr/build/solr-core/test-files/solr/collection1/'
[junit4:junit4]   2> 881 T2903 oasc.SolrResourceLoader.replaceClassLoader Adding 'file:/mnt/ssd/jenkins/workspace/Lucene-Solr-4.x-Linux/checkout/solr/build/solr-core/test-files/solr/collection1/lib/README' to classloader
[junit4:junit4]   2> 882 T2903 oasc.SolrResourceLoader.replaceClassLoader Adding 'file:/mnt/ssd/jenkins/workspace/Lucene-Solr-4.x-Linux/checkout/solr/build/solr-core/test-files/solr/collection1/lib/classes/' to classloader
[junit4:junit4]   2> 910 T2903 oasc.SolrConfig.<init> Using Lucene MatchVersion: LUCENE_40
[junit4:junit4]   2> 943 T2903 oasc.SolrConfig.<init> Loaded SolrConfig: solrconfig-elevate.xml
[junit4:junit4]   2> 944 T2903 oass.IndexSchema.readSchema Reading Solr Schema
[junit4:junit4]   2> 946 T2903 oass.IndexSchema.readSchema Schema name=example
[junit4:junit4]   2> 1107 T2903 oass.IndexSchema.readSchema default search field in schema is text
[junit4:junit4]   2> 1109 T2903 oass.IndexSchema.readSchema unique key field: id
[junit4:junit4]   2> 1111 T2903 oasc.SolrCore.<init> [collection1] Opening new SolrCore at /mnt/ssd/jenkins/workspace/Lucene-Solr-4.x-Linux/checkout/solr/build/solr-core/test-files/solr/collection1/, dataDir=./org.apache.solr.handler.component.DistributedQueryElevationComponentTest-1343876012186/shard2/data/
[junit4:junit4]   2> 1112 T2903 oasc.JmxMonitoredMap.<init> JMX monitoring is enabled. Adding Solr mbeans to JMX Server: com.sun.jmx.mbeanserver.JmxMBeanServer@d9b971
[junit4:junit4]   2> 1112 T2903 oasc.SolrCore.getNewIndexDir WARNING New index directory detected: old=null new=./org.apache.solr.handler.component.DistributedQueryElevationComponentTest-1343876012186/shard2/data/index/
[junit4:junit4]   2> 1112 T2903 oasc.SolrCore.initIndex WARNING [collection1] Solr index directory './org.apache.solr.handler.component.DistributedQueryElevationComponentTest-1343876012186/shard2/data/index' doesn't exist. Creating new index...
[junit4:junit4]   2> 1120 T2903 oasc.SolrDeletionPolicy.onCommit SolrDeletionPolicy.onCommit: commits:num=1
[junit4:junit4]   2> 		commit{dir=MockDirWrapper(org.apache.lucene.store.RAMDirectory@3db67d lockFactory=org.apache.lucene.store.SingleInstanceLockFactory@c07988),segFN=segments_1,generation=1,filenames=[segments_1]
[junit4:junit4]   2> 1120 T2903 oasc.SolrDeletionPolicy.updateCommits newest commit = 1
[junit4:junit4]   2> 1121 T2903 oasc.RequestHandlers.initHandlersFromConfig created /update: solr.UpdateRequestHandler
[junit4:junit4]   2> 1121 T2903 oasc.RequestHandlers.initHandlersFromConfig created /elevate: org.apache.solr.handler.component.SearchHandler
[junit4:junit4]   2> 1122 T2903 oasc.RequestHandlers.initHandlersFromConfig created /dataElevate: org.apache.solr.handler.component.SearchHandler
[junit4:junit4]   2> 1122 T2903 oashl.XMLLoader.init xsltCacheLifetimeSeconds=60
[junit4:junit4]   2> 1122 T2903 oasc.RequestHandlers.initHandlersFromConfig WARNING no default request handler is registered (either '/select' or 'standard')
[junit4:junit4]   2> 1124 T2903 oasc.SolrCore.initDeprecatedSupport WARNING solrconfig.xml uses deprecated <admin/gettableFiles>, Please update your config to use the ShowFileRequestHandler.
[junit4:junit4]   2> 1124 T2903 oasc.SolrCore.initDeprecatedSupport WARNING adding ShowFileRequestHandler with hidden files: [SCHEMA-COPYFIELD-TEST.XML, SOLRCONFIG-DELPOLICY1.XML, BAD-SCHEMA-NOT-INDEXED-BUT-NORMS.XML, BAD-SOLRCONFIG-INVALID-SCRIPTFILE.XML, SCHEMA-BM25.XML, SOLRCONFIG-DELPOLICY2.XML, OPEN-EXCHANGE-RATES.JSON, SCHEMA15.XML, XSLT, STOPTYPES-2.TXT, HUNSPELL-TEST.DIC, STOPTYPES-1.TXT, BAD-SCHEMA-NONTEXT-ANALYZER.XML, SCHEMA-SIM.XML, SCHEMA.XML, SOLRCONFIG-UPDATE-PROCESSOR-CHAINS.XML, THROW.ERROR.ON.ADD.UPDATEPROCESSOR.JS, SOLRCONFIG-MASTER.XML, STOPWORDS.TXT, SCHEMA12.XML, BAD-SCHEMA-NOT-INDEXED-BUT-TF.XML, STOP-SNOWBALL.TXT, CURRENCY.XML, SOLRCONFIG-MERGEPOLICY.XML, SCHEMA-SPELLCHECKER.XML, SOLRCONFIG-PROPINJECT.XML, SCHEMA-LMJELINEKMERCER.XML, SOLRCONFIG-MASTER2.XML, SCHEMA-REPLICATION1.XML, SOLRCONFIG-NATIVELOCK.XML, SCHEMA-FOLDING.XML, STOP-2.TXT, SCHEMA-REPLICATION2.XML, SOLRCONFIG-REQHANDLER.INCL, SOLRCONFIG-SPELLCHECKCOMPONENT.XML, DA_COMPOUNDDICTIONARY.TXT, COMPOUNDDICTIONARY.TXT, SOLRCONFIG-XINCLUDE.XML, SOLRCONFIG-TLOG.XML, BAD-SCHEMA-EXTERNAL-FILEFIELD.XML, SOLRCONFIG-ELEVATE.XML, HUNSPELL-TEST.AFF, MISSLEADING.EXTENSION.UPDATEPROCESSOR.JS.TXT, SOLRCONFIG-QUERYSENDER.XML, SCHEMA-TFIDF.XML, ADDFIELDS.UPDATEPROCESSOR.JS, SOLRCONFIG-TERMINDEX.XML, SOLRCONFIG-BASIC.XML, BAD-SCHEMA-ANALYZER-CLASS-AND-NESTED.XML, WDFTYPES.TXT, MAPPING-ISOLATIN1ACCENT.TXT, BAD-SOLRCONFIG-MISSING-SCRIPTFILE.XML, OLD_SYNONYMS.TXT, BAD-SCHEMA-SIM-GLOBAL-VS-FT-MISMATCH.XML, SCHEMA-STOP-KEEP.XML, SCHEMA-REVERSED.XML, SCHEMA-CHARFILTERS.XML, STOP-1.TXT, SOLRCONFIG-SCRIPT-UPDATEPROCESSOR.XML, STEMDICT.TXT, BAD-SCHEMA-DUP-DYNAMICFIELD.XML, SOLRCONFIG-SOLR-749.XML, BAD-SOLRCONFIG-BOGUS-SCRIPTENGINE-NAME.XML, BAD_SOLRCONFIG.XML, BAD-SCHEMA-UNIQUEKEY-MULTIVALUED.XML, SOLRCONFIG-SIMPLELOCK.XML, SOLRCONFIG-SLAVE1.XML, SCHEMA11.XML, PROTWORDS.TXT, SCHEMA-PHRASESUGGEST.XML, CONDITIONAL.UPDATEPROCESSOR.JS, BAD-SCHEMA-DUP-FIELDTYPE.XML, SCHEMASURROUND.XML, MISSING.FUNCTIONS.UPDATEPROCESSOR.JS, SOLRCONFIG_PERF.XML, SOLRCONFIG-NOCACHE.XML, SCHEMA-COLLATE.XML, BAD-MP-SOLRCONFIG.XML, BAD-SCHEMA-UNIQUEKEY-USES-DEFAULT.XML, SCHEMA-TRIE.XML, SOLRCONFIG-PHRASESUGGEST.XML, TRIVIAL.UPDATEPROCESSOR0.JS, SOLRCONFIG-BASIC-LUCENEVERSION31.XML, KEEP-2.TXT, SOLRCONFIG-FUNCTIONQUERY.XML, SCHEMA-LMDIRICHLET.XML, STOPWORDSWRONGENCODING.TXT, SCHEMA-NUMERIC.XML, SOLRCONFIG-ENABLEPLUGIN.XML, PHRASESUGGEST.TXT, SYNONYMS.TXT, HYPHENATION.DTD, SOLRCONFIG-QUERYSENDER-NOQUERY.XML, BAD-SCHEMA-UNIQUEKEY-IS-COPYFIELD-DEST.XML, SOLRCONFIG-MASTER3.XML, SOLRCONFIG-SPELLCHECKER.XML, SOLRCONFIG-HIGHLIGHT.XML, SOLRCONFIG-REPEATER.XML, SOLRCONFIG-MASTER1.XML, SOLRCONFIG-LAZYWRITER.XML, SOLRCONFIG-SLAVE.XML, SOLRCONFIG_CODEC.XML, DA_UTF8.XML, ELEVATE.XML, BAD-SCHEMA-CODEC-GLOBAL-VS-FT-MISMATCH.XML, TRIVIAL.UPDATEPROCESSOR1.JS, BAD-SCHEMA-OMIT-TF-BUT-NOT-POS.XML, SOLRCONFIG-SOLCOREPROPERTIES.XML, FRENCHARTICLES.TXT, SCHEMA-IB.XML, SCHEMA-COLLATEFILTER.XML, SOLRCONFIG-MASTER1-KEEPONEBACKUP.XML, SOLRCONFIG-TRANSFORMERS.XML, BAD-SCHEMA-DUP-FIELD.XML, SOLRCONFIG-CACHING.XML, SCHEMA-LUCENEMATCHVERSION.XML, STOPWITHBOM.TXT, KEEP-1.TXT, BAD-SCHEMA-NOT-INDEXED-BUT-POS.XML, SOLRCONFIG-PROPINJECT-INDEXDEFAULT.XML, SOLRCONFIG-ALTDIRECTORY.XML, SCHEMA-BINARYFIELD.XML, SCHEMA_CODEC.XML, SCHEMA-MINIMAL.XML, SCHEMA-NOT-REQUIRED-UNIQUE-KEY.XML, SCHEMA-REQUIRED-FIELDS.XML, SCHEMA-DFR.XML]
[junit4:junit4]   2> 1127 T2903 oass.SolrIndexSearcher.<init> Opening Searcher@11cee9a main
[junit4:junit4]   2> 1127 T2903 oass.SolrIndexSearcher.getIndexDir WARNING WARNING: Directory impl does not support setting indexDir: org.apache.lucene.store.MockDirectoryWrapper
[junit4:junit4]   2> 1127 T2903 oasu.CommitTracker.<init> Hard AutoCommit: disabled
[junit4:junit4]   2> 1128 T2903 oasu.CommitTracker.<init> Soft AutoCommit: disabled
[junit4:junit4]   2> 1128 T2903 oashc.QueryElevationComponent.inform Loading QueryElevation from: /mnt/ssd/jenkins/workspace/Lucene-Solr-4.x-Linux/checkout/solr/build/solr-core/test-files/solr/collection1/conf/elevate.xml
[junit4:junit4]   2> 1138 T2903 oashc.QueryElevationComponent.inform Loading QueryElevation from: /mnt/ssd/jenkins/workspace/Lucene-Solr-4.x-Linux/checkout/solr/build/solr-core/test-files/solr/collection1/conf/elevate.xml
[junit4:junit4]   2> 1148 T2903 oashc.HttpShardHandlerFactory.getParameter Setting socketTimeout to: 0
[junit4:junit4]   2> 1149 T2903 oashc.HttpShardHandlerFactory.getParameter Setting urlScheme to: http://
[junit4:junit4]   2> 1149 T2903 oashc.HttpShardHandlerFactory.getParameter Setting connTimeout to: 0
[junit4:junit4]   2> 1149 T2903 oashc.HttpShardHandlerFactory.getParameter Setting maxConnectionsPerHost to: 20
[junit4:junit4]   2> 1150 T2903 oashc.HttpShardHandlerFactory.getParameter Setting corePoolSize to: 0
[junit4:junit4]   2> 1150 T2903 oashc.HttpShardHandlerFactory.getParameter Setting maximumPoolSize to: 2147483647
[junit4:junit4]   2> 1150 T2903 oashc.HttpShardHandlerFactory.getParameter Setting maxThreadIdleTime to: 5
[junit4:junit4]   2> 1151 T2903 oashc.HttpShardHandlerFactory.getParameter Setting sizeOfQueue to: -1
[junit4:junit4]   2> 1151 T2903 oashc.HttpShardHandlerFactory.getParameter Setting fairnessPolicy to: false
[junit4:junit4]   2> 1151 T2903 oascsi.HttpClientUtil.createClient Creating new http client, config:maxConnectionsPerHost=20&maxConnections=10000&socketTimeout=0&connTimeout=0&retry=false
[junit4:junit4]   2> 1154 T2903 oasc.CoreContainer.register registering core: collection1
[junit4:junit4]   2> 1154 T2943 oasc.SolrCore.registerSearcher [collection1] Registered new searcher Searcher@11cee9a main{StandardDirectoryReader(segments_1:1)}
[junit4:junit4]   2> 1154 T2903 oass.SolrDispatchFilter.init user.dir=/mnt/ssd/jenkins/workspace/Lucene-Solr-4.x-Linux/checkout/solr/build/solr-core/test/J0
[junit4:junit4]   2> 1154 T2903 oass.SolrDispatchFilter.init SolrDispatchFilter.init() done
[junit4:junit4]   2> 1155 T2903 oascsi.HttpClientUtil.createClient Creating new http client, config:maxConnections=128&maxConnectionsPerHost=32&followRedirects=false
[junit4:junit4]   2> ASYNC  NEW_CORE C208 name=collection1 org.apache.solr.core.SolrCore@dc2bc0
[junit4:junit4]   2> 1160 T2906 C208 oasu.DirectUpdateHandler2.deleteAll [collection1] REMOVING ALL DOCUMENTS FROM INDEX
[junit4:junit4]   2> 1161 T2906 C208 oasc.SolrDeletionPolicy.onInit SolrDeletionPolicy.onInit: commits:num=1
[junit4:junit4]   2> 		commit{dir=BaseDirectoryWrapper(org.apache.lucene.store.RAMDirectory@bc4bb7 lockFactory=org.apache.lucene.store.SingleInstanceLockFactory@efea2),segFN=segments_1,generation=1,filenames=[segments_1]
[junit4:junit4]   2> 1162 T2906 C208 oasc.SolrDeletionPolicy.updateCommits newest commit = 1
[junit4:junit4]   2> 1162 T2906 C208 UPDATE [collection1] webapp=/solr path=/update params={version=2&wt=javabin} {deleteByQuery=*:*} 0 2
[junit4:junit4]   2> ASYNC  NEW_CORE C209 name=collection1 org.apache.solr.core.SolrCore@12988e
[junit4:junit4]   2> 1167 T2916 C209 oasu.DirectUpdateHandler2.deleteAll [collection1] REMOVING ALL DOCUMENTS FROM INDEX
[junit4:junit4]   2> 1168 T2916 C209 oasc.SolrDeletionPolicy.onInit SolrDeletionPolicy.onInit: commits:num=1
[junit4:junit4]   2> 		commit{dir=MockDirWrapper(org.apache.lucene.store.RAMDirectory@ddad57 lockFactory=org.apache.lucene.store.SingleInstanceLockFactory@11d63b0),segFN=segments_1,generation=1,filenames=[segments_1]
[junit4:junit4]   2> 1169 T2916 C209 oasc.SolrDeletionPolicy.updateCommits newest commit = 1
[junit4:junit4]   2> 1169 T2916 C209 UPDATE [collection1] webapp=/solr path=/update params={version=2&wt=javabin} {deleteByQuery=*:*} 0 2
[junit4:junit4]   2> ASYNC  NEW_CORE C210 name=collection1 org.apache.solr.core.SolrCore@1a852ba
[junit4:junit4]   2> 1174 T2926 C210 oasu.DirectUpdateHandler2.deleteAll [collection1] REMOVING ALL DOCUMENTS FROM INDEX
[junit4:junit4]   2> 1176 T2926 C210 oasc.SolrDeletionPolicy.onInit SolrDeletionPolicy.onInit: commits:num=1
[junit4:junit4]   2> 		commit{dir=MockDirWrapper(org.apache.lucene.store.RAMDirectory@1cf4ee8 lockFactory=org.apache.lucene.store.SingleInstanceLockFactory@1ca1238),segFN=segments_1,generation=1,filenames=[segments_1]
[junit4:junit4]   2> 1176 T2926 C210 oasc.SolrDeletionPolicy.updateCommits newest commit = 1
[junit4:junit4]   2> 1177 T2926 C210 UPDATE [collection1] webapp=/solr path=/update params={version=2&wt=javabin} {deleteByQuery=*:*} 0 3
[junit4:junit4]   2> ASYNC  NEW_CORE C211 name=collection1 org.apache.solr.core.SolrCore@52b64a
[junit4:junit4]   2> 1182 T2936 C211 oasu.DirectUpdateHandler2.deleteAll [collection1] REMOVING ALL DOCUMENTS FROM INDEX
[junit4:junit4]   2> 1183 T2936 C211 oasc.SolrDeletionPolicy.onInit SolrDeletionPolicy.onInit: commits:num=1
[junit4:junit4]   2> 		commit{dir=MockDirWrapper(org.apache.lucene.store.RAMDirectory@3db67d lockFactory=org.apache.lucene.store.SingleInstanceLockFactory@c07988),segFN=segments_1,generation=1,filenames=[segments_1]
[junit4:junit4]   2> 1184 T2936 C211 oasc.SolrDeletionPolicy.updateCommits newest commit = 1
[junit4:junit4]   2> 1184 T2936 C211 UPDATE [collection1] webapp=/solr path=/update params={version=2&wt=javabin} {deleteByQuery=*:*} 0 2
[junit4:junit4]   2> 1187 T2906 C208 UPDATE [collection1] webapp=/solr path=/update params={version=2&wt=javabin} {add=[1]} 0 1
[junit4:junit4]   2> 1189 T2916 C209 UPDATE [collection1] webapp=/solr path=/update params={version=2&wt=javabin} {add=[1]} 0 0
[junit4:junit4]   2> 1191 T2906 C208 UPDATE [collection1] webapp=/solr path=/update params={version=2&wt=javabin} {add=[2]} 0 0
[junit4:junit4]   2> 1194 T2926 C210 UPDATE [collection1] webapp=/solr path=/update params={version=2&wt=javabin} {add=[2]} 0 1
[junit4:junit4]   2> 1196 T2906 C208 UPDATE [collection1] webapp=/solr path=/update params={version=2&wt=javabin} {add=[3]} 0 1
[junit4:junit4]   2> 1198 T2936 C211 UPDATE [collection1] webapp=/solr path=/update params={version=2&wt=javabin} {add=[3]} 0 1
[junit4:junit4]   2> 1200 T2906 C208 UPDATE [collection1] webapp=/solr path=/update params={version=2&wt=javabin} {add=[4]} 0 0
[junit4:junit4]   2> 1202 T2916 C209 UPDATE [collection1] webapp=/solr path=/update params={version=2&wt=javabin} {add=[4]} 0 0
[junit4:junit4]   2> 1203 T2906 C208 UPDATE [collection1] webapp=/solr path=/update params={version=2&wt=javabin} {add=[5]} 0 0
[junit4:junit4]   2> 1205 T2926 C210 UPDATE [collection1] webapp=/solr path=/update params={version=2&wt=javabin} {add=[5]} 0 0
[junit4:junit4]   2> 1207 T2906 C208 UPDATE [collection1] webapp=/solr path=/update params={version=2&wt=javabin} {add=[6]} 0 0
[junit4:junit4]   2> 1209 T2936 C211 UPDATE [collection1] webapp=/solr path=/update params={version=2&wt=javabin} {add=[6]} 0 0
[junit4:junit4]   2> 1211 T2906 C208 UPDATE [collection1] webapp=/solr path=/update params={version=2&wt=javabin} {add=[7]} 0 0
[junit4:junit4]   2> 1213 T2936 C211 UPDATE [collection1] webapp=/solr path=/update params={version=2&wt=javabin} {add=[7]} 0 0
[junit4:junit4]   2> 1215 T2906 C208 oasu.DirectUpdateHandler2.commit start commit{flags=0,_version_=0,optimize=false,openSearcher=true,waitSearcher=true,expungeDeletes=false,softCommit=false}
[junit4:junit4]   2> 1216 T2906 C208 oasc.SolrDeletionPolicy.onCommit SolrDeletionPolicy.onCommit: commits:num=2
[junit4:junit4]   2> 		commit{dir=BaseDirectoryWrapper(org.apache.lucene.store.RAMDirectory@bc4bb7 lockFactory=org.apache.lucene.store.SingleInstanceLockFactory@efea2),segFN=segments_1,generation=1,filenames=[segments_1]
[junit4:junit4]   2> 		commit{dir=BaseDirectoryWrapper(org.apache.lucene.store.RAMDirectory@bc4bb7 lockFactory=org.apache.lucene.store.SingleInstanceLockFactory@efea2),segFN=segments_2,generation=2,filenames=[_0.frq, segments_2, _0_nrm.cfe, _0.tim, _0_nrm.cfs, _0.tip, _0.si, _0.prx, _0.fdt, _0.fnm, _0.fdx]
[junit4:junit4]   2> 1216 T2906 C208 oasc.SolrDeletionPolicy.updateCommits newest commit = 2
[junit4:junit4]   2> 1216 T2906 C208 oass.SolrIndexSearcher.<init> Opening Searcher@13e4100 main
[junit4:junit4]   2> 1216 T2906 C208 oass.SolrIndexSearcher.getIndexDir WARNING WARNING: Directory impl does not support setting indexDir: org.apache.lucene.store.BaseDirectoryWrapper
[junit4:junit4]   2> 1217 T2906 C208 oasu.DirectUpdateHandler2.commit end_commit_flush
[junit4:junit4]   2> 1217 T2913 oasc.SolrCore.registerSearcher [collection1] Registered new searcher Searcher@13e4100 main{StandardDirectoryReader(segments_2:4 _0(4.0.0.1):C7)}
[junit4:junit4]   2> 1217 T2906 C208 UPDATE [collection1] webapp=/solr path=/update params={wt=javabin&waitSearcher=true&version=2&softCommit=false&commit=true} {commit=} 0 2
[junit4:junit4]   2> 1219 T2916 C209 oasu.DirectUpdateHandler2.commit start commit{flags=0,_version_=0,optimize=false,openSearcher=true,waitSearcher=true,expungeDeletes=false,softCommit=false}
[junit4:junit4]   2> 1220 T2916 C209 oasc.SolrDeletionPolicy.onCommit SolrDeletionPolicy.onCommit: commits:num=2
[junit4:junit4]   2> 		commit{dir=MockDirWrapper(org.apache.lucene.store.RAMDirectory@ddad57 lockFactory=org.apache.lucene.store.SingleInstanceLockFactory@11d63b0),segFN=segments_1,generation=1,filenames=[segments_1]
[junit4:junit4]   2> 		commit{dir=MockDirWrapper(org.apache.lucene.store.RAMDirectory@ddad57 lockFactory=org.apache.lucene.store.SingleInstanceLockFactory@11d63b0),segFN=segments_2,generation=2,filenames=[_0.frq, segments_2, _0_nrm.cfe, _0.tim, _0_nrm.cfs, _0.tip, _0.si, _0.prx, _0.fdt, _0.fnm, _0.fdx]
[junit4:junit4]   2> 1221 T2916 C209 oasc.SolrDeletionPolicy.updateCommits newest commit = 2
[junit4:junit4]   2> 1222 T2916 C209 oass.SolrIndexSearcher.<init> Opening Searcher@127b3ff main
[junit4:junit4]   2> 1222 T2916 C209 oass.SolrIndexSearcher.getIndexDir WARNING WARNING: Directory impl does not support setting indexDir: org.apache.lucene.store.MockDirectoryWrapper
[junit4:junit4]   2> 1223 T2916 C209 oasu.DirectUpdateHandler2.commit end_commit_flush
[junit4:junit4]   2> 1223 T2923 oasc.SolrCore.registerSearcher [collection1] Registered new searcher Searcher@127b3ff main{StandardDirectoryReader(segments_2:4 _0(4.0.0.1):C2)}
[junit4:junit4]   2> 1223 T2916 C209 UPDATE [collection1] webapp=/solr path=/update params={wt=javabin&waitSearcher=true&version=2&softCommit=false&commit=true} {commit=} 0 4
[junit4:junit4]   2> 1225 T2926 C210 oasu.DirectUpdateHandler2.commit start commit{flags=0,_version_=0,optimize=false,openSearcher=true,waitSearcher=true,expungeDeletes=false,softCommit=false}
[junit4:junit4]   2> 1226 T2926 C210 oasc.SolrDeletionPolicy.onCommit SolrDeletionPolicy.onCommit: commits:num=2
[junit4:junit4]   2> 		commit{dir=MockDirWrapper(org.apache.lucene.store.RAMDirectory@1cf4ee8 lockFactory=org.apache.lucene.store.SingleInstanceLockFactory@1ca1238),segFN=segments_1,generation=1,filenames=[segments_1]
[junit4:junit4]   2> 		commit{dir=MockDirWrapper(org.apache.lucene.store.RAMDirectory@1cf4ee8 lockFactory=org.apache.lucene.store.SingleInstanceLockFactory@1ca1238),segFN=segments_2,generation=2,filenames=[_0.frq, segments_2, _0_nrm.cfe, _0.tim, _0_nrm.cfs, _0.tip, _0.si, _0.prx, _0.fdt, _0.fnm, _0.fdx]
[junit4:junit4]   2> 1227 T2926 C210 oasc.SolrDeletionPolicy.updateCommits newest commit = 2
[junit4:junit4]   2> 1228 T2926 C210 oass.SolrIndexSearcher.<init> Opening Searcher@3e7ea5 main
[junit4:junit4]   2> 1228 T2926 C210 oass.SolrIndexSearcher.getIndexDir WARNING WARNING: Directory impl does not support setting indexDir: org.apache.lucene.store.MockDirectoryWrapper
[junit4:junit4]   2> 1229 T2926 C210 oasu.DirectUpdateHandler2.commit end_commit_flush
[junit4:junit4]   2> 1229 T2933 oasc.SolrCore.registerSearcher [collection1] Registered new searcher Searcher@3e7ea5 main{StandardDirectoryReader(segments_2:4 _0(4.0.0.1):C2)}
[junit4:junit4]   2> 1229 T2926 C210 UPDATE [collection1] webapp=/solr path=/update params={wt=javabin&waitSearcher=true&version=2&softCommit=false&commit=true} {commit=} 0 4
[junit4:junit4]   2> 1231 T2936 C211 oasu.DirectUpdateHandler2.commit start commit{flags=0,_version_=0,optimize=false,openSearcher=true,waitSearcher=true,expungeDeletes=false,softCommit=false}
[junit4:junit4]   2> 1233 T2936 C211 oasc.SolrDeletionPolicy.onCommit SolrDeletionPolicy.onCommit: commits:num=2
[junit4:junit4]   2> 		commit{dir=MockDirWrapper(org.apache.lucene.store.RAMDirectory@3db67d lockFactory=org.apache.lucene.store.SingleInstanceLockFactory@c07988),segFN=segments_1,generation=1,filenames=[segments_1]
[junit4:junit4]   2> 		commit{dir=MockDirWrapper(org.apache.lucene.store.RAMDirectory@3db67d lockFactory=org.apache.lucene.store.SingleInstanceLockFactory@c07988),segFN=segments_2,generation=2,filenames=[_0.frq, segments_2, _0_nrm.cfe, _0.tim, _0_nrm.cfs, _0.tip, _0.si, _0.prx, _0.fdt, _0.fnm, _0.fdx]
[junit4:junit4]   2> 1233 T2936 C211 oasc.SolrDeletionPolicy.updateCommits newest commit = 2
[junit4:junit4]   2> 1234 T2936 C211 oass.SolrIndexSearcher.<init> Opening Searcher@12e6060 main
[junit4:junit4]   2> 1234 T2936 C211 oass.SolrIndexSearcher.getIndexDir WARNING WARNING: Directory impl does not support setting indexDir: org.apache.lucene.store.MockDirectoryWrapper
[junit4:junit4]   2> 1235 T2936 C211 oasu.DirectUpdateHandler2.commit end_commit_flush
[junit4:junit4]   2> 1235 T2943 oasc.SolrCore.registerSearcher [collection1] Registered new searcher Searcher@12e6060 main{StandardDirectoryReader(segments_2:4 _0(4.0.0.1):C3)}
[junit4:junit4]   2> 1235 T2936 C211 UPDATE [collection1] webapp=/solr path=/update params={wt=javabin&waitSearcher=true&version=2&softCommit=false&commit=true} {commit=} 0 4
[junit4:junit4]   2> 1238 T2906 C208 REQ [collection1] webapp=/solr path=/elevate params={rows=500&version=2&q=*:*&sort=id+desc&wt=javabin&qt=/elevate&fl=id,+score,+[elevated]&shards.qt=/elevate&distrib=false} hits=7 status=0 QTime=1 
[junit4:junit4]   2> 1244 T2917 C209 REQ [collection1] webapp=/solr path=/elevate params={rows=500&fsv=true&start=0&sort=id+desc&wt=javabin&shards.qt=/elevate&distrib=false&NOW=1343876013424&version=2&q=*:*&qt=/elevate&fl=id,score&isShard=true&shard.url=localhost:57569/solr} hits=2 status=0 QTime=0 
[junit4:junit4]   2> 1245 T2927 C210 REQ [collection1] webapp=/solr path=/elevate params={rows=500&fsv=true&start=0&sort=id+desc&wt=javabin&shards.qt=/elevate&distrib=false&NOW=1343876013424&version=2&q=*:*&qt=/elevate&fl=id,score&isShard=true&shard.url=localhost:38747/solr|[::1]:33332/solr} hits=2 status=0 QTime=0 
[junit4:junit4]   2> 1245 T2937 C211 REQ [collection1] webapp=/solr path=/elevate params={rows=500&fsv=true&start=0&sort=id+desc&wt=javabin&shards.qt=/elevate&distrib=false&NOW=1343876013424&version=2&q=*:*&qt=/elevate&fl=id,score&isShard=true&shard.url=localhost:44884/solr} hits=3 status=0 QTime=0 
[junit4:junit4]   2> 1247 T2917 C209 REQ [collection1] webapp=/solr path=/elevate params={rows=500&wt=javabin&shards.qt=/elevate&distrib=false&NOW=1343876013424&version=2&ids=1.0,4.0&q=*:*&qt=/elevate&fl=id,+score,+[elevated]&isShard=true&shard.url=localhost:57569/solr} status=0 QTime=0 
[junit4:junit4]   2> 1247 T2937 C211 REQ [collection1] webapp=/solr path=/elevate params={rows=500&wt=javabin&shards.qt=/elevate&distrib=false&NOW=1343876013424&version=2&ids=7.0,6.0,3.0&q=*:*&qt=/elevate&fl=id,+score,+[elevated]&isShard=true&shard.url=localhost:44884/solr} status=0 QTime=0 
[junit4:junit4]   2> 1247 T2927 C210 REQ [collection1] webapp=/solr path=/elevate params={rows=500&wt=javabin&shards.qt=/elevate&distrib=false&NOW=1343876013424&version=2&ids=2.0,5.0&q=*:*&qt=/elevate&fl=id,+score,+[elevated]&isShard=true&shard.url=localhost:38747/solr|[::1]:33332/solr} status=0 QTime=0 
[junit4:junit4]   2> 1248 T2916 C209 REQ [collection1] webapp=/solr path=/elevate params={rows=500&version=2&q=*:*&sort=id+desc&wt=javabin&qt=/elevate&shards=localhost:57569/solr,localhost:38747/solr|[::1]:33332/solr,localhost:44884/solr&fl=id,+score,+[elevated]&shards.qt=/elevate} status=0 QTime=8 
[junit4:junit4]   2> 1249 T2903 oas.BaseDistributedSearchTestCase.compareResponses SEVERE Mismatched responses:
[junit4:junit4]   2> 	{responseHeader={status=0,QTime=8,params={rows=500,version=2,q=*:*,sort=id desc,wt=javabin,qt=/elevate,shards=localhost:57569/solr,localhost:38747/solr|[::1]:33332/solr,localhost:44884/solr,fl=id, score, [elevated],shards.qt=/elevate}},response={numFound=7,start=0,maxScore=1.0,docs=[SolrDocument{id=7.0, [elevated]=false, score=1.0}, SolrDocument{id=6.0, [elevated]=false, score=1.0}, SolrDocument{id=5.0, [elevated]=false, score=1.0}, SolrDocument{id=4.0, [elevated]=false, score=1.0}, SolrDocument{id=3.0, [elevated]=false, score=1.0}, SolrDocument{id=2.0, [elevated]=false, score=1.0}, SolrDocument{id=1.0, [elevated]=false, score=1.0}]}}
[junit4:junit4]   2> 	{responseHeader={status=0,QTime=1,params={rows=500,version=2,q=*:*,sort=id desc,wt=javabin,qt=/elevate,fl=id, score, [elevated],shards.qt=/elevate,distrib=false}},response={numFound=7,start=0,maxScore=1.0,docs=[SolrDocument{id=7.0, score=1.0, [elevated]=false}, SolrDocument{id=6.0, score=1.0, [elevated]=false}, SolrDocument{id=5.0, score=1.0, [elevated]=false}, SolrDocument{id=4.0, score=1.0, [elevated]=false}, SolrDocument{id=3.0, score=1.0, [elevated]=false}, SolrDocument{id=2.0, score=1.0, [elevated]=false}, SolrDocument{id=1.0, score=1.0, [elevated]=false}]}}
[junit4:junit4]   2> 1250 T2903 oasc.CoreContainer.shutdown Shutting down CoreContainer instance=16272607
[junit4:junit4]   2> 1250 T2903 oasc.SolrCore.close [collection1]  CLOSING SolrCore org.apache.solr.core.SolrCore@dc2bc0
[junit4:junit4]   2> 1251 T2903 oasc.SolrCore.closeSearcher [collection1] Closing main searcher on request.
[junit4:junit4]   2> 1251 T2903 oasu.DirectUpdateHandler2.close closing DirectUpdateHandler2{commits=1,autocommits=0,soft autocommits=0,optimizes=0,rollbacks=0,expungeDeletes=0,docsPending=0,adds=0,deletesById=0,deletesByQuery=0,errors=0,cumulative_adds=7,cumulative_deletesById=0,cumulative_deletesByQuery=1,cumulative_errors=0}
[junit4:junit4]   2> 1253 T2903 oejsh.ContextHandler.doStop stopped o.e.j.s.ServletContextHandler{/solr,null}
[junit4:junit4]   2> 1304 T2903 oasc.CoreContainer.shutdown Shutting down CoreContainer instance=11375514
[junit4:junit4]   2> 1305 T2903 oasc.SolrCore.close [collection1]  CLOSING SolrCore org.apache.solr.core.SolrCore@12988e
[junit4:junit4]   2> 1306 T2903 oasc.SolrCore.closeSearcher [collection1] Closing main searcher on request.
[junit4:junit4]   2> 1306 T2903 oasu.DirectUpdateHandler2.close closing DirectUpdateHandler2{commits=1,autocommits=0,soft autocommits=0,optimizes=0,rollbacks=0,expungeDeletes=0,docsPending=0,adds=0,deletesById=0,deletesByQuery=0,errors=0,cumulative_adds=2,cumulative_deletesById=0,cumulative_deletesByQuery=1,cumulative_errors=0}
[junit4:junit4]   2> 1308 T2903 oejsh.ContextHandler.doStop stopped o.e.j.s.ServletContextHandler{/solr,null}
[junit4:junit4]   2> 1360 T2903 oasc.CoreContainer.shutdown Shutting down CoreContainer instance=446285
[junit4:junit4]   2> 1361 T2903 oasc.SolrCore.close [collection1]  CLOSING SolrCore org.apache.solr.core.SolrCore@1a852ba
[junit4:junit4]   2> 1361 T2903 oasc.SolrCore.closeSearcher [collection1] Closing main searcher on request.
[junit4:junit4]   2> 1362 T2903 oasu.DirectUpdateHandler2.close closing DirectUpdateHandler2{commits=1,autocommits=0,soft autocommits=0,optimizes=0,rollbacks=0,expungeDeletes=0,docsPending=0,adds=0,deletesById=0,deletesByQuery=0,errors=0,cumulative_adds=2,cumulative_deletesById=0,cumulative_deletesByQuery=1,cumulative_errors=0}
[junit4:junit4]   2> 1364 T2903 oejsh.ContextHandler.doStop stopped o.e.j.s.ServletContextHandler{/solr,null}
[junit4:junit4]   2> 1415 T2903 oasc.CoreContainer.shutdown Shutting down CoreContainer instance=14254935
[junit4:junit4]   2> 1416 T2903 oasc.SolrCore.close [collection1]  CLOSING SolrCore org.apache.solr.core.SolrCore@52b64a
[junit4:junit4]   2> 1416 T2903 oasc.SolrCore.closeSearcher [collection1] Closing main searcher on request.
[junit4:junit4]   2> 1417 T2903 oasu.DirectUpdateHandler2.close closing DirectUpdateHandler2{commits=1,autocommits=0,soft autocommits=0,optimizes=0,rollbacks=0,expungeDeletes=0,docsPending=0,adds=0,deletesById=0,deletesByQuery=0,errors=0,cumulative_adds=3,cumulative_deletesById=0,cumulative_deletesByQuery=1,cumulative_errors=0}
[junit4:junit4]   2> 1419 T2903 oejsh.ContextHandler.doStop stopped o.e.j.s.ServletContextHandler{/solr,null}
[junit4:junit4]   2> 1471 T2903 oas.SolrTestCaseJ4.tearDown ###Ending testDistribSearch
[junit4:junit4]   2> NOTE: reproduce with: ant test  -Dtestcase=DistributedQueryElevationComponentTest -Dtests.method=testDistribSearch -Dtests.seed=74254ECA031050A7 -Dtests.multiplier=3 -Dtests.slow=true -Dtests.locale=in_ID -Dtests.timezone=America/Anchorage -Dtests.file.encoding=UTF-8
[junit4:junit4]   2>
[junit4:junit4]    > (@AfterClass output)
[junit4:junit4]   2> 1503 T2903 oas.SolrTestCaseJ4.deleteCore ###deleteCore
[junit4:junit4]   2> NOTE: test params are: codec=Appending, sim=DefaultSimilarity, locale=in_ID, timezone=America/Anchorage
[junit4:junit4]   2> NOTE: Linux 3.2.0-27-generic i386/Oracle Corporation 1.8.0-ea (32-bit)/cpus=8,threads=1,free=77934928,total=173572096
[junit4:junit4]   2> NOTE: All tests run in this JVM: [NumericFieldsTest, TestRecovery, TestWordDelimiterFilterFactory, UniqFieldsUpdateProcessorFactoryTest, TestCollationField, AnalysisAfterCoreReloadTest, TestSolrJ, HighlighterConfigTest, DefaultValueUpdateProcessorTest, TestSort, TestCollationKeyRangeQueries, AlternateDirectoryTest, TestLMDirichletSimilarityFactory, NotRequiredUniqueKeyTest, TestStressVersions, SearchHandlerTest, PeerSyncTest, DocumentAnalysisRequestHandlerTest, TestBadConfig, TestJmxMonitoredMap, TestUtils, ZkSolrClientTest, TestDistributedGrouping, CSVRequestHandlerTest, SortByFunctionTest, DOMUtilTest, DistanceFunctionTest, JSONWriterTest, SolrCoreCheckLockOnStartupTest, CurrencyFieldTest, TestFastLRUCache, IndexSchemaRuntimeFieldTest, CacheHeaderTest, TestQuerySenderNoQuery, TestDefaultSimilarityFactory, MinimalSchemaTest, RequestHandlersTest, TestStressRecovery, PingRequestHandlerTest, TestLMJelinekMercerSimilarityFactory, SolrCoreTest, TestLFUCache, FullSolrCloudDistribCmdsTest, TestRangeQuery, CopyFieldTest, SolrCmdDistributorTest, TestExtendedDismaxParser, ResourceLoaderTest, PreAnalyzedFieldTest, SignatureUpdateProcessorFactoryTest, TestIBSimilarityFactory, DistributedSpellCheckComponentTest, DistributedTermsComponentTest, TestConfig, BasicDistributedZkTest, OverseerTest, TestReplicationHandler, TestRealTimeGet, CloudStateUpdateTest, TestDistributedSearch, SpellCheckCollatorTest, AutoCommitTest, DirectUpdateHandlerTest, TestMultiCoreConfBootstrap, SimpleFacetsTest, TestCoreContainer, DirectSolrSpellCheckerTest, FileBasedSpellCheckerTest, QueryElevationComponentTest, TestBinaryResponseWriter, TestJmxIntegration, SampleTest, HighlighterTest, TestIndexSearcher, CoreAdminHandlerTest, TestTrie, SolrRequestParserTest, DirectSolrConnectionTest, QueryEqualityTest, TestCSVLoader, PolyFieldTest, SpatialFilterTest, TestCSVResponseWriter, MoreLikeThisHandlerTest, MBeansHandlerTest, DistributedQueryElevationComponentTest]
[junit4:junit4]   2> 
[junit4:junit4] Completed on J0 in 1.51s, 1 test, 1 failure <<< FAILURES!

[...truncated 234 lines...]
BUILD FAILED
/mnt/ssd/jenkins/workspace/Lucene-Solr-4.x-Linux/checkout/build.xml:29: The following error occurred while executing this line:
/mnt/ssd/jenkins/workspace/Lucene-Solr-4.x-Linux/checkout/solr/build.xml:144: The following error occurred while executing this line:
/mnt/ssd/jenkins/workspace/Lucene-Solr-4.x-Linux/checkout/lucene/module-build.xml:62: The following error occurred while executing this line:
/mnt/ssd/jenkins/workspace/Lucene-Solr-4.x-Linux/checkout/lucene/common-build.xml:1095: The following error occurred while executing this line:
/mnt/ssd/jenkins/workspace/Lucene-Solr-4.x-Linux/checkout/lucene/common-build.xml:790: There were test failures: 224 suites, 903 tests, 1 failure, 5 ignored

Total time: 21 minutes 34 seconds
Build step 'Execute shell' marked build as failure
Archiving artifacts
Recording test results
Email was triggered for: Failure
Sending email for trigger: Failure



Mime
View raw message