lucene-dev mailing list archives

Site index · List index
Message view « Date » · « Thread »
Top « Date » · « Thread »
From Policeman Jenkins Server <jenk...@sd-datasolutions.de>
Subject [JENKINS] Lucene-Solr-trunk-Linux (32bit/jdk1.8.0-ea-b49) - Build # 206 - Failure!
Date Mon, 06 Aug 2012 00:11:52 GMT
Build: http://jenkins.sd-datasolutions.de/job/Lucene-Solr-trunk-Linux/206/
Java: 32bit/jdk1.8.0-ea-b49 -server -XX:+UseG1GC

1 tests failed.
REGRESSION:  org.apache.solr.handler.component.DistributedQueryElevationComponentTest.testDistribSearch

Error Message:
.responseHeader.params.size()==9,9skipped=4,5

Stack Trace:
junit.framework.AssertionFailedError: .responseHeader.params.size()==9,9skipped=4,5
	at __randomizedtesting.SeedInfo.seed([DD9B73BAD491000E:5C7DFDA2A3CE6032]:0)
	at junit.framework.Assert.fail(Assert.java:50)
	at org.apache.solr.BaseDistributedSearchTestCase.compareResponses(BaseDistributedSearchTestCase.java:670)
	at org.apache.solr.BaseDistributedSearchTestCase.query(BaseDistributedSearchTestCase.java:392)
	at org.apache.solr.handler.component.DistributedQueryElevationComponentTest.doTest(DistributedQueryElevationComponentTest.java:81)
	at org.apache.solr.BaseDistributedSearchTestCase.testDistribSearch(BaseDistributedSearchTestCase.java:679)
	at sun.reflect.NativeMethodAccessorImpl.invoke0(Native Method)
	at sun.reflect.NativeMethodAccessorImpl.invoke(NativeMethodAccessorImpl.java:57)
	at sun.reflect.DelegatingMethodAccessorImpl.invoke(DelegatingMethodAccessorImpl.java:43)
	at java.lang.reflect.Method.invoke(Method.java:474)
	at com.carrotsearch.randomizedtesting.RandomizedRunner.invoke(RandomizedRunner.java:1995)
	at com.carrotsearch.randomizedtesting.RandomizedRunner.access$1100(RandomizedRunner.java:132)
	at com.carrotsearch.randomizedtesting.RandomizedRunner$6.evaluate(RandomizedRunner.java:818)
	at com.carrotsearch.randomizedtesting.RandomizedRunner$7.evaluate(RandomizedRunner.java:877)
	at com.carrotsearch.randomizedtesting.RandomizedRunner$8.evaluate(RandomizedRunner.java:891)
	at com.carrotsearch.randomizedtesting.rules.SystemPropertiesRestoreRule$1.evaluate(SystemPropertiesRestoreRule.java:53)
	at org.apache.lucene.util.TestRuleSetupTeardownChained$1.evaluate(TestRuleSetupTeardownChained.java:50)
	at org.apache.lucene.util.TestRuleFieldCacheSanity$1.evaluate(TestRuleFieldCacheSanity.java:32)
	at org.apache.lucene.util.AbstractBeforeAfterRule$1.evaluate(AbstractBeforeAfterRule.java:45)
	at com.carrotsearch.randomizedtesting.rules.SystemPropertiesInvariantRule$1.evaluate(SystemPropertiesInvariantRule.java:55)
	at org.apache.lucene.util.TestRuleReportUncaughtExceptions$1.evaluate(TestRuleReportUncaughtExceptions.java:68)
	at org.apache.lucene.util.TestRuleThreadAndTestName$1.evaluate(TestRuleThreadAndTestName.java:48)
	at org.apache.lucene.util.TestRuleIgnoreAfterMaxFailures$1.evaluate(TestRuleIgnoreAfterMaxFailures.java:70)
	at org.apache.lucene.util.TestRuleMarkFailure$1.evaluate(TestRuleMarkFailure.java:48)
	at com.carrotsearch.randomizedtesting.RandomizedRunner.runSingleTest(RandomizedRunner.java:825)
	at com.carrotsearch.randomizedtesting.RandomizedRunner.access$700(RandomizedRunner.java:132)
	at com.carrotsearch.randomizedtesting.RandomizedRunner$3$1.run(RandomizedRunner.java:671)
	at com.carrotsearch.randomizedtesting.RandomizedRunner$3.evaluate(RandomizedRunner.java:697)
	at com.carrotsearch.randomizedtesting.RandomizedRunner$4.evaluate(RandomizedRunner.java:736)
	at com.carrotsearch.randomizedtesting.RandomizedRunner$5.evaluate(RandomizedRunner.java:747)
	at com.carrotsearch.randomizedtesting.rules.SystemPropertiesRestoreRule$1.evaluate(SystemPropertiesRestoreRule.java:53)
	at org.apache.lucene.util.AbstractBeforeAfterRule$1.evaluate(AbstractBeforeAfterRule.java:45)
	at org.apache.lucene.util.TestRuleReportUncaughtExceptions$1.evaluate(TestRuleReportUncaughtExceptions.java:68)
	at org.apache.lucene.util.TestRuleStoreClassName$1.evaluate(TestRuleStoreClassName.java:38)
	at com.carrotsearch.randomizedtesting.rules.SystemPropertiesInvariantRule$1.evaluate(SystemPropertiesInvariantRule.java:55)
	at org.apache.lucene.util.TestRuleNoInstanceHooksOverrides$1.evaluate(TestRuleNoInstanceHooksOverrides.java:53)
	at org.apache.lucene.util.TestRuleNoStaticHooksShadowing$1.evaluate(TestRuleNoStaticHooksShadowing.java:52)
	at org.apache.lucene.util.TestRuleAssertionsRequired$1.evaluate(TestRuleAssertionsRequired.java:36)
	at org.apache.lucene.util.TestRuleMarkFailure$1.evaluate(TestRuleMarkFailure.java:48)
	at org.apache.lucene.util.TestRuleIgnoreAfterMaxFailures$1.evaluate(TestRuleIgnoreAfterMaxFailures.java:70)
	at org.apache.lucene.util.TestRuleIgnoreTestSuites$1.evaluate(TestRuleIgnoreTestSuites.java:55)
	at com.carrotsearch.randomizedtesting.RandomizedRunner.runSuite(RandomizedRunner.java:605)
	at com.carrotsearch.randomizedtesting.RandomizedRunner.access$400(RandomizedRunner.java:132)
	at com.carrotsearch.randomizedtesting.RandomizedRunner$2.run(RandomizedRunner.java:551)




Build Log:
[...truncated 7518 lines...]
[junit4:junit4] Suite: org.apache.solr.handler.component.DistributedQueryElevationComponentTest
[junit4:junit4] FAILURE 1.64s J1 | DistributedQueryElevationComponentTest.testDistribSearch
[junit4:junit4]    > Throwable #1: junit.framework.AssertionFailedError: .responseHeader.params.size()==9,9skipped=4,5
[junit4:junit4]    > 	at __randomizedtesting.SeedInfo.seed([DD9B73BAD491000E:5C7DFDA2A3CE6032]:0)
[junit4:junit4]    > 	at junit.framework.Assert.fail(Assert.java:50)
[junit4:junit4]    > 	at org.apache.solr.BaseDistributedSearchTestCase.compareResponses(BaseDistributedSearchTestCase.java:670)
[junit4:junit4]    > 	at org.apache.solr.BaseDistributedSearchTestCase.query(BaseDistributedSearchTestCase.java:392)
[junit4:junit4]    > 	at org.apache.solr.handler.component.DistributedQueryElevationComponentTest.doTest(DistributedQueryElevationComponentTest.java:81)
[junit4:junit4]    > 	at org.apache.solr.BaseDistributedSearchTestCase.testDistribSearch(BaseDistributedSearchTestCase.java:679)
[junit4:junit4]    > 	at sun.reflect.NativeMethodAccessorImpl.invoke0(Native Method)
[junit4:junit4]    > 	at sun.reflect.NativeMethodAccessorImpl.invoke(NativeMethodAccessorImpl.java:57)
[junit4:junit4]    > 	at sun.reflect.DelegatingMethodAccessorImpl.invoke(DelegatingMethodAccessorImpl.java:43)
[junit4:junit4]    > 	at java.lang.reflect.Method.invoke(Method.java:474)
[junit4:junit4]    > 	at com.carrotsearch.randomizedtesting.RandomizedRunner.invoke(RandomizedRunner.java:1995)
[junit4:junit4]    > 	at com.carrotsearch.randomizedtesting.RandomizedRunner.access$1100(RandomizedRunner.java:132)
[junit4:junit4]    > 	at com.carrotsearch.randomizedtesting.RandomizedRunner$6.evaluate(RandomizedRunner.java:818)
[junit4:junit4]    > 	at com.carrotsearch.randomizedtesting.RandomizedRunner$7.evaluate(RandomizedRunner.java:877)
[junit4:junit4]    > 	at com.carrotsearch.randomizedtesting.RandomizedRunner$8.evaluate(RandomizedRunner.java:891)
[junit4:junit4]    > 	at com.carrotsearch.randomizedtesting.rules.SystemPropertiesRestoreRule$1.evaluate(SystemPropertiesRestoreRule.java:53)
[junit4:junit4]    > 	at org.apache.lucene.util.TestRuleSetupTeardownChained$1.evaluate(TestRuleSetupTeardownChained.java:50)
[junit4:junit4]    > 	at org.apache.lucene.util.TestRuleFieldCacheSanity$1.evaluate(TestRuleFieldCacheSanity.java:32)
[junit4:junit4]    > 	at org.apache.lucene.util.AbstractBeforeAfterRule$1.evaluate(AbstractBeforeAfterRule.java:45)
[junit4:junit4]    > 	at com.carrotsearch.randomizedtesting.rules.SystemPropertiesInvariantRule$1.evaluate(SystemPropertiesInvariantRule.java:55)
[junit4:junit4]    > 	at org.apache.lucene.util.TestRuleReportUncaughtExceptions$1.evaluate(TestRuleReportUncaughtExceptions.java:68)
[junit4:junit4]    > 	at org.apache.lucene.util.TestRuleThreadAndTestName$1.evaluate(TestRuleThreadAndTestName.java:48)
[junit4:junit4]    > 	at org.apache.lucene.util.TestRuleIgnoreAfterMaxFailures$1.evaluate(TestRuleIgnoreAfterMaxFailures.java:70)
[junit4:junit4]    > 	at org.apache.lucene.util.TestRuleMarkFailure$1.evaluate(TestRuleMarkFailure.java:48)
[junit4:junit4]    > 	at com.carrotsearch.randomizedtesting.RandomizedRunner.runSingleTest(RandomizedRunner.java:825)
[junit4:junit4]    > 	at com.carrotsearch.randomizedtesting.RandomizedRunner.access$700(RandomizedRunner.java:132)
[junit4:junit4]    > 	at com.carrotsearch.randomizedtesting.RandomizedRunner$3$1.run(RandomizedRunner.java:671)
[junit4:junit4]    > 	at com.carrotsearch.randomizedtesting.RandomizedRunner$3.evaluate(RandomizedRunner.java:697)
[junit4:junit4]    > 	at com.carrotsearch.randomizedtesting.RandomizedRunner$4.evaluate(RandomizedRunner.java:736)
[junit4:junit4]    > 	at com.carrotsearch.randomizedtesting.RandomizedRunner$5.evaluate(RandomizedRunner.java:747)
[junit4:junit4]    > 	at com.carrotsearch.randomizedtesting.rules.SystemPropertiesRestoreRule$1.evaluate(SystemPropertiesRestoreRule.java:53)
[junit4:junit4]    > 	at org.apache.lucene.util.AbstractBeforeAfterRule$1.evaluate(AbstractBeforeAfterRule.java:45)
[junit4:junit4]    > 	at org.apache.lucene.util.TestRuleReportUncaughtExceptions$1.evaluate(TestRuleReportUncaughtExceptions.java:68)
[junit4:junit4]    > 	at org.apache.lucene.util.TestRuleStoreClassName$1.evaluate(TestRuleStoreClassName.java:38)
[junit4:junit4]    > 	at com.carrotsearch.randomizedtesting.rules.SystemPropertiesInvariantRule$1.evaluate(SystemPropertiesInvariantRule.java:55)
[junit4:junit4]    > 	at org.apache.lucene.util.TestRuleNoInstanceHooksOverrides$1.evaluate(TestRuleNoInstanceHooksOverrides.java:53)
[junit4:junit4]    > 	at org.apache.lucene.util.TestRuleNoStaticHooksShadowing$1.evaluate(TestRuleNoStaticHooksShadowing.java:52)
[junit4:junit4]    > 	at org.apache.lucene.util.TestRuleAssertionsRequired$1.evaluate(TestRuleAssertionsRequired.java:36)
[junit4:junit4]    > 	at org.apache.lucene.util.TestRuleMarkFailure$1.evaluate(TestRuleMarkFailure.java:48)
[junit4:junit4]    > 	at org.apache.lucene.util.TestRuleIgnoreAfterMaxFailures$1.evaluate(TestRuleIgnoreAfterMaxFailures.java:70)
[junit4:junit4]    > 	at org.apache.lucene.util.TestRuleIgnoreTestSuites$1.evaluate(TestRuleIgnoreTestSuites.java:55)
[junit4:junit4]    > 	at com.carrotsearch.randomizedtesting.RandomizedRunner.runSuite(RandomizedRunner.java:605)
[junit4:junit4]    > 	at com.carrotsearch.randomizedtesting.RandomizedRunner.access$400(RandomizedRunner.java:132)
[junit4:junit4]    > 	at com.carrotsearch.randomizedtesting.RandomizedRunner$2.run(RandomizedRunner.java:551)
[junit4:junit4]    > 
[junit4:junit4]   2> 2 T2096 oas.SolrTestCaseJ4.setUp ###Starting testDistribSearch
[junit4:junit4]   2> 3 T2096 oejs.Server.doStart jetty-8.1.2.v20120308
[junit4:junit4]   2> 8 T2096 oejs.AbstractConnector.doStart Started SocketConnector@0.0.0.0:35940
[junit4:junit4]   2> 8 T2096 oasc.SolrResourceLoader.locateSolrHome JNDI not configured for solr (NoInitialContextEx)
[junit4:junit4]   2> 8 T2096 oasc.SolrResourceLoader.locateSolrHome using system property solr.solr.home: /mnt/ssd/jenkins/workspace/Lucene-Solr-trunk-Linux/checkout/solr/build/solr-core/test-files/solr
[junit4:junit4]   2> 9 T2096 oasc.SolrResourceLoader.<init> new SolrResourceLoader for deduced Solr Home: '/mnt/ssd/jenkins/workspace/Lucene-Solr-trunk-Linux/checkout/solr/build/solr-core/test-files/solr/'
[junit4:junit4]   2> 16 T2096 oass.SolrDispatchFilter.init SolrDispatchFilter.init()
[junit4:junit4]   2> 17 T2096 oasc.SolrResourceLoader.locateSolrHome JNDI not configured for solr (NoInitialContextEx)
[junit4:junit4]   2> 17 T2096 oasc.SolrResourceLoader.locateSolrHome using system property solr.solr.home: /mnt/ssd/jenkins/workspace/Lucene-Solr-trunk-Linux/checkout/solr/build/solr-core/test-files/solr
[junit4:junit4]   2> 17 T2096 oasc.CoreContainer$Initializer.initialize looking for solr.xml: /mnt/ssd/jenkins/workspace/Lucene-Solr-trunk-Linux/checkout/solr/build/solr-core/test-files/solr/solr.xml
[junit4:junit4]   2> 18 T2096 oasc.CoreContainer.<init> New CoreContainer 24858148
[junit4:junit4]   2> 18 T2096 oasc.CoreContainer.load Loading CoreContainer using Solr Home: '/mnt/ssd/jenkins/workspace/Lucene-Solr-trunk-Linux/checkout/solr/build/solr-core/test-files/solr/'
[junit4:junit4]   2> 18 T2096 oasc.SolrResourceLoader.<init> new SolrResourceLoader for directory: '/mnt/ssd/jenkins/workspace/Lucene-Solr-trunk-Linux/checkout/solr/build/solr-core/test-files/solr/'
[junit4:junit4]   2> 31 T2096 oasc.CoreContainer.load Registering Log Listener
[junit4:junit4]   2> 47 T2096 oasc.CoreContainer.create Creating SolrCore 'collection1' using instanceDir: /mnt/ssd/jenkins/workspace/Lucene-Solr-trunk-Linux/checkout/solr/build/solr-core/test-files/solr/collection1
[junit4:junit4]   2> 47 T2096 oasc.SolrResourceLoader.<init> new SolrResourceLoader for directory: '/mnt/ssd/jenkins/workspace/Lucene-Solr-trunk-Linux/checkout/solr/build/solr-core/test-files/solr/collection1/'
[junit4:junit4]   2> 48 T2096 oasc.SolrResourceLoader.replaceClassLoader Adding 'file:/mnt/ssd/jenkins/workspace/Lucene-Solr-trunk-Linux/checkout/solr/build/solr-core/test-files/solr/collection1/lib/README' to classloader
[junit4:junit4]   2> 48 T2096 oasc.SolrResourceLoader.replaceClassLoader Adding 'file:/mnt/ssd/jenkins/workspace/Lucene-Solr-trunk-Linux/checkout/solr/build/solr-core/test-files/solr/collection1/lib/classes/' to classloader
[junit4:junit4]   2> 77 T2096 oasc.SolrConfig.<init> Using Lucene MatchVersion: LUCENE_50
[junit4:junit4]   2> 123 T2096 oasc.SolrConfig.<init> Loaded SolrConfig: solrconfig-elevate.xml
[junit4:junit4]   2> 123 T2096 oass.IndexSchema.readSchema Reading Solr Schema
[junit4:junit4]   2> 127 T2096 oass.IndexSchema.readSchema Schema name=example
[junit4:junit4]   2> 267 T2096 oass.IndexSchema.readSchema default search field in schema is text
[junit4:junit4]   2> 269 T2096 oass.IndexSchema.readSchema unique key field: id
[junit4:junit4]   2> 271 T2096 oasc.SolrCore.<init> [collection1] Opening new SolrCore at /mnt/ssd/jenkins/workspace/Lucene-Solr-trunk-Linux/checkout/solr/build/solr-core/test-files/solr/collection1/, dataDir=./org.apache.solr.handler.component.DistributedQueryElevationComponentTest-1344211861192/control/data/
[junit4:junit4]   2> 271 T2096 oasc.JmxMonitoredMap.<init> JMX monitoring is enabled. Adding Solr mbeans to JMX Server: com.sun.jmx.mbeanserver.JmxMBeanServer@1130f01
[junit4:junit4]   2> 272 T2096 oasc.SolrCore.getNewIndexDir WARNING New index directory detected: old=null new=./org.apache.solr.handler.component.DistributedQueryElevationComponentTest-1344211861192/control/data/index/
[junit4:junit4]   2> 272 T2096 oasc.SolrCore.initIndex WARNING [collection1] Solr index directory './org.apache.solr.handler.component.DistributedQueryElevationComponentTest-1344211861192/control/data/index' doesn't exist. Creating new index...
[junit4:junit4]   2> 273 T2096 oasc.SolrDeletionPolicy.onCommit SolrDeletionPolicy.onCommit: commits:num=1
[junit4:junit4]   2> 		commit{dir=MockDirWrapper(org.apache.lucene.store.RAMDirectory@1bf6fce lockFactory=org.apache.lucene.store.SingleInstanceLockFactory@fafac3),segFN=segments_1,generation=1,filenames=[segments_1]
[junit4:junit4]   2> 273 T2096 oasc.SolrDeletionPolicy.updateCommits newest commit = 1
[junit4:junit4]   2> 274 T2096 oasc.RequestHandlers.initHandlersFromConfig created /update: solr.UpdateRequestHandler
[junit4:junit4]   2> 274 T2096 oasc.RequestHandlers.initHandlersFromConfig created /elevate: org.apache.solr.handler.component.SearchHandler
[junit4:junit4]   2> 274 T2096 oasc.RequestHandlers.initHandlersFromConfig created /dataElevate: org.apache.solr.handler.component.SearchHandler
[junit4:junit4]   2> 275 T2096 oashl.XMLLoader.init xsltCacheLifetimeSeconds=60
[junit4:junit4]   2> 275 T2096 oasc.RequestHandlers.initHandlersFromConfig WARNING no default request handler is registered (either '/select' or 'standard')
[junit4:junit4]   2> 276 T2096 oasc.SolrCore.initDeprecatedSupport WARNING solrconfig.xml uses deprecated <admin/gettableFiles>, Please update your config to use the ShowFileRequestHandler.
[junit4:junit4]   2> 277 T2096 oasc.SolrCore.initDeprecatedSupport WARNING adding ShowFileRequestHandler with hidden files: [SOLRCONFIG-DELPOLICY1.XML, HUNSPELL-TEST.AFF, DA_UTF8.XML, TRIVIAL.UPDATEPROCESSOR0.JS, SOLRCONFIG-SIMPLELOCK.XML, SCHEMA-COLLATE.XML, MISSLEADING.EXTENSION.UPDATEPROCESSOR.JS.TXT, SOLRCONFIG-PROPINJECT-INDEXDEFAULT.XML, SCHEMA_CODEC.XML, KEEP-2.TXT, SOLRCONFIG-SPELLCHECKCOMPONENT.XML, PHRASESUGGEST.TXT, BAD-SCHEMA-EXTERNAL-FILEFIELD.XML, SOLRCONFIG-MASTER1.XML, SOLRCONFIG-ELEVATE.XML, SCHEMA-PHRASESUGGEST.XML, COMPOUNDDICTIONARY.TXT, SOLRCONFIG-SCRIPT-UPDATEPROCESSOR.XML, SCHEMA-NUMERIC.XML, SOLRCONFIG-TLOG.XML, CURRENCY.XML, SCHEMA-LMJELINEKMERCER.XML, SOLRCONFIG-NATIVELOCK.XML, BAD-SOLRCONFIG-INVALID-SCRIPTFILE.XML, KEEP-1.TXT, BAD-SCHEMA-NOT-INDEXED-BUT-POS.XML, BAD-SCHEMA-UNIQUEKEY-MULTIVALUED.XML, SOLRCONFIG-PHRASESUGGEST.XML, SCHEMA-FOLDING.XML, SOLRCONFIG-MASTER.XML, SCHEMA-REQUIRED-FIELDS.XML, SOLRCONFIG-SOLCOREPROPERTIES.XML, SCHEMA-IB.XML, SOLRCONFIG-QUERYSENDER.XML, SOLRCONFIG-PROPINJECT.XML, XSLT, BAD-MP-SOLRCONFIG.XML, SOLRCONFIG-REQHANDLER.INCL, BAD-SCHEMA-NOT-INDEXED-BUT-TF.XML, SCHEMA12.XML, DA_COMPOUNDDICTIONARY.TXT, MISSING.FUNCTIONS.UPDATEPROCESSOR.JS, SCHEMA15.XML, FRENCHARTICLES.TXT, SCHEMA-DFR.XML, BAD-SCHEMA-DUP-DYNAMICFIELD.XML, SOLRCONFIG-TRANSFORMERS.XML, SCHEMA-COPYFIELD-TEST.XML, SOLRCONFIG-MERGEPOLICY.XML, STOP-2.TXT, SOLRCONFIG-TERMINDEX.XML, SCHEMA.XML, SOLRCONFIG-ENABLEPLUGIN.XML, BAD-SCHEMA-CODEC-GLOBAL-VS-FT-MISMATCH.XML, SOLRCONFIG-MASTER3.XML, SOLRCONFIG-SOLR-749.XML, SCHEMA-BM25.XML, SCHEMA-NOT-REQUIRED-UNIQUE-KEY.XML, OPEN-EXCHANGE-RATES.JSON, SOLRCONFIG-CACHING.XML, ELEVATE.XML, SOLRCONFIG-MASTER2.XML, SOLRCONFIG-SLAVE1.XML, BAD-SCHEMA-ANALYZER-CLASS-AND-NESTED.XML, STOPTYPES-1.TXT, BAD-SOLRCONFIG-BOGUS-SCRIPTENGINE-NAME.XML, CONDITIONAL.UPDATEPROCESSOR.JS, SCHEMA-STOP-KEEP.XML, SYNONYMS.TXT, OLD_SYNONYMS.TXT, SCHEMA-CHARFILTERS.XML, STOPTYPES-2.TXT, ADDFIELDS.UPDATEPROCESSOR.JS, HUNSPELL-TEST.DIC, BAD-SOLRCONFIG-MISSING-SCRIPTFILE.XML, STOPWITHBOM.TXT, SCHEMA-LUCENEMATCHVERSION.XML, SOLRCONFIG_PERF.XML, BAD-SCHEMA-OMIT-TF-BUT-NOT-POS.XML, SCHEMA-REPLICATION1.XML, SOLRCONFIG-QUERYSENDER-NOQUERY.XML, PROTWORDS.TXT, SOLRCONFIG-DELPOLICY2.XML, SOLRCONFIG-HIGHLIGHT.XML, SOLRCONFIG-REPEATER.XML, SOLRCONFIG-SLAVE.XML, SOLRCONFIG-SPELLCHECKER.XML, SOLRCONFIG-XINCLUDE.XML, SCHEMA-REPLICATION2.XML, SCHEMA-MINIMAL.XML, BAD-SCHEMA-NOT-INDEXED-BUT-NORMS.XML, STOPWORDS.TXT, SOLRCONFIG-ALTDIRECTORY.XML, BAD-SCHEMA-UNIQUEKEY-IS-COPYFIELD-DEST.XML, SCHEMA11.XML, SCHEMA-BINARYFIELD.XML, SCHEMA-SPELLCHECKER.XML, SCHEMA-REVERSED.XML, SOLRCONFIG-FUNCTIONQUERY.XML, BAD-SCHEMA-DUP-FIELDTYPE.XML, SCHEMA-TRIE.XML, STOP-SNOWBALL.TXT, SOLRCONFIG-MASTER1-KEEPONEBACKUP.XML, BAD-SCHEMA-UNIQUEKEY-USES-DEFAULT.XML, HYPHENATION.DTD, SOLRCONFIG-NOCACHE.XML, BAD-SCHEMA-NONTEXT-ANALYZER.XML, BAD-SCHEMA-SIM-GLOBAL-VS-FT-MISMATCH.XML, BAD_SOLRCONFIG.XML, STOPWORDSWRONGENCODING.TXT, WDFTYPES.TXT, SCHEMA-LMDIRICHLET.XML, TRIVIAL.UPDATEPROCESSOR1.JS, SCHEMASURROUND.XML, THROW.ERROR.ON.ADD.UPDATEPROCESSOR.JS, MAPPING-ISOLATIN1ACCENT.TXT, SCHEMA-TFIDF.XML, STOP-1.TXT, SOLRCONFIG_CODEC.XML, SCHEMA-SIM.XML, SOLRCONFIG-BASIC.XML, SOLRCONFIG-UPDATE-PROCESSOR-CHAINS.XML, STEMDICT.TXT, BAD-SCHEMA-DUP-FIELD.XML, SOLRCONFIG-LAZYWRITER.XML]
[junit4:junit4]   2> 278 T2096 oass.SolrIndexSearcher.<init> Opening Searcher@f61769 main
[junit4:junit4]   2> 279 T2096 oass.SolrIndexSearcher.getIndexDir WARNING WARNING: Directory impl does not support setting indexDir: org.apache.lucene.store.MockDirectoryWrapper
[junit4:junit4]   2> 279 T2096 oasu.CommitTracker.<init> Hard AutoCommit: disabled
[junit4:junit4]   2> 279 T2096 oasu.CommitTracker.<init> Soft AutoCommit: disabled
[junit4:junit4]   2> 281 T2096 oashc.QueryElevationComponent.inform Loading QueryElevation from: /mnt/ssd/jenkins/workspace/Lucene-Solr-trunk-Linux/checkout/solr/build/solr-core/test-files/solr/collection1/conf/elevate.xml
[junit4:junit4]   2> 287 T2096 oashc.QueryElevationComponent.inform Loading QueryElevation from: /mnt/ssd/jenkins/workspace/Lucene-Solr-trunk-Linux/checkout/solr/build/solr-core/test-files/solr/collection1/conf/elevate.xml
[junit4:junit4]   2> 295 T2096 oashc.HttpShardHandlerFactory.getParameter Setting socketTimeout to: 0
[junit4:junit4]   2> 295 T2096 oashc.HttpShardHandlerFactory.getParameter Setting urlScheme to: http://
[junit4:junit4]   2> 296 T2096 oashc.HttpShardHandlerFactory.getParameter Setting connTimeout to: 0
[junit4:junit4]   2> 296 T2096 oashc.HttpShardHandlerFactory.getParameter Setting maxConnectionsPerHost to: 20
[junit4:junit4]   2> 296 T2096 oashc.HttpShardHandlerFactory.getParameter Setting corePoolSize to: 0
[junit4:junit4]   2> 297 T2096 oashc.HttpShardHandlerFactory.getParameter Setting maximumPoolSize to: 2147483647
[junit4:junit4]   2> 297 T2096 oashc.HttpShardHandlerFactory.getParameter Setting maxThreadIdleTime to: 5
[junit4:junit4]   2> 297 T2096 oashc.HttpShardHandlerFactory.getParameter Setting sizeOfQueue to: -1
[junit4:junit4]   2> 298 T2096 oashc.HttpShardHandlerFactory.getParameter Setting fairnessPolicy to: false
[junit4:junit4]   2> 298 T2096 oascsi.HttpClientUtil.createClient Creating new http client, config:maxConnectionsPerHost=20&maxConnections=10000&socketTimeout=0&connTimeout=0&retry=false
[junit4:junit4]   2> 336 T2106 oasc.SolrCore.registerSearcher [collection1] Registered new searcher Searcher@f61769 main{StandardDirectoryReader(segments_1:1)}
[junit4:junit4]   2> 336 T2096 oasc.CoreContainer.register registering core: collection1
[junit4:junit4]   2> 336 T2096 oass.SolrDispatchFilter.init user.dir=/mnt/ssd/jenkins/workspace/Lucene-Solr-trunk-Linux/checkout/solr/build/solr-core/test/J1
[junit4:junit4]   2> 337 T2096 oass.SolrDispatchFilter.init SolrDispatchFilter.init() done
[junit4:junit4]   2> 337 T2096 oascsi.HttpClientUtil.createClient Creating new http client, config:maxConnections=128&maxConnectionsPerHost=32&followRedirects=false
[junit4:junit4]   2> 340 T2096 oejs.Server.doStart jetty-8.1.2.v20120308
[junit4:junit4]   2> 342 T2096 oejs.AbstractConnector.doStart Started SocketConnector@0.0.0.0:43401
[junit4:junit4]   2> 342 T2096 oasc.SolrResourceLoader.locateSolrHome JNDI not configured for solr (NoInitialContextEx)
[junit4:junit4]   2> 342 T2096 oasc.SolrResourceLoader.locateSolrHome using system property solr.solr.home: /mnt/ssd/jenkins/workspace/Lucene-Solr-trunk-Linux/checkout/solr/build/solr-core/test-files/solr
[junit4:junit4]   2> 343 T2096 oasc.SolrResourceLoader.<init> new SolrResourceLoader for deduced Solr Home: '/mnt/ssd/jenkins/workspace/Lucene-Solr-trunk-Linux/checkout/solr/build/solr-core/test-files/solr/'
[junit4:junit4]   2> 350 T2096 oass.SolrDispatchFilter.init SolrDispatchFilter.init()
[junit4:junit4]   2> 350 T2096 oasc.SolrResourceLoader.locateSolrHome JNDI not configured for solr (NoInitialContextEx)
[junit4:junit4]   2> 350 T2096 oasc.SolrResourceLoader.locateSolrHome using system property solr.solr.home: /mnt/ssd/jenkins/workspace/Lucene-Solr-trunk-Linux/checkout/solr/build/solr-core/test-files/solr
[junit4:junit4]   2> 350 T2096 oasc.CoreContainer$Initializer.initialize looking for solr.xml: /mnt/ssd/jenkins/workspace/Lucene-Solr-trunk-Linux/checkout/solr/build/solr-core/test-files/solr/solr.xml
[junit4:junit4]   2> 351 T2096 oasc.CoreContainer.<init> New CoreContainer 30254946
[junit4:junit4]   2> 351 T2096 oasc.CoreContainer.load Loading CoreContainer using Solr Home: '/mnt/ssd/jenkins/workspace/Lucene-Solr-trunk-Linux/checkout/solr/build/solr-core/test-files/solr/'
[junit4:junit4]   2> 351 T2096 oasc.SolrResourceLoader.<init> new SolrResourceLoader for directory: '/mnt/ssd/jenkins/workspace/Lucene-Solr-trunk-Linux/checkout/solr/build/solr-core/test-files/solr/'
[junit4:junit4]   2> 360 T2096 oasc.CoreContainer.load Registering Log Listener
[junit4:junit4]   2> 370 T2096 oasc.CoreContainer.create Creating SolrCore 'collection1' using instanceDir: /mnt/ssd/jenkins/workspace/Lucene-Solr-trunk-Linux/checkout/solr/build/solr-core/test-files/solr/collection1
[junit4:junit4]   2> 371 T2096 oasc.SolrResourceLoader.<init> new SolrResourceLoader for directory: '/mnt/ssd/jenkins/workspace/Lucene-Solr-trunk-Linux/checkout/solr/build/solr-core/test-files/solr/collection1/'
[junit4:junit4]   2> 371 T2096 oasc.SolrResourceLoader.replaceClassLoader Adding 'file:/mnt/ssd/jenkins/workspace/Lucene-Solr-trunk-Linux/checkout/solr/build/solr-core/test-files/solr/collection1/lib/README' to classloader
[junit4:junit4]   2> 371 T2096 oasc.SolrResourceLoader.replaceClassLoader Adding 'file:/mnt/ssd/jenkins/workspace/Lucene-Solr-trunk-Linux/checkout/solr/build/solr-core/test-files/solr/collection1/lib/classes/' to classloader
[junit4:junit4]   2> 391 T2096 oasc.SolrConfig.<init> Using Lucene MatchVersion: LUCENE_50
[junit4:junit4]   2> 422 T2096 oasc.SolrConfig.<init> Loaded SolrConfig: solrconfig-elevate.xml
[junit4:junit4]   2> 422 T2096 oass.IndexSchema.readSchema Reading Solr Schema
[junit4:junit4]   2> 434 T2096 oass.IndexSchema.readSchema Schema name=example
[junit4:junit4]   2> 563 T2096 oass.IndexSchema.readSchema default search field in schema is text
[junit4:junit4]   2> 565 T2096 oass.IndexSchema.readSchema unique key field: id
[junit4:junit4]   2> 567 T2096 oasc.SolrCore.<init> [collection1] Opening new SolrCore at /mnt/ssd/jenkins/workspace/Lucene-Solr-trunk-Linux/checkout/solr/build/solr-core/test-files/solr/collection1/, dataDir=./org.apache.solr.handler.component.DistributedQueryElevationComponentTest-1344211861192/shard0/data/
[junit4:junit4]   2> 567 T2096 oasc.JmxMonitoredMap.<init> JMX monitoring is enabled. Adding Solr mbeans to JMX Server: com.sun.jmx.mbeanserver.JmxMBeanServer@1130f01
[junit4:junit4]   2> 568 T2096 oasc.SolrCore.getNewIndexDir WARNING New index directory detected: old=null new=./org.apache.solr.handler.component.DistributedQueryElevationComponentTest-1344211861192/shard0/data/index/
[junit4:junit4]   2> 568 T2096 oasc.SolrCore.initIndex WARNING [collection1] Solr index directory './org.apache.solr.handler.component.DistributedQueryElevationComponentTest-1344211861192/shard0/data/index' doesn't exist. Creating new index...
[junit4:junit4]   2> 569 T2096 oasc.SolrDeletionPolicy.onCommit SolrDeletionPolicy.onCommit: commits:num=1
[junit4:junit4]   2> 		commit{dir=MockDirWrapper(org.apache.lucene.store.RAMDirectory@984cb6 lockFactory=org.apache.lucene.store.SingleInstanceLockFactory@2ea40f),segFN=segments_1,generation=1,filenames=[segments_1]
[junit4:junit4]   2> 569 T2096 oasc.SolrDeletionPolicy.updateCommits newest commit = 1
[junit4:junit4]   2> 570 T2096 oasc.RequestHandlers.initHandlersFromConfig created /update: solr.UpdateRequestHandler
[junit4:junit4]   2> 570 T2096 oasc.RequestHandlers.initHandlersFromConfig created /elevate: org.apache.solr.handler.component.SearchHandler
[junit4:junit4]   2> 570 T2096 oasc.RequestHandlers.initHandlersFromConfig created /dataElevate: org.apache.solr.handler.component.SearchHandler
[junit4:junit4]   2> 571 T2096 oashl.XMLLoader.init xsltCacheLifetimeSeconds=60
[junit4:junit4]   2> 571 T2096 oasc.RequestHandlers.initHandlersFromConfig WARNING no default request handler is registered (either '/select' or 'standard')
[junit4:junit4]   2> 572 T2096 oasc.SolrCore.initDeprecatedSupport WARNING solrconfig.xml uses deprecated <admin/gettableFiles>, Please update your config to use the ShowFileRequestHandler.
[junit4:junit4]   2> 573 T2096 oasc.SolrCore.initDeprecatedSupport WARNING adding ShowFileRequestHandler with hidden files: [SOLRCONFIG-DELPOLICY1.XML, HUNSPELL-TEST.AFF, DA_UTF8.XML, TRIVIAL.UPDATEPROCESSOR0.JS, SOLRCONFIG-SIMPLELOCK.XML, SCHEMA-COLLATE.XML, MISSLEADING.EXTENSION.UPDATEPROCESSOR.JS.TXT, SOLRCONFIG-PROPINJECT-INDEXDEFAULT.XML, SCHEMA_CODEC.XML, KEEP-2.TXT, SOLRCONFIG-SPELLCHECKCOMPONENT.XML, PHRASESUGGEST.TXT, BAD-SCHEMA-EXTERNAL-FILEFIELD.XML, SOLRCONFIG-MASTER1.XML, SOLRCONFIG-ELEVATE.XML, SCHEMA-PHRASESUGGEST.XML, COMPOUNDDICTIONARY.TXT, SOLRCONFIG-SCRIPT-UPDATEPROCESSOR.XML, SCHEMA-NUMERIC.XML, SOLRCONFIG-TLOG.XML, CURRENCY.XML, SCHEMA-LMJELINEKMERCER.XML, SOLRCONFIG-NATIVELOCK.XML, BAD-SOLRCONFIG-INVALID-SCRIPTFILE.XML, KEEP-1.TXT, BAD-SCHEMA-NOT-INDEXED-BUT-POS.XML, BAD-SCHEMA-UNIQUEKEY-MULTIVALUED.XML, SOLRCONFIG-PHRASESUGGEST.XML, SCHEMA-FOLDING.XML, SOLRCONFIG-MASTER.XML, SCHEMA-REQUIRED-FIELDS.XML, SOLRCONFIG-SOLCOREPROPERTIES.XML, SCHEMA-IB.XML, SOLRCONFIG-QUERYSENDER.XML, SOLRCONFIG-PROPINJECT.XML, XSLT, BAD-MP-SOLRCONFIG.XML, SOLRCONFIG-REQHANDLER.INCL, BAD-SCHEMA-NOT-INDEXED-BUT-TF.XML, SCHEMA12.XML, DA_COMPOUNDDICTIONARY.TXT, MISSING.FUNCTIONS.UPDATEPROCESSOR.JS, SCHEMA15.XML, FRENCHARTICLES.TXT, SCHEMA-DFR.XML, BAD-SCHEMA-DUP-DYNAMICFIELD.XML, SOLRCONFIG-TRANSFORMERS.XML, SCHEMA-COPYFIELD-TEST.XML, SOLRCONFIG-MERGEPOLICY.XML, STOP-2.TXT, SOLRCONFIG-TERMINDEX.XML, SCHEMA.XML, SOLRCONFIG-ENABLEPLUGIN.XML, BAD-SCHEMA-CODEC-GLOBAL-VS-FT-MISMATCH.XML, SOLRCONFIG-MASTER3.XML, SOLRCONFIG-SOLR-749.XML, SCHEMA-BM25.XML, SCHEMA-NOT-REQUIRED-UNIQUE-KEY.XML, OPEN-EXCHANGE-RATES.JSON, SOLRCONFIG-CACHING.XML, ELEVATE.XML, SOLRCONFIG-MASTER2.XML, SOLRCONFIG-SLAVE1.XML, BAD-SCHEMA-ANALYZER-CLASS-AND-NESTED.XML, STOPTYPES-1.TXT, BAD-SOLRCONFIG-BOGUS-SCRIPTENGINE-NAME.XML, CONDITIONAL.UPDATEPROCESSOR.JS, SCHEMA-STOP-KEEP.XML, SYNONYMS.TXT, OLD_SYNONYMS.TXT, SCHEMA-CHARFILTERS.XML, STOPTYPES-2.TXT, ADDFIELDS.UPDATEPROCESSOR.JS, HUNSPELL-TEST.DIC, BAD-SOLRCONFIG-MISSING-SCRIPTFILE.XML, STOPWITHBOM.TXT, SCHEMA-LUCENEMATCHVERSION.XML, SOLRCONFIG_PERF.XML, BAD-SCHEMA-OMIT-TF-BUT-NOT-POS.XML, SCHEMA-REPLICATION1.XML, SOLRCONFIG-QUERYSENDER-NOQUERY.XML, PROTWORDS.TXT, SOLRCONFIG-DELPOLICY2.XML, SOLRCONFIG-HIGHLIGHT.XML, SOLRCONFIG-REPEATER.XML, SOLRCONFIG-SLAVE.XML, SOLRCONFIG-SPELLCHECKER.XML, SOLRCONFIG-XINCLUDE.XML, SCHEMA-REPLICATION2.XML, SCHEMA-MINIMAL.XML, BAD-SCHEMA-NOT-INDEXED-BUT-NORMS.XML, STOPWORDS.TXT, SOLRCONFIG-ALTDIRECTORY.XML, BAD-SCHEMA-UNIQUEKEY-IS-COPYFIELD-DEST.XML, SCHEMA11.XML, SCHEMA-BINARYFIELD.XML, SCHEMA-SPELLCHECKER.XML, SCHEMA-REVERSED.XML, SOLRCONFIG-FUNCTIONQUERY.XML, BAD-SCHEMA-DUP-FIELDTYPE.XML, SCHEMA-TRIE.XML, STOP-SNOWBALL.TXT, SOLRCONFIG-MASTER1-KEEPONEBACKUP.XML, BAD-SCHEMA-UNIQUEKEY-USES-DEFAULT.XML, HYPHENATION.DTD, SOLRCONFIG-NOCACHE.XML, BAD-SCHEMA-NONTEXT-ANALYZER.XML, BAD-SCHEMA-SIM-GLOBAL-VS-FT-MISMATCH.XML, BAD_SOLRCONFIG.XML, STOPWORDSWRONGENCODING.TXT, WDFTYPES.TXT, SCHEMA-LMDIRICHLET.XML, TRIVIAL.UPDATEPROCESSOR1.JS, SCHEMASURROUND.XML, THROW.ERROR.ON.ADD.UPDATEPROCESSOR.JS, MAPPING-ISOLATIN1ACCENT.TXT, SCHEMA-TFIDF.XML, STOP-1.TXT, SOLRCONFIG_CODEC.XML, SCHEMA-SIM.XML, SOLRCONFIG-BASIC.XML, SOLRCONFIG-UPDATE-PROCESSOR-CHAINS.XML, STEMDICT.TXT, BAD-SCHEMA-DUP-FIELD.XML, SOLRCONFIG-LAZYWRITER.XML]
[junit4:junit4]   2> 574 T2096 oass.SolrIndexSearcher.<init> Opening Searcher@114a0d2 main
[junit4:junit4]   2> 575 T2096 oass.SolrIndexSearcher.getIndexDir WARNING WARNING: Directory impl does not support setting indexDir: org.apache.lucene.store.MockDirectoryWrapper
[junit4:junit4]   2> 575 T2096 oasu.CommitTracker.<init> Hard AutoCommit: disabled
[junit4:junit4]   2> 575 T2096 oasu.CommitTracker.<init> Soft AutoCommit: disabled
[junit4:junit4]   2> 576 T2096 oashc.QueryElevationComponent.inform Loading QueryElevation from: /mnt/ssd/jenkins/workspace/Lucene-Solr-trunk-Linux/checkout/solr/build/solr-core/test-files/solr/collection1/conf/elevate.xml
[junit4:junit4]   2> 582 T2096 oashc.QueryElevationComponent.inform Loading QueryElevation from: /mnt/ssd/jenkins/workspace/Lucene-Solr-trunk-Linux/checkout/solr/build/solr-core/test-files/solr/collection1/conf/elevate.xml
[junit4:junit4]   2> 587 T2096 oashc.HttpShardHandlerFactory.getParameter Setting socketTimeout to: 0
[junit4:junit4]   2> 588 T2096 oashc.HttpShardHandlerFactory.getParameter Setting urlScheme to: http://
[junit4:junit4]   2> 588 T2096 oashc.HttpShardHandlerFactory.getParameter Setting connTimeout to: 0
[junit4:junit4]   2> 588 T2096 oashc.HttpShardHandlerFactory.getParameter Setting maxConnectionsPerHost to: 20
[junit4:junit4]   2> 589 T2096 oashc.HttpShardHandlerFactory.getParameter Setting corePoolSize to: 0
[junit4:junit4]   2> 589 T2096 oashc.HttpShardHandlerFactory.getParameter Setting maximumPoolSize to: 2147483647
[junit4:junit4]   2> 589 T2096 oashc.HttpShardHandlerFactory.getParameter Setting maxThreadIdleTime to: 5
[junit4:junit4]   2> 589 T2096 oashc.HttpShardHandlerFactory.getParameter Setting sizeOfQueue to: -1
[junit4:junit4]   2> 589 T2096 oashc.HttpShardHandlerFactory.getParameter Setting fairnessPolicy to: false
[junit4:junit4]   2> 590 T2096 oascsi.HttpClientUtil.createClient Creating new http client, config:maxConnectionsPerHost=20&maxConnections=10000&socketTimeout=0&connTimeout=0&retry=false
[junit4:junit4]   2> 592 T2116 oasc.SolrCore.registerSearcher [collection1] Registered new searcher Searcher@114a0d2 main{StandardDirectoryReader(segments_1:1)}
[junit4:junit4]   2> 592 T2096 oasc.CoreContainer.register registering core: collection1
[junit4:junit4]   2> 592 T2096 oass.SolrDispatchFilter.init user.dir=/mnt/ssd/jenkins/workspace/Lucene-Solr-trunk-Linux/checkout/solr/build/solr-core/test/J1
[junit4:junit4]   2> 592 T2096 oass.SolrDispatchFilter.init SolrDispatchFilter.init() done
[junit4:junit4]   2> 593 T2096 oascsi.HttpClientUtil.createClient Creating new http client, config:maxConnections=128&maxConnectionsPerHost=32&followRedirects=false
[junit4:junit4]   2> 594 T2096 oejs.Server.doStart jetty-8.1.2.v20120308
[junit4:junit4]   2> 629 T2096 oejs.AbstractConnector.doStart Started SocketConnector@0.0.0.0:42206
[junit4:junit4]   2> 629 T2096 oasc.SolrResourceLoader.locateSolrHome JNDI not configured for solr (NoInitialContextEx)
[junit4:junit4]   2> 630 T2096 oasc.SolrResourceLoader.locateSolrHome using system property solr.solr.home: /mnt/ssd/jenkins/workspace/Lucene-Solr-trunk-Linux/checkout/solr/build/solr-core/test-files/solr
[junit4:junit4]   2> 630 T2096 oasc.SolrResourceLoader.<init> new SolrResourceLoader for deduced Solr Home: '/mnt/ssd/jenkins/workspace/Lucene-Solr-trunk-Linux/checkout/solr/build/solr-core/test-files/solr/'
[junit4:junit4]   2> 637 T2096 oass.SolrDispatchFilter.init SolrDispatchFilter.init()
[junit4:junit4]   2> 637 T2096 oasc.SolrResourceLoader.locateSolrHome JNDI not configured for solr (NoInitialContextEx)
[junit4:junit4]   2> 637 T2096 oasc.SolrResourceLoader.locateSolrHome using system property solr.solr.home: /mnt/ssd/jenkins/workspace/Lucene-Solr-trunk-Linux/checkout/solr/build/solr-core/test-files/solr
[junit4:junit4]   2> 638 T2096 oasc.CoreContainer$Initializer.initialize looking for solr.xml: /mnt/ssd/jenkins/workspace/Lucene-Solr-trunk-Linux/checkout/solr/build/solr-core/test-files/solr/solr.xml
[junit4:junit4]   2> 638 T2096 oasc.CoreContainer.<init> New CoreContainer 9921325
[junit4:junit4]   2> 638 T2096 oasc.CoreContainer.load Loading CoreContainer using Solr Home: '/mnt/ssd/jenkins/workspace/Lucene-Solr-trunk-Linux/checkout/solr/build/solr-core/test-files/solr/'
[junit4:junit4]   2> 638 T2096 oasc.SolrResourceLoader.<init> new SolrResourceLoader for directory: '/mnt/ssd/jenkins/workspace/Lucene-Solr-trunk-Linux/checkout/solr/build/solr-core/test-files/solr/'
[junit4:junit4]   2> 650 T2096 oasc.CoreContainer.load Registering Log Listener
[junit4:junit4]   2> 660 T2096 oasc.CoreContainer.create Creating SolrCore 'collection1' using instanceDir: /mnt/ssd/jenkins/workspace/Lucene-Solr-trunk-Linux/checkout/solr/build/solr-core/test-files/solr/collection1
[junit4:junit4]   2> 661 T2096 oasc.SolrResourceLoader.<init> new SolrResourceLoader for directory: '/mnt/ssd/jenkins/workspace/Lucene-Solr-trunk-Linux/checkout/solr/build/solr-core/test-files/solr/collection1/'
[junit4:junit4]   2> 661 T2096 oasc.SolrResourceLoader.replaceClassLoader Adding 'file:/mnt/ssd/jenkins/workspace/Lucene-Solr-trunk-Linux/checkout/solr/build/solr-core/test-files/solr/collection1/lib/README' to classloader
[junit4:junit4]   2> 661 T2096 oasc.SolrResourceLoader.replaceClassLoader Adding 'file:/mnt/ssd/jenkins/workspace/Lucene-Solr-trunk-Linux/checkout/solr/build/solr-core/test-files/solr/collection1/lib/classes/' to classloader
[junit4:junit4]   2> 683 T2096 oasc.SolrConfig.<init> Using Lucene MatchVersion: LUCENE_50
[junit4:junit4]   2> 712 T2096 oasc.SolrConfig.<init> Loaded SolrConfig: solrconfig-elevate.xml
[junit4:junit4]   2> 713 T2096 oass.IndexSchema.readSchema Reading Solr Schema
[junit4:junit4]   2> 715 T2096 oass.IndexSchema.readSchema Schema name=example
[junit4:junit4]   2> 903 T2096 oass.IndexSchema.readSchema default search field in schema is text
[junit4:junit4]   2> 906 T2096 oass.IndexSchema.readSchema unique key field: id
[junit4:junit4]   2> 908 T2096 oasc.SolrCore.<init> [collection1] Opening new SolrCore at /mnt/ssd/jenkins/workspace/Lucene-Solr-trunk-Linux/checkout/solr/build/solr-core/test-files/solr/collection1/, dataDir=./org.apache.solr.handler.component.DistributedQueryElevationComponentTest-1344211861192/shard1/data/
[junit4:junit4]   2> 908 T2096 oasc.JmxMonitoredMap.<init> JMX monitoring is enabled. Adding Solr mbeans to JMX Server: com.sun.jmx.mbeanserver.JmxMBeanServer@1130f01
[junit4:junit4]   2> 909 T2096 oasc.SolrCore.getNewIndexDir WARNING New index directory detected: old=null new=./org.apache.solr.handler.component.DistributedQueryElevationComponentTest-1344211861192/shard1/data/index/
[junit4:junit4]   2> 909 T2096 oasc.SolrCore.initIndex WARNING [collection1] Solr index directory './org.apache.solr.handler.component.DistributedQueryElevationComponentTest-1344211861192/shard1/data/index' doesn't exist. Creating new index...
[junit4:junit4]   2> 910 T2096 oasc.SolrDeletionPolicy.onCommit SolrDeletionPolicy.onCommit: commits:num=1
[junit4:junit4]   2> 		commit{dir=MockDirWrapper(org.apache.lucene.store.RAMDirectory@6d02c2 lockFactory=org.apache.lucene.store.SingleInstanceLockFactory@1ffc843),segFN=segments_1,generation=1,filenames=[segments_1]
[junit4:junit4]   2> 910 T2096 oasc.SolrDeletionPolicy.updateCommits newest commit = 1
[junit4:junit4]   2> 911 T2096 oasc.RequestHandlers.initHandlersFromConfig created /update: solr.UpdateRequestHandler
[junit4:junit4]   2> 911 T2096 oasc.RequestHandlers.initHandlersFromConfig created /elevate: org.apache.solr.handler.component.SearchHandler
[junit4:junit4]   2> 912 T2096 oasc.RequestHandlers.initHandlersFromConfig created /dataElevate: org.apache.solr.handler.component.SearchHandler
[junit4:junit4]   2> 912 T2096 oashl.XMLLoader.init xsltCacheLifetimeSeconds=60
[junit4:junit4]   2> 912 T2096 oasc.RequestHandlers.initHandlersFromConfig WARNING no default request handler is registered (either '/select' or 'standard')
[junit4:junit4]   2> 913 T2096 oasc.SolrCore.initDeprecatedSupport WARNING solrconfig.xml uses deprecated <admin/gettableFiles>, Please update your config to use the ShowFileRequestHandler.
[junit4:junit4]   2> 914 T2096 oasc.SolrCore.initDeprecatedSupport WARNING adding ShowFileRequestHandler with hidden files: [SOLRCONFIG-DELPOLICY1.XML, HUNSPELL-TEST.AFF, DA_UTF8.XML, TRIVIAL.UPDATEPROCESSOR0.JS, SOLRCONFIG-SIMPLELOCK.XML, SCHEMA-COLLATE.XML, MISSLEADING.EXTENSION.UPDATEPROCESSOR.JS.TXT, SOLRCONFIG-PROPINJECT-INDEXDEFAULT.XML, SCHEMA_CODEC.XML, KEEP-2.TXT, SOLRCONFIG-SPELLCHECKCOMPONENT.XML, PHRASESUGGEST.TXT, BAD-SCHEMA-EXTERNAL-FILEFIELD.XML, SOLRCONFIG-MASTER1.XML, SOLRCONFIG-ELEVATE.XML, SCHEMA-PHRASESUGGEST.XML, COMPOUNDDICTIONARY.TXT, SOLRCONFIG-SCRIPT-UPDATEPROCESSOR.XML, SCHEMA-NUMERIC.XML, SOLRCONFIG-TLOG.XML, CURRENCY.XML, SCHEMA-LMJELINEKMERCER.XML, SOLRCONFIG-NATIVELOCK.XML, BAD-SOLRCONFIG-INVALID-SCRIPTFILE.XML, KEEP-1.TXT, BAD-SCHEMA-NOT-INDEXED-BUT-POS.XML, BAD-SCHEMA-UNIQUEKEY-MULTIVALUED.XML, SOLRCONFIG-PHRASESUGGEST.XML, SCHEMA-FOLDING.XML, SOLRCONFIG-MASTER.XML, SCHEMA-REQUIRED-FIELDS.XML, SOLRCONFIG-SOLCOREPROPERTIES.XML, SCHEMA-IB.XML, SOLRCONFIG-QUERYSENDER.XML, SOLRCONFIG-PROPINJECT.XML, XSLT, BAD-MP-SOLRCONFIG.XML, SOLRCONFIG-REQHANDLER.INCL, BAD-SCHEMA-NOT-INDEXED-BUT-TF.XML, SCHEMA12.XML, DA_COMPOUNDDICTIONARY.TXT, MISSING.FUNCTIONS.UPDATEPROCESSOR.JS, SCHEMA15.XML, FRENCHARTICLES.TXT, SCHEMA-DFR.XML, BAD-SCHEMA-DUP-DYNAMICFIELD.XML, SOLRCONFIG-TRANSFORMERS.XML, SCHEMA-COPYFIELD-TEST.XML, SOLRCONFIG-MERGEPOLICY.XML, STOP-2.TXT, SOLRCONFIG-TERMINDEX.XML, SCHEMA.XML, SOLRCONFIG-ENABLEPLUGIN.XML, BAD-SCHEMA-CODEC-GLOBAL-VS-FT-MISMATCH.XML, SOLRCONFIG-MASTER3.XML, SOLRCONFIG-SOLR-749.XML, SCHEMA-BM25.XML, SCHEMA-NOT-REQUIRED-UNIQUE-KEY.XML, OPEN-EXCHANGE-RATES.JSON, SOLRCONFIG-CACHING.XML, ELEVATE.XML, SOLRCONFIG-MASTER2.XML, SOLRCONFIG-SLAVE1.XML, BAD-SCHEMA-ANALYZER-CLASS-AND-NESTED.XML, STOPTYPES-1.TXT, BAD-SOLRCONFIG-BOGUS-SCRIPTENGINE-NAME.XML, CONDITIONAL.UPDATEPROCESSOR.JS, SCHEMA-STOP-KEEP.XML, SYNONYMS.TXT, OLD_SYNONYMS.TXT, SCHEMA-CHARFILTERS.XML, STOPTYPES-2.TXT, ADDFIELDS.UPDATEPROCESSOR.JS, HUNSPELL-TEST.DIC, BAD-SOLRCONFIG-MISSING-SCRIPTFILE.XML, STOPWITHBOM.TXT, SCHEMA-LUCENEMATCHVERSION.XML, SOLRCONFIG_PERF.XML, BAD-SCHEMA-OMIT-TF-BUT-NOT-POS.XML, SCHEMA-REPLICATION1.XML, SOLRCONFIG-QUERYSENDER-NOQUERY.XML, PROTWORDS.TXT, SOLRCONFIG-DELPOLICY2.XML, SOLRCONFIG-HIGHLIGHT.XML, SOLRCONFIG-REPEATER.XML, SOLRCONFIG-SLAVE.XML, SOLRCONFIG-SPELLCHECKER.XML, SOLRCONFIG-XINCLUDE.XML, SCHEMA-REPLICATION2.XML, SCHEMA-MINIMAL.XML, BAD-SCHEMA-NOT-INDEXED-BUT-NORMS.XML, STOPWORDS.TXT, SOLRCONFIG-ALTDIRECTORY.XML, BAD-SCHEMA-UNIQUEKEY-IS-COPYFIELD-DEST.XML, SCHEMA11.XML, SCHEMA-BINARYFIELD.XML, SCHEMA-SPELLCHECKER.XML, SCHEMA-REVERSED.XML, SOLRCONFIG-FUNCTIONQUERY.XML, BAD-SCHEMA-DUP-FIELDTYPE.XML, SCHEMA-TRIE.XML, STOP-SNOWBALL.TXT, SOLRCONFIG-MASTER1-KEEPONEBACKUP.XML, BAD-SCHEMA-UNIQUEKEY-USES-DEFAULT.XML, HYPHENATION.DTD, SOLRCONFIG-NOCACHE.XML, BAD-SCHEMA-NONTEXT-ANALYZER.XML, BAD-SCHEMA-SIM-GLOBAL-VS-FT-MISMATCH.XML, BAD_SOLRCONFIG.XML, STOPWORDSWRONGENCODING.TXT, WDFTYPES.TXT, SCHEMA-LMDIRICHLET.XML, TRIVIAL.UPDATEPROCESSOR1.JS, SCHEMASURROUND.XML, THROW.ERROR.ON.ADD.UPDATEPROCESSOR.JS, MAPPING-ISOLATIN1ACCENT.TXT, SCHEMA-TFIDF.XML, STOP-1.TXT, SOLRCONFIG_CODEC.XML, SCHEMA-SIM.XML, SOLRCONFIG-BASIC.XML, SOLRCONFIG-UPDATE-PROCESSOR-CHAINS.XML, STEMDICT.TXT, BAD-SCHEMA-DUP-FIELD.XML, SOLRCONFIG-LAZYWRITER.XML]
[junit4:junit4]   2> 916 T2096 oass.SolrIndexSearcher.<init> Opening Searcher@132beb7 main
[junit4:junit4]   2> 916 T2096 oass.SolrIndexSearcher.getIndexDir WARNING WARNING: Directory impl does not support setting indexDir: org.apache.lucene.store.MockDirectoryWrapper
[junit4:junit4]   2> 917 T2096 oasu.CommitTracker.<init> Hard AutoCommit: disabled
[junit4:junit4]   2> 917 T2096 oasu.CommitTracker.<init> Soft AutoCommit: disabled
[junit4:junit4]   2> 917 T2096 oashc.QueryElevationComponent.inform Loading QueryElevation from: /mnt/ssd/jenkins/workspace/Lucene-Solr-trunk-Linux/checkout/solr/build/solr-core/test-files/solr/collection1/conf/elevate.xml
[junit4:junit4]   2> 923 T2096 oashc.QueryElevationComponent.inform Loading QueryElevation from: /mnt/ssd/jenkins/workspace/Lucene-Solr-trunk-Linux/checkout/solr/build/solr-core/test-files/solr/collection1/conf/elevate.xml
[junit4:junit4]   2> 930 T2096 oashc.HttpShardHandlerFactory.getParameter Setting socketTimeout to: 0
[junit4:junit4]   2> 930 T2096 oashc.HttpShardHandlerFactory.getParameter Setting urlScheme to: http://
[junit4:junit4]   2> 930 T2096 oashc.HttpShardHandlerFactory.getParameter Setting connTimeout to: 0
[junit4:junit4]   2> 930 T2096 oashc.HttpShardHandlerFactory.getParameter Setting maxConnectionsPerHost to: 20
[junit4:junit4]   2> 931 T2096 oashc.HttpShardHandlerFactory.getParameter Setting corePoolSize to: 0
[junit4:junit4]   2> 931 T2096 oashc.HttpShardHandlerFactory.getParameter Setting maximumPoolSize to: 2147483647
[junit4:junit4]   2> 931 T2096 oashc.HttpShardHandlerFactory.getParameter Setting maxThreadIdleTime to: 5
[junit4:junit4]   2> 931 T2096 oashc.HttpShardHandlerFactory.getParameter Setting sizeOfQueue to: -1
[junit4:junit4]   2> 932 T2096 oashc.HttpShardHandlerFactory.getParameter Setting fairnessPolicy to: false
[junit4:junit4]   2> 932 T2096 oascsi.HttpClientUtil.createClient Creating new http client, config:maxConnectionsPerHost=20&maxConnections=10000&socketTimeout=0&connTimeout=0&retry=false
[junit4:junit4]   2> 934 T2126 oasc.SolrCore.registerSearcher [collection1] Registered new searcher Searcher@132beb7 main{StandardDirectoryReader(segments_1:1)}
[junit4:junit4]   2> 934 T2096 oasc.CoreContainer.register registering core: collection1
[junit4:junit4]   2> 934 T2096 oass.SolrDispatchFilter.init user.dir=/mnt/ssd/jenkins/workspace/Lucene-Solr-trunk-Linux/checkout/solr/build/solr-core/test/J1
[junit4:junit4]   2> 935 T2096 oass.SolrDispatchFilter.init SolrDispatchFilter.init() done
[junit4:junit4]   2> 935 T2096 oascsi.HttpClientUtil.createClient Creating new http client, config:maxConnections=128&maxConnectionsPerHost=32&followRedirects=false
[junit4:junit4]   2> 937 T2096 oejs.Server.doStart jetty-8.1.2.v20120308
[junit4:junit4]   2> 938 T2096 oejs.AbstractConnector.doStart Started SocketConnector@0.0.0.0:53398
[junit4:junit4]   2> 938 T2096 oasc.SolrResourceLoader.locateSolrHome JNDI not configured for solr (NoInitialContextEx)
[junit4:junit4]   2> 939 T2096 oasc.SolrResourceLoader.locateSolrHome using system property solr.solr.home: /mnt/ssd/jenkins/workspace/Lucene-Solr-trunk-Linux/checkout/solr/build/solr-core/test-files/solr
[junit4:junit4]   2> 939 T2096 oasc.SolrResourceLoader.<init> new SolrResourceLoader for deduced Solr Home: '/mnt/ssd/jenkins/workspace/Lucene-Solr-trunk-Linux/checkout/solr/build/solr-core/test-files/solr/'
[junit4:junit4]   2> 948 T2096 oass.SolrDispatchFilter.init SolrDispatchFilter.init()
[junit4:junit4]   2> 949 T2096 oasc.SolrResourceLoader.locateSolrHome JNDI not configured for solr (NoInitialContextEx)
[junit4:junit4]   2> 949 T2096 oasc.SolrResourceLoader.locateSolrHome using system property solr.solr.home: /mnt/ssd/jenkins/workspace/Lucene-Solr-trunk-Linux/checkout/solr/build/solr-core/test-files/solr
[junit4:junit4]   2> 949 T2096 oasc.CoreContainer$Initializer.initialize looking for solr.xml: /mnt/ssd/jenkins/workspace/Lucene-Solr-trunk-Linux/checkout/solr/build/solr-core/test-files/solr/solr.xml
[junit4:junit4]   2> 950 T2096 oasc.CoreContainer.<init> New CoreContainer 30258613
[junit4:junit4]   2> 950 T2096 oasc.CoreContainer.load Loading CoreContainer using Solr Home: '/mnt/ssd/jenkins/workspace/Lucene-Solr-trunk-Linux/checkout/solr/build/solr-core/test-files/solr/'
[junit4:junit4]   2> 950 T2096 oasc.SolrResourceLoader.<init> new SolrResourceLoader for directory: '/mnt/ssd/jenkins/workspace/Lucene-Solr-trunk-Linux/checkout/solr/build/solr-core/test-files/solr/'
[junit4:junit4]   2> 959 T2096 oasc.CoreContainer.load Registering Log Listener
[junit4:junit4]   2> 969 T2096 oasc.CoreContainer.create Creating SolrCore 'collection1' using instanceDir: /mnt/ssd/jenkins/workspace/Lucene-Solr-trunk-Linux/checkout/solr/build/solr-core/test-files/solr/collection1
[junit4:junit4]   2> 970 T2096 oasc.SolrResourceLoader.<init> new SolrResourceLoader for directory: '/mnt/ssd/jenkins/workspace/Lucene-Solr-trunk-Linux/checkout/solr/build/solr-core/test-files/solr/collection1/'
[junit4:junit4]   2> 970 T2096 oasc.SolrResourceLoader.replaceClassLoader Adding 'file:/mnt/ssd/jenkins/workspace/Lucene-Solr-trunk-Linux/checkout/solr/build/solr-core/test-files/solr/collection1/lib/README' to classloader
[junit4:junit4]   2> 970 T2096 oasc.SolrResourceLoader.replaceClassLoader Adding 'file:/mnt/ssd/jenkins/workspace/Lucene-Solr-trunk-Linux/checkout/solr/build/solr-core/test-files/solr/collection1/lib/classes/' to classloader
[junit4:junit4]   2> 989 T2096 oasc.SolrConfig.<init> Using Lucene MatchVersion: LUCENE_50
[junit4:junit4]   2> 1018 T2096 oasc.SolrConfig.<init> Loaded SolrConfig: solrconfig-elevate.xml
[junit4:junit4]   2> 1019 T2096 oass.IndexSchema.readSchema Reading Solr Schema
[junit4:junit4]   2> 1022 T2096 oass.IndexSchema.readSchema Schema name=example
[junit4:junit4]   2> 1175 T1205 oaz.ClientCnxn$SendThread.startConnect Opening socket connection to server localhost.localdomain/127.0.0.1:33311
[junit4:junit4]   2> 1175 T1205 oaz.ClientCnxn$SendThread.run WARNING Session 0x138f941981d0010 for server null, unexpected error, closing socket connection and attempting reconnect java.net.ConnectException: Connection refused
[junit4:junit4]   2> 	at sun.nio.ch.SocketChannelImpl.checkConnect(Native Method)
[junit4:junit4]   2> 	at sun.nio.ch.SocketChannelImpl.finishConnect(SocketChannelImpl.java:692)
[junit4:junit4]   2> 	at org.apache.zookeeper.ClientCnxn$SendThread.run(ClientCnxn.java:1143)
[junit4:junit4]   2> 
[junit4:junit4]   2> 1193 T2096 oass.IndexSchema.readSchema default search field in schema is text
[junit4:junit4]   2> 1195 T2096 oass.IndexSchema.readSchema unique key field: id
[junit4:junit4]   2> 1197 T2096 oasc.SolrCore.<init> [collection1] Opening new SolrCore at /mnt/ssd/jenkins/workspace/Lucene-Solr-trunk-Linux/checkout/solr/build/solr-core/test-files/solr/collection1/, dataDir=./org.apache.solr.handler.component.DistributedQueryElevationComponentTest-1344211861192/shard2/data/
[junit4:junit4]   2> 1197 T2096 oasc.JmxMonitoredMap.<init> JMX monitoring is enabled. Adding Solr mbeans to JMX Server: com.sun.jmx.mbeanserver.JmxMBeanServer@1130f01
[junit4:junit4]   2> 1198 T2096 oasc.SolrCore.getNewIndexDir WARNING New index directory detected: old=null new=./org.apache.solr.handler.component.DistributedQueryElevationComponentTest-1344211861192/shard2/data/index/
[junit4:junit4]   2> 1198 T2096 oasc.SolrCore.initIndex WARNING [collection1] Solr index directory './org.apache.solr.handler.component.DistributedQueryElevationComponentTest-1344211861192/shard2/data/index' doesn't exist. Creating new index...
[junit4:junit4]   2> 1199 T2096 oasc.SolrDeletionPolicy.onCommit SolrDeletionPolicy.onCommit: commits:num=1
[junit4:junit4]   2> 		commit{dir=MockDirWrapper(org.apache.lucene.store.RAMDirectory@47dd3a lockFactory=org.apache.lucene.store.SingleInstanceLockFactory@1fab86c),segFN=segments_1,generation=1,filenames=[segments_1]
[junit4:junit4]   2> 1200 T2096 oasc.SolrDeletionPolicy.updateCommits newest commit = 1
[junit4:junit4]   2> 1201 T2096 oasc.RequestHandlers.initHandlersFromConfig created /update: solr.UpdateRequestHandler
[junit4:junit4]   2> 1201 T2096 oasc.RequestHandlers.initHandlersFromConfig created /elevate: org.apache.solr.handler.component.SearchHandler
[junit4:junit4]   2> 1202 T2096 oasc.RequestHandlers.initHandlersFromConfig created /dataElevate: org.apache.solr.handler.component.SearchHandler
[junit4:junit4]   2> 1202 T2096 oashl.XMLLoader.init xsltCacheLifetimeSeconds=60
[junit4:junit4]   2> 1203 T2096 oasc.RequestHandlers.initHandlersFromConfig WARNING no default request handler is registered (either '/select' or 'standard')
[junit4:junit4]   2> 1204 T2096 oasc.SolrCore.initDeprecatedSupport WARNING solrconfig.xml uses deprecated <admin/gettableFiles>, Please update your config to use the ShowFileRequestHandler.
[junit4:junit4]   2> 1205 T2096 oasc.SolrCore.initDeprecatedSupport WARNING adding ShowFileRequestHandler with hidden files: [SOLRCONFIG-DELPOLICY1.XML, HUNSPELL-TEST.AFF, DA_UTF8.XML, TRIVIAL.UPDATEPROCESSOR0.JS, SOLRCONFIG-SIMPLELOCK.XML, SCHEMA-COLLATE.XML, MISSLEADING.EXTENSION.UPDATEPROCESSOR.JS.TXT, SOLRCONFIG-PROPINJECT-INDEXDEFAULT.XML, SCHEMA_CODEC.XML, KEEP-2.TXT, SOLRCONFIG-SPELLCHECKCOMPONENT.XML, PHRASESUGGEST.TXT, BAD-SCHEMA-EXTERNAL-FILEFIELD.XML, SOLRCONFIG-MASTER1.XML, SOLRCONFIG-ELEVATE.XML, SCHEMA-PHRASESUGGEST.XML, COMPOUNDDICTIONARY.TXT, SOLRCONFIG-SCRIPT-UPDATEPROCESSOR.XML, SCHEMA-NUMERIC.XML, SOLRCONFIG-TLOG.XML, CURRENCY.XML, SCHEMA-LMJELINEKMERCER.XML, SOLRCONFIG-NATIVELOCK.XML, BAD-SOLRCONFIG-INVALID-SCRIPTFILE.XML, KEEP-1.TXT, BAD-SCHEMA-NOT-INDEXED-BUT-POS.XML, BAD-SCHEMA-UNIQUEKEY-MULTIVALUED.XML, SOLRCONFIG-PHRASESUGGEST.XML, SCHEMA-FOLDING.XML, SOLRCONFIG-MASTER.XML, SCHEMA-REQUIRED-FIELDS.XML, SOLRCONFIG-SOLCOREPROPERTIES.XML, SCHEMA-IB.XML, SOLRCONFIG-QUERYSENDER.XML, SOLRCONFIG-PROPINJECT.XML, XSLT, BAD-MP-SOLRCONFIG.XML, SOLRCONFIG-REQHANDLER.INCL, BAD-SCHEMA-NOT-INDEXED-BUT-TF.XML, SCHEMA12.XML, DA_COMPOUNDDICTIONARY.TXT, MISSING.FUNCTIONS.UPDATEPROCESSOR.JS, SCHEMA15.XML, FRENCHARTICLES.TXT, SCHEMA-DFR.XML, BAD-SCHEMA-DUP-DYNAMICFIELD.XML, SOLRCONFIG-TRANSFORMERS.XML, SCHEMA-COPYFIELD-TEST.XML, SOLRCONFIG-MERGEPOLICY.XML, STOP-2.TXT, SOLRCONFIG-TERMINDEX.XML, SCHEMA.XML, SOLRCONFIG-ENABLEPLUGIN.XML, BAD-SCHEMA-CODEC-GLOBAL-VS-FT-MISMATCH.XML, SOLRCONFIG-MASTER3.XML, SOLRCONFIG-SOLR-749.XML, SCHEMA-BM25.XML, SCHEMA-NOT-REQUIRED-UNIQUE-KEY.XML, OPEN-EXCHANGE-RATES.JSON, SOLRCONFIG-CACHING.XML, ELEVATE.XML, SOLRCONFIG-MASTER2.XML, SOLRCONFIG-SLAVE1.XML, BAD-SCHEMA-ANALYZER-CLASS-AND-NESTED.XML, STOPTYPES-1.TXT, BAD-SOLRCONFIG-BOGUS-SCRIPTENGINE-NAME.XML, CONDITIONAL.UPDATEPROCESSOR.JS, SCHEMA-STOP-KEEP.XML, SYNONYMS.TXT, OLD_SYNONYMS.TXT, SCHEMA-CHARFILTERS.XML, STOPTYPES-2.TXT, ADDFIELDS.UPDATEPROCESSOR.JS, HUNSPELL-TEST.DIC, BAD-SOLRCONFIG-MISSING-SCRIPTFILE.XML, STOPWITHBOM.TXT, SCHEMA-LUCENEMATCHVERSION.XML, SOLRCONFIG_PERF.XML, BAD-SCHEMA-OMIT-TF-BUT-NOT-POS.XML, SCHEMA-REPLICATION1.XML, SOLRCONFIG-QUERYSENDER-NOQUERY.XML, PROTWORDS.TXT, SOLRCONFIG-DELPOLICY2.XML, SOLRCONFIG-HIGHLIGHT.XML, SOLRCONFIG-REPEATER.XML, SOLRCONFIG-SLAVE.XML, SOLRCONFIG-SPELLCHECKER.XML, SOLRCONFIG-XINCLUDE.XML, SCHEMA-REPLICATION2.XML, SCHEMA-MINIMAL.XML, BAD-SCHEMA-NOT-INDEXED-BUT-NORMS.XML, STOPWORDS.TXT, SOLRCONFIG-ALTDIRECTORY.XML, BAD-SCHEMA-UNIQUEKEY-IS-COPYFIELD-DEST.XML, SCHEMA11.XML, SCHEMA-BINARYFIELD.XML, SCHEMA-SPELLCHECKER.XML, SCHEMA-REVERSED.XML, SOLRCONFIG-FUNCTIONQUERY.XML, BAD-SCHEMA-DUP-FIELDTYPE.XML, SCHEMA-TRIE.XML, STOP-SNOWBALL.TXT, SOLRCONFIG-MASTER1-KEEPONEBACKUP.XML, BAD-SCHEMA-UNIQUEKEY-USES-DEFAULT.XML, HYPHENATION.DTD, SOLRCONFIG-NOCACHE.XML, BAD-SCHEMA-NONTEXT-ANALYZER.XML, BAD-SCHEMA-SIM-GLOBAL-VS-FT-MISMATCH.XML, BAD_SOLRCONFIG.XML, STOPWORDSWRONGENCODING.TXT, WDFTYPES.TXT, SCHEMA-LMDIRICHLET.XML, TRIVIAL.UPDATEPROCESSOR1.JS, SCHEMASURROUND.XML, THROW.ERROR.ON.ADD.UPDATEPROCESSOR.JS, MAPPING-ISOLATIN1ACCENT.TXT, SCHEMA-TFIDF.XML, STOP-1.TXT, SOLRCONFIG_CODEC.XML, SCHEMA-SIM.XML, SOLRCONFIG-BASIC.XML, SOLRCONFIG-UPDATE-PROCESSOR-CHAINS.XML, STEMDICT.TXT, BAD-SCHEMA-DUP-FIELD.XML, SOLRCONFIG-LAZYWRITER.XML]
[junit4:junit4]   2> 1208 T2096 oass.SolrIndexSearcher.<init> Opening Searcher@41d1fc main
[junit4:junit4]   2> 1208 T2096 oass.SolrIndexSearcher.getIndexDir WARNING WARNING: Directory impl does not support setting indexDir: org.apache.lucene.store.MockDirectoryWrapper
[junit4:junit4]   2> 1209 T2096 oasu.CommitTracker.<init> Hard AutoCommit: disabled
[junit4:junit4]   2> 1209 T2096 oasu.CommitTracker.<init> Soft AutoCommit: disabled
[junit4:junit4]   2> 1209 T2096 oashc.QueryElevationComponent.inform Loading QueryElevation from: /mnt/ssd/jenkins/workspace/Lucene-Solr-trunk-Linux/checkout/solr/build/solr-core/test-files/solr/collection1/conf/elevate.xml
[junit4:junit4]   2> 1218 T2096 oashc.QueryElevationComponent.inform Loading QueryElevation from: /mnt/ssd/jenkins/workspace/Lucene-Solr-trunk-Linux/checkout/solr/build/solr-core/test-files/solr/collection1/conf/elevate.xml
[junit4:junit4]   2> 1227 T2096 oashc.HttpShardHandlerFactory.getParameter Setting socketTimeout to: 0
[junit4:junit4]   2> 1228 T2096 oashc.HttpShardHandlerFactory.getParameter Setting urlScheme to: http://
[junit4:junit4]   2> 1228 T2096 oashc.HttpShardHandlerFactory.getParameter Setting connTimeout to: 0
[junit4:junit4]   2> 1228 T2096 oashc.HttpShardHandlerFactory.getParameter Setting maxConnectionsPerHost to: 20
[junit4:junit4]   2> 1229 T2096 oashc.HttpShardHandlerFactory.getParameter Setting corePoolSize to: 0
[junit4:junit4]   2> 1229 T2096 oashc.HttpShardHandlerFactory.getParameter Setting maximumPoolSize to: 2147483647
[junit4:junit4]   2> 1229 T2096 oashc.HttpShardHandlerFactory.getParameter Setting maxThreadIdleTime to: 5
[junit4:junit4]   2> 1230 T2096 oashc.HttpShardHandlerFactory.getParameter Setting sizeOfQueue to: -1
[junit4:junit4]   2> 1230 T2096 oashc.HttpShardHandlerFactory.getParameter Setting fairnessPolicy to: false
[junit4:junit4]   2> 1230 T2096 oascsi.HttpClientUtil.createClient Creating new http client, config:maxConnectionsPerHost=20&maxConnections=10000&socketTimeout=0&connTimeout=0&retry=false
[junit4:junit4]   2> 1234 T2136 oasc.SolrCore.registerSearcher [collection1] Registered new searcher Searcher@41d1fc main{StandardDirectoryReader(segments_1:1)}
[junit4:junit4]   2> 1234 T2096 oasc.CoreContainer.register registering core: collection1
[junit4:junit4]   2> 1234 T2096 oass.SolrDispatchFilter.init user.dir=/mnt/ssd/jenkins/workspace/Lucene-Solr-trunk-Linux/checkout/solr/build/solr-core/test/J1
[junit4:junit4]   2> 1234 T2096 oass.SolrDispatchFilter.init SolrDispatchFilter.init() done
[junit4:junit4]   2> 1235 T2096 oascsi.HttpClientUtil.createClient Creating new http client, config:maxConnections=128&maxConnectionsPerHost=32&followRedirects=false
[junit4:junit4]   2> ASYNC  NEW_CORE C95 name=collection1 org.apache.solr.core.SolrCore@179e555
[junit4:junit4]   2> 1241 T2099 C95 oasu.DirectUpdateHandler2.deleteAll [collection1] REMOVING ALL DOCUMENTS FROM INDEX
[junit4:junit4]   2> 1242 T2099 C95 oasc.SolrDeletionPolicy.onInit SolrDeletionPolicy.onInit: commits:num=1
[junit4:junit4]   2> 		commit{dir=MockDirWrapper(org.apache.lucene.store.RAMDirectory@1bf6fce lockFactory=org.apache.lucene.store.SingleInstanceLockFactory@fafac3),segFN=segments_1,generation=1,filenames=[segments_1]
[junit4:junit4]   2> 1243 T2099 C95 oasc.SolrDeletionPolicy.updateCommits newest commit = 1
[junit4:junit4]   2> 1243 T2099 C95 UPDATE [collection1] webapp=/solr path=/update params={wt=javabin&version=2} {deleteByQuery=*:*} 0 2
[junit4:junit4]   2> ASYNC  NEW_CORE C96 name=collection1 org.apache.solr.core.SolrCore@17f06d0
[junit4:junit4]   2> 1247 T2109 C96 oasu.DirectUpdateHandler2.deleteAll [collection1] REMOVING ALL DOCUMENTS FROM INDEX
[junit4:junit4]   2> 1248 T2109 C96 oasc.SolrDeletionPolicy.onInit SolrDeletionPolicy.onInit: commits:num=1
[junit4:junit4]   2> 		commit{dir=MockDirWrapper(org.apache.lucene.store.RAMDirectory@984cb6 lockFactory=org.apache.lucene.store.SingleInstanceLockFactory@2ea40f),segFN=segments_1,generation=1,filenames=[segments_1]
[junit4:junit4]   2> 1248 T2109 C96 oasc.SolrDeletionPolicy.updateCommits newest commit = 1
[junit4:junit4]   2> 1249 T2109 C96 UPDATE [collection1] webapp=/solr path=/update params={wt=javabin&version=2} {deleteByQuery=*:*} 0 3
[junit4:junit4]   2> ASYNC  NEW_CORE C97 name=collection1 org.apache.solr.core.SolrCore@1a946e3
[junit4:junit4]   2> 1254 T2119 C97 oasu.DirectUpdateHandler2.deleteAll [collection1] REMOVING ALL DOCUMENTS FROM INDEX
[junit4:junit4]   2> 1255 T2119 C97 oasc.SolrDeletionPolicy.onInit SolrDeletionPolicy.onInit: commits:num=1
[junit4:junit4]   2> 		commit{dir=MockDirWrapper(org.apache.lucene.store.RAMDirectory@6d02c2 lockFactory=org.apache.lucene.store.SingleInstanceLockFactory@1ffc843),segFN=segments_1,generation=1,filenames=[segments_1]
[junit4:junit4]   2> 1255 T2119 C97 oasc.SolrDeletionPolicy.updateCommits newest commit = 1
[junit4:junit4]   2> 1256 T2119 C97 UPDATE [collection1] webapp=/solr path=/update params={wt=javabin&version=2} {deleteByQuery=*:*} 0 3
[junit4:junit4]   2> ASYNC  NEW_CORE C98 name=collection1 org.apache.solr.core.SolrCore@99c8b4
[junit4:junit4]   2> 1260 T2129 C98 oasu.DirectUpdateHandler2.deleteAll [collection1] REMOVING ALL DOCUMENTS FROM INDEX
[junit4:junit4]   2> 1261 T2129 C98 oasc.SolrDeletionPolicy.onInit SolrDeletionPolicy.onInit: commits:num=1
[junit4:junit4]   2> 		commit{dir=MockDirWrapper(org.apache.lucene.store.RAMDirectory@47dd3a lockFactory=org.apache.lucene.store.SingleInstanceLockFactory@1fab86c),segFN=segments_1,generation=1,filenames=[segments_1]
[junit4:junit4]   2> 1262 T2129 C98 oasc.SolrDeletionPolicy.updateCommits newest commit = 1
[junit4:junit4]   2> 1262 T2129 C98 UPDATE [collection1] webapp=/solr path=/update params={wt=javabin&version=2} {deleteByQuery=*:*} 0 2
[junit4:junit4]   2> 1265 T2099 C95 UPDATE [collection1] webapp=/solr path=/update params={wt=javabin&version=2} {add=[1]} 0 1
[junit4:junit4]   2> 1267 T2109 C96 UPDATE [collection1] webapp=/solr path=/update params={wt=javabin&version=2} {add=[1]} 0 1
[junit4:junit4]   2> 1269 T2099 C95 UPDATE [collection1] webapp=/solr path=/update params={wt=javabin&version=2} {add=[2]} 0 1
[junit4:junit4]   2> 1271 T2119 C97 UPDATE [collection1] webapp=/solr path=/update params={wt=javabin&version=2} {add=[2]} 0 0
[junit4:junit4]   2> 1273 T2099 C95 UPDATE [collection1] webapp=/solr path=/update params={wt=javabin&version=2} {add=[3]} 0 0
[junit4:junit4]   2> 1275 T2129 C98 UPDATE [collection1] webapp=/solr path=/update params={wt=javabin&version=2} {add=[3]} 0 0
[junit4:junit4]   2> 1279 T2099 C95 UPDATE [collection1] webapp=/solr path=/update params={wt=javabin&version=2} {add=[4]} 0 0
[junit4:junit4]   2> 1280 T2109 C96 UPDATE [collection1] webapp=/solr path=/update params={wt=javabin&version=2} {add=[4]} 0 0
[junit4:junit4]   2> 1282 T2099 C95 UPDATE [collection1] webapp=/solr path=/update params={wt=javabin&version=2} {add=[5]} 0 0
[junit4:junit4]   2> 1284 T2119 C97 UPDATE [collection1] webapp=/solr path=/update params={wt=javabin&version=2} {add=[5]} 0 0
[junit4:junit4]   2> 1285 T2099 C95 UPDATE [collection1] webapp=/solr path=/update params={wt=javabin&version=2} {add=[6]} 0 0
[junit4:junit4]   2> 1287 T2129 C98 UPDATE [collection1] webapp=/solr path=/update params={wt=javabin&version=2} {add=[6]} 0 0
[junit4:junit4]   2> 1289 T2099 C95 UPDATE [collection1] webapp=/solr path=/update params={wt=javabin&version=2} {add=[7]} 0 1
[junit4:junit4]   2> 1290 T2129 C98 UPDATE [collection1] webapp=/solr path=/update params={wt=javabin&version=2} {add=[7]} 0 0
[junit4:junit4]   2> 1292 T2099 C95 oasu.DirectUpdateHandler2.commit start commit{flags=0,_version_=0,optimize=false,openSearcher=true,waitSearcher=true,expungeDeletes=false,softCommit=false}
[junit4:junit4]   2> 1294 T2099 C95 oasc.SolrDeletionPolicy.onCommit SolrDeletionPolicy.onCommit: commits:num=2
[junit4:junit4]   2> 		commit{dir=MockDirWrapper(org.apache.lucene.store.RAMDirectory@1bf6fce lockFactory=org.apache.lucene.store.SingleInstanceLockFactory@fafac3),segFN=segments_1,generation=1,filenames=[segments_1]
[junit4:junit4]   2> 		commit{dir=MockDirWrapper(org.apache.lucene.store.RAMDirectory@1bf6fce lockFactory=org.apache.lucene.store.SingleInstanceLockFactory@fafac3),segFN=segments_2,generation=2,filenames=[_0_MockVariableIntBlock_0.pyl, _0.fnm, _0_nrm.cfs, _0_MockVariableIntBlock_0.pos, _0_MockVariableIntBlock_0.frq, _0_nrm.cfe, segments_2, _0_MockVariableIntBlock_0.skp, _0.fdt, _0_MockVariableIntBlock_0.tib, _0_MockVariableIntBlock_0.doc, _0.fdx, _0.si, _0_MockVariableIntBlock_0.tii, _0_Memory_0.ram]
[junit4:junit4]   2> 1295 T2099 C95 oasc.SolrDeletionPolicy.updateCommits newest commit = 2
[junit4:junit4]   2> 1295 T2099 C95 oass.SolrIndexSearcher.<init> Opening Searcher@9cebda main
[junit4:junit4]   2> 1295 T2099 C95 oass.SolrIndexSearcher.getIndexDir WARNING WARNING: Directory impl does not support setting indexDir: org.apache.lucene.store.MockDirectoryWrapper
[junit4:junit4]   2> 1296 T2099 C95 oasu.DirectUpdateHandler2.commit end_commit_flush
[junit4:junit4]   2> 1296 T2106 oasc.SolrCore.registerSearcher [collection1] Registered new searcher Searcher@9cebda main{StandardDirectoryReader(segments_2:4 _0(5.0):C7)}
[junit4:junit4]   2> 1297 T2099 C95 UPDATE [collection1] webapp=/solr path=/update params={waitSearcher=true&softCommit=false&wt=javabin&version=2&commit=true} {commit=} 0 5
[junit4:junit4]   2> 1298 T2109 C96 oasu.DirectUpdateHandler2.commit start commit{flags=0,_version_=0,optimize=false,openSearcher=true,waitSearcher=true,expungeDeletes=false,softCommit=false}
[junit4:junit4]   2> 1300 T2109 C96 oasc.SolrDeletionPolicy.onCommit SolrDeletionPolicy.onCommit: commits:num=2
[junit4:junit4]   2> 		commit{dir=MockDirWrapper(org.apache.lucene.store.RAMDirectory@984cb6 lockFactory=org.apache.lucene.store.SingleInstanceLockFactory@2ea40f),segFN=segments_1,generation=1,filenames=[segments_1]
[junit4:junit4]   2> 		commit{dir=MockDirWrapper(org.apache.lucene.store.RAMDirectory@984cb6 lockFactory=org.apache.lucene.store.SingleInstanceLockFactory@2ea40f),segFN=segments_2,generation=2,filenames=[_0_MockVariableIntBlock_0.pyl, _0.fnm, _0_nrm.cfs, _0_MockVariableIntBlock_0.pos, _0_MockVariableIntBlock_0.frq, _0_nrm.cfe, segments_2, _0_MockVariableIntBlock_0.skp, _0.fdt, _0_MockVariableIntBlock_0.tib, _0_MockVariableIntBlock_0.doc, _0.fdx, _0.si, _0_MockVariableIntBlock_0.tii, _0_Memory_0.ram]
[junit4:junit4]   2> 1300 T2109 C96 oasc.SolrDeletionPolicy.updateCommits newest commit = 2
[junit4:junit4]   2> 1301 T2109 C96 oass.SolrIndexSearcher.<init> Opening Searcher@16e63d9 main
[junit4:junit4]   2> 1301 T2109 C96 oass.SolrIndexSearcher.getIndexDir WARNING WARNING: Directory impl does not support setting indexDir: org.apache.lucene.store.MockDirectoryWrapper
[junit4:junit4]   2> 1301 T2109 C96 oasu.DirectUpdateHandler2.commit end_commit_flush
[junit4:junit4]   2> 1302 T2116 oasc.SolrCore.registerSearcher [collection1] Registered new searcher Searcher@16e63d9 main{StandardDirectoryReader(segments_2:4 _0(5.0):C2)}
[junit4:junit4]   2> 1302 T2109 C96 UPDATE [collection1] webapp=/solr path=/update params={waitSearcher=true&softCommit=false&wt=javabin&version=2&commit=true} {commit=} 0 4
[junit4:junit4]   2> 1304 T2119 C97 oasu.DirectUpdateHandler2.commit start commit{flags=0,_version_=0,optimize=false,openSearcher=true,waitSearcher=true,expungeDeletes=false,softCommit=false}
[junit4:junit4]   2> 1305 T2119 C97 oasc.SolrDeletionPolicy.onCommit SolrDeletionPolicy.onCommit: commits:num=2
[junit4:junit4]   2> 		commit{dir=MockDirWrapper(org.apache.lucene.store.RAMDirectory@6d02c2 lockFactory=org.apache.lucene.store.SingleInstanceLockFactory@1ffc843),segFN=segments_1,generation=1,filenames=[segments_1]
[junit4:junit4]   2> 		commit{dir=MockDirWrapper(org.apache.lucene.store.RAMDirectory@6d02c2 lockFactory=org.apache.lucene.store.SingleInstanceLockFactory@1ffc843),segFN=segments_2,generation=2,filenames=[_0_MockVariableIntBlock_0.pyl, _0.fnm, _0_nrm.cfs, _0_MockVariableIntBlock_0.pos, _0_MockVariableIntBlock_0.frq, _0_nrm.cfe, segments_2, _0_MockVariableIntBlock_0.skp, _0.fdt, _0_MockVariableIntBlock_0.tib, _0_MockVariableIntBlock_0.doc, _0.fdx, _0.si, _0_MockVariableIntBlock_0.tii, _0_Memory_0.ram]
[junit4:junit4]   2> 1306 T2119 C97 oasc.SolrDeletionPolicy.updateCommits newest commit = 2
[junit4:junit4]   2> 1307 T2119 C97 oass.SolrIndexSearcher.<init> Opening Searcher@9673bf main
[junit4:junit4]   2> 1307 T2119 C97 oass.SolrIndexSearcher.getIndexDir WARNING WARNING: Directory impl does not support setting indexDir: org.apache.lucene.store.MockDirectoryWrapper
[junit4:junit4]   2> 1308 T2126 oasc.SolrCore.registerSearcher [collection1] Registered new searcher Searcher@9673bf main{StandardDirectoryReader(segments_2:4 _0(5.0):C2)}
[junit4:junit4]   2> 1308 T2119 C97 oasu.DirectUpdateHandler2.commit end_commit_flush
[junit4:junit4]   2> 1308 T2119 C97 UPDATE [collection1] webapp=/solr path=/update params={waitSearcher=true&softCommit=false&wt=javabin&version=2&commit=true} {commit=} 0 4
[junit4:junit4]   2> 1310 T2129 C98 oasu.DirectUpdateHandler2.commit start commit{flags=0,_version_=0,optimize=false,openSearcher=true,waitSearcher=true,expungeDeletes=false,softCommit=false}
[junit4:junit4]   2> 1311 T2129 C98 oasc.SolrDeletionPolicy.onCommit SolrDeletionPolicy.onCommit: commits:num=2
[junit4:junit4]   2> 		commit{dir=MockDirWrapper(org.apache.lucene.store.RAMDirectory@47dd3a lockFactory=org.apache.lucene.store.SingleInstanceLockFactory@1fab86c),segFN=segments_1,generation=1,filenames=[segments_1]
[junit4:junit4]   2> 		commit{dir=MockDirWrapper(org.apache.lucene.store.RAMDirectory@47dd3a lockFactory=org.apache.lucene.store.SingleInstanceLockFactory@1fab86c),segFN=segments_2,generation=2,filenames=[_0_MockVariableIntBlock_0.pyl, _0.fnm, _0_nrm.cfs, _0_MockVariableIntBlock_0.pos, _0_MockVariableIntBlock_0.frq, _0_nrm.cfe, segments_2, _0_MockVariableIntBlock_0.skp, _0.fdt, _0_MockVariableIntBlock_0.tib, _0_MockVariableIntBlock_0.doc, _0.fdx, _0.si, _0_MockVariableIntBlock_0.tii, _0_Memory_0.ram]
[junit4:junit4]   2> 1312 T2129 C98 oasc.SolrDeletionPolicy.updateCommits newest commit = 2
[junit4:junit4]   2> 1312 T2129 C98 oass.SolrIndexSearcher.<init> Opening Searcher@8316c7 main
[junit4:junit4]   2> 1312 T2129 C98 oass.SolrIndexSearcher.getIndexDir WARNING WARNING: Directory impl does not support setting indexDir: org.apache.lucene.store.MockDirectoryWrapper
[junit4:junit4]   2> 1313 T2129 C98 oasu.DirectUpdateHandler2.commit end_commit_flush
[junit4:junit4]   2> 1313 T2136 oasc.SolrCore.registerSearcher [collection1] Registered new searcher Searcher@8316c7 main{StandardDirectoryReader(segments_2:4 _0(5.0):C3)}
[junit4:junit4]   2> 1313 T2129 C98 UPDATE [collection1] webapp=/solr path=/update params={waitSearcher=true&softCommit=false&wt=javabin&version=2&commit=true} {commit=} 0 3
[junit4:junit4]   2> 1317 T2099 C95 REQ [collection1] webapp=/solr path=/elevate params={q=*:*&rows=500&distrib=false&wt=javabin&shards.qt=/elevate&qt=/elevate&fl=id,+score,+[elevated]&sort=id+desc&version=2} hits=7 status=0 QTime=2 
[junit4:junit4]   2> 1329 T2110 C96 REQ [collection1] webapp=/solr path=/elevate params={shard.url=localhost:43401/solr|[::1]:33332/solr&distrib=false&wt=javabin&fl=id,score&sort=id+desc&version=2&NOW=1344211862509&fsv=true&rows=500&q=*:*&start=0&shards.qt=/elevate&qt=/elevate&isShard=true} hits=2 status=0 QTime=0 
[junit4:junit4]   2> 1331 T2120 C97 REQ [collection1] webapp=/solr path=/elevate params={shard.url=[::1]:33332/solr|localhost:42206/solr&distrib=false&wt=javabin&fl=id,score&sort=id+desc&version=2&NOW=1344211862509&fsv=true&rows=500&q=*:*&start=0&shards.qt=/elevate&qt=/elevate&isShard=true} hits=2 status=0 QTime=5 
[junit4:junit4]   2> 1331 T2130 C98 REQ [collection1] webapp=/solr path=/elevate params={shard.url=[::1]:33332/solr|localhost:53398/solr&distrib=false&wt=javabin&fl=id,score&sort=id+desc&version=2&NOW=1344211862509&fsv=true&rows=500&q=*:*&start=0&shards.qt=/elevate&qt=/elevate&isShard=true} hits=3 status=0 QTime=0 
[junit4:junit4]   2> 1335 T2110 C96 REQ [collection1] webapp=/solr path=/elevate params={distrib=false&shard.url=localhost:43401/solr|[::1]:33332/solr&wt=javabin&ids=4.0,1.0&fl=id,+score,+[elevated]&version=2&q=*:*&rows=500&NOW=1344211862509&shards.qt=/elevate&qt=/elevate&isShard=true} status=0 QTime=0 
[junit4:junit4]   2> 1335 T2120 C97 REQ [collection1] webapp=/solr path=/elevate params={distrib=false&shard.url=[::1]:33332/solr|localhost:42206/solr&wt=javabin&ids=2.0,5.0&fl=id,+score,+[elevated]&version=2&q=*:*&rows=500&NOW=1344211862509&shards.qt=/elevate&qt=/elevate&isShard=true} status=0 QTime=0 
[junit4:junit4]   2> 1335 T2130 C98 REQ [collection1] webapp=/solr path=/elevate params={distrib=false&shard.url=[::1]:33332/solr|localhost:53398/solr&wt=javabin&ids=6.0,7.0,3.0&fl=id,+score,+[elevated]&version=2&q=*:*&rows=500&NOW=1344211862509&shards.qt=/elevate&qt=/elevate&isShard=true} status=0 QTime=0 
[junit4:junit4]   2> 1336 T2129 C98 REQ [collection1] webapp=/solr path=/elevate params={q=*:*&rows=500&wt=javabin&shards.qt=/elevate&qt=/elevate&fl=id,+score,+[elevated]&sort=id+desc&version=2&shards=localhost:43401/solr|[::1]:33332/solr,[::1]:33332/solr|localhost:42206/solr,[::1]:33332/solr|localhost:53398/solr} status=0 QTime=17 
[junit4:junit4]   2> 1339 T2096 oas.BaseDistributedSearchTestCase.compareResponses SEVERE Mismatched responses:
[junit4:junit4]   2> 	{responseHeader={status=0,QTime=17,params={q=*:*,rows=500,wt=javabin,shards.qt=/elevate,qt=/elevate,fl=id, score, [elevated],sort=id desc,version=2,shards=localhost:43401/solr|[::1]:33332/solr,[::1]:33332/solr|localhost:42206/solr,[::1]:33332/solr|localhost:53398/solr}},response={numFound=7,start=0,maxScore=1.0,docs=[SolrDocument{id=7.0, [elevated]=false, score=1.0}, SolrDocument{id=6.0, [elevated]=false, score=1.0}, SolrDocument{id=5.0, [elevated]=false, score=1.0}, SolrDocument{id=4.0, [elevated]=false, score=1.0}, SolrDocument{id=3.0, [elevated]=false, score=1.0}, SolrDocument{id=2.0, [elevated]=false, score=1.0}, SolrDocument{id=1.0, [elevated]=false, score=1.0}]}}
[junit4:junit4]   2> 	{responseHeader={status=0,QTime=2,params={q=*:*,rows=500,distrib=false,wt=javabin,shards.qt=/elevate,qt=/elevate,fl=id, score, [elevated],sort=id desc,version=2}},response={numFound=7,start=0,maxScore=1.0,docs=[SolrDocument{id=7.0, score=1.0, [elevated]=false}, SolrDocument{id=6.0, score=1.0, [elevated]=false}, SolrDocument{id=5.0, score=1.0, [elevated]=false}, SolrDocument{id=4.0, score=1.0, [elevated]=false}, SolrDocument{id=3.0, score=1.0, [elevated]=false}, SolrDocument{id=2.0, score=1.0, [elevated]=false}, SolrDocument{id=1.0, score=1.0, [elevated]=false}]}}
[junit4:junit4]   2> 1340 T2096 oasc.CoreContainer.shutdown Shutting down CoreContainer instance=24858148
[junit4:junit4]   2> 1341 T2096 oasc.SolrCore.close [collection1]  CLOSING SolrCore org.apache.solr.core.SolrCore@179e555
[junit4:junit4]   2> 1341 T2096 oasc.SolrCore.closeSearcher [collection1] Closing main searcher on request.
[junit4:junit4]   2> 1341 T2096 oasu.DirectUpdateHandler2.close closing DirectUpdateHandler2{commits=1,autocommits=0,soft autocommits=0,optimizes=0,rollbacks=0,expungeDeletes=0,docsPending=0,adds=0,deletesById=0,deletesByQuery=0,errors=0,cumulative_adds=7,cumulative_deletesById=0,cumulative_deletesByQuery=1,cumulative_errors=0}
[junit4:junit4]   2> 1344 T2096 oejsh.ContextHandler.doStop stopped o.e.j.s.ServletContextHandler{/solr,null}
[junit4:junit4]   2> 1396 T2096 oasc.CoreContainer.shutdown Shutting down CoreContainer instance=30254946
[junit4:junit4]   2> 1399 T2096 oasc.SolrCore.close [collection1]  CLOSING SolrCore org.apache.solr.core.SolrCore@17f06d0
[junit4:junit4]   2> 1400 T2096 oasc.SolrCore.closeSearcher [collection1] Closing main searcher on request.
[junit4:junit4]   2> 1400 T2096 oasu.DirectUpdateHandler2.close closing DirectUpdateHandler2{commits=1,autocommits=0,soft autocommits=0,optimizes=0,rollbacks=0,expungeDeletes=0,docsPending=0,adds=0,deletesById=0,deletesByQuery=0,errors=0,cumulative_adds=2,cumulative_deletesById=0,cumulative_deletesByQuery=1,cumulative_errors=0}
[junit4:junit4]   2> 1403 T2096 oejsh.ContextHandler.doStop stopped o.e.j.s.ServletContextHandler{/solr,null}
[junit4:junit4]   2> 1455 T2096 oasc.CoreContainer.shutdown Shutting down CoreContainer instance=9921325
[junit4:junit4]   2> 1455 T2096 oasc.SolrCore.close [collection1]  CLOSING SolrCore org.apache.solr.core.SolrCore@1a946e3
[junit4:junit4]   2> 1456 T2096 oasc.SolrCore.closeSearcher [collection1] Closing main searcher on request.
[junit4:junit4]   2> 1456 T2096 oasu.DirectUpdateHandler2.close closing DirectUpdateHandler2{commits=1,autocommits=0,soft autocommits=0,optimizes=0,rollbacks=0,expungeDeletes=0,docsPending=0,adds=0,deletesById=0,deletesByQuery=0,errors=0,cumulative_adds=2,cumulative_deletesById=0,cumulative_deletesByQuery=1,cumulative_errors=0}
[junit4:junit4]   2> 1461 T2096 oejsh.ContextHandler.doStop stopped o.e.j.s.ServletContextHandler{/solr,null}
[junit4:junit4]   2> 1513 T2096 oasc.CoreContainer.shutdown Shutting down CoreContainer instance=30258613
[junit4:junit4]   2> 1513 T2096 oasc.SolrCore.close [collection1]  CLOSING SolrCore org.apache.solr.core.SolrCore@99c8b4
[junit4:junit4]   2> 1514 T2096 oasc.SolrCore.closeSearcher [collection1] Closing main searcher on request.
[junit4:junit4]   2> 1514 T2096 oasu.DirectUpdateHandler2.close closing DirectUpdateHandler2{commits=1,autocommits=0,soft autocommits=0,optimizes=0,rollbacks=0,expungeDeletes=0,docsPending=0,adds=0,deletesById=0,deletesByQuery=0,errors=0,cumulative_adds=3,cumulative_deletesById=0,cumulative_deletesByQuery=1,cumulative_errors=0}
[junit4:junit4]   2> 1518 T2096 oejsh.ContextHandler.doStop stopped o.e.j.s.ServletContextHandler{/solr,null}
[junit4:junit4]   2> 1570 T2096 oas.SolrTestCaseJ4.tearDown ###Ending testDistribSearch
[junit4:junit4]   2> NOTE: reproduce with: ant test  -Dtestcase=DistributedQueryElevationComponentTest -Dtests.method=testDistribSearch -Dtests.seed=DD9B73BAD491000E -Dtests.multiplier=3 -Dtests.slow=true -Dtests.locale=ar_SD -Dtests.timezone=America/Indiana/Winamac -Dtests.file.encoding=US-ASCII
[junit4:junit4]   2>
[junit4:junit4]    > (@AfterClass output)
[junit4:junit4]   2> 1636 T2096 oas.SolrTestCaseJ4.deleteCore ###deleteCore
[junit4:junit4]   2> NOTE: test params are: codec=Lucene40: {field_t=PostingsFormat(name=Memory doPackFST= true), plow_t=MockVariableIntBlock(baseBlockSize=83), id=MockVariableIntBlock(baseBlockSize=83), text=PostingsFormat(name=Memory doPackFST= true), int_i=PostingsFormat(name=Memory doPackFST= true)}, sim=DefaultSimilarity, locale=ar_SD, timezone=America/Indiana/Winamac
[junit4:junit4]   2> NOTE: Linux 3.2.0-27-generic i386/Oracle Corporation 1.8.0-ea (32-bit)/cpus=8,threads=1,free=338861456,total=536870912
[junit4:junit4]   2> NOTE: All tests run in this JVM: [TestGroupingSearch, TestSuggestSpellingConverter, SystemInfoHandlerTest, TestCoreContainer, TestCSVResponseWriter, CopyFieldTest, ZkCLITest, QueryEqualityTest, ResourceLoaderTest, DirectSolrConnectionTest, DateFieldTest, TestStressRecovery, TestRealTimeGet, TestPseudoReturnFields, TestRTGBase, OpenExchangeRatesOrgProviderTest, TermVectorComponentTest, TestDistributedSearch, ZkControllerTest, OverseerTest, TestCharFilters, TestQuerySenderNoQuery, NoCacheHeaderTest, TestReversedWildcardFilterFactory, RequestHandlersTest, EchoParamsTest, ZkSolrClientTest, TestRangeQuery, TestSolrDeletionPolicy1, DocumentBuilderTest, TestSolrJ, TestJmxIntegration, TestBM25SimilarityFactory, AlternateDirectoryTest, BadIndexSchemaTest, DocumentAnalysisRequestHandlerTest, TestSolrDeletionPolicy2, TestIBSimilarityFactory, SolrInfoMBeanTest, TestLMJelinekMercerSimilarityFactory, CircularListTest, ClusterStateUpdateTest, ZkNodePropsTest, PolyFieldTest, TestNumberUtils, UpdateParamsTest, TestPluginEnable, BinaryUpdateRequestHandlerTest, TestSystemIdResolver, MBeansHandlerTest, TestLuceneMatchVersion, RequiredFieldsTest, URLClassifyProcessorTest, TestCollationField, FullSolrCloudTest, RecoveryZkTest, SpellCheckComponentTest, LeaderElectionIntegrationTest, LeaderElectionTest, SpellCheckCollatorTest, TestExtendedDismaxParser, AutoCommitTest, WordBreakSolrSpellCheckerTest, DistributedTermsComponentTest, StatsComponentTest, TestRecovery, TestJoin, TestIndexSearcher, TestRemoteStreaming, CacheHeaderTest, DistributedQueryElevationComponentTest]
[junit4:junit4]   2> 
[junit4:junit4] Completed on J1 in 1.64s, 1 test, 1 failure <<< FAILURES!

[...truncated 230 lines...]
BUILD FAILED
/mnt/ssd/jenkins/workspace/Lucene-Solr-trunk-Linux/checkout/build.xml:29: The following error occurred while executing this line:
/mnt/ssd/jenkins/workspace/Lucene-Solr-trunk-Linux/checkout/solr/build.xml:144: The following error occurred while executing this line:
/mnt/ssd/jenkins/workspace/Lucene-Solr-trunk-Linux/checkout/lucene/module-build.xml:62: The following error occurred while executing this line:
/mnt/ssd/jenkins/workspace/Lucene-Solr-trunk-Linux/checkout/lucene/common-build.xml:1095: The following error occurred while executing this line:
/mnt/ssd/jenkins/workspace/Lucene-Solr-trunk-Linux/checkout/lucene/common-build.xml:790: There were test failures: 223 suites, 898 tests, 1 failure, 5 ignored

Total time: 19 minutes 51 seconds
Build step 'Execute shell' marked build as failure
Archiving artifacts
Recording test results
Email was triggered for: Failure
Sending email for trigger: Failure



Mime
View raw message