lucene-dev mailing list archives

Site index · List index
Message view « Date » · « Thread »
Top « Date » · « Thread »
From Apache Jenkins Server <jenk...@builds.apache.org>
Subject [JENKINS] Lucene-Solr-tests-only-4.x-java7 - Build # 260 - Failure
Date Tue, 07 Aug 2012 03:31:16 GMT
Build: https://builds.apache.org/job/Lucene-Solr-tests-only-4.x-java7/260/

1 tests failed.
FAILED:  junit.framework.TestSuite.org.apache.solr.handler.TestReplicationHandler

Error Message:
ERROR: SolrIndexSearcher opens=76 closes=75

Stack Trace:
java.lang.AssertionError: ERROR: SolrIndexSearcher opens=76 closes=75
	at __randomizedtesting.SeedInfo.seed([48D5CDE332603C61]:0)
	at org.junit.Assert.fail(Assert.java:93)
	at org.apache.solr.SolrTestCaseJ4.endTrackingSearchers(SolrTestCaseJ4.java:216)
	at org.apache.solr.SolrTestCaseJ4.afterClass(SolrTestCaseJ4.java:82)
	at sun.reflect.NativeMethodAccessorImpl.invoke0(Native Method)
	at sun.reflect.NativeMethodAccessorImpl.invoke(NativeMethodAccessorImpl.java:57)
	at sun.reflect.DelegatingMethodAccessorImpl.invoke(DelegatingMethodAccessorImpl.java:43)
	at java.lang.reflect.Method.invoke(Method.java:601)
	at com.carrotsearch.randomizedtesting.RandomizedRunner.invoke(RandomizedRunner.java:1995)
	at com.carrotsearch.randomizedtesting.RandomizedRunner.access$1100(RandomizedRunner.java:132)
	at com.carrotsearch.randomizedtesting.RandomizedRunner$5.evaluate(RandomizedRunner.java:754)
	at com.carrotsearch.randomizedtesting.rules.SystemPropertiesRestoreRule$1.evaluate(SystemPropertiesRestoreRule.java:53)
	at org.apache.lucene.util.AbstractBeforeAfterRule$1.evaluate(AbstractBeforeAfterRule.java:45)
	at org.apache.lucene.util.TestRuleReportUncaughtExceptions$1.evaluate(TestRuleReportUncaughtExceptions.java:68)
	at org.apache.lucene.util.TestRuleStoreClassName$1.evaluate(TestRuleStoreClassName.java:38)
	at com.carrotsearch.randomizedtesting.rules.SystemPropertiesInvariantRule$1.evaluate(SystemPropertiesInvariantRule.java:55)
	at org.apache.lucene.util.TestRuleNoInstanceHooksOverrides$1.evaluate(TestRuleNoInstanceHooksOverrides.java:53)
	at org.apache.lucene.util.TestRuleNoStaticHooksShadowing$1.evaluate(TestRuleNoStaticHooksShadowing.java:52)
	at org.apache.lucene.util.TestRuleAssertionsRequired$1.evaluate(TestRuleAssertionsRequired.java:36)
	at org.apache.lucene.util.TestRuleMarkFailure$1.evaluate(TestRuleMarkFailure.java:48)
	at org.apache.lucene.util.TestRuleIgnoreAfterMaxFailures$1.evaluate(TestRuleIgnoreAfterMaxFailures.java:70)
	at org.apache.lucene.util.TestRuleIgnoreTestSuites$1.evaluate(TestRuleIgnoreTestSuites.java:55)
	at com.carrotsearch.randomizedtesting.RandomizedRunner.runSuite(RandomizedRunner.java:605)
	at com.carrotsearch.randomizedtesting.RandomizedRunner.access$400(RandomizedRunner.java:132)
	at com.carrotsearch.randomizedtesting.RandomizedRunner$2.run(RandomizedRunner.java:551)




Build Log:
[...truncated 7236 lines...]
[junit4:junit4] Suite: org.apache.solr.handler.TestReplicationHandler
[junit4:junit4]    > (@BeforeClass output)
[junit4:junit4]   2> 7 T46 oejs.Server.doStart jetty-8.1.2.v20120308
[junit4:junit4]   2> 12 T46 oejs.AbstractConnector.doStart Started SocketConnector@0.0.0.0:42529
[junit4:junit4]   2> 13 T46 oasc.SolrResourceLoader.locateSolrHome JNDI not configured
for solr (NoInitialContextEx)
[junit4:junit4]   2> 14 T46 oasc.SolrResourceLoader.locateSolrHome using system property
solr.solr.home: ./org.apache.solr.handler.TestReplicationHandler$SolrInstance-1344309052357/master
[junit4:junit4]   2> 15 T46 oasc.SolrResourceLoader.<init> new SolrResourceLoader
for deduced Solr Home: './org.apache.solr.handler.TestReplicationHandler$SolrInstance-1344309052357/master/'
[junit4:junit4]   2> 49 T46 oass.SolrDispatchFilter.init SolrDispatchFilter.init()
[junit4:junit4]   2> 50 T46 oasc.SolrResourceLoader.locateSolrHome JNDI not configured
for solr (NoInitialContextEx)
[junit4:junit4]   2> 50 T46 oasc.SolrResourceLoader.locateSolrHome using system property
solr.solr.home: ./org.apache.solr.handler.TestReplicationHandler$SolrInstance-1344309052357/master
[junit4:junit4]   2> 51 T46 oasc.CoreContainer$Initializer.initialize looking for solr.xml:
/usr/home/hudson/hudson-slave/workspace/Lucene-Solr-tests-only-4.x-java7/checkout/solr/build/solr-core/test/J1/./org.apache.solr.handler.TestReplicationHandler$SolrInstance-1344309052357/master/solr.xml
[junit4:junit4]   2> 52 T46 oasc.CoreContainer.<init> New CoreContainer 451485183
[junit4:junit4]   2> 52 T46 oasc.CoreContainer$Initializer.initialize no solr.xml file
found - using default
[junit4:junit4]   2> 53 T46 oasc.CoreContainer.load Loading CoreContainer using Solr Home:
'./org.apache.solr.handler.TestReplicationHandler$SolrInstance-1344309052357/master/'
[junit4:junit4]   2> 53 T46 oasc.SolrResourceLoader.<init> new SolrResourceLoader
for directory: './org.apache.solr.handler.TestReplicationHandler$SolrInstance-1344309052357/master/'
[junit4:junit4]   2> 88 T46 oasc.CoreContainer.load Registering Log Listener
[junit4:junit4]   2> 129 T46 oasc.CoreContainer.create Creating SolrCore 'collection1'
using instanceDir: ./org.apache.solr.handler.TestReplicationHandler$SolrInstance-1344309052357/master/collection1
[junit4:junit4]   2> 130 T46 oasc.SolrResourceLoader.<init> new SolrResourceLoader
for directory: './org.apache.solr.handler.TestReplicationHandler$SolrInstance-1344309052357/master/collection1/'
[junit4:junit4]   2> 191 T46 oasc.SolrConfig.<init> Using Lucene MatchVersion: LUCENE_40
[junit4:junit4]   2> 277 T46 oasc.SolrConfig.<init> Loaded SolrConfig: solrconfig.xml
[junit4:junit4]   2> 278 T46 oass.IndexSchema.readSchema Reading Solr Schema
[junit4:junit4]   2> 300 T46 oass.IndexSchema.readSchema Schema name=test
[junit4:junit4]   2> 346 T46 oass.IndexSchema.readSchema unique key field: id
[junit4:junit4]   2> 350 T46 oasc.SolrCore.<init> [collection1] Opening new SolrCore
at ./org.apache.solr.handler.TestReplicationHandler$SolrInstance-1344309052357/master/collection1/,
dataDir=./org.apache.solr.handler.TestReplicationHandler$SolrInstance-1344309052357/master/collection1/data/
[junit4:junit4]   2> 350 T46 oasc.SolrCore.<init> JMX monitoring not detected for
core: collection1
[junit4:junit4]   2> 359 T46 oasc.SolrCore.getNewIndexDir WARNING New index directory detected:
old=null new=./org.apache.solr.handler.TestReplicationHandler$SolrInstance-1344309052357/master/collection1/data/index/
[junit4:junit4]   2> 360 T46 oasc.SolrCore.initIndex WARNING [collection1] Solr index directory
'./org.apache.solr.handler.TestReplicationHandler$SolrInstance-1344309052357/master/collection1/data/index'
doesn't exist. Creating new index...
[junit4:junit4]   2> 404 T46 oasc.SolrDeletionPolicy.onCommit SolrDeletionPolicy.onCommit:
commits:num=1
[junit4:junit4]   2> 		commit{dir=NRTCachingDirectory(org.apache.lucene.store.NIOFSDirectory@/usr/home/hudson/hudson-slave/workspace/Lucene-Solr-tests-only-4.x-java7/checkout/solr/build/solr-core/test/J1/org.apache.solr.handler.TestReplicationHandler$SolrInstance-1344309052357/master/collection1/data/index
lockFactory=org.apache.lucene.store.SingleInstanceLockFactory@22c57d32; maxCacheMB=48.0 maxMergeSizeMB=4.0),segFN=segments_1,generation=1,filenames=[segments_1]
[junit4:junit4]   2> 405 T46 oasc.SolrDeletionPolicy.updateCommits newest commit = 1
[junit4:junit4]   2> 406 T46 oasc.RequestHandlers.initHandlersFromConfig created standard:
solr.StandardRequestHandler
[junit4:junit4]   2> 446 T46 oasc.RequestHandlers.initHandlersFromConfig created /replication:
solr.ReplicationHandler
[junit4:junit4]   2> 447 T46 oasc.RequestHandlers.initHandlersFromConfig created defaults:
solr.StandardRequestHandler
[junit4:junit4]   2> 447 T46 oasc.RequestHandlers.initHandlersFromConfig adding lazy requestHandler:
solr.StandardRequestHandler
[junit4:junit4]   2> 448 T46 oasc.RequestHandlers.initHandlersFromConfig created lazy:
solr.StandardRequestHandler
[junit4:junit4]   2> 448 T46 oasc.RequestHandlers.initHandlersFromConfig created /update:
solr.UpdateRequestHandler
[junit4:junit4]   2> 450 T46 oashl.XMLLoader.init xsltCacheLifetimeSeconds=60
[junit4:junit4]   2> 466 T46 oass.SolrIndexSearcher.<init> Opening Searcher@6d6a8f6d
main
[junit4:junit4]   2> 467 T46 oasu.CommitTracker.<init> Hard AutoCommit: disabled
[junit4:junit4]   2> 467 T46 oasu.CommitTracker.<init> Soft AutoCommit: disabled
[junit4:junit4]   2> 468 T46 oashc.HttpShardHandlerFactory.getParameter Setting socketTimeout
to: 0
[junit4:junit4]   2> 469 T46 oashc.HttpShardHandlerFactory.getParameter Setting urlScheme
to: http://
[junit4:junit4]   2> 469 T46 oashc.HttpShardHandlerFactory.getParameter Setting connTimeout
to: 0
[junit4:junit4]   2> 470 T46 oashc.HttpShardHandlerFactory.getParameter Setting maxConnectionsPerHost
to: 20
[junit4:junit4]   2> 470 T46 oashc.HttpShardHandlerFactory.getParameter Setting corePoolSize
to: 0
[junit4:junit4]   2> 471 T46 oashc.HttpShardHandlerFactory.getParameter Setting maximumPoolSize
to: 2147483647
[junit4:junit4]   2> 471 T46 oashc.HttpShardHandlerFactory.getParameter Setting maxThreadIdleTime
to: 5
[junit4:junit4]   2> 472 T46 oashc.HttpShardHandlerFactory.getParameter Setting sizeOfQueue
to: -1
[junit4:junit4]   2> 472 T46 oashc.HttpShardHandlerFactory.getParameter Setting fairnessPolicy
to: false
[junit4:junit4]   2> 473 T46 oascsi.HttpClientUtil.createClient Creating new http client,
config:maxConnectionsPerHost=20&maxConnections=10000&socketTimeout=0&connTimeout=0&retry=false
[junit4:junit4]   2> 494 T46 oash.ReplicationHandler.inform Replication enabled for following
config files: schema.xml
[junit4:junit4]   2> 496 T46 oash.ReplicationHandler.inform Commits will be reserved for
 10000
[junit4:junit4]   2> 496 T56 oasc.SolrCore.registerSearcher [collection1] Registered new
searcher Searcher@6d6a8f6d main{StandardDirectoryReader(segments_1:1)}
[junit4:junit4]   2> 496 T46 oasc.CoreContainer.register registering core: collection1
[junit4:junit4]   2> 497 T46 oass.SolrDispatchFilter.init user.dir=/usr/home/hudson/hudson-slave/workspace/Lucene-Solr-tests-only-4.x-java7/checkout/solr/build/solr-core/test/J1
[junit4:junit4]   2> 498 T46 oass.SolrDispatchFilter.init SolrDispatchFilter.init() done
[junit4:junit4]   2> 499 T46 oascsi.HttpClientUtil.createClient Creating new http client,
config:maxConnections=128&maxConnectionsPerHost=32&followRedirects=false
[junit4:junit4]   2> 524 T46 oejs.Server.doStart jetty-8.1.2.v20120308
[junit4:junit4]   2> 527 T46 oejs.AbstractConnector.doStart Started SocketConnector@0.0.0.0:39959
[junit4:junit4]   2> 528 T46 oasc.SolrResourceLoader.locateSolrHome JNDI not configured
for solr (NoInitialContextEx)
[junit4:junit4]   2> 529 T46 oasc.SolrResourceLoader.locateSolrHome using system property
solr.solr.home: ./org.apache.solr.handler.TestReplicationHandler$SolrInstance-1344309052872/slave
[junit4:junit4]   2> 529 T46 oasc.SolrResourceLoader.<init> new SolrResourceLoader
for deduced Solr Home: './org.apache.solr.handler.TestReplicationHandler$SolrInstance-1344309052872/slave/'
[junit4:junit4]   2> 557 T46 oass.SolrDispatchFilter.init SolrDispatchFilter.init()
[junit4:junit4]   2> 557 T46 oasc.SolrResourceLoader.locateSolrHome JNDI not configured
for solr (NoInitialContextEx)
[junit4:junit4]   2> 558 T46 oasc.SolrResourceLoader.locateSolrHome using system property
solr.solr.home: ./org.apache.solr.handler.TestReplicationHandler$SolrInstance-1344309052872/slave
[junit4:junit4]   2> 558 T46 oasc.CoreContainer$Initializer.initialize looking for solr.xml:
/usr/home/hudson/hudson-slave/workspace/Lucene-Solr-tests-only-4.x-java7/checkout/solr/build/solr-core/test/J1/./org.apache.solr.handler.TestReplicationHandler$SolrInstance-1344309052872/slave/solr.xml
[junit4:junit4]   2> 559 T46 oasc.CoreContainer.<init> New CoreContainer 2000652295
[junit4:junit4]   2> 559 T46 oasc.CoreContainer$Initializer.initialize no solr.xml file
found - using default
[junit4:junit4]   2> 560 T46 oasc.CoreContainer.load Loading CoreContainer using Solr Home:
'./org.apache.solr.handler.TestReplicationHandler$SolrInstance-1344309052872/slave/'
[junit4:junit4]   2> 561 T46 oasc.SolrResourceLoader.<init> new SolrResourceLoader
for directory: './org.apache.solr.handler.TestReplicationHandler$SolrInstance-1344309052872/slave/'
[junit4:junit4]   2> 584 T46 oasc.CoreContainer.load Registering Log Listener
[junit4:junit4]   2> 615 T46 oasc.CoreContainer.create Creating SolrCore 'collection1'
using instanceDir: ./org.apache.solr.handler.TestReplicationHandler$SolrInstance-1344309052872/slave/collection1
[junit4:junit4]   2> 616 T46 oasc.SolrResourceLoader.<init> new SolrResourceLoader
for directory: './org.apache.solr.handler.TestReplicationHandler$SolrInstance-1344309052872/slave/collection1/'
[junit4:junit4]   2> 674 T46 oasc.SolrConfig.<init> Using Lucene MatchVersion: LUCENE_40
[junit4:junit4]   2> 758 T46 oasc.SolrConfig.<init> Loaded SolrConfig: solrconfig.xml
[junit4:junit4]   2> 758 T46 oass.IndexSchema.readSchema Reading Solr Schema
[junit4:junit4]   2> 764 T46 oass.IndexSchema.readSchema Schema name=test
[junit4:junit4]   2> 791 T46 oass.IndexSchema.readSchema unique key field: id
[junit4:junit4]   2> 794 T46 oasc.SolrCore.<init> [collection1] Opening new SolrCore
at ./org.apache.solr.handler.TestReplicationHandler$SolrInstance-1344309052872/slave/collection1/,
dataDir=./org.apache.solr.handler.TestReplicationHandler$SolrInstance-1344309052872/slave/collection1/data/
[junit4:junit4]   2> 795 T46 oasc.SolrCore.<init> JMX monitoring not detected for
core: collection1
[junit4:junit4]   2> 795 T46 oasc.SolrCore.getNewIndexDir WARNING New index directory detected:
old=null new=./org.apache.solr.handler.TestReplicationHandler$SolrInstance-1344309052872/slave/collection1/data/index/
[junit4:junit4]   2> 796 T46 oasc.SolrCore.initIndex WARNING [collection1] Solr index directory
'./org.apache.solr.handler.TestReplicationHandler$SolrInstance-1344309052872/slave/collection1/data/index'
doesn't exist. Creating new index...
[junit4:junit4]   2> 821 T46 oasc.SolrDeletionPolicy.onCommit SolrDeletionPolicy.onCommit:
commits:num=1
[junit4:junit4]   2> 		commit{dir=NRTCachingDirectory(org.apache.lucene.store.NIOFSDirectory@/usr/home/hudson/hudson-slave/workspace/Lucene-Solr-tests-only-4.x-java7/checkout/solr/build/solr-core/test/J1/org.apache.solr.handler.TestReplicationHandler$SolrInstance-1344309052872/slave/collection1/data/index
lockFactory=org.apache.lucene.store.SingleInstanceLockFactory@23e049d9; maxCacheMB=48.0 maxMergeSizeMB=4.0),segFN=segments_1,generation=1,filenames=[segments_1]
[junit4:junit4]   2> 821 T46 oasc.SolrDeletionPolicy.updateCommits newest commit = 1
[junit4:junit4]   2> 823 T46 oasc.RequestHandlers.initHandlersFromConfig created standard:
solr.StandardRequestHandler
[junit4:junit4]   2> 823 T46 oasc.RequestHandlers.initHandlersFromConfig created defaults:
solr.StandardRequestHandler
[junit4:junit4]   2> 824 T46 oasc.RequestHandlers.initHandlersFromConfig adding lazy requestHandler:
solr.StandardRequestHandler
[junit4:junit4]   2> 824 T46 oasc.RequestHandlers.initHandlersFromConfig created lazy:
solr.StandardRequestHandler
[junit4:junit4]   2> 825 T46 oasc.RequestHandlers.initHandlersFromConfig created /update:
solr.UpdateRequestHandler
[junit4:junit4]   2> 826 T46 oasc.RequestHandlers.initHandlersFromConfig created /replication:
solr.ReplicationHandler
[junit4:junit4]   2> 827 T46 oashl.XMLLoader.init xsltCacheLifetimeSeconds=60
[junit4:junit4]   2> 833 T46 oass.SolrIndexSearcher.<init> Opening Searcher@4485d951
main
[junit4:junit4]   2> 833 T46 oasu.CommitTracker.<init> Hard AutoCommit: disabled
[junit4:junit4]   2> 834 T46 oasu.CommitTracker.<init> Soft AutoCommit: disabled
[junit4:junit4]   2> 835 T46 oashc.HttpShardHandlerFactory.getParameter Setting socketTimeout
to: 0
[junit4:junit4]   2> 835 T46 oashc.HttpShardHandlerFactory.getParameter Setting urlScheme
to: http://
[junit4:junit4]   2> 836 T46 oashc.HttpShardHandlerFactory.getParameter Setting connTimeout
to: 0
[junit4:junit4]   2> 836 T46 oashc.HttpShardHandlerFactory.getParameter Setting maxConnectionsPerHost
to: 20
[junit4:junit4]   2> 837 T46 oashc.HttpShardHandlerFactory.getParameter Setting corePoolSize
to: 0
[junit4:junit4]   2> 837 T46 oashc.HttpShardHandlerFactory.getParameter Setting maximumPoolSize
to: 2147483647
[junit4:junit4]   2> 838 T46 oashc.HttpShardHandlerFactory.getParameter Setting maxThreadIdleTime
to: 5
[junit4:junit4]   2> 838 T46 oashc.HttpShardHandlerFactory.getParameter Setting sizeOfQueue
to: -1
[junit4:junit4]   2> 839 T46 oashc.HttpShardHandlerFactory.getParameter Setting fairnessPolicy
to: false
[junit4:junit4]   2> 839 T46 oascsi.HttpClientUtil.createClient Creating new http client,
config:maxConnectionsPerHost=20&maxConnections=10000&socketTimeout=0&connTimeout=0&retry=false
[junit4:junit4]   2> 854 T46 oascsi.HttpClientUtil.createClient Creating new http client,
config:connTimeout=5000&socketTimeout=20000&allowCompression=false&maxConnections=10000&maxConnectionsPerHost=10000
[junit4:junit4]   2> 876 T46 oash.SnapPuller.startExecutorService Poll Scheduled at an
interval of 1000ms
[junit4:junit4]   2> 876 T66 oasc.SolrCore.registerSearcher [collection1] Registered new
searcher Searcher@4485d951 main{StandardDirectoryReader(segments_1:1)}
[junit4:junit4]   2> 876 T46 oasc.CoreContainer.register registering core: collection1
[junit4:junit4]   2> 877 T46 oass.SolrDispatchFilter.init user.dir=/usr/home/hudson/hudson-slave/workspace/Lucene-Solr-tests-only-4.x-java7/checkout/solr/build/solr-core/test/J1
[junit4:junit4]   2> 878 T46 oass.SolrDispatchFilter.init SolrDispatchFilter.init() done
[junit4:junit4]   2> 878 T46 oascsi.HttpClientUtil.createClient Creating new http client,
config:maxConnections=128&maxConnectionsPerHost=32&followRedirects=false
[junit4:junit4]   2> 
[junit4:junit4]    > (@AfterClass output)
[junit4:junit4]   2> 45627 T46 oasc.CoreContainer.shutdown Shutting down CoreContainer
instance=2101506524
[junit4:junit4]   2> 45627 T46 oasc.SolrCore.close [collection1]  CLOSING SolrCore org.apache.solr.core.SolrCore@4ee93a1b
[junit4:junit4]   2> 45628 T46 oasc.SolrCore.closeSearcher [collection1] Closing main searcher
on request.
[junit4:junit4]   2> 45628 T46 oasu.DirectUpdateHandler2.close closing DirectUpdateHandler2{commits=1,autocommits=0,soft
autocommits=0,optimizes=0,rollbacks=0,expungeDeletes=0,docsPending=0,adds=0,deletesById=0,deletesByQuery=0,errors=0,cumulative_adds=493,cumulative_deletesById=0,cumulative_deletesByQuery=1,cumulative_errors=0}
[junit4:junit4]   2> 45630 T46 oejsh.ContextHandler.doStop stopped o.e.j.s.ServletContextHandler{/solr,null}
[junit4:junit4]   2> 45682 T46 oasc.CoreContainer.shutdown Shutting down CoreContainer
instance=1822011114
[junit4:junit4]   2> 45683 T46 oasc.SolrCore.close [collection1]  CLOSING SolrCore org.apache.solr.core.SolrCore@5c1d6172
[junit4:junit4]   2> 45683 T46 oasc.SolrCore.closeSearcher [collection1] Closing main searcher
on request.
[junit4:junit4]   2> 45684 T46 oasu.DirectUpdateHandler2.close closing DirectUpdateHandler2{commits=2,autocommits=0,soft
autocommits=0,optimizes=0,rollbacks=0,expungeDeletes=0,docsPending=0,adds=0,deletesById=0,deletesByQuery=0,errors=0,cumulative_adds=1,cumulative_deletesById=0,cumulative_deletesByQuery=0,cumulative_errors=0}
[junit4:junit4]   2> 45685 T46 oejsh.ContextHandler.doStop stopped o.e.j.s.ServletContextHandler{/solr,null}
[junit4:junit4]   2> 45787 T46 oas.SolrTestCaseJ4.deleteCore ###deleteCore
[junit4:junit4]   2> 46707 T248 oash.SnapPuller.fetchLatestIndex removing temporary index
download directory ./org.apache.solr.handler.TestReplicationHandler$SolrInstance-1344309052872/slave/collection1/data/index.20120807061134014
[junit4:junit4]   2> 46708 T248 oash.SnapPuller.logReplicationTimeAndConfFiles WARNING
Exception while updating statistics java.io.FileNotFoundException: ./org.apache.solr.handler.TestReplicationHandler$SolrInstance-1344309052872/slave/collection1/data/replication.properties
(No such file or directory)
[junit4:junit4]   2> 	at java.io.FileOutputStream.open(Native Method)
[junit4:junit4]   2> 	at java.io.FileOutputStream.<init>(FileOutputStream.java:212)
[junit4:junit4]   2> 	at java.io.FileOutputStream.<init>(FileOutputStream.java:165)
[junit4:junit4]   2> 	at org.apache.solr.handler.SnapPuller.logReplicationTimeAndConfFiles(SnapPuller.java:481)
[junit4:junit4]   2> 	at org.apache.solr.handler.SnapPuller.fetchLatestIndex(SnapPuller.java:407)
[junit4:junit4]   2> 	at org.apache.solr.handler.ReplicationHandler.doFetch(ReplicationHandler.java:297)
[junit4:junit4]   2> 	at org.apache.solr.handler.SnapPuller$1.run(SnapPuller.java:175)
[junit4:junit4]   2> 	at java.util.concurrent.Executors$RunnableAdapter.call(Executors.java:471)
[junit4:junit4]   2> 	at java.util.concurrent.FutureTask$Sync.innerRunAndReset(FutureTask.java:351)
[junit4:junit4]   2> 	at java.util.concurrent.FutureTask.runAndReset(FutureTask.java:178)
[junit4:junit4]   2> 	at java.util.concurrent.ScheduledThreadPoolExecutor$ScheduledFutureTask.access$301(ScheduledThreadPoolExecutor.java:178)
[junit4:junit4]   2> 	at java.util.concurrent.ScheduledThreadPoolExecutor$ScheduledFutureTask.run(ScheduledThreadPoolExecutor.java:293)
[junit4:junit4]   2> 	at java.util.concurrent.ThreadPoolExecutor.runWorker(ThreadPoolExecutor.java:1110)
[junit4:junit4]   2> 	at java.util.concurrent.ThreadPoolExecutor$Worker.run(ThreadPoolExecutor.java:603)
[junit4:junit4]   2> 	at java.lang.Thread.run(Thread.java:722)
[junit4:junit4]   2> 
[junit4:junit4]   2> 46709 T248 oasc.SolrException.log SEVERE SnapPull failed :org.apache.solr.common.SolrException:
Unable to download _a_nrm.cfs completely. Downloaded 0!=85
[junit4:junit4]   2> 		at org.apache.solr.handler.SnapPuller$FileFetcher.cleanup(SnapPuller.java:1115)
[junit4:junit4]   2> 		at org.apache.solr.handler.SnapPuller$FileFetcher.fetchFile(SnapPuller.java:999)
[junit4:junit4]   2> 		at org.apache.solr.handler.SnapPuller.downloadIndexFiles(SnapPuller.java:627)
[junit4:junit4]   2> 		at org.apache.solr.handler.SnapPuller.fetchLatestIndex(SnapPuller.java:331)
[junit4:junit4]   2> 		at org.apache.solr.handler.ReplicationHandler.doFetch(ReplicationHandler.java:297)
[junit4:junit4]   2> 		at org.apache.solr.handler.SnapPuller$1.run(SnapPuller.java:175)
[junit4:junit4]   2> 		at java.util.concurrent.Executors$RunnableAdapter.call(Executors.java:471)
[junit4:junit4]   2> 		at java.util.concurrent.FutureTask$Sync.innerRunAndReset(FutureTask.java:351)
[junit4:junit4]   2> 		at java.util.concurrent.FutureTask.runAndReset(FutureTask.java:178)
[junit4:junit4]   2> 		at java.util.concurrent.ScheduledThreadPoolExecutor$ScheduledFutureTask.access$301(ScheduledThreadPoolExecutor.java:178)
[junit4:junit4]   2> 		at java.util.concurrent.ScheduledThreadPoolExecutor$ScheduledFutureTask.run(ScheduledThreadPoolExecutor.java:293)
[junit4:junit4]   2> 		at java.util.concurrent.ThreadPoolExecutor.runWorker(ThreadPoolExecutor.java:1110)
[junit4:junit4]   2> 		at java.util.concurrent.ThreadPoolExecutor$Worker.run(ThreadPoolExecutor.java:603)
[junit4:junit4]   2> 		at java.lang.Thread.run(Thread.java:722)
[junit4:junit4]   2> 	
[junit4:junit4]   2> 166908 T46 oas.SolrTestCaseJ4.endTrackingSearchers SEVERE ERROR: SolrIndexSearcher
opens=76 closes=75
[junit4:junit4]   2> NOTE: test params are: codec=Lucene40: {newname=PostingsFormat(name=TestBloomFilteredLucene40Postings),
id=PostingsFormat(name=TestBloomFilteredLucene40Postings), name=PostingsFormat(name=TestBloomFilteredLucene40Postings)},
sim=DefaultSimilarity, locale=el_GR, timezone=Etc/GMT-3
[junit4:junit4]   2> NOTE: FreeBSD 9.0-RELEASE amd64/Oracle Corporation 1.7.0_04 (64-bit)/cpus=16,threads=1,free=211314040,total=242221056
[junit4:junit4]   2> NOTE: All tests run in this JVM: [UUIDFieldTest, TestReversedWildcardFilterFactory,
MultiTermTest, TestJmxMonitoredMap, CoreAdminHandlerTest, TestRemoteStreaming, TestReplicationHandler]
[junit4:junit4]   2> NOTE: reproduce with: ant test  -Dtestcase=TestReplicationHandler
-Dtests.seed=48D5CDE332603C61 -Dtests.multiplier=3 -Dtests.slow=true -Dtests.locale=el_GR
-Dtests.timezone=Etc/GMT-3 -Dtests.file.encoding=US-ASCII
[junit4:junit4]   2> 
[junit4:junit4] ERROR   0.00s J1 | TestReplicationHandler (suite)
[junit4:junit4]    > Throwable #1: java.lang.AssertionError: ERROR: SolrIndexSearcher opens=76
closes=75
[junit4:junit4]    > 	at __randomizedtesting.SeedInfo.seed([48D5CDE332603C61]:0)
[junit4:junit4]    > 	at org.junit.Assert.fail(Assert.java:93)
[junit4:junit4]    > 	at org.apache.solr.SolrTestCaseJ4.endTrackingSearchers(SolrTestCaseJ4.java:216)
[junit4:junit4]    > 	at org.apache.solr.SolrTestCaseJ4.afterClass(SolrTestCaseJ4.java:82)
[junit4:junit4]    > 	at sun.reflect.NativeMethodAccessorImpl.invoke0(Native Method)
[junit4:junit4]    > 	at sun.reflect.NativeMethodAccessorImpl.invoke(NativeMethodAccessorImpl.java:57)
[junit4:junit4]    > 	at sun.reflect.DelegatingMethodAccessorImpl.invoke(DelegatingMethodAccessorImpl.java:43)
[junit4:junit4]    > 	at java.lang.reflect.Method.invoke(Method.java:601)
[junit4:junit4]    > 	at com.carrotsearch.randomizedtesting.RandomizedRunner.invoke(RandomizedRunner.java:1995)
[junit4:junit4]    > 	at com.carrotsearch.randomizedtesting.RandomizedRunner.access$1100(RandomizedRunner.java:132)
[junit4:junit4]    > 	at com.carrotsearch.randomizedtesting.RandomizedRunner$5.evaluate(RandomizedRunner.java:754)
[junit4:junit4]    > 	at com.carrotsearch.randomizedtesting.rules.SystemPropertiesRestoreRule$1.evaluate(SystemPropertiesRestoreRule.java:53)
[junit4:junit4]    > 	at org.apache.lucene.util.AbstractBeforeAfterRule$1.evaluate(AbstractBeforeAfterRule.java:45)
[junit4:junit4]    > 	at org.apache.lucene.util.TestRuleReportUncaughtExceptions$1.evaluate(TestRuleReportUncaughtExceptions.java:68)
[junit4:junit4]    > 	at org.apache.lucene.util.TestRuleStoreClassName$1.evaluate(TestRuleStoreClassName.java:38)
[junit4:junit4]    > 	at com.carrotsearch.randomizedtesting.rules.SystemPropertiesInvariantRule$1.evaluate(SystemPropertiesInvariantRule.java:55)
[junit4:junit4]    > 	at org.apache.lucene.util.TestRuleNoInstanceHooksOverrides$1.evaluate(TestRuleNoInstanceHooksOverrides.java:53)
[junit4:junit4]    > 	at org.apache.lucene.util.TestRuleNoStaticHooksShadowing$1.evaluate(TestRuleNoStaticHooksShadowing.java:52)
[junit4:junit4]    > 	at org.apache.lucene.util.TestRuleAssertionsRequired$1.evaluate(TestRuleAssertionsRequired.java:36)
[junit4:junit4]    > 	at org.apache.lucene.util.TestRuleMarkFailure$1.evaluate(TestRuleMarkFailure.java:48)
[junit4:junit4]    > 	at org.apache.lucene.util.TestRuleIgnoreAfterMaxFailures$1.evaluate(TestRuleIgnoreAfterMaxFailures.java:70)
[junit4:junit4]    > 	at org.apache.lucene.util.TestRuleIgnoreTestSuites$1.evaluate(TestRuleIgnoreTestSuites.java:55)
[junit4:junit4]    > 	at com.carrotsearch.randomizedtesting.RandomizedRunner.runSuite(RandomizedRunner.java:605)
[junit4:junit4]    > 	at com.carrotsearch.randomizedtesting.RandomizedRunner.access$400(RandomizedRunner.java:132)
[junit4:junit4]    > 	at com.carrotsearch.randomizedtesting.RandomizedRunner$2.run(RandomizedRunner.java:551)
[junit4:junit4]    >
[junit4:junit4] Completed on J1 in 166.97s, 1 test, 1 failure <<< FAILURES!

[...truncated 617 lines...]
BUILD FAILED
/usr/home/hudson/hudson-slave/workspace/Lucene-Solr-tests-only-4.x-java7/checkout/build.xml:29:
The following error occurred while executing this line:
/usr/home/hudson/hudson-slave/workspace/Lucene-Solr-tests-only-4.x-java7/checkout/solr/build.xml:144:
The following error occurred while executing this line:
/usr/home/hudson/hudson-slave/workspace/Lucene-Solr-tests-only-4.x-java7/checkout/lucene/module-build.xml:62:
The following error occurred while executing this line:
/usr/home/hudson/hudson-slave/workspace/Lucene-Solr-tests-only-4.x-java7/checkout/lucene/common-build.xml:1095:
The following error occurred while executing this line:
/usr/home/hudson/hudson-slave/workspace/Lucene-Solr-tests-only-4.x-java7/checkout/lucene/common-build.xml:790:
There were test failures: 224 suites, 903 tests, 1 suite-level error, 6 ignored (1 assumption)

Total time: 35 minutes 47 seconds
Build step 'Execute shell' marked build as failure
Archiving artifacts
Recording test results
Email was triggered for: Failure
Sending email for trigger: Failure




Mime
View raw message