lucene-dev mailing list archives

Site index · List index
Message view « Date » · « Thread »
Top « Date » · « Thread »
From Policeman Jenkins Server <jenk...@sd-datasolutions.de>
Subject [JENKINS] Lucene-Solr-4.x-Linux (32bit/jdk1.8.0-ea-b49) - Build # 129 - Still Failing!
Date Fri, 03 Aug 2012 09:31:33 GMT
Build: http://jenkins.sd-datasolutions.de/job/Lucene-Solr-4.x-Linux/129/
Java: 32bit/jdk1.8.0-ea-b49 -server -XX:+UseConcMarkSweepGC

1 tests failed.
FAILED:  org.apache.solr.handler.component.DistributedQueryElevationComponentTest.testDistribSearch

Error Message:
.responseHeader.params.shards.qt:/elevate!=false

Stack Trace:
junit.framework.AssertionFailedError: .responseHeader.params.shards.qt:/elevate!=false
	at __randomizedtesting.SeedInfo.seed([BD049714FEA983F4:3CE2190C89F6E3C8]:0)
	at junit.framework.Assert.fail(Assert.java:50)
	at org.apache.solr.BaseDistributedSearchTestCase.compareResponses(BaseDistributedSearchTestCase.java:670)
	at org.apache.solr.BaseDistributedSearchTestCase.query(BaseDistributedSearchTestCase.java:392)
	at org.apache.solr.handler.component.DistributedQueryElevationComponentTest.doTest(DistributedQueryElevationComponentTest.java:81)
	at org.apache.solr.BaseDistributedSearchTestCase.testDistribSearch(BaseDistributedSearchTestCase.java:679)
	at sun.reflect.NativeMethodAccessorImpl.invoke0(Native Method)
	at sun.reflect.NativeMethodAccessorImpl.invoke(NativeMethodAccessorImpl.java:57)
	at sun.reflect.DelegatingMethodAccessorImpl.invoke(DelegatingMethodAccessorImpl.java:43)
	at java.lang.reflect.Method.invoke(Method.java:474)
	at com.carrotsearch.randomizedtesting.RandomizedRunner.invoke(RandomizedRunner.java:1995)
	at com.carrotsearch.randomizedtesting.RandomizedRunner.access$1100(RandomizedRunner.java:132)
	at com.carrotsearch.randomizedtesting.RandomizedRunner$6.evaluate(RandomizedRunner.java:818)
	at com.carrotsearch.randomizedtesting.RandomizedRunner$7.evaluate(RandomizedRunner.java:877)
	at com.carrotsearch.randomizedtesting.RandomizedRunner$8.evaluate(RandomizedRunner.java:891)
	at com.carrotsearch.randomizedtesting.rules.SystemPropertiesRestoreRule$1.evaluate(SystemPropertiesRestoreRule.java:53)
	at org.apache.lucene.util.TestRuleSetupTeardownChained$1.evaluate(TestRuleSetupTeardownChained.java:50)
	at org.apache.lucene.util.TestRuleFieldCacheSanity$1.evaluate(TestRuleFieldCacheSanity.java:32)
	at org.apache.lucene.util.AbstractBeforeAfterRule$1.evaluate(AbstractBeforeAfterRule.java:45)
	at com.carrotsearch.randomizedtesting.rules.SystemPropertiesInvariantRule$1.evaluate(SystemPropertiesInvariantRule.java:55)
	at org.apache.lucene.util.TestRuleReportUncaughtExceptions$1.evaluate(TestRuleReportUncaughtExceptions.java:68)
	at org.apache.lucene.util.TestRuleThreadAndTestName$1.evaluate(TestRuleThreadAndTestName.java:48)
	at org.apache.lucene.util.TestRuleIgnoreAfterMaxFailures$1.evaluate(TestRuleIgnoreAfterMaxFailures.java:70)
	at org.apache.lucene.util.TestRuleMarkFailure$1.evaluate(TestRuleMarkFailure.java:48)
	at com.carrotsearch.randomizedtesting.RandomizedRunner.runSingleTest(RandomizedRunner.java:825)
	at com.carrotsearch.randomizedtesting.RandomizedRunner.access$700(RandomizedRunner.java:132)
	at com.carrotsearch.randomizedtesting.RandomizedRunner$3$1.run(RandomizedRunner.java:671)
	at com.carrotsearch.randomizedtesting.RandomizedRunner$3.evaluate(RandomizedRunner.java:697)
	at com.carrotsearch.randomizedtesting.RandomizedRunner$4.evaluate(RandomizedRunner.java:736)
	at com.carrotsearch.randomizedtesting.RandomizedRunner$5.evaluate(RandomizedRunner.java:747)
	at com.carrotsearch.randomizedtesting.rules.SystemPropertiesRestoreRule$1.evaluate(SystemPropertiesRestoreRule.java:53)
	at org.apache.lucene.util.AbstractBeforeAfterRule$1.evaluate(AbstractBeforeAfterRule.java:45)
	at org.apache.lucene.util.TestRuleReportUncaughtExceptions$1.evaluate(TestRuleReportUncaughtExceptions.java:68)
	at org.apache.lucene.util.TestRuleStoreClassName$1.evaluate(TestRuleStoreClassName.java:38)
	at com.carrotsearch.randomizedtesting.rules.SystemPropertiesInvariantRule$1.evaluate(SystemPropertiesInvariantRule.java:55)
	at org.apache.lucene.util.TestRuleNoInstanceHooksOverrides$1.evaluate(TestRuleNoInstanceHooksOverrides.java:53)
	at org.apache.lucene.util.TestRuleNoStaticHooksShadowing$1.evaluate(TestRuleNoStaticHooksShadowing.java:52)
	at org.apache.lucene.util.TestRuleAssertionsRequired$1.evaluate(TestRuleAssertionsRequired.java:36)
	at org.apache.lucene.util.TestRuleMarkFailure$1.evaluate(TestRuleMarkFailure.java:48)
	at org.apache.lucene.util.TestRuleIgnoreAfterMaxFailures$1.evaluate(TestRuleIgnoreAfterMaxFailures.java:70)
	at org.apache.lucene.util.TestRuleIgnoreTestSuites$1.evaluate(TestRuleIgnoreTestSuites.java:55)
	at com.carrotsearch.randomizedtesting.RandomizedRunner.runSuite(RandomizedRunner.java:605)
	at com.carrotsearch.randomizedtesting.RandomizedRunner.access$400(RandomizedRunner.java:132)
	at com.carrotsearch.randomizedtesting.RandomizedRunner$2.run(RandomizedRunner.java:551)




Build Log:
[...truncated 7512 lines...]
[junit4:junit4] Suite: org.apache.solr.handler.component.DistributedQueryElevationComponentTest
[junit4:junit4] FAILURE 1.69s J0 | DistributedQueryElevationComponentTest.testDistribSearch
[junit4:junit4]    > Throwable #1: junit.framework.AssertionFailedError: .responseHeader.params.shards.qt:/elevate!=false
[junit4:junit4]    > 	at __randomizedtesting.SeedInfo.seed([BD049714FEA983F4:3CE2190C89F6E3C8]:0)
[junit4:junit4]    > 	at junit.framework.Assert.fail(Assert.java:50)
[junit4:junit4]    > 	at org.apache.solr.BaseDistributedSearchTestCase.compareResponses(BaseDistributedSearchTestCase.java:670)
[junit4:junit4]    > 	at org.apache.solr.BaseDistributedSearchTestCase.query(BaseDistributedSearchTestCase.java:392)
[junit4:junit4]    > 	at org.apache.solr.handler.component.DistributedQueryElevationComponentTest.doTest(DistributedQueryElevationComponentTest.java:81)
[junit4:junit4]    > 	at org.apache.solr.BaseDistributedSearchTestCase.testDistribSearch(BaseDistributedSearchTestCase.java:679)
[junit4:junit4]    > 	at sun.reflect.NativeMethodAccessorImpl.invoke0(Native Method)
[junit4:junit4]    > 	at sun.reflect.NativeMethodAccessorImpl.invoke(NativeMethodAccessorImpl.java:57)
[junit4:junit4]    > 	at sun.reflect.DelegatingMethodAccessorImpl.invoke(DelegatingMethodAccessorImpl.java:43)
[junit4:junit4]    > 	at java.lang.reflect.Method.invoke(Method.java:474)
[junit4:junit4]    > 	at com.carrotsearch.randomizedtesting.RandomizedRunner.invoke(RandomizedRunner.java:1995)
[junit4:junit4]    > 	at com.carrotsearch.randomizedtesting.RandomizedRunner.access$1100(RandomizedRunner.java:132)
[junit4:junit4]    > 	at com.carrotsearch.randomizedtesting.RandomizedRunner$6.evaluate(RandomizedRunner.java:818)
[junit4:junit4]    > 	at com.carrotsearch.randomizedtesting.RandomizedRunner$7.evaluate(RandomizedRunner.java:877)
[junit4:junit4]    > 	at com.carrotsearch.randomizedtesting.RandomizedRunner$8.evaluate(RandomizedRunner.java:891)
[junit4:junit4]    > 	at com.carrotsearch.randomizedtesting.rules.SystemPropertiesRestoreRule$1.evaluate(SystemPropertiesRestoreRule.java:53)
[junit4:junit4]    > 	at org.apache.lucene.util.TestRuleSetupTeardownChained$1.evaluate(TestRuleSetupTeardownChained.java:50)
[junit4:junit4]    > 	at org.apache.lucene.util.TestRuleFieldCacheSanity$1.evaluate(TestRuleFieldCacheSanity.java:32)
[junit4:junit4]    > 	at org.apache.lucene.util.AbstractBeforeAfterRule$1.evaluate(AbstractBeforeAfterRule.java:45)
[junit4:junit4]    > 	at com.carrotsearch.randomizedtesting.rules.SystemPropertiesInvariantRule$1.evaluate(SystemPropertiesInvariantRule.java:55)
[junit4:junit4]    > 	at org.apache.lucene.util.TestRuleReportUncaughtExceptions$1.evaluate(TestRuleReportUncaughtExceptions.java:68)
[junit4:junit4]    > 	at org.apache.lucene.util.TestRuleThreadAndTestName$1.evaluate(TestRuleThreadAndTestName.java:48)
[junit4:junit4]    > 	at org.apache.lucene.util.TestRuleIgnoreAfterMaxFailures$1.evaluate(TestRuleIgnoreAfterMaxFailures.java:70)
[junit4:junit4]    > 	at org.apache.lucene.util.TestRuleMarkFailure$1.evaluate(TestRuleMarkFailure.java:48)
[junit4:junit4]    > 	at com.carrotsearch.randomizedtesting.RandomizedRunner.runSingleTest(RandomizedRunner.java:825)
[junit4:junit4]    > 	at com.carrotsearch.randomizedtesting.RandomizedRunner.access$700(RandomizedRunner.java:132)
[junit4:junit4]    > 	at com.carrotsearch.randomizedtesting.RandomizedRunner$3$1.run(RandomizedRunner.java:671)
[junit4:junit4]    > 	at com.carrotsearch.randomizedtesting.RandomizedRunner$3.evaluate(RandomizedRunner.java:697)
[junit4:junit4]    > 	at com.carrotsearch.randomizedtesting.RandomizedRunner$4.evaluate(RandomizedRunner.java:736)
[junit4:junit4]    > 	at com.carrotsearch.randomizedtesting.RandomizedRunner$5.evaluate(RandomizedRunner.java:747)
[junit4:junit4]    > 	at com.carrotsearch.randomizedtesting.rules.SystemPropertiesRestoreRule$1.evaluate(SystemPropertiesRestoreRule.java:53)
[junit4:junit4]    > 	at org.apache.lucene.util.AbstractBeforeAfterRule$1.evaluate(AbstractBeforeAfterRule.java:45)
[junit4:junit4]    > 	at org.apache.lucene.util.TestRuleReportUncaughtExceptions$1.evaluate(TestRuleReportUncaughtExceptions.java:68)
[junit4:junit4]    > 	at org.apache.lucene.util.TestRuleStoreClassName$1.evaluate(TestRuleStoreClassName.java:38)
[junit4:junit4]    > 	at com.carrotsearch.randomizedtesting.rules.SystemPropertiesInvariantRule$1.evaluate(SystemPropertiesInvariantRule.java:55)
[junit4:junit4]    > 	at org.apache.lucene.util.TestRuleNoInstanceHooksOverrides$1.evaluate(TestRuleNoInstanceHooksOverrides.java:53)
[junit4:junit4]    > 	at org.apache.lucene.util.TestRuleNoStaticHooksShadowing$1.evaluate(TestRuleNoStaticHooksShadowing.java:52)
[junit4:junit4]    > 	at org.apache.lucene.util.TestRuleAssertionsRequired$1.evaluate(TestRuleAssertionsRequired.java:36)
[junit4:junit4]    > 	at org.apache.lucene.util.TestRuleMarkFailure$1.evaluate(TestRuleMarkFailure.java:48)
[junit4:junit4]    > 	at org.apache.lucene.util.TestRuleIgnoreAfterMaxFailures$1.evaluate(TestRuleIgnoreAfterMaxFailures.java:70)
[junit4:junit4]    > 	at org.apache.lucene.util.TestRuleIgnoreTestSuites$1.evaluate(TestRuleIgnoreTestSuites.java:55)
[junit4:junit4]    > 	at com.carrotsearch.randomizedtesting.RandomizedRunner.runSuite(RandomizedRunner.java:605)
[junit4:junit4]    > 	at com.carrotsearch.randomizedtesting.RandomizedRunner.access$400(RandomizedRunner.java:132)
[junit4:junit4]    > 	at com.carrotsearch.randomizedtesting.RandomizedRunner$2.run(RandomizedRunner.java:551)
[junit4:junit4]    > 
[junit4:junit4]   2> 2 T2265 oas.SolrTestCaseJ4.setUp ###Starting testDistribSearch
[junit4:junit4]   2> 2 T2265 oejs.Server.doStart jetty-8.1.2.v20120308
[junit4:junit4]   2> 6 T2265 oejs.AbstractConnector.doStart Started SocketConnector@0.0.0.0:53918
[junit4:junit4]   2> 7 T2265 oasc.SolrResourceLoader.locateSolrHome JNDI not configured for solr (NoInitialContextEx)
[junit4:junit4]   2> 7 T2265 oasc.SolrResourceLoader.locateSolrHome using system property solr.solr.home: /mnt/ssd/jenkins/workspace/Lucene-Solr-4.x-Linux/checkout/solr/build/solr-core/test-files/solr
[junit4:junit4]   2> 7 T2265 oasc.SolrResourceLoader.<init> new SolrResourceLoader for deduced Solr Home: '/mnt/ssd/jenkins/workspace/Lucene-Solr-4.x-Linux/checkout/solr/build/solr-core/test-files/solr/'
[junit4:junit4]   2> 22 T2265 oass.SolrDispatchFilter.init SolrDispatchFilter.init()
[junit4:junit4]   2> 23 T2265 oasc.SolrResourceLoader.locateSolrHome JNDI not configured for solr (NoInitialContextEx)
[junit4:junit4]   2> 23 T2265 oasc.SolrResourceLoader.locateSolrHome using system property solr.solr.home: /mnt/ssd/jenkins/workspace/Lucene-Solr-4.x-Linux/checkout/solr/build/solr-core/test-files/solr
[junit4:junit4]   2> 23 T2265 oasc.CoreContainer$Initializer.initialize looking for solr.xml: /mnt/ssd/jenkins/workspace/Lucene-Solr-4.x-Linux/checkout/solr/build/solr-core/test-files/solr/solr.xml
[junit4:junit4]   2> 23 T2265 oasc.CoreContainer.<init> New CoreContainer 29175641
[junit4:junit4]   2> 23 T2265 oasc.CoreContainer.load Loading CoreContainer using Solr Home: '/mnt/ssd/jenkins/workspace/Lucene-Solr-4.x-Linux/checkout/solr/build/solr-core/test-files/solr/'
[junit4:junit4]   2> 24 T2265 oasc.SolrResourceLoader.<init> new SolrResourceLoader for directory: '/mnt/ssd/jenkins/workspace/Lucene-Solr-4.x-Linux/checkout/solr/build/solr-core/test-files/solr/'
[junit4:junit4]   2> 33 T2265 oasc.CoreContainer.load Registering Log Listener
[junit4:junit4]   2> 62 T2265 oasc.CoreContainer.create Creating SolrCore 'collection1' using instanceDir: /mnt/ssd/jenkins/workspace/Lucene-Solr-4.x-Linux/checkout/solr/build/solr-core/test-files/solr/collection1
[junit4:junit4]   2> 62 T2265 oasc.SolrResourceLoader.<init> new SolrResourceLoader for directory: '/mnt/ssd/jenkins/workspace/Lucene-Solr-4.x-Linux/checkout/solr/build/solr-core/test-files/solr/collection1/'
[junit4:junit4]   2> 63 T2265 oasc.SolrResourceLoader.replaceClassLoader Adding 'file:/mnt/ssd/jenkins/workspace/Lucene-Solr-4.x-Linux/checkout/solr/build/solr-core/test-files/solr/collection1/lib/README' to classloader
[junit4:junit4]   2> 63 T2265 oasc.SolrResourceLoader.replaceClassLoader Adding 'file:/mnt/ssd/jenkins/workspace/Lucene-Solr-4.x-Linux/checkout/solr/build/solr-core/test-files/solr/collection1/lib/classes/' to classloader
[junit4:junit4]   2> 111 T2265 oasc.SolrConfig.<init> Using Lucene MatchVersion: LUCENE_40
[junit4:junit4]   2> 147 T2265 oasc.SolrConfig.<init> Loaded SolrConfig: solrconfig-elevate.xml
[junit4:junit4]   2> 148 T2265 oass.IndexSchema.readSchema Reading Solr Schema
[junit4:junit4]   2> 150 T2265 oass.IndexSchema.readSchema Schema name=example
[junit4:junit4]   2> 333 T2265 oass.IndexSchema.readSchema default search field in schema is text
[junit4:junit4]   2> 335 T2265 oass.IndexSchema.readSchema unique key field: id
[junit4:junit4]   2> 337 T2265 oasc.SolrCore.<init> [collection1] Opening new SolrCore at /mnt/ssd/jenkins/workspace/Lucene-Solr-4.x-Linux/checkout/solr/build/solr-core/test-files/solr/collection1/, dataDir=./org.apache.solr.handler.component.DistributedQueryElevationComponentTest-1343986239251/control/data/
[junit4:junit4]   2> 337 T2265 oasc.JmxMonitoredMap.<init> JMX monitoring is enabled. Adding Solr mbeans to JMX Server: com.sun.jmx.mbeanserver.JmxMBeanServer@6d043e
[junit4:junit4]   2> 338 T2265 oasc.SolrCore.getNewIndexDir WARNING New index directory detected: old=null new=./org.apache.solr.handler.component.DistributedQueryElevationComponentTest-1343986239251/control/data/index/
[junit4:junit4]   2> 338 T2265 oasc.SolrCore.initIndex WARNING [collection1] Solr index directory './org.apache.solr.handler.component.DistributedQueryElevationComponentTest-1343986239251/control/data/index' doesn't exist. Creating new index...
[junit4:junit4]   2> 339 T2265 oasc.SolrDeletionPolicy.onCommit SolrDeletionPolicy.onCommit: commits:num=1
[junit4:junit4]   2> 		commit{dir=MockDirWrapper(org.apache.lucene.store.RAMDirectory@164a121 lockFactory=org.apache.lucene.store.SingleInstanceLockFactory@1caea58),segFN=segments_1,generation=1,filenames=[segments_1]
[junit4:junit4]   2> 339 T2265 oasc.SolrDeletionPolicy.updateCommits newest commit = 1
[junit4:junit4]   2> 340 T2265 oasc.RequestHandlers.initHandlersFromConfig created /update: solr.UpdateRequestHandler
[junit4:junit4]   2> 341 T2265 oasc.RequestHandlers.initHandlersFromConfig created /elevate: org.apache.solr.handler.component.SearchHandler
[junit4:junit4]   2> 341 T2265 oasc.RequestHandlers.initHandlersFromConfig created /dataElevate: org.apache.solr.handler.component.SearchHandler
[junit4:junit4]   2> 342 T2265 oashl.XMLLoader.init xsltCacheLifetimeSeconds=60
[junit4:junit4]   2> 342 T2265 oasc.RequestHandlers.initHandlersFromConfig WARNING no default request handler is registered (either '/select' or 'standard')
[junit4:junit4]   2> 343 T2265 oasc.SolrCore.initDeprecatedSupport WARNING solrconfig.xml uses deprecated <admin/gettableFiles>, Please update your config to use the ShowFileRequestHandler.
[junit4:junit4]   2> 344 T2265 oasc.SolrCore.initDeprecatedSupport WARNING adding ShowFileRequestHandler with hidden files: [MAPPING-ISOLATIN1ACCENT.TXT, SCHEMA15.XML, COMPOUNDDICTIONARY.TXT, SCHEMASURROUND.XML, SOLRCONFIG-XINCLUDE.XML, BAD-SCHEMA-UNIQUEKEY-MULTIVALUED.XML, STOPTYPES-2.TXT, BAD-SCHEMA-DUP-DYNAMICFIELD.XML, SOLRCONFIG-HIGHLIGHT.XML, BAD-SCHEMA-NOT-INDEXED-BUT-NORMS.XML, SCHEMA-COPYFIELD-TEST.XML, TRIVIAL.UPDATEPROCESSOR0.JS, SCHEMA-REVERSED.XML, SCHEMA-NUMERIC.XML, HUNSPELL-TEST.AFF, SCHEMA-TRIE.XML, SCHEMA-SPELLCHECKER.XML, KEEP-1.TXT, SCHEMA-BINARYFIELD.XML, SOLRCONFIG-DELPOLICY1.XML, SCHEMA-STOP-KEEP.XML, SCHEMA-LMJELINEKMERCER.XML, TRIVIAL.UPDATEPROCESSOR1.JS, BAD-SCHEMA-NOT-INDEXED-BUT-TF.XML, SOLRCONFIG-CACHING.XML, SCHEMA-SIM.XML, SOLRCONFIG-MERGEPOLICY.XML, SOLRCONFIG_CODEC.XML, SOLRCONFIG_PERF.XML, SCHEMA-PHRASESUGGEST.XML, SOLRCONFIG-SPELLCHECKER.XML, PROTWORDS.TXT, SOLRCONFIG-NATIVELOCK.XML, SCHEMA.XML, SOLRCONFIG-MASTER2.XML, SOLRCONFIG-ENABLEPLUGIN.XML, SOLRCONFIG-MASTER1.XML, SCHEMA-NOT-REQUIRED-UNIQUE-KEY.XML, SCHEMA12.XML, CURRENCY.XML, STOP-2.TXT, STOPWITHBOM.TXT, SCHEMA-REPLICATION2.XML, SCHEMA-BM25.XML, SCHEMA-COLLATE.XML, BAD-SCHEMA-DUP-FIELDTYPE.XML, SOLRCONFIG-BASIC-LUCENEVERSION31.XML, HUNSPELL-TEST.DIC, ELEVATE.XML, SOLRCONFIG-TERMINDEX.XML, BAD-SOLRCONFIG-MISSING-SCRIPTFILE.XML, SOLRCONFIG-PHRASESUGGEST.XML, SCHEMA-TFIDF.XML, SOLRCONFIG-UPDATE-PROCESSOR-CHAINS.XML, STOPWORDSWRONGENCODING.TXT, SCHEMA_CODEC.XML, STEMDICT.TXT, SOLRCONFIG-QUERYSENDER-NOQUERY.XML, MISSING.FUNCTIONS.UPDATEPROCESSOR.JS, SOLRCONFIG-SLAVE.XML, SOLRCONFIG-REQHANDLER.INCL, SOLRCONFIG-SOLCOREPROPERTIES.XML, OLD_SYNONYMS.TXT, BAD-SCHEMA-DUP-FIELD.XML, STOP-1.TXT, SCHEMA-LMDIRICHLET.XML, OPEN-EXCHANGE-RATES.JSON, MISSLEADING.EXTENSION.UPDATEPROCESSOR.JS.TXT, SOLRCONFIG-TRANSFORMERS.XML, BAD-SCHEMA-UNIQUEKEY-IS-COPYFIELD-DEST.XML, SCHEMA-REQUIRED-FIELDS.XML, BAD-SCHEMA-OMIT-TF-BUT-NOT-POS.XML, BAD-SCHEMA-CODEC-GLOBAL-VS-FT-MISMATCH.XML, BAD-SCHEMA-SIM-GLOBAL-VS-FT-MISMATCH.XML, STOPWORDS.TXT, STOPTYPES-1.TXT, STOP-SNOWBALL.TXT, SCHEMA-MINIMAL.XML, SCHEMA-CHARFILTERS.XML, SOLRCONFIG-BASIC.XML, BAD-SOLRCONFIG-INVALID-SCRIPTFILE.XML, SOLRCONFIG-LAZYWRITER.XML, PHRASESUGGEST.TXT, SOLRCONFIG-ALTDIRECTORY.XML, SOLRCONFIG-SLAVE1.XML, HYPHENATION.DTD, BAD-SCHEMA-ANALYZER-CLASS-AND-NESTED.XML, SCHEMA-REPLICATION1.XML, SOLRCONFIG-REPEATER.XML, SYNONYMS.TXT, SOLRCONFIG-PROPINJECT.XML, DA_COMPOUNDDICTIONARY.TXT, SOLRCONFIG-MASTER.XML, THROW.ERROR.ON.ADD.UPDATEPROCESSOR.JS, SOLRCONFIG-ELEVATE.XML, BAD-MP-SOLRCONFIG.XML, SCHEMA11.XML, SOLRCONFIG-SPELLCHECKCOMPONENT.XML, SCHEMA-FOLDING.XML, DA_UTF8.XML, BAD-SCHEMA-NOT-INDEXED-BUT-POS.XML, SOLRCONFIG-NOCACHE.XML, WDFTYPES.TXT, FRENCHARTICLES.TXT, ADDFIELDS.UPDATEPROCESSOR.JS, SOLRCONFIG-QUERYSENDER.XML, BAD-SOLRCONFIG-BOGUS-SCRIPTENGINE-NAME.XML, BAD-SCHEMA-NONTEXT-ANALYZER.XML, SOLRCONFIG-PROPINJECT-INDEXDEFAULT.XML, SOLRCONFIG-MASTER3.XML, SOLRCONFIG-SIMPLELOCK.XML, SCHEMA-IB.XML, CONDITIONAL.UPDATEPROCESSOR.JS, SCHEMA-DFR.XML, SCHEMA-COLLATEFILTER.XML, SOLRCONFIG-SCRIPT-UPDATEPROCESSOR.XML, SOLRCONFIG-MASTER1-KEEPONEBACKUP.XML, KEEP-2.TXT, SCHEMA-LUCENEMATCHVERSION.XML, BAD-SCHEMA-UNIQUEKEY-USES-DEFAULT.XML, SOLRCONFIG-FUNCTIONQUERY.XML, BAD_SOLRCONFIG.XML, BAD-SCHEMA-EXTERNAL-FILEFIELD.XML, SOLRCONFIG-SOLR-749.XML, SOLRCONFIG-TLOG.XML, XSLT, SOLRCONFIG-DELPOLICY2.XML]
[junit4:junit4]   2> 347 T2265 oass.SolrIndexSearcher.<init> Opening Searcher@4be280 main
[junit4:junit4]   2> 347 T2265 oass.SolrIndexSearcher.getIndexDir WARNING WARNING: Directory impl does not support setting indexDir: org.apache.lucene.store.MockDirectoryWrapper
[junit4:junit4]   2> 348 T2265 oasu.CommitTracker.<init> Hard AutoCommit: disabled
[junit4:junit4]   2> 348 T2265 oasu.CommitTracker.<init> Soft AutoCommit: disabled
[junit4:junit4]   2> 348 T2265 oashc.QueryElevationComponent.inform Loading QueryElevation from: /mnt/ssd/jenkins/workspace/Lucene-Solr-4.x-Linux/checkout/solr/build/solr-core/test-files/solr/collection1/conf/elevate.xml
[junit4:junit4]   2> 355 T2265 oashc.QueryElevationComponent.inform Loading QueryElevation from: /mnt/ssd/jenkins/workspace/Lucene-Solr-4.x-Linux/checkout/solr/build/solr-core/test-files/solr/collection1/conf/elevate.xml
[junit4:junit4]   2> 362 T2265 oashc.HttpShardHandlerFactory.getParameter Setting socketTimeout to: 0
[junit4:junit4]   2> 362 T2265 oashc.HttpShardHandlerFactory.getParameter Setting urlScheme to: http://
[junit4:junit4]   2> 363 T2265 oashc.HttpShardHandlerFactory.getParameter Setting connTimeout to: 0
[junit4:junit4]   2> 363 T2265 oashc.HttpShardHandlerFactory.getParameter Setting maxConnectionsPerHost to: 20
[junit4:junit4]   2> 363 T2265 oashc.HttpShardHandlerFactory.getParameter Setting corePoolSize to: 0
[junit4:junit4]   2> 363 T2265 oashc.HttpShardHandlerFactory.getParameter Setting maximumPoolSize to: 2147483647
[junit4:junit4]   2> 364 T2265 oashc.HttpShardHandlerFactory.getParameter Setting maxThreadIdleTime to: 5
[junit4:junit4]   2> 364 T2265 oashc.HttpShardHandlerFactory.getParameter Setting sizeOfQueue to: -1
[junit4:junit4]   2> 364 T2265 oashc.HttpShardHandlerFactory.getParameter Setting fairnessPolicy to: false
[junit4:junit4]   2> 365 T2265 oascsi.HttpClientUtil.createClient Creating new http client, config:maxConnectionsPerHost=20&maxConnections=10000&socketTimeout=0&connTimeout=0&retry=false
[junit4:junit4]   2> 368 T2275 oasc.SolrCore.registerSearcher [collection1] Registered new searcher Searcher@4be280 main{StandardDirectoryReader(segments_1:1)}
[junit4:junit4]   2> 368 T2265 oasc.CoreContainer.register registering core: collection1
[junit4:junit4]   2> 368 T2265 oass.SolrDispatchFilter.init user.dir=/mnt/ssd/jenkins/workspace/Lucene-Solr-4.x-Linux/checkout/solr/build/solr-core/test/J0
[junit4:junit4]   2> 369 T2265 oass.SolrDispatchFilter.init SolrDispatchFilter.init() done
[junit4:junit4]   2> 369 T2265 oascsi.HttpClientUtil.createClient Creating new http client, config:maxConnections=128&maxConnectionsPerHost=32&followRedirects=false
[junit4:junit4]   2> 371 T2265 oejs.Server.doStart jetty-8.1.2.v20120308
[junit4:junit4]   2> 373 T2265 oejs.AbstractConnector.doStart Started SocketConnector@0.0.0.0:54474
[junit4:junit4]   2> 373 T2265 oasc.SolrResourceLoader.locateSolrHome JNDI not configured for solr (NoInitialContextEx)
[junit4:junit4]   2> 373 T2265 oasc.SolrResourceLoader.locateSolrHome using system property solr.solr.home: /mnt/ssd/jenkins/workspace/Lucene-Solr-4.x-Linux/checkout/solr/build/solr-core/test-files/solr
[junit4:junit4]   2> 374 T2265 oasc.SolrResourceLoader.<init> new SolrResourceLoader for deduced Solr Home: '/mnt/ssd/jenkins/workspace/Lucene-Solr-4.x-Linux/checkout/solr/build/solr-core/test-files/solr/'
[junit4:junit4]   2> 388 T2265 oass.SolrDispatchFilter.init SolrDispatchFilter.init()
[junit4:junit4]   2> 388 T2265 oasc.SolrResourceLoader.locateSolrHome JNDI not configured for solr (NoInitialContextEx)
[junit4:junit4]   2> 388 T2265 oasc.SolrResourceLoader.locateSolrHome using system property solr.solr.home: /mnt/ssd/jenkins/workspace/Lucene-Solr-4.x-Linux/checkout/solr/build/solr-core/test-files/solr
[junit4:junit4]   2> 389 T2265 oasc.CoreContainer$Initializer.initialize looking for solr.xml: /mnt/ssd/jenkins/workspace/Lucene-Solr-4.x-Linux/checkout/solr/build/solr-core/test-files/solr/solr.xml
[junit4:junit4]   2> 389 T2265 oasc.CoreContainer.<init> New CoreContainer 10213813
[junit4:junit4]   2> 389 T2265 oasc.CoreContainer.load Loading CoreContainer using Solr Home: '/mnt/ssd/jenkins/workspace/Lucene-Solr-4.x-Linux/checkout/solr/build/solr-core/test-files/solr/'
[junit4:junit4]   2> 389 T2265 oasc.SolrResourceLoader.<init> new SolrResourceLoader for directory: '/mnt/ssd/jenkins/workspace/Lucene-Solr-4.x-Linux/checkout/solr/build/solr-core/test-files/solr/'
[junit4:junit4]   2> 398 T2265 oasc.CoreContainer.load Registering Log Listener
[junit4:junit4]   2> 407 T2265 oasc.CoreContainer.create Creating SolrCore 'collection1' using instanceDir: /mnt/ssd/jenkins/workspace/Lucene-Solr-4.x-Linux/checkout/solr/build/solr-core/test-files/solr/collection1
[junit4:junit4]   2> 407 T2265 oasc.SolrResourceLoader.<init> new SolrResourceLoader for directory: '/mnt/ssd/jenkins/workspace/Lucene-Solr-4.x-Linux/checkout/solr/build/solr-core/test-files/solr/collection1/'
[junit4:junit4]   2> 408 T2265 oasc.SolrResourceLoader.replaceClassLoader Adding 'file:/mnt/ssd/jenkins/workspace/Lucene-Solr-4.x-Linux/checkout/solr/build/solr-core/test-files/solr/collection1/lib/README' to classloader
[junit4:junit4]   2> 408 T2265 oasc.SolrResourceLoader.replaceClassLoader Adding 'file:/mnt/ssd/jenkins/workspace/Lucene-Solr-4.x-Linux/checkout/solr/build/solr-core/test-files/solr/collection1/lib/classes/' to classloader
[junit4:junit4]   2> 438 T2265 oasc.SolrConfig.<init> Using Lucene MatchVersion: LUCENE_40
[junit4:junit4]   2> 484 T2265 oasc.SolrConfig.<init> Loaded SolrConfig: solrconfig-elevate.xml
[junit4:junit4]   2> 484 T2265 oass.IndexSchema.readSchema Reading Solr Schema
[junit4:junit4]   2> 493 T2265 oass.IndexSchema.readSchema Schema name=example
[junit4:junit4]   2> 650 T2265 oass.IndexSchema.readSchema default search field in schema is text
[junit4:junit4]   2> 651 T2265 oass.IndexSchema.readSchema unique key field: id
[junit4:junit4]   2> 653 T2265 oasc.SolrCore.<init> [collection1] Opening new SolrCore at /mnt/ssd/jenkins/workspace/Lucene-Solr-4.x-Linux/checkout/solr/build/solr-core/test-files/solr/collection1/, dataDir=./org.apache.solr.handler.component.DistributedQueryElevationComponentTest-1343986239251/shard0/data/
[junit4:junit4]   2> 653 T2265 oasc.JmxMonitoredMap.<init> JMX monitoring is enabled. Adding Solr mbeans to JMX Server: com.sun.jmx.mbeanserver.JmxMBeanServer@6d043e
[junit4:junit4]   2> 654 T2265 oasc.SolrCore.getNewIndexDir WARNING New index directory detected: old=null new=./org.apache.solr.handler.component.DistributedQueryElevationComponentTest-1343986239251/shard0/data/index/
[junit4:junit4]   2> 654 T2265 oasc.SolrCore.initIndex WARNING [collection1] Solr index directory './org.apache.solr.handler.component.DistributedQueryElevationComponentTest-1343986239251/shard0/data/index' doesn't exist. Creating new index...
[junit4:junit4]   2> 655 T2265 oasc.SolrDeletionPolicy.onCommit SolrDeletionPolicy.onCommit: commits:num=1
[junit4:junit4]   2> 		commit{dir=MockDirWrapper(org.apache.lucene.store.RAMDirectory@10eb6ba lockFactory=org.apache.lucene.store.SingleInstanceLockFactory@1ebf535),segFN=segments_1,generation=1,filenames=[segments_1]
[junit4:junit4]   2> 655 T2265 oasc.SolrDeletionPolicy.updateCommits newest commit = 1
[junit4:junit4]   2> 656 T2265 oasc.RequestHandlers.initHandlersFromConfig created /update: solr.UpdateRequestHandler
[junit4:junit4]   2> 656 T2265 oasc.RequestHandlers.initHandlersFromConfig created /elevate: org.apache.solr.handler.component.SearchHandler
[junit4:junit4]   2> 656 T2265 oasc.RequestHandlers.initHandlersFromConfig created /dataElevate: org.apache.solr.handler.component.SearchHandler
[junit4:junit4]   2> 657 T2265 oashl.XMLLoader.init xsltCacheLifetimeSeconds=60
[junit4:junit4]   2> 657 T2265 oasc.RequestHandlers.initHandlersFromConfig WARNING no default request handler is registered (either '/select' or 'standard')
[junit4:junit4]   2> 658 T2265 oasc.SolrCore.initDeprecatedSupport WARNING solrconfig.xml uses deprecated <admin/gettableFiles>, Please update your config to use the ShowFileRequestHandler.
[junit4:junit4]   2> 659 T2265 oasc.SolrCore.initDeprecatedSupport WARNING adding ShowFileRequestHandler with hidden files: [MAPPING-ISOLATIN1ACCENT.TXT, SCHEMA15.XML, COMPOUNDDICTIONARY.TXT, SCHEMASURROUND.XML, SOLRCONFIG-XINCLUDE.XML, BAD-SCHEMA-UNIQUEKEY-MULTIVALUED.XML, STOPTYPES-2.TXT, BAD-SCHEMA-DUP-DYNAMICFIELD.XML, SOLRCONFIG-HIGHLIGHT.XML, BAD-SCHEMA-NOT-INDEXED-BUT-NORMS.XML, SCHEMA-COPYFIELD-TEST.XML, TRIVIAL.UPDATEPROCESSOR0.JS, SCHEMA-REVERSED.XML, SCHEMA-NUMERIC.XML, HUNSPELL-TEST.AFF, SCHEMA-TRIE.XML, SCHEMA-SPELLCHECKER.XML, KEEP-1.TXT, SCHEMA-BINARYFIELD.XML, SOLRCONFIG-DELPOLICY1.XML, SCHEMA-STOP-KEEP.XML, SCHEMA-LMJELINEKMERCER.XML, TRIVIAL.UPDATEPROCESSOR1.JS, BAD-SCHEMA-NOT-INDEXED-BUT-TF.XML, SOLRCONFIG-CACHING.XML, SCHEMA-SIM.XML, SOLRCONFIG-MERGEPOLICY.XML, SOLRCONFIG_CODEC.XML, SOLRCONFIG_PERF.XML, SCHEMA-PHRASESUGGEST.XML, SOLRCONFIG-SPELLCHECKER.XML, PROTWORDS.TXT, SOLRCONFIG-NATIVELOCK.XML, SCHEMA.XML, SOLRCONFIG-MASTER2.XML, SOLRCONFIG-ENABLEPLUGIN.XML, SOLRCONFIG-MASTER1.XML, SCHEMA-NOT-REQUIRED-UNIQUE-KEY.XML, SCHEMA12.XML, CURRENCY.XML, STOP-2.TXT, STOPWITHBOM.TXT, SCHEMA-REPLICATION2.XML, SCHEMA-BM25.XML, SCHEMA-COLLATE.XML, BAD-SCHEMA-DUP-FIELDTYPE.XML, SOLRCONFIG-BASIC-LUCENEVERSION31.XML, HUNSPELL-TEST.DIC, ELEVATE.XML, SOLRCONFIG-TERMINDEX.XML, BAD-SOLRCONFIG-MISSING-SCRIPTFILE.XML, SOLRCONFIG-PHRASESUGGEST.XML, SCHEMA-TFIDF.XML, SOLRCONFIG-UPDATE-PROCESSOR-CHAINS.XML, STOPWORDSWRONGENCODING.TXT, SCHEMA_CODEC.XML, STEMDICT.TXT, SOLRCONFIG-QUERYSENDER-NOQUERY.XML, MISSING.FUNCTIONS.UPDATEPROCESSOR.JS, SOLRCONFIG-SLAVE.XML, SOLRCONFIG-REQHANDLER.INCL, SOLRCONFIG-SOLCOREPROPERTIES.XML, OLD_SYNONYMS.TXT, BAD-SCHEMA-DUP-FIELD.XML, STOP-1.TXT, SCHEMA-LMDIRICHLET.XML, OPEN-EXCHANGE-RATES.JSON, MISSLEADING.EXTENSION.UPDATEPROCESSOR.JS.TXT, SOLRCONFIG-TRANSFORMERS.XML, BAD-SCHEMA-UNIQUEKEY-IS-COPYFIELD-DEST.XML, SCHEMA-REQUIRED-FIELDS.XML, BAD-SCHEMA-OMIT-TF-BUT-NOT-POS.XML, BAD-SCHEMA-CODEC-GLOBAL-VS-FT-MISMATCH.XML, BAD-SCHEMA-SIM-GLOBAL-VS-FT-MISMATCH.XML, STOPWORDS.TXT, STOPTYPES-1.TXT, STOP-SNOWBALL.TXT, SCHEMA-MINIMAL.XML, SCHEMA-CHARFILTERS.XML, SOLRCONFIG-BASIC.XML, BAD-SOLRCONFIG-INVALID-SCRIPTFILE.XML, SOLRCONFIG-LAZYWRITER.XML, PHRASESUGGEST.TXT, SOLRCONFIG-ALTDIRECTORY.XML, SOLRCONFIG-SLAVE1.XML, HYPHENATION.DTD, BAD-SCHEMA-ANALYZER-CLASS-AND-NESTED.XML, SCHEMA-REPLICATION1.XML, SOLRCONFIG-REPEATER.XML, SYNONYMS.TXT, SOLRCONFIG-PROPINJECT.XML, DA_COMPOUNDDICTIONARY.TXT, SOLRCONFIG-MASTER.XML, THROW.ERROR.ON.ADD.UPDATEPROCESSOR.JS, SOLRCONFIG-ELEVATE.XML, BAD-MP-SOLRCONFIG.XML, SCHEMA11.XML, SOLRCONFIG-SPELLCHECKCOMPONENT.XML, SCHEMA-FOLDING.XML, DA_UTF8.XML, BAD-SCHEMA-NOT-INDEXED-BUT-POS.XML, SOLRCONFIG-NOCACHE.XML, WDFTYPES.TXT, FRENCHARTICLES.TXT, ADDFIELDS.UPDATEPROCESSOR.JS, SOLRCONFIG-QUERYSENDER.XML, BAD-SOLRCONFIG-BOGUS-SCRIPTENGINE-NAME.XML, BAD-SCHEMA-NONTEXT-ANALYZER.XML, SOLRCONFIG-PROPINJECT-INDEXDEFAULT.XML, SOLRCONFIG-MASTER3.XML, SOLRCONFIG-SIMPLELOCK.XML, SCHEMA-IB.XML, CONDITIONAL.UPDATEPROCESSOR.JS, SCHEMA-DFR.XML, SCHEMA-COLLATEFILTER.XML, SOLRCONFIG-SCRIPT-UPDATEPROCESSOR.XML, SOLRCONFIG-MASTER1-KEEPONEBACKUP.XML, KEEP-2.TXT, SCHEMA-LUCENEMATCHVERSION.XML, BAD-SCHEMA-UNIQUEKEY-USES-DEFAULT.XML, SOLRCONFIG-FUNCTIONQUERY.XML, BAD_SOLRCONFIG.XML, BAD-SCHEMA-EXTERNAL-FILEFIELD.XML, SOLRCONFIG-SOLR-749.XML, SOLRCONFIG-TLOG.XML, XSLT, SOLRCONFIG-DELPOLICY2.XML]
[junit4:junit4]   2> 660 T2265 oass.SolrIndexSearcher.<init> Opening Searcher@28db9c main
[junit4:junit4]   2> 660 T2265 oass.SolrIndexSearcher.getIndexDir WARNING WARNING: Directory impl does not support setting indexDir: org.apache.lucene.store.MockDirectoryWrapper
[junit4:junit4]   2> 661 T2265 oasu.CommitTracker.<init> Hard AutoCommit: disabled
[junit4:junit4]   2> 661 T2265 oasu.CommitTracker.<init> Soft AutoCommit: disabled
[junit4:junit4]   2> 661 T2265 oashc.QueryElevationComponent.inform Loading QueryElevation from: /mnt/ssd/jenkins/workspace/Lucene-Solr-4.x-Linux/checkout/solr/build/solr-core/test-files/solr/collection1/conf/elevate.xml
[junit4:junit4]   2> 666 T2265 oashc.QueryElevationComponent.inform Loading QueryElevation from: /mnt/ssd/jenkins/workspace/Lucene-Solr-4.x-Linux/checkout/solr/build/solr-core/test-files/solr/collection1/conf/elevate.xml
[junit4:junit4]   2> 680 T2265 oashc.HttpShardHandlerFactory.getParameter Setting socketTimeout to: 0
[junit4:junit4]   2> 681 T2265 oashc.HttpShardHandlerFactory.getParameter Setting urlScheme to: http://
[junit4:junit4]   2> 681 T2265 oashc.HttpShardHandlerFactory.getParameter Setting connTimeout to: 0
[junit4:junit4]   2> 681 T2265 oashc.HttpShardHandlerFactory.getParameter Setting maxConnectionsPerHost to: 20
[junit4:junit4]   2> 681 T2265 oashc.HttpShardHandlerFactory.getParameter Setting corePoolSize to: 0
[junit4:junit4]   2> 681 T2265 oashc.HttpShardHandlerFactory.getParameter Setting maximumPoolSize to: 2147483647
[junit4:junit4]   2> 682 T2265 oashc.HttpShardHandlerFactory.getParameter Setting maxThreadIdleTime to: 5
[junit4:junit4]   2> 682 T2265 oashc.HttpShardHandlerFactory.getParameter Setting sizeOfQueue to: -1
[junit4:junit4]   2> 682 T2265 oashc.HttpShardHandlerFactory.getParameter Setting fairnessPolicy to: false
[junit4:junit4]   2> 682 T2265 oascsi.HttpClientUtil.createClient Creating new http client, config:maxConnectionsPerHost=20&maxConnections=10000&socketTimeout=0&connTimeout=0&retry=false
[junit4:junit4]   2> 685 T2285 oasc.SolrCore.registerSearcher [collection1] Registered new searcher Searcher@28db9c main{StandardDirectoryReader(segments_1:1)}
[junit4:junit4]   2> 685 T2265 oasc.CoreContainer.register registering core: collection1
[junit4:junit4]   2> 685 T2265 oass.SolrDispatchFilter.init user.dir=/mnt/ssd/jenkins/workspace/Lucene-Solr-4.x-Linux/checkout/solr/build/solr-core/test/J0
[junit4:junit4]   2> 686 T2265 oass.SolrDispatchFilter.init SolrDispatchFilter.init() done
[junit4:junit4]   2> 686 T2265 oascsi.HttpClientUtil.createClient Creating new http client, config:maxConnections=128&maxConnectionsPerHost=32&followRedirects=false
[junit4:junit4]   2> 688 T2265 oejs.Server.doStart jetty-8.1.2.v20120308
[junit4:junit4]   2> 690 T2265 oejs.AbstractConnector.doStart Started SocketConnector@0.0.0.0:54611
[junit4:junit4]   2> 691 T2265 oasc.SolrResourceLoader.locateSolrHome JNDI not configured for solr (NoInitialContextEx)
[junit4:junit4]   2> 691 T2265 oasc.SolrResourceLoader.locateSolrHome using system property solr.solr.home: /mnt/ssd/jenkins/workspace/Lucene-Solr-4.x-Linux/checkout/solr/build/solr-core/test-files/solr
[junit4:junit4]   2> 691 T2265 oasc.SolrResourceLoader.<init> new SolrResourceLoader for deduced Solr Home: '/mnt/ssd/jenkins/workspace/Lucene-Solr-4.x-Linux/checkout/solr/build/solr-core/test-files/solr/'
[junit4:junit4]   2> 701 T2265 oass.SolrDispatchFilter.init SolrDispatchFilter.init()
[junit4:junit4]   2> 702 T2265 oasc.SolrResourceLoader.locateSolrHome JNDI not configured for solr (NoInitialContextEx)
[junit4:junit4]   2> 702 T2265 oasc.SolrResourceLoader.locateSolrHome using system property solr.solr.home: /mnt/ssd/jenkins/workspace/Lucene-Solr-4.x-Linux/checkout/solr/build/solr-core/test-files/solr
[junit4:junit4]   2> 702 T2265 oasc.CoreContainer$Initializer.initialize looking for solr.xml: /mnt/ssd/jenkins/workspace/Lucene-Solr-4.x-Linux/checkout/solr/build/solr-core/test-files/solr/solr.xml
[junit4:junit4]   2> 703 T2265 oasc.CoreContainer.<init> New CoreContainer 9335157
[junit4:junit4]   2> 703 T2265 oasc.CoreContainer.load Loading CoreContainer using Solr Home: '/mnt/ssd/jenkins/workspace/Lucene-Solr-4.x-Linux/checkout/solr/build/solr-core/test-files/solr/'
[junit4:junit4]   2> 703 T2265 oasc.SolrResourceLoader.<init> new SolrResourceLoader for directory: '/mnt/ssd/jenkins/workspace/Lucene-Solr-4.x-Linux/checkout/solr/build/solr-core/test-files/solr/'
[junit4:junit4]   2> 713 T2265 oasc.CoreContainer.load Registering Log Listener
[junit4:junit4]   2> 734 T2265 oasc.CoreContainer.create Creating SolrCore 'collection1' using instanceDir: /mnt/ssd/jenkins/workspace/Lucene-Solr-4.x-Linux/checkout/solr/build/solr-core/test-files/solr/collection1
[junit4:junit4]   2> 734 T2265 oasc.SolrResourceLoader.<init> new SolrResourceLoader for directory: '/mnt/ssd/jenkins/workspace/Lucene-Solr-4.x-Linux/checkout/solr/build/solr-core/test-files/solr/collection1/'
[junit4:junit4]   2> 735 T2265 oasc.SolrResourceLoader.replaceClassLoader Adding 'file:/mnt/ssd/jenkins/workspace/Lucene-Solr-4.x-Linux/checkout/solr/build/solr-core/test-files/solr/collection1/lib/README' to classloader
[junit4:junit4]   2> 735 T2265 oasc.SolrResourceLoader.replaceClassLoader Adding 'file:/mnt/ssd/jenkins/workspace/Lucene-Solr-4.x-Linux/checkout/solr/build/solr-core/test-files/solr/collection1/lib/classes/' to classloader
[junit4:junit4]   2> 759 T2265 oasc.SolrConfig.<init> Using Lucene MatchVersion: LUCENE_40
[junit4:junit4]   2> 806 T2265 oasc.SolrConfig.<init> Loaded SolrConfig: solrconfig-elevate.xml
[junit4:junit4]   2> 806 T2265 oass.IndexSchema.readSchema Reading Solr Schema
[junit4:junit4]   2> 808 T2265 oass.IndexSchema.readSchema Schema name=example
[junit4:junit4]   2> 959 T2265 oass.IndexSchema.readSchema default search field in schema is text
[junit4:junit4]   2> 961 T2265 oass.IndexSchema.readSchema unique key field: id
[junit4:junit4]   2> 963 T2265 oasc.SolrCore.<init> [collection1] Opening new SolrCore at /mnt/ssd/jenkins/workspace/Lucene-Solr-4.x-Linux/checkout/solr/build/solr-core/test-files/solr/collection1/, dataDir=./org.apache.solr.handler.component.DistributedQueryElevationComponentTest-1343986239251/shard1/data/
[junit4:junit4]   2> 963 T2265 oasc.JmxMonitoredMap.<init> JMX monitoring is enabled. Adding Solr mbeans to JMX Server: com.sun.jmx.mbeanserver.JmxMBeanServer@6d043e
[junit4:junit4]   2> 963 T2265 oasc.SolrCore.getNewIndexDir WARNING New index directory detected: old=null new=./org.apache.solr.handler.component.DistributedQueryElevationComponentTest-1343986239251/shard1/data/index/
[junit4:junit4]   2> 964 T2265 oasc.SolrCore.initIndex WARNING [collection1] Solr index directory './org.apache.solr.handler.component.DistributedQueryElevationComponentTest-1343986239251/shard1/data/index' doesn't exist. Creating new index...
[junit4:junit4]   2> 964 T2265 oasc.SolrDeletionPolicy.onCommit SolrDeletionPolicy.onCommit: commits:num=1
[junit4:junit4]   2> 		commit{dir=BaseDirectoryWrapper(org.apache.lucene.store.RAMDirectory@a46e05 lockFactory=org.apache.lucene.store.SingleInstanceLockFactory@1330eb1),segFN=segments_1,generation=1,filenames=[segments_1]
[junit4:junit4]   2> 965 T2265 oasc.SolrDeletionPolicy.updateCommits newest commit = 1
[junit4:junit4]   2> 966 T2265 oasc.RequestHandlers.initHandlersFromConfig created /update: solr.UpdateRequestHandler
[junit4:junit4]   2> 966 T2265 oasc.RequestHandlers.initHandlersFromConfig created /elevate: org.apache.solr.handler.component.SearchHandler
[junit4:junit4]   2> 966 T2265 oasc.RequestHandlers.initHandlersFromConfig created /dataElevate: org.apache.solr.handler.component.SearchHandler
[junit4:junit4]   2> 966 T2265 oashl.XMLLoader.init xsltCacheLifetimeSeconds=60
[junit4:junit4]   2> 967 T2265 oasc.RequestHandlers.initHandlersFromConfig WARNING no default request handler is registered (either '/select' or 'standard')
[junit4:junit4]   2> 968 T2265 oasc.SolrCore.initDeprecatedSupport WARNING solrconfig.xml uses deprecated <admin/gettableFiles>, Please update your config to use the ShowFileRequestHandler.
[junit4:junit4]   2> 978 T2265 oasc.SolrCore.initDeprecatedSupport WARNING adding ShowFileRequestHandler with hidden files: [MAPPING-ISOLATIN1ACCENT.TXT, SCHEMA15.XML, COMPOUNDDICTIONARY.TXT, SCHEMASURROUND.XML, SOLRCONFIG-XINCLUDE.XML, BAD-SCHEMA-UNIQUEKEY-MULTIVALUED.XML, STOPTYPES-2.TXT, BAD-SCHEMA-DUP-DYNAMICFIELD.XML, SOLRCONFIG-HIGHLIGHT.XML, BAD-SCHEMA-NOT-INDEXED-BUT-NORMS.XML, SCHEMA-COPYFIELD-TEST.XML, TRIVIAL.UPDATEPROCESSOR0.JS, SCHEMA-REVERSED.XML, SCHEMA-NUMERIC.XML, HUNSPELL-TEST.AFF, SCHEMA-TRIE.XML, SCHEMA-SPELLCHECKER.XML, KEEP-1.TXT, SCHEMA-BINARYFIELD.XML, SOLRCONFIG-DELPOLICY1.XML, SCHEMA-STOP-KEEP.XML, SCHEMA-LMJELINEKMERCER.XML, TRIVIAL.UPDATEPROCESSOR1.JS, BAD-SCHEMA-NOT-INDEXED-BUT-TF.XML, SOLRCONFIG-CACHING.XML, SCHEMA-SIM.XML, SOLRCONFIG-MERGEPOLICY.XML, SOLRCONFIG_CODEC.XML, SOLRCONFIG_PERF.XML, SCHEMA-PHRASESUGGEST.XML, SOLRCONFIG-SPELLCHECKER.XML, PROTWORDS.TXT, SOLRCONFIG-NATIVELOCK.XML, SCHEMA.XML, SOLRCONFIG-MASTER2.XML, SOLRCONFIG-ENABLEPLUGIN.XML, SOLRCONFIG-MASTER1.XML, SCHEMA-NOT-REQUIRED-UNIQUE-KEY.XML, SCHEMA12.XML, CURRENCY.XML, STOP-2.TXT, STOPWITHBOM.TXT, SCHEMA-REPLICATION2.XML, SCHEMA-BM25.XML, SCHEMA-COLLATE.XML, BAD-SCHEMA-DUP-FIELDTYPE.XML, SOLRCONFIG-BASIC-LUCENEVERSION31.XML, HUNSPELL-TEST.DIC, ELEVATE.XML, SOLRCONFIG-TERMINDEX.XML, BAD-SOLRCONFIG-MISSING-SCRIPTFILE.XML, SOLRCONFIG-PHRASESUGGEST.XML, SCHEMA-TFIDF.XML, SOLRCONFIG-UPDATE-PROCESSOR-CHAINS.XML, STOPWORDSWRONGENCODING.TXT, SCHEMA_CODEC.XML, STEMDICT.TXT, SOLRCONFIG-QUERYSENDER-NOQUERY.XML, MISSING.FUNCTIONS.UPDATEPROCESSOR.JS, SOLRCONFIG-SLAVE.XML, SOLRCONFIG-REQHANDLER.INCL, SOLRCONFIG-SOLCOREPROPERTIES.XML, OLD_SYNONYMS.TXT, BAD-SCHEMA-DUP-FIELD.XML, STOP-1.TXT, SCHEMA-LMDIRICHLET.XML, OPEN-EXCHANGE-RATES.JSON, MISSLEADING.EXTENSION.UPDATEPROCESSOR.JS.TXT, SOLRCONFIG-TRANSFORMERS.XML, BAD-SCHEMA-UNIQUEKEY-IS-COPYFIELD-DEST.XML, SCHEMA-REQUIRED-FIELDS.XML, BAD-SCHEMA-OMIT-TF-BUT-NOT-POS.XML, BAD-SCHEMA-CODEC-GLOBAL-VS-FT-MISMATCH.XML, BAD-SCHEMA-SIM-GLOBAL-VS-FT-MISMATCH.XML, STOPWORDS.TXT, STOPTYPES-1.TXT, STOP-SNOWBALL.TXT, SCHEMA-MINIMAL.XML, SCHEMA-CHARFILTERS.XML, SOLRCONFIG-BASIC.XML, BAD-SOLRCONFIG-INVALID-SCRIPTFILE.XML, SOLRCONFIG-LAZYWRITER.XML, PHRASESUGGEST.TXT, SOLRCONFIG-ALTDIRECTORY.XML, SOLRCONFIG-SLAVE1.XML, HYPHENATION.DTD, BAD-SCHEMA-ANALYZER-CLASS-AND-NESTED.XML, SCHEMA-REPLICATION1.XML, SOLRCONFIG-REPEATER.XML, SYNONYMS.TXT, SOLRCONFIG-PROPINJECT.XML, DA_COMPOUNDDICTIONARY.TXT, SOLRCONFIG-MASTER.XML, THROW.ERROR.ON.ADD.UPDATEPROCESSOR.JS, SOLRCONFIG-ELEVATE.XML, BAD-MP-SOLRCONFIG.XML, SCHEMA11.XML, SOLRCONFIG-SPELLCHECKCOMPONENT.XML, SCHEMA-FOLDING.XML, DA_UTF8.XML, BAD-SCHEMA-NOT-INDEXED-BUT-POS.XML, SOLRCONFIG-NOCACHE.XML, WDFTYPES.TXT, FRENCHARTICLES.TXT, ADDFIELDS.UPDATEPROCESSOR.JS, SOLRCONFIG-QUERYSENDER.XML, BAD-SOLRCONFIG-BOGUS-SCRIPTENGINE-NAME.XML, BAD-SCHEMA-NONTEXT-ANALYZER.XML, SOLRCONFIG-PROPINJECT-INDEXDEFAULT.XML, SOLRCONFIG-MASTER3.XML, SOLRCONFIG-SIMPLELOCK.XML, SCHEMA-IB.XML, CONDITIONAL.UPDATEPROCESSOR.JS, SCHEMA-DFR.XML, SCHEMA-COLLATEFILTER.XML, SOLRCONFIG-SCRIPT-UPDATEPROCESSOR.XML, SOLRCONFIG-MASTER1-KEEPONEBACKUP.XML, KEEP-2.TXT, SCHEMA-LUCENEMATCHVERSION.XML, BAD-SCHEMA-UNIQUEKEY-USES-DEFAULT.XML, SOLRCONFIG-FUNCTIONQUERY.XML, BAD_SOLRCONFIG.XML, BAD-SCHEMA-EXTERNAL-FILEFIELD.XML, SOLRCONFIG-SOLR-749.XML, SOLRCONFIG-TLOG.XML, XSLT, SOLRCONFIG-DELPOLICY2.XML]
[junit4:junit4]   2> 980 T2265 oass.SolrIndexSearcher.<init> Opening Searcher@a7f890 main
[junit4:junit4]   2> 980 T2265 oass.SolrIndexSearcher.getIndexDir WARNING WARNING: Directory impl does not support setting indexDir: org.apache.lucene.store.BaseDirectoryWrapper
[junit4:junit4]   2> 981 T2265 oasu.CommitTracker.<init> Hard AutoCommit: disabled
[junit4:junit4]   2> 981 T2265 oasu.CommitTracker.<init> Soft AutoCommit: disabled
[junit4:junit4]   2> 981 T2265 oashc.QueryElevationComponent.inform Loading QueryElevation from: /mnt/ssd/jenkins/workspace/Lucene-Solr-4.x-Linux/checkout/solr/build/solr-core/test-files/solr/collection1/conf/elevate.xml
[junit4:junit4]   2> 986 T2265 oashc.QueryElevationComponent.inform Loading QueryElevation from: /mnt/ssd/jenkins/workspace/Lucene-Solr-4.x-Linux/checkout/solr/build/solr-core/test-files/solr/collection1/conf/elevate.xml
[junit4:junit4]   2> 991 T2265 oashc.HttpShardHandlerFactory.getParameter Setting socketTimeout to: 0
[junit4:junit4]   2> 992 T2265 oashc.HttpShardHandlerFactory.getParameter Setting urlScheme to: http://
[junit4:junit4]   2> 992 T2265 oashc.HttpShardHandlerFactory.getParameter Setting connTimeout to: 0
[junit4:junit4]   2> 992 T2265 oashc.HttpShardHandlerFactory.getParameter Setting maxConnectionsPerHost to: 20
[junit4:junit4]   2> 992 T2265 oashc.HttpShardHandlerFactory.getParameter Setting corePoolSize to: 0
[junit4:junit4]   2> 992 T2265 oashc.HttpShardHandlerFactory.getParameter Setting maximumPoolSize to: 2147483647
[junit4:junit4]   2> 993 T2265 oashc.HttpShardHandlerFactory.getParameter Setting maxThreadIdleTime to: 5
[junit4:junit4]   2> 993 T2265 oashc.HttpShardHandlerFactory.getParameter Setting sizeOfQueue to: -1
[junit4:junit4]   2> 993 T2265 oashc.HttpShardHandlerFactory.getParameter Setting fairnessPolicy to: false
[junit4:junit4]   2> 993 T2265 oascsi.HttpClientUtil.createClient Creating new http client, config:maxConnectionsPerHost=20&maxConnections=10000&socketTimeout=0&connTimeout=0&retry=false
[junit4:junit4]   2> 998 T2265 oasc.CoreContainer.register registering core: collection1
[junit4:junit4]   2> 998 T2265 oass.SolrDispatchFilter.init user.dir=/mnt/ssd/jenkins/workspace/Lucene-Solr-4.x-Linux/checkout/solr/build/solr-core/test/J0
[junit4:junit4]   2> 998 T2265 oass.SolrDispatchFilter.init SolrDispatchFilter.init() done
[junit4:junit4]   2> 999 T2265 oascsi.HttpClientUtil.createClient Creating new http client, config:maxConnections=128&maxConnectionsPerHost=32&followRedirects=false
[junit4:junit4]   2> 1001 T2265 oejs.Server.doStart jetty-8.1.2.v20120308
[junit4:junit4]   2> 1002 T2295 oasc.SolrCore.registerSearcher [collection1] Registered new searcher Searcher@a7f890 main{StandardDirectoryReader(segments_1:1)}
[junit4:junit4]   2> 1003 T2265 oejs.AbstractConnector.doStart Started SocketConnector@0.0.0.0:44413
[junit4:junit4]   2> 1003 T2265 oasc.SolrResourceLoader.locateSolrHome JNDI not configured for solr (NoInitialContextEx)
[junit4:junit4]   2> 1003 T2265 oasc.SolrResourceLoader.locateSolrHome using system property solr.solr.home: /mnt/ssd/jenkins/workspace/Lucene-Solr-4.x-Linux/checkout/solr/build/solr-core/test-files/solr
[junit4:junit4]   2> 1003 T2265 oasc.SolrResourceLoader.<init> new SolrResourceLoader for deduced Solr Home: '/mnt/ssd/jenkins/workspace/Lucene-Solr-4.x-Linux/checkout/solr/build/solr-core/test-files/solr/'
[junit4:junit4]   2> 1013 T2265 oass.SolrDispatchFilter.init SolrDispatchFilter.init()
[junit4:junit4]   2> 1014 T2265 oasc.SolrResourceLoader.locateSolrHome JNDI not configured for solr (NoInitialContextEx)
[junit4:junit4]   2> 1014 T2265 oasc.SolrResourceLoader.locateSolrHome using system property solr.solr.home: /mnt/ssd/jenkins/workspace/Lucene-Solr-4.x-Linux/checkout/solr/build/solr-core/test-files/solr
[junit4:junit4]   2> 1014 T2265 oasc.CoreContainer$Initializer.initialize looking for solr.xml: /mnt/ssd/jenkins/workspace/Lucene-Solr-4.x-Linux/checkout/solr/build/solr-core/test-files/solr/solr.xml
[junit4:junit4]   2> 1015 T2265 oasc.CoreContainer.<init> New CoreContainer 28339390
[junit4:junit4]   2> 1015 T2265 oasc.CoreContainer.load Loading CoreContainer using Solr Home: '/mnt/ssd/jenkins/workspace/Lucene-Solr-4.x-Linux/checkout/solr/build/solr-core/test-files/solr/'
[junit4:junit4]   2> 1015 T2265 oasc.SolrResourceLoader.<init> new SolrResourceLoader for directory: '/mnt/ssd/jenkins/workspace/Lucene-Solr-4.x-Linux/checkout/solr/build/solr-core/test-files/solr/'
[junit4:junit4]   2> 1036 T2265 oasc.CoreContainer.load Registering Log Listener
[junit4:junit4]   2> 1048 T2265 oasc.CoreContainer.create Creating SolrCore 'collection1' using instanceDir: /mnt/ssd/jenkins/workspace/Lucene-Solr-4.x-Linux/checkout/solr/build/solr-core/test-files/solr/collection1
[junit4:junit4]   2> 1048 T2265 oasc.SolrResourceLoader.<init> new SolrResourceLoader for directory: '/mnt/ssd/jenkins/workspace/Lucene-Solr-4.x-Linux/checkout/solr/build/solr-core/test-files/solr/collection1/'
[junit4:junit4]   2> 1049 T2265 oasc.SolrResourceLoader.replaceClassLoader Adding 'file:/mnt/ssd/jenkins/workspace/Lucene-Solr-4.x-Linux/checkout/solr/build/solr-core/test-files/solr/collection1/lib/README' to classloader
[junit4:junit4]   2> 1049 T2265 oasc.SolrResourceLoader.replaceClassLoader Adding 'file:/mnt/ssd/jenkins/workspace/Lucene-Solr-4.x-Linux/checkout/solr/build/solr-core/test-files/solr/collection1/lib/classes/' to classloader
[junit4:junit4]   2> 1073 T2265 oasc.SolrConfig.<init> Using Lucene MatchVersion: LUCENE_40
[junit4:junit4]   2> 1111 T2265 oasc.SolrConfig.<init> Loaded SolrConfig: solrconfig-elevate.xml
[junit4:junit4]   2> 1112 T2265 oass.IndexSchema.readSchema Reading Solr Schema
[junit4:junit4]   2> 1114 T2265 oass.IndexSchema.readSchema Schema name=example
[junit4:junit4]   2> 1284 T2265 oass.IndexSchema.readSchema default search field in schema is text
[junit4:junit4]   2> 1286 T2265 oass.IndexSchema.readSchema unique key field: id
[junit4:junit4]   2> 1288 T2265 oasc.SolrCore.<init> [collection1] Opening new SolrCore at /mnt/ssd/jenkins/workspace/Lucene-Solr-4.x-Linux/checkout/solr/build/solr-core/test-files/solr/collection1/, dataDir=./org.apache.solr.handler.component.DistributedQueryElevationComponentTest-1343986239251/shard2/data/
[junit4:junit4]   2> 1288 T2265 oasc.JmxMonitoredMap.<init> JMX monitoring is enabled. Adding Solr mbeans to JMX Server: com.sun.jmx.mbeanserver.JmxMBeanServer@6d043e
[junit4:junit4]   2> 1289 T2265 oasc.SolrCore.getNewIndexDir WARNING New index directory detected: old=null new=./org.apache.solr.handler.component.DistributedQueryElevationComponentTest-1343986239251/shard2/data/index/
[junit4:junit4]   2> 1289 T2265 oasc.SolrCore.initIndex WARNING [collection1] Solr index directory './org.apache.solr.handler.component.DistributedQueryElevationComponentTest-1343986239251/shard2/data/index' doesn't exist. Creating new index...
[junit4:junit4]   2> 1290 T2265 oasc.SolrDeletionPolicy.onCommit SolrDeletionPolicy.onCommit: commits:num=1
[junit4:junit4]   2> 		commit{dir=MockDirWrapper(NRTCachingDirectory(org.apache.lucene.store.RAMDirectory@31a49d lockFactory=org.apache.lucene.store.SingleInstanceLockFactory@e8b229; maxCacheMB=0.5244140625 maxMergeSizeMB=0.2548828125)),segFN=segments_1,generation=1,filenames=[segments_1]
[junit4:junit4]   2> 1291 T2265 oasc.SolrDeletionPolicy.updateCommits newest commit = 1
[junit4:junit4]   2> 1291 T2265 oasc.RequestHandlers.initHandlersFromConfig created /update: solr.UpdateRequestHandler
[junit4:junit4]   2> 1292 T2265 oasc.RequestHandlers.initHandlersFromConfig created /elevate: org.apache.solr.handler.component.SearchHandler
[junit4:junit4]   2> 1292 T2265 oasc.RequestHandlers.initHandlersFromConfig created /dataElevate: org.apache.solr.handler.component.SearchHandler
[junit4:junit4]   2> 1292 T2265 oashl.XMLLoader.init xsltCacheLifetimeSeconds=60
[junit4:junit4]   2> 1293 T2265 oasc.RequestHandlers.initHandlersFromConfig WARNING no default request handler is registered (either '/select' or 'standard')
[junit4:junit4]   2> 1294 T2265 oasc.SolrCore.initDeprecatedSupport WARNING solrconfig.xml uses deprecated <admin/gettableFiles>, Please update your config to use the ShowFileRequestHandler.
[junit4:junit4]   2> 1295 T2265 oasc.SolrCore.initDeprecatedSupport WARNING adding ShowFileRequestHandler with hidden files: [MAPPING-ISOLATIN1ACCENT.TXT, SCHEMA15.XML, COMPOUNDDICTIONARY.TXT, SCHEMASURROUND.XML, SOLRCONFIG-XINCLUDE.XML, BAD-SCHEMA-UNIQUEKEY-MULTIVALUED.XML, STOPTYPES-2.TXT, BAD-SCHEMA-DUP-DYNAMICFIELD.XML, SOLRCONFIG-HIGHLIGHT.XML, BAD-SCHEMA-NOT-INDEXED-BUT-NORMS.XML, SCHEMA-COPYFIELD-TEST.XML, TRIVIAL.UPDATEPROCESSOR0.JS, SCHEMA-REVERSED.XML, SCHEMA-NUMERIC.XML, HUNSPELL-TEST.AFF, SCHEMA-TRIE.XML, SCHEMA-SPELLCHECKER.XML, KEEP-1.TXT, SCHEMA-BINARYFIELD.XML, SOLRCONFIG-DELPOLICY1.XML, SCHEMA-STOP-KEEP.XML, SCHEMA-LMJELINEKMERCER.XML, TRIVIAL.UPDATEPROCESSOR1.JS, BAD-SCHEMA-NOT-INDEXED-BUT-TF.XML, SOLRCONFIG-CACHING.XML, SCHEMA-SIM.XML, SOLRCONFIG-MERGEPOLICY.XML, SOLRCONFIG_CODEC.XML, SOLRCONFIG_PERF.XML, SCHEMA-PHRASESUGGEST.XML, SOLRCONFIG-SPELLCHECKER.XML, PROTWORDS.TXT, SOLRCONFIG-NATIVELOCK.XML, SCHEMA.XML, SOLRCONFIG-MASTER2.XML, SOLRCONFIG-ENABLEPLUGIN.XML, SOLRCONFIG-MASTER1.XML, SCHEMA-NOT-REQUIRED-UNIQUE-KEY.XML, SCHEMA12.XML, CURRENCY.XML, STOP-2.TXT, STOPWITHBOM.TXT, SCHEMA-REPLICATION2.XML, SCHEMA-BM25.XML, SCHEMA-COLLATE.XML, BAD-SCHEMA-DUP-FIELDTYPE.XML, SOLRCONFIG-BASIC-LUCENEVERSION31.XML, HUNSPELL-TEST.DIC, ELEVATE.XML, SOLRCONFIG-TERMINDEX.XML, BAD-SOLRCONFIG-MISSING-SCRIPTFILE.XML, SOLRCONFIG-PHRASESUGGEST.XML, SCHEMA-TFIDF.XML, SOLRCONFIG-UPDATE-PROCESSOR-CHAINS.XML, STOPWORDSWRONGENCODING.TXT, SCHEMA_CODEC.XML, STEMDICT.TXT, SOLRCONFIG-QUERYSENDER-NOQUERY.XML, MISSING.FUNCTIONS.UPDATEPROCESSOR.JS, SOLRCONFIG-SLAVE.XML, SOLRCONFIG-REQHANDLER.INCL, SOLRCONFIG-SOLCOREPROPERTIES.XML, OLD_SYNONYMS.TXT, BAD-SCHEMA-DUP-FIELD.XML, STOP-1.TXT, SCHEMA-LMDIRICHLET.XML, OPEN-EXCHANGE-RATES.JSON, MISSLEADING.EXTENSION.UPDATEPROCESSOR.JS.TXT, SOLRCONFIG-TRANSFORMERS.XML, BAD-SCHEMA-UNIQUEKEY-IS-COPYFIELD-DEST.XML, SCHEMA-REQUIRED-FIELDS.XML, BAD-SCHEMA-OMIT-TF-BUT-NOT-POS.XML, BAD-SCHEMA-CODEC-GLOBAL-VS-FT-MISMATCH.XML, BAD-SCHEMA-SIM-GLOBAL-VS-FT-MISMATCH.XML, STOPWORDS.TXT, STOPTYPES-1.TXT, STOP-SNOWBALL.TXT, SCHEMA-MINIMAL.XML, SCHEMA-CHARFILTERS.XML, SOLRCONFIG-BASIC.XML, BAD-SOLRCONFIG-INVALID-SCRIPTFILE.XML, SOLRCONFIG-LAZYWRITER.XML, PHRASESUGGEST.TXT, SOLRCONFIG-ALTDIRECTORY.XML, SOLRCONFIG-SLAVE1.XML, HYPHENATION.DTD, BAD-SCHEMA-ANALYZER-CLASS-AND-NESTED.XML, SCHEMA-REPLICATION1.XML, SOLRCONFIG-REPEATER.XML, SYNONYMS.TXT, SOLRCONFIG-PROPINJECT.XML, DA_COMPOUNDDICTIONARY.TXT, SOLRCONFIG-MASTER.XML, THROW.ERROR.ON.ADD.UPDATEPROCESSOR.JS, SOLRCONFIG-ELEVATE.XML, BAD-MP-SOLRCONFIG.XML, SCHEMA11.XML, SOLRCONFIG-SPELLCHECKCOMPONENT.XML, SCHEMA-FOLDING.XML, DA_UTF8.XML, BAD-SCHEMA-NOT-INDEXED-BUT-POS.XML, SOLRCONFIG-NOCACHE.XML, WDFTYPES.TXT, FRENCHARTICLES.TXT, ADDFIELDS.UPDATEPROCESSOR.JS, SOLRCONFIG-QUERYSENDER.XML, BAD-SOLRCONFIG-BOGUS-SCRIPTENGINE-NAME.XML, BAD-SCHEMA-NONTEXT-ANALYZER.XML, SOLRCONFIG-PROPINJECT-INDEXDEFAULT.XML, SOLRCONFIG-MASTER3.XML, SOLRCONFIG-SIMPLELOCK.XML, SCHEMA-IB.XML, CONDITIONAL.UPDATEPROCESSOR.JS, SCHEMA-DFR.XML, SCHEMA-COLLATEFILTER.XML, SOLRCONFIG-SCRIPT-UPDATEPROCESSOR.XML, SOLRCONFIG-MASTER1-KEEPONEBACKUP.XML, KEEP-2.TXT, SCHEMA-LUCENEMATCHVERSION.XML, BAD-SCHEMA-UNIQUEKEY-USES-DEFAULT.XML, SOLRCONFIG-FUNCTIONQUERY.XML, BAD_SOLRCONFIG.XML, BAD-SCHEMA-EXTERNAL-FILEFIELD.XML, SOLRCONFIG-SOLR-749.XML, SOLRCONFIG-TLOG.XML, XSLT, SOLRCONFIG-DELPOLICY2.XML]
[junit4:junit4]   2> 1296 T2265 oass.SolrIndexSearcher.<init> Opening Searcher@15e3353 main
[junit4:junit4]   2> 1297 T2265 oass.SolrIndexSearcher.getIndexDir WARNING WARNING: Directory impl does not support setting indexDir: org.apache.lucene.store.MockDirectoryWrapper
[junit4:junit4]   2> 1297 T2265 oasu.CommitTracker.<init> Hard AutoCommit: disabled
[junit4:junit4]   2> 1297 T2265 oasu.CommitTracker.<init> Soft AutoCommit: disabled
[junit4:junit4]   2> 1297 T2265 oashc.QueryElevationComponent.inform Loading QueryElevation from: /mnt/ssd/jenkins/workspace/Lucene-Solr-4.x-Linux/checkout/solr/build/solr-core/test-files/solr/collection1/conf/elevate.xml
[junit4:junit4]   2> 1303 T2265 oashc.QueryElevationComponent.inform Loading QueryElevation from: /mnt/ssd/jenkins/workspace/Lucene-Solr-4.x-Linux/checkout/solr/build/solr-core/test-files/solr/collection1/conf/elevate.xml
[junit4:junit4]   2> 1308 T2265 oashc.HttpShardHandlerFactory.getParameter Setting socketTimeout to: 0
[junit4:junit4]   2> 1309 T2265 oashc.HttpShardHandlerFactory.getParameter Setting urlScheme to: http://
[junit4:junit4]   2> 1309 T2265 oashc.HttpShardHandlerFactory.getParameter Setting connTimeout to: 0
[junit4:junit4]   2> 1309 T2265 oashc.HttpShardHandlerFactory.getParameter Setting maxConnectionsPerHost to: 20
[junit4:junit4]   2> 1310 T2265 oashc.HttpShardHandlerFactory.getParameter Setting corePoolSize to: 0
[junit4:junit4]   2> 1310 T2265 oashc.HttpShardHandlerFactory.getParameter Setting maximumPoolSize to: 2147483647
[junit4:junit4]   2> 1310 T2265 oashc.HttpShardHandlerFactory.getParameter Setting maxThreadIdleTime to: 5
[junit4:junit4]   2> 1310 T2265 oashc.HttpShardHandlerFactory.getParameter Setting sizeOfQueue to: -1
[junit4:junit4]   2> 1311 T2265 oashc.HttpShardHandlerFactory.getParameter Setting fairnessPolicy to: false
[junit4:junit4]   2> 1311 T2265 oascsi.HttpClientUtil.createClient Creating new http client, config:maxConnectionsPerHost=20&maxConnections=10000&socketTimeout=0&connTimeout=0&retry=false
[junit4:junit4]   2> 1321 T2305 oasc.SolrCore.registerSearcher [collection1] Registered new searcher Searcher@15e3353 main{StandardDirectoryReader(segments_1:1)}
[junit4:junit4]   2> 1321 T2265 oasc.CoreContainer.register registering core: collection1
[junit4:junit4]   2> 1321 T2265 oass.SolrDispatchFilter.init user.dir=/mnt/ssd/jenkins/workspace/Lucene-Solr-4.x-Linux/checkout/solr/build/solr-core/test/J0
[junit4:junit4]   2> 1322 T2265 oass.SolrDispatchFilter.init SolrDispatchFilter.init() done
[junit4:junit4]   2> 1322 T2265 oascsi.HttpClientUtil.createClient Creating new http client, config:maxConnections=128&maxConnectionsPerHost=32&followRedirects=false
[junit4:junit4]   2> ASYNC  NEW_CORE C183 name=collection1 org.apache.solr.core.SolrCore@167c3c0
[junit4:junit4]   2> 1326 T2268 C183 oasu.DirectUpdateHandler2.deleteAll [collection1] REMOVING ALL DOCUMENTS FROM INDEX
[junit4:junit4]   2> 1327 T2268 C183 oasc.SolrDeletionPolicy.onInit SolrDeletionPolicy.onInit: commits:num=1
[junit4:junit4]   2> 		commit{dir=MockDirWrapper(org.apache.lucene.store.RAMDirectory@164a121 lockFactory=org.apache.lucene.store.SingleInstanceLockFactory@1caea58),segFN=segments_1,generation=1,filenames=[segments_1]
[junit4:junit4]   2> 1327 T2268 C183 oasc.SolrDeletionPolicy.updateCommits newest commit = 1
[junit4:junit4]   2> 1328 T2268 C183 UPDATE [collection1] webapp=/solr path=/update params={wt=javabin&version=2} {deleteByQuery=*:*} 0 2
[junit4:junit4]   2> ASYNC  NEW_CORE C184 name=collection1 org.apache.solr.core.SolrCore@24539
[junit4:junit4]   2> 1331 T2278 C184 oasu.DirectUpdateHandler2.deleteAll [collection1] REMOVING ALL DOCUMENTS FROM INDEX
[junit4:junit4]   2> 1332 T2278 C184 oasc.SolrDeletionPolicy.onInit SolrDeletionPolicy.onInit: commits:num=1
[junit4:junit4]   2> 		commit{dir=MockDirWrapper(org.apache.lucene.store.RAMDirectory@10eb6ba lockFactory=org.apache.lucene.store.SingleInstanceLockFactory@1ebf535),segFN=segments_1,generation=1,filenames=[segments_1]
[junit4:junit4]   2> 1332 T2278 C184 oasc.SolrDeletionPolicy.updateCommits newest commit = 1
[junit4:junit4]   2> 1332 T2278 C184 UPDATE [collection1] webapp=/solr path=/update params={wt=javabin&version=2} {deleteByQuery=*:*} 0 1
[junit4:junit4]   2> ASYNC  NEW_CORE C185 name=collection1 org.apache.solr.core.SolrCore@6a6b35
[junit4:junit4]   2> 1337 T2288 C185 oasu.DirectUpdateHandler2.deleteAll [collection1] REMOVING ALL DOCUMENTS FROM INDEX
[junit4:junit4]   2> 1337 T2288 C185 oasc.SolrDeletionPolicy.onInit SolrDeletionPolicy.onInit: commits:num=1
[junit4:junit4]   2> 		commit{dir=BaseDirectoryWrapper(org.apache.lucene.store.RAMDirectory@a46e05 lockFactory=org.apache.lucene.store.SingleInstanceLockFactory@1330eb1),segFN=segments_1,generation=1,filenames=[segments_1]
[junit4:junit4]   2> 1338 T2288 C185 oasc.SolrDeletionPolicy.updateCommits newest commit = 1
[junit4:junit4]   2> 1338 T2288 C185 UPDATE [collection1] webapp=/solr path=/update params={wt=javabin&version=2} {deleteByQuery=*:*} 0 2
[junit4:junit4]   2> ASYNC  NEW_CORE C186 name=collection1 org.apache.solr.core.SolrCore@85996
[junit4:junit4]   2> 1342 T2298 C186 oasu.DirectUpdateHandler2.deleteAll [collection1] REMOVING ALL DOCUMENTS FROM INDEX
[junit4:junit4]   2> 1343 T2298 C186 oasc.SolrDeletionPolicy.onInit SolrDeletionPolicy.onInit: commits:num=1
[junit4:junit4]   2> 		commit{dir=MockDirWrapper(NRTCachingDirectory(org.apache.lucene.store.RAMDirectory@31a49d lockFactory=org.apache.lucene.store.SingleInstanceLockFactory@e8b229; maxCacheMB=0.5244140625 maxMergeSizeMB=0.2548828125)),segFN=segments_1,generation=1,filenames=[segments_1]
[junit4:junit4]   2> 1343 T2298 C186 oasc.SolrDeletionPolicy.updateCommits newest commit = 1
[junit4:junit4]   2> 1344 T2298 C186 UPDATE [collection1] webapp=/solr path=/update params={wt=javabin&version=2} {deleteByQuery=*:*} 0 2
[junit4:junit4]   2> 1348 T2268 C183 UPDATE [collection1] webapp=/solr path=/update params={wt=javabin&version=2} {add=[1]} 0 1
[junit4:junit4]   2> 1350 T2278 C184 UPDATE [collection1] webapp=/solr path=/update params={wt=javabin&version=2} {add=[1]} 0 0
[junit4:junit4]   2> 1351 T2268 C183 UPDATE [collection1] webapp=/solr path=/update params={wt=javabin&version=2} {add=[2]} 0 0
[junit4:junit4]   2> 1353 T2288 C185 UPDATE [collection1] webapp=/solr path=/update params={wt=javabin&version=2} {add=[2]} 0 0
[junit4:junit4]   2> 1355 T2268 C183 UPDATE [collection1] webapp=/solr path=/update params={wt=javabin&version=2} {add=[3]} 0 0
[junit4:junit4]   2> 1357 T2298 C186 UPDATE [collection1] webapp=/solr path=/update params={wt=javabin&version=2} {add=[3]} 0 1
[junit4:junit4]   2> 1358 T2268 C183 UPDATE [collection1] webapp=/solr path=/update params={wt=javabin&version=2} {add=[4]} 0 0
[junit4:junit4]   2> 1360 T2278 C184 UPDATE [collection1] webapp=/solr path=/update params={wt=javabin&version=2} {add=[4]} 0 0
[junit4:junit4]   2> 1362 T2268 C183 UPDATE [collection1] webapp=/solr path=/update params={wt=javabin&version=2} {add=[5]} 0 0
[junit4:junit4]   2> 1363 T2288 C185 UPDATE [collection1] webapp=/solr path=/update params={wt=javabin&version=2} {add=[5]} 0 0
[junit4:junit4]   2> 1365 T2268 C183 UPDATE [collection1] webapp=/solr path=/update params={wt=javabin&version=2} {add=[6]} 0 0
[junit4:junit4]   2> 1367 T2298 C186 UPDATE [collection1] webapp=/solr path=/update params={wt=javabin&version=2} {add=[6]} 0 0
[junit4:junit4]   2> 1389 T2268 C183 UPDATE [collection1] webapp=/solr path=/update params={wt=javabin&version=2} {add=[7]} 0 0
[junit4:junit4]   2> 1391 T2298 C186 UPDATE [collection1] webapp=/solr path=/update params={wt=javabin&version=2} {add=[7]} 0 0
[junit4:junit4]   2> 1393 T2268 C183 oasu.DirectUpdateHandler2.commit start commit{flags=0,_version_=0,optimize=false,openSearcher=true,waitSearcher=true,expungeDeletes=false,softCommit=false}
[junit4:junit4]   2> 1394 T2268 C183 oasc.SolrDeletionPolicy.onCommit SolrDeletionPolicy.onCommit: commits:num=2
[junit4:junit4]   2> 		commit{dir=MockDirWrapper(org.apache.lucene.store.RAMDirectory@164a121 lockFactory=org.apache.lucene.store.SingleInstanceLockFactory@1caea58),segFN=segments_1,generation=1,filenames=[segments_1]
[junit4:junit4]   2> 		commit{dir=MockDirWrapper(org.apache.lucene.store.RAMDirectory@164a121 lockFactory=org.apache.lucene.store.SingleInstanceLockFactory@1caea58),segFN=segments_2,generation=2,filenames=[_0.fdx, _0.fdt, _0.frq, _0.tii, _0.prx, _0.nrm, _0.fnm, segments_2, _0.si, _0.tis]
[junit4:junit4]   2> 1394 T2268 C183 oasc.SolrDeletionPolicy.updateCommits newest commit = 2
[junit4:junit4]   2> 1395 T2268 C183 oass.SolrIndexSearcher.<init> Opening Searcher@5ab05e main
[junit4:junit4]   2> 1395 T2268 C183 oass.SolrIndexSearcher.getIndexDir WARNING WARNING: Directory impl does not support setting indexDir: org.apache.lucene.store.MockDirectoryWrapper
[junit4:junit4]   2> 1395 T2268 C183 oasu.DirectUpdateHandler2.commit end_commit_flush
[junit4:junit4]   2> 1395 T2275 oasc.SolrCore.registerSearcher [collection1] Registered new searcher Searcher@5ab05e main{StandardDirectoryReader(segments_2:4 _0(4.0.0.1):C7)}
[junit4:junit4]   2> 1398 T2268 C183 UPDATE [collection1] webapp=/solr path=/update params={wt=javabin&softCommit=false&commit=true&version=2&waitSearcher=true} {commit=} 0 4
[junit4:junit4]   2> 1400 T2278 C184 oasu.DirectUpdateHandler2.commit start commit{flags=0,_version_=0,optimize=false,openSearcher=true,waitSearcher=true,expungeDeletes=false,softCommit=false}
[junit4:junit4]   2> 1400 T2278 C184 oasc.SolrDeletionPolicy.onCommit SolrDeletionPolicy.onCommit: commits:num=2
[junit4:junit4]   2> 		commit{dir=MockDirWrapper(org.apache.lucene.store.RAMDirectory@10eb6ba lockFactory=org.apache.lucene.store.SingleInstanceLockFactory@1ebf535),segFN=segments_1,generation=1,filenames=[segments_1]
[junit4:junit4]   2> 		commit{dir=MockDirWrapper(org.apache.lucene.store.RAMDirectory@10eb6ba lockFactory=org.apache.lucene.store.SingleInstanceLockFactory@1ebf535),segFN=segments_2,generation=2,filenames=[_0.fdx, _0.fdt, _0.frq, _0.tii, _0.prx, _0.nrm, _0.fnm, segments_2, _0.si, _0.tis]
[junit4:junit4]   2> 1401 T2278 C184 oasc.SolrDeletionPolicy.updateCommits newest commit = 2
[junit4:junit4]   2> 1401 T2278 C184 oass.SolrIndexSearcher.<init> Opening Searcher@b3326 main
[junit4:junit4]   2> 1402 T2278 C184 oass.SolrIndexSearcher.getIndexDir WARNING WARNING: Directory impl does not support setting indexDir: org.apache.lucene.store.MockDirectoryWrapper
[junit4:junit4]   2> 1402 T2278 C184 oasu.DirectUpdateHandler2.commit end_commit_flush
[junit4:junit4]   2> 1402 T2285 oasc.SolrCore.registerSearcher [collection1] Registered new searcher Searcher@b3326 main{StandardDirectoryReader(segments_2:4 _0(4.0.0.1):C2)}
[junit4:junit4]   2> 1402 T2278 C184 UPDATE [collection1] webapp=/solr path=/update params={wt=javabin&softCommit=false&commit=true&version=2&waitSearcher=true} {commit=} 0 2
[junit4:junit4]   2> 1404 T2288 C185 oasu.DirectUpdateHandler2.commit start commit{flags=0,_version_=0,optimize=false,openSearcher=true,waitSearcher=true,expungeDeletes=false,softCommit=false}
[junit4:junit4]   2> 1405 T2288 C185 oasc.SolrDeletionPolicy.onCommit SolrDeletionPolicy.onCommit: commits:num=2
[junit4:junit4]   2> 		commit{dir=BaseDirectoryWrapper(org.apache.lucene.store.RAMDirectory@a46e05 lockFactory=org.apache.lucene.store.SingleInstanceLockFactory@1330eb1),segFN=segments_1,generation=1,filenames=[segments_1]
[junit4:junit4]   2> 		commit{dir=BaseDirectoryWrapper(org.apache.lucene.store.RAMDirectory@a46e05 lockFactory=org.apache.lucene.store.SingleInstanceLockFactory@1330eb1),segFN=segments_2,generation=2,filenames=[_0.fdx, _0.fdt, _0.frq, _0.tii, _0.prx, _0.nrm, _0.fnm, segments_2, _0.si, _0.tis]
[junit4:junit4]   2> 1405 T2288 C185 oasc.SolrDeletionPolicy.updateCommits newest commit = 2
[junit4:junit4]   2> 1406 T2288 C185 oass.SolrIndexSearcher.<init> Opening Searcher@1111528 main
[junit4:junit4]   2> 1406 T2288 C185 oass.SolrIndexSearcher.getIndexDir WARNING WARNING: Directory impl does not support setting indexDir: org.apache.lucene.store.BaseDirectoryWrapper
[junit4:junit4]   2> 1406 T2288 C185 oasu.DirectUpdateHandler2.commit end_commit_flush
[junit4:junit4]   2> 1406 T2295 oasc.SolrCore.registerSearcher [collection1] Registered new searcher Searcher@1111528 main{StandardDirectoryReader(segments_2:4 _0(4.0.0.1):C2)}
[junit4:junit4]   2> 1407 T2288 C185 UPDATE [collection1] webapp=/solr path=/update params={wt=javabin&softCommit=false&commit=true&version=2&waitSearcher=true} {commit=} 0 3
[junit4:junit4]   2> 1408 T2298 C186 oasu.DirectUpdateHandler2.commit start commit{flags=0,_version_=0,optimize=false,openSearcher=true,waitSearcher=true,expungeDeletes=false,softCommit=false}
[junit4:junit4]   2> 1409 T2298 C186 oasc.SolrDeletionPolicy.onCommit SolrDeletionPolicy.onCommit: commits:num=2
[junit4:junit4]   2> 		commit{dir=MockDirWrapper(NRTCachingDirectory(org.apache.lucene.store.RAMDirectory@31a49d lockFactory=org.apache.lucene.store.SingleInstanceLockFactory@e8b229; maxCacheMB=0.5244140625 maxMergeSizeMB=0.2548828125)),segFN=segments_1,generation=1,filenames=[segments_1]
[junit4:junit4]   2> 		commit{dir=MockDirWrapper(NRTCachingDirectory(org.apache.lucene.store.RAMDirectory@31a49d lockFactory=org.apache.lucene.store.SingleInstanceLockFactory@e8b229; maxCacheMB=0.5244140625 maxMergeSizeMB=0.2548828125)),segFN=segments_2,generation=2,filenames=[_0.fdx, _0.fdt, _0.frq, _0.tii, _0.prx, _0.nrm, _0.fnm, segments_2, _0.si, _0.tis]
[junit4:junit4]   2> 1409 T2298 C186 oasc.SolrDeletionPolicy.updateCommits newest commit = 2
[junit4:junit4]   2> 1410 T2298 C186 oass.SolrIndexSearcher.<init> Opening Searcher@1ebe264 main
[junit4:junit4]   2> 1410 T2298 C186 oass.SolrIndexSearcher.getIndexDir WARNING WARNING: Directory impl does not support setting indexDir: org.apache.lucene.store.MockDirectoryWrapper
[junit4:junit4]   2> 1410 T2298 C186 oasu.DirectUpdateHandler2.commit end_commit_flush
[junit4:junit4]   2> 1410 T2305 oasc.SolrCore.registerSearcher [collection1] Registered new searcher Searcher@1ebe264 main{StandardDirectoryReader(segments_2:4 _0(4.0.0.1):C3)}
[junit4:junit4]   2> 1411 T2298 C186 UPDATE [collection1] webapp=/solr path=/update params={wt=javabin&softCommit=false&commit=true&version=2&waitSearcher=true} {commit=} 0 3
[junit4:junit4]   2> 1413 T2268 C183 REQ [collection1] webapp=/solr path=/elevate params={qt=/elevate&rows=500&wt=javabin&q=*:*&sort=id+desc&version=2&fl=id,+score,+[elevated]&shards.qt=/elevate&distrib=false} hits=7 status=0 QTime=1 
[junit4:junit4]   2> 1417 T2299 C186 REQ [collection1] webapp=/solr path=/elevate params={qt=/elevate&NOW=1343986240664&sort=id+desc&isShard=true&fsv=true&shard.url=localhost:44413/solr&rows=500&wt=javabin&q=*:*&version=2&fl=id,score&shards.qt=/elevate&start=0&distrib=false} hits=3 status=0 QTime=1 
[junit4:junit4]   2> 1418 T2289 C185 REQ [collection1] webapp=/solr path=/elevate params={qt=/elevate&NOW=1343986240664&sort=id+desc&isShard=true&fsv=true&shard.url=localhost:54611/solr|[::1]:33332/solr&rows=500&wt=javabin&q=*:*&version=2&fl=id,score&shards.qt=/elevate&start=0&distrib=false} hits=2 status=0 QTime=0 
[junit4:junit4]   2> 1419 T2279 C184 REQ [collection1] webapp=/solr path=/elevate params={qt=/elevate&NOW=1343986240664&sort=id+desc&isShard=true&fsv=true&shard.url=localhost:54474/solr|[::1]:33332/solr&rows=500&wt=javabin&q=*:*&version=2&fl=id,score&shards.qt=/elevate&start=0&distrib=false} hits=2 status=0 QTime=1 
[junit4:junit4]   2> 1421 T2289 C185 REQ [collection1] webapp=/solr path=/elevate params={qt=/elevate&NOW=1343986240664&isShard=true&shard.url=localhost:54611/solr|[::1]:33332/solr&rows=500&wt=javabin&q=*:*&version=2&fl=id,+score,+[elevated]&ids=5.0,2.0&shards.qt=/elevate&distrib=false} status=0 QTime=0 
[junit4:junit4]   2> 1421 T2279 C184 REQ [collection1] webapp=/solr path=/elevate params={qt=/elevate&NOW=1343986240664&isShard=true&shard.url=localhost:54474/solr|[::1]:33332/solr&rows=500&wt=javabin&q=*:*&version=2&fl=id,+score,+[elevated]&ids=4.0,1.0&shards.qt=/elevate&distrib=false} status=0 QTime=0 
[junit4:junit4]   2> 1421 T2299 C186 REQ [collection1] webapp=/solr path=/elevate params={qt=/elevate&NOW=1343986240664&isShard=true&shard.url=localhost:44413/solr&rows=500&wt=javabin&q=*:*&version=2&fl=id,+score,+[elevated]&ids=6.0,3.0,7.0&shards.qt=/elevate&distrib=false} status=0 QTime=0 
[junit4:junit4]   2> 1422 T2298 C186 REQ [collection1] webapp=/solr path=/elevate params={qt=/elevate&rows=500&wt=javabin&q=*:*&sort=id+desc&shards=localhost:54474/solr|[::1]:33332/solr,localhost:54611/solr|[::1]:33332/solr,localhost:44413/solr&version=2&fl=id,+score,+[elevated]&shards.qt=/elevate} status=0 QTime=7 
[junit4:junit4]   2> 1422 T2265 oas.BaseDistributedSearchTestCase.compareResponses SEVERE Mismatched responses:
[junit4:junit4]   2> 	{responseHeader={status=0,QTime=7,params={qt=/elevate,rows=500,wt=javabin,q=*:*,sort=id desc,shards=localhost:54474/solr|[::1]:33332/solr,localhost:54611/solr|[::1]:33332/solr,localhost:44413/solr,version=2,fl=id, score, [elevated],shards.qt=/elevate}},response={numFound=7,start=0,maxScore=1.0,docs=[SolrDocument{id=7.0, [elevated]=false, score=1.0}, SolrDocument{id=6.0, [elevated]=false, score=1.0}, SolrDocument{id=5.0, [elevated]=false, score=1.0}, SolrDocument{id=4.0, [elevated]=false, score=1.0}, SolrDocument{id=3.0, [elevated]=false, score=1.0}, SolrDocument{id=2.0, [elevated]=false, score=1.0}, SolrDocument{id=1.0, [elevated]=false, score=1.0}]}}
[junit4:junit4]   2> 	{responseHeader={status=0,QTime=1,params={qt=/elevate,rows=500,wt=javabin,q=*:*,sort=id desc,version=2,fl=id, score, [elevated],shards.qt=/elevate,distrib=false}},response={numFound=7,start=0,maxScore=1.0,docs=[SolrDocument{id=7.0, score=1.0, [elevated]=false}, SolrDocument{id=6.0, score=1.0, [elevated]=false}, SolrDocument{id=5.0, score=1.0, [elevated]=false}, SolrDocument{id=4.0, score=1.0, [elevated]=false}, SolrDocument{id=3.0, score=1.0, [elevated]=false}, SolrDocument{id=2.0, score=1.0, [elevated]=false}, SolrDocument{id=1.0, score=1.0, [elevated]=false}]}}
[junit4:junit4]   2> 1424 T2265 oasc.CoreContainer.shutdown Shutting down CoreContainer instance=29175641
[junit4:junit4]   2> 1425 T2265 oasc.SolrCore.close [collection1]  CLOSING SolrCore org.apache.solr.core.SolrCore@167c3c0
[junit4:junit4]   2> 1425 T2265 oasc.SolrCore.closeSearcher [collection1] Closing main searcher on request.
[junit4:junit4]   2> 1425 T2265 oasu.DirectUpdateHandler2.close closing DirectUpdateHandler2{commits=1,autocommits=0,soft autocommits=0,optimizes=0,rollbacks=0,expungeDeletes=0,docsPending=0,adds=0,deletesById=0,deletesByQuery=0,errors=0,cumulative_adds=7,cumulative_deletesById=0,cumulative_deletesByQuery=1,cumulative_errors=0}
[junit4:junit4]   2> 1433 T2265 oejsh.ContextHandler.doStop stopped o.e.j.s.ServletContextHandler{/solr,null}
[junit4:junit4]   2> 1492 T2265 oasc.CoreContainer.shutdown Shutting down CoreContainer instance=10213813
[junit4:junit4]   2> 1492 T2265 oasc.SolrCore.close [collection1]  CLOSING SolrCore org.apache.solr.core.SolrCore@24539
[junit4:junit4]   2> 1493 T2265 oasc.SolrCore.closeSearcher [collection1] Closing main searcher on request.
[junit4:junit4]   2> 1493 T2265 oasu.DirectUpdateHandler2.close closing DirectUpdateHandler2{commits=1,autocommits=0,soft autocommits=0,optimizes=0,rollbacks=0,expungeDeletes=0,docsPending=0,adds=0,deletesById=0,deletesByQuery=0,errors=0,cumulative_adds=2,cumulative_deletesById=0,cumulative_deletesByQuery=1,cumulative_errors=0}
[junit4:junit4]   2> 1496 T2265 oejsh.ContextHandler.doStop stopped o.e.j.s.ServletContextHandler{/solr,null}
[junit4:junit4]   2> 1547 T2265 oasc.CoreContainer.shutdown Shutting down CoreContainer instance=9335157
[junit4:junit4]   2> 1548 T2265 oasc.SolrCore.close [collection1]  CLOSING SolrCore org.apache.solr.core.SolrCore@6a6b35
[junit4:junit4]   2> 1548 T2265 oasc.SolrCore.closeSearcher [collection1] Closing main searcher on request.
[junit4:junit4]   2> 1549 T2265 oasu.DirectUpdateHandler2.close closing DirectUpdateHandler2{commits=1,autocommits=0,soft autocommits=0,optimizes=0,rollbacks=0,expungeDeletes=0,docsPending=0,adds=0,deletesById=0,deletesByQuery=0,errors=0,cumulative_adds=2,cumulative_deletesById=0,cumulative_deletesByQuery=1,cumulative_errors=0}
[junit4:junit4]   2> 1552 T2265 oejsh.ContextHandler.doStop stopped o.e.j.s.ServletContextHandler{/solr,null}
[junit4:junit4]   2> 1604 T2265 oasc.CoreContainer.shutdown Shutting down CoreContainer instance=28339390
[junit4:junit4]   2> 1604 T2265 oasc.SolrCore.close [collection1]  CLOSING SolrCore org.apache.solr.core.SolrCore@85996
[junit4:junit4]   2> 1605 T2265 oasc.SolrCore.closeSearcher [collection1] Closing main searcher on request.
[junit4:junit4]   2> 1605 T2265 oasu.DirectUpdateHandler2.close closing DirectUpdateHandler2{commits=1,autocommits=0,soft autocommits=0,optimizes=0,rollbacks=0,expungeDeletes=0,docsPending=0,adds=0,deletesById=0,deletesByQuery=0,errors=0,cumulative_adds=3,cumulative_deletesById=0,cumulative_deletesByQuery=1,cumulative_errors=0}
[junit4:junit4]   2> 1609 T2265 oejsh.ContextHandler.doStop stopped o.e.j.s.ServletContextHandler{/solr,null}
[junit4:junit4]   2> 1661 T2265 oas.SolrTestCaseJ4.tearDown ###Ending testDistribSearch
[junit4:junit4]   2> NOTE: reproduce with: ant test  -Dtestcase=DistributedQueryElevationComponentTest -Dtests.method=testDistribSearch -Dtests.seed=BD049714FEA983F4 -Dtests.multiplier=3 -Dtests.slow=true -Dtests.locale=it_IT -Dtests.timezone=America/Indiana/Indianapolis -Dtests.file.encoding=US-ASCII
[junit4:junit4]   2>
[junit4:junit4]    > (@AfterClass output)
[junit4:junit4]   2> 1694 T2265 oas.SolrTestCaseJ4.deleteCore ###deleteCore
[junit4:junit4]   2> NOTE: test params are: codec=Lucene3x, sim=RandomSimilarityProvider(queryNorm=false,coord=false): {}, locale=it_IT, timezone=America/Indiana/Indianapolis
[junit4:junit4]   2> NOTE: Linux 3.2.0-27-generic i386/Oracle Corporation 1.8.0-ea (32-bit)/cpus=8,threads=1,free=101377064,total=213782528
[junit4:junit4]   2> NOTE: All tests run in this JVM: [PreAnalyzedFieldTest, TestRTGBase, TestWordDelimiterFilterFactory, ZkSolrClientTest, TestLFUCache, TestRangeQuery, SpatialFilterTest, TestStressRecovery, TestIndexSearcher, SolrCmdDistributorTest, DOMUtilTest, UpdateRequestProcessorFactoryTest, CopyFieldTest, UniqFieldsUpdateProcessorFactoryTest, ZkCLITest, TestCoreContainer, TestSearchPerf, RequestHandlersTest, TestJmxIntegration, SignatureUpdateProcessorFactoryTest, FileBasedSpellCheckerTest, TestPseudoReturnFields, BasicDistributedZkTest, TestCollationKeyRangeQueries, StandardRequestHandlerTest, TestJmxMonitoredMap, CloudStateTest, TermVectorComponentTest, DistributedTermsComponentTest, TestLMDirichletSimilarityFactory, MoreLikeThisHandlerTest, DocumentAnalysisRequestHandlerTest, PathHierarchyTokenizerFactoryTest, TestCollationField, CSVRequestHandlerTest, SOLR749Test, AlternateDirectoryTest, BinaryUpdateRequestHandlerTest, TestExtendedDismaxParser, TestRecovery, HighlighterConfigTest, CacheHeaderTest, TestIndexingPerformance, TestStressVersions, TestDistributedSearch, ResourceLoaderTest, TestDistributedGrouping, SolrCoreCheckLockOnStartupTest, JSONWriterTest, TestSurroundQueryParser, TestLuceneMatchVersion, LeaderElectionIntegrationTest, BadComponentTest, TestPerFieldSimilarity, RecoveryZkTest, TestReplicationHandler, ZkControllerTest, TestRandomFaceting, ConvertedLegacyTest, PeerSyncTest, QueryElevationComponentTest, SortByFunctionTest, BasicFunctionalityTest, TestBinaryResponseWriter, CoreAdminHandlerTest, SolrRequestParserTest, DirectSolrConnectionTest, TestCSVLoader, TestCSVResponseWriter, DocumentBuilderTest, MBeansHandlerTest, DistributedQueryElevationComponentTest]
[junit4:junit4]   2> 
[junit4:junit4] Completed on J0 in 1.70s, 1 test, 1 failure <<< FAILURES!

[...truncated 248 lines...]
BUILD FAILED
/mnt/ssd/jenkins/workspace/Lucene-Solr-4.x-Linux/checkout/build.xml:29: The following error occurred while executing this line:
/mnt/ssd/jenkins/workspace/Lucene-Solr-4.x-Linux/checkout/solr/build.xml:144: The following error occurred while executing this line:
/mnt/ssd/jenkins/workspace/Lucene-Solr-4.x-Linux/checkout/lucene/module-build.xml:62: The following error occurred while executing this line:
/mnt/ssd/jenkins/workspace/Lucene-Solr-4.x-Linux/checkout/lucene/common-build.xml:1095: The following error occurred while executing this line:
/mnt/ssd/jenkins/workspace/Lucene-Solr-4.x-Linux/checkout/lucene/common-build.xml:790: There were test failures: 224 suites, 903 tests, 1 failure, 5 ignored

Total time: 22 minutes 40 seconds
Build step 'Execute shell' marked build as failure
Archiving artifacts
Recording test results
Email was triggered for: Failure
Sending email for trigger: Failure



Mime
View raw message