lucene-dev mailing list archives

Site index · List index
Message view « Date » · « Thread »
Top « Date » · « Thread »
From Apache Jenkins Server <jenk...@builds.apache.org>
Subject [JENKINS] Lucene-Solr-tests-only-trunk-java7 - Build # 3041 - Failure
Date Sat, 11 Aug 2012 09:53:06 GMT
Build: https://builds.apache.org/job/Lucene-Solr-tests-only-trunk-java7/3041/

1 tests failed.
FAILED:  junit.framework.TestSuite.org.apache.solr.handler.TestReplicationHandler

Error Message:
ERROR: SolrIndexSearcher opens=78 closes=77

Stack Trace:
java.lang.AssertionError: ERROR: SolrIndexSearcher opens=78 closes=77
	at __randomizedtesting.SeedInfo.seed([7BC27597C902F00A]:0)
	at org.junit.Assert.fail(Assert.java:93)
	at org.apache.solr.SolrTestCaseJ4.endTrackingSearchers(SolrTestCaseJ4.java:216)
	at org.apache.solr.SolrTestCaseJ4.afterClass(SolrTestCaseJ4.java:82)
	at sun.reflect.GeneratedMethodAccessor13.invoke(Unknown Source)
	at sun.reflect.DelegatingMethodAccessorImpl.invoke(DelegatingMethodAccessorImpl.java:43)
	at java.lang.reflect.Method.invoke(Method.java:601)
	at com.carrotsearch.randomizedtesting.RandomizedRunner.invoke(RandomizedRunner.java:1995)
	at com.carrotsearch.randomizedtesting.RandomizedRunner.access$1100(RandomizedRunner.java:132)
	at com.carrotsearch.randomizedtesting.RandomizedRunner$5.evaluate(RandomizedRunner.java:754)
	at com.carrotsearch.randomizedtesting.rules.SystemPropertiesRestoreRule$1.evaluate(SystemPropertiesRestoreRule.java:53)
	at org.apache.lucene.util.AbstractBeforeAfterRule$1.evaluate(AbstractBeforeAfterRule.java:45)
	at org.apache.lucene.util.TestRuleReportUncaughtExceptions$1.evaluate(TestRuleReportUncaughtExceptions.java:68)
	at org.apache.lucene.util.TestRuleStoreClassName$1.evaluate(TestRuleStoreClassName.java:38)
	at com.carrotsearch.randomizedtesting.rules.SystemPropertiesInvariantRule$1.evaluate(SystemPropertiesInvariantRule.java:55)
	at org.apache.lucene.util.TestRuleNoInstanceHooksOverrides$1.evaluate(TestRuleNoInstanceHooksOverrides.java:53)
	at org.apache.lucene.util.TestRuleNoStaticHooksShadowing$1.evaluate(TestRuleNoStaticHooksShadowing.java:52)
	at org.apache.lucene.util.TestRuleAssertionsRequired$1.evaluate(TestRuleAssertionsRequired.java:36)
	at org.apache.lucene.util.TestRuleMarkFailure$1.evaluate(TestRuleMarkFailure.java:48)
	at org.apache.lucene.util.TestRuleIgnoreAfterMaxFailures$1.evaluate(TestRuleIgnoreAfterMaxFailures.java:70)
	at org.apache.lucene.util.TestRuleIgnoreTestSuites$1.evaluate(TestRuleIgnoreTestSuites.java:55)
	at com.carrotsearch.randomizedtesting.RandomizedRunner.runSuite(RandomizedRunner.java:605)
	at com.carrotsearch.randomizedtesting.RandomizedRunner.access$400(RandomizedRunner.java:132)
	at com.carrotsearch.randomizedtesting.RandomizedRunner$2.run(RandomizedRunner.java:551)




Build Log:
[...truncated 7396 lines...]
[junit4:junit4] Suite: org.apache.solr.handler.TestReplicationHandler
[junit4:junit4]    > (@BeforeClass output)
[junit4:junit4]   2> 7 T1148 oejs.Server.doStart jetty-8.1.2.v20120308
[junit4:junit4]   2> 10 T1148 oejs.AbstractConnector.doStart Started SocketConnector@0.0.0.0:50690
[junit4:junit4]   2> 11 T1148 oasc.SolrResourceLoader.locateSolrHome JNDI not configured
for solr (NoInitialContextEx)
[junit4:junit4]   2> 11 T1148 oasc.SolrResourceLoader.locateSolrHome using system property
solr.solr.home: ./org.apache.solr.handler.TestReplicationHandler$SolrInstance-1344678068288/master
[junit4:junit4]   2> 11 T1148 oasc.SolrResourceLoader.<init> new SolrResourceLoader
for deduced Solr Home: './org.apache.solr.handler.TestReplicationHandler$SolrInstance-1344678068288/master/'
[junit4:junit4]   2> 23 T1148 oass.SolrDispatchFilter.init SolrDispatchFilter.init()
[junit4:junit4]   2> 23 T1148 oasc.SolrResourceLoader.locateSolrHome JNDI not configured
for solr (NoInitialContextEx)
[junit4:junit4]   2> 24 T1148 oasc.SolrResourceLoader.locateSolrHome using system property
solr.solr.home: ./org.apache.solr.handler.TestReplicationHandler$SolrInstance-1344678068288/master
[junit4:junit4]   2> 24 T1148 oasc.CoreContainer$Initializer.initialize looking for solr.xml:
/usr/home/hudson/hudson-slave/workspace/Lucene-Solr-tests-only-trunk-java7/solr/build/solr-core/test/J1/./org.apache.solr.handler.TestReplicationHandler$SolrInstance-1344678068288/master/solr.xml
[junit4:junit4]   2> 24 T1148 oasc.CoreContainer.<init> New CoreContainer 1815998050
[junit4:junit4]   2> 24 T1148 oasc.CoreContainer$Initializer.initialize no solr.xml file
found - using default
[junit4:junit4]   2> 24 T1148 oasc.CoreContainer.load Loading CoreContainer using Solr
Home: './org.apache.solr.handler.TestReplicationHandler$SolrInstance-1344678068288/master/'
[junit4:junit4]   2> 25 T1148 oasc.SolrResourceLoader.<init> new SolrResourceLoader
for directory: './org.apache.solr.handler.TestReplicationHandler$SolrInstance-1344678068288/master/'
[junit4:junit4]   2> 39 T1148 oasc.CoreContainer.load Registering Log Listener
[junit4:junit4]   2> 58 T1148 oasc.CoreContainer.create Creating SolrCore 'collection1'
using instanceDir: ./org.apache.solr.handler.TestReplicationHandler$SolrInstance-1344678068288/master/collection1
[junit4:junit4]   2> 59 T1148 oasc.SolrResourceLoader.<init> new SolrResourceLoader
for directory: './org.apache.solr.handler.TestReplicationHandler$SolrInstance-1344678068288/master/collection1/'
[junit4:junit4]   2> 99 T1148 oasc.SolrConfig.<init> Using Lucene MatchVersion: LUCENE_50
[junit4:junit4]   2> 167 T1148 oasc.SolrConfig.<init> Loaded SolrConfig: solrconfig.xml
[junit4:junit4]   2> 168 T1148 oass.IndexSchema.readSchema Reading Solr Schema
[junit4:junit4]   2> 171 T1148 oass.IndexSchema.readSchema Schema name=test
[junit4:junit4]   2> 188 T1148 oass.IndexSchema.readSchema unique key field: id
[junit4:junit4]   2> 189 T1148 oasc.SolrCore.<init> [collection1] Opening new SolrCore
at ./org.apache.solr.handler.TestReplicationHandler$SolrInstance-1344678068288/master/collection1/,
dataDir=./org.apache.solr.handler.TestReplicationHandler$SolrInstance-1344678068288/master/collection1/data/
[junit4:junit4]   2> 189 T1148 oasc.SolrCore.<init> JMX monitoring not detected for
core: collection1
[junit4:junit4]   2> 190 T1148 oasc.SolrCore.getNewIndexDir WARNING New index directory
detected: old=null new=./org.apache.solr.handler.TestReplicationHandler$SolrInstance-1344678068288/master/collection1/data/index/
[junit4:junit4]   2> 190 T1148 oasc.SolrCore.initIndex WARNING [collection1] Solr index
directory './org.apache.solr.handler.TestReplicationHandler$SolrInstance-1344678068288/master/collection1/data/index'
doesn't exist. Creating new index...
[junit4:junit4]   2> 193 T1148 oasc.SolrDeletionPolicy.onCommit SolrDeletionPolicy.onCommit:
commits:num=1
[junit4:junit4]   2> 		commit{dir=NRTCachingDirectory(org.apache.lucene.store.NIOFSDirectory@/usr/home/hudson/hudson-slave/workspace/Lucene-Solr-tests-only-trunk-java7/solr/build/solr-core/test/J1/org.apache.solr.handler.TestReplicationHandler$SolrInstance-1344678068288/master/collection1/data/index
lockFactory=org.apache.lucene.store.SingleInstanceLockFactory@2b2cbc8e; maxCacheMB=48.0 maxMergeSizeMB=4.0),segFN=segments_1,generation=1,filenames=[segments_1]
[junit4:junit4]   2> 194 T1148 oasc.SolrDeletionPolicy.updateCommits newest commit = 1
[junit4:junit4]   2> 195 T1148 oasc.RequestHandlers.initHandlersFromConfig created standard:
solr.StandardRequestHandler
[junit4:junit4]   2> 195 T1148 oasc.RequestHandlers.initHandlersFromConfig created /replication:
solr.ReplicationHandler
[junit4:junit4]   2> 195 T1148 oasc.RequestHandlers.initHandlersFromConfig created defaults:
solr.StandardRequestHandler
[junit4:junit4]   2> 195 T1148 oasc.RequestHandlers.initHandlersFromConfig adding lazy
requestHandler: solr.StandardRequestHandler
[junit4:junit4]   2> 195 T1148 oasc.RequestHandlers.initHandlersFromConfig created lazy:
solr.StandardRequestHandler
[junit4:junit4]   2> 196 T1148 oasc.RequestHandlers.initHandlersFromConfig created /update:
solr.UpdateRequestHandler
[junit4:junit4]   2> 196 T1148 oashl.XMLLoader.init xsltCacheLifetimeSeconds=60
[junit4:junit4]   2> 199 T1146 oasc.Overseer$ClusterStateUpdater.amILeader WARNING  org.apache.zookeeper.KeeperException$SessionExpiredException:
KeeperErrorCode = Session expired for /overseer_elect/leader
[junit4:junit4]   2> 	at org.apache.zookeeper.KeeperException.create(KeeperException.java:118)
[junit4:junit4]   2> 	at org.apache.zookeeper.KeeperException.create(KeeperException.java:42)
[junit4:junit4]   2> 	at org.apache.zookeeper.ZooKeeper.getData(ZooKeeper.java:927)
[junit4:junit4]   2> 	at org.apache.solr.common.cloud.SolrZkClient$7.execute(SolrZkClient.java:289)
[junit4:junit4]   2> 	at org.apache.solr.common.cloud.SolrZkClient$7.execute(SolrZkClient.java:286)
[junit4:junit4]   2> 	at org.apache.solr.common.cloud.ZkCmdExecutor.retryOperation(ZkCmdExecutor.java:67)
[junit4:junit4]   2> 	at org.apache.solr.common.cloud.SolrZkClient.getData(SolrZkClient.java:286)
[junit4:junit4]   2> 	at org.apache.solr.cloud.Overseer$ClusterStateUpdater.amILeader(Overseer.java:187)
[junit4:junit4]   2> 	at org.apache.solr.cloud.Overseer$ClusterStateUpdater.run(Overseer.java:113)
[junit4:junit4]   2> 	at java.lang.Thread.run(Thread.java:722)
[junit4:junit4]   2> 
[junit4:junit4]   2> 200 T1146 oasc.Overseer$ClusterStateUpdater.amILeader According to
ZK I (id=88124821812609028-127.0.0.1:50682_solr-n_0000000000) am no longer a leader.
[junit4:junit4]   2> 201 T1148 oass.SolrIndexSearcher.<init> Opening Searcher@547f705f
main
[junit4:junit4]   2> 202 T1148 oasu.CommitTracker.<init> Hard AutoCommit: disabled
[junit4:junit4]   2> 202 T1148 oasu.CommitTracker.<init> Soft AutoCommit: disabled
[junit4:junit4]   2> 202 T1148 oashc.HttpShardHandlerFactory.getParameter Setting socketTimeout
to: 0
[junit4:junit4]   2> 202 T1148 oashc.HttpShardHandlerFactory.getParameter Setting urlScheme
to: http://
[junit4:junit4]   2> 203 T1148 oashc.HttpShardHandlerFactory.getParameter Setting connTimeout
to: 0
[junit4:junit4]   2> 203 T1148 oashc.HttpShardHandlerFactory.getParameter Setting maxConnectionsPerHost
to: 20
[junit4:junit4]   2> 203 T1148 oashc.HttpShardHandlerFactory.getParameter Setting corePoolSize
to: 0
[junit4:junit4]   2> 203 T1148 oashc.HttpShardHandlerFactory.getParameter Setting maximumPoolSize
to: 2147483647
[junit4:junit4]   2> 203 T1148 oashc.HttpShardHandlerFactory.getParameter Setting maxThreadIdleTime
to: 5
[junit4:junit4]   2> 203 T1148 oashc.HttpShardHandlerFactory.getParameter Setting sizeOfQueue
to: -1
[junit4:junit4]   2> 204 T1148 oashc.HttpShardHandlerFactory.getParameter Setting fairnessPolicy
to: false
[junit4:junit4]   2> 204 T1148 oascsi.HttpClientUtil.createClient Creating new http client,
config:maxConnectionsPerHost=20&maxConnections=10000&socketTimeout=0&connTimeout=0&retry=false
[junit4:junit4]   2> 213 T1148 oash.ReplicationHandler.inform Replication enabled for following
config files: schema.xml
[junit4:junit4]   2> 213 T1148 oash.ReplicationHandler.inform Commits will be reserved
for  10000
[junit4:junit4]   2> 213 T1148 oasc.CoreContainer.register registering core: collection1
[junit4:junit4]   2> 213 T1158 oasc.SolrCore.registerSearcher [collection1] Registered
new searcher Searcher@547f705f main{StandardDirectoryReader(segments_1:1)}
[junit4:junit4]   2> 214 T1148 oass.SolrDispatchFilter.init user.dir=/usr/home/hudson/hudson-slave/workspace/Lucene-Solr-tests-only-trunk-java7/solr/build/solr-core/test/J1
[junit4:junit4]   2> 214 T1148 oass.SolrDispatchFilter.init SolrDispatchFilter.init() done
[junit4:junit4]   2> 214 T1148 oascsi.HttpClientUtil.createClient Creating new http client,
config:maxConnections=128&maxConnectionsPerHost=32&followRedirects=false
[junit4:junit4]   2> 225 T1148 oejs.Server.doStart jetty-8.1.2.v20120308
[junit4:junit4]   2> 227 T1148 oejs.AbstractConnector.doStart Started SocketConnector@0.0.0.0:50691
[junit4:junit4]   2> 227 T1148 oasc.SolrResourceLoader.locateSolrHome JNDI not configured
for solr (NoInitialContextEx)
[junit4:junit4]   2> 228 T1148 oasc.SolrResourceLoader.locateSolrHome using system property
solr.solr.home: ./org.apache.solr.handler.TestReplicationHandler$SolrInstance-1344678068505/slave
[junit4:junit4]   2> 228 T1148 oasc.SolrResourceLoader.<init> new SolrResourceLoader
for deduced Solr Home: './org.apache.solr.handler.TestReplicationHandler$SolrInstance-1344678068505/slave/'
[junit4:junit4]   2> 239 T1148 oass.SolrDispatchFilter.init SolrDispatchFilter.init()
[junit4:junit4]   2> 240 T1148 oasc.SolrResourceLoader.locateSolrHome JNDI not configured
for solr (NoInitialContextEx)
[junit4:junit4]   2> 240 T1148 oasc.SolrResourceLoader.locateSolrHome using system property
solr.solr.home: ./org.apache.solr.handler.TestReplicationHandler$SolrInstance-1344678068505/slave
[junit4:junit4]   2> 240 T1148 oasc.CoreContainer$Initializer.initialize looking for solr.xml:
/usr/home/hudson/hudson-slave/workspace/Lucene-Solr-tests-only-trunk-java7/solr/build/solr-core/test/J1/./org.apache.solr.handler.TestReplicationHandler$SolrInstance-1344678068505/slave/solr.xml
[junit4:junit4]   2> 240 T1148 oasc.CoreContainer.<init> New CoreContainer 2038926015
[junit4:junit4]   2> 240 T1148 oasc.CoreContainer$Initializer.initialize no solr.xml file
found - using default
[junit4:junit4]   2> 240 T1148 oasc.CoreContainer.load Loading CoreContainer using Solr
Home: './org.apache.solr.handler.TestReplicationHandler$SolrInstance-1344678068505/slave/'
[junit4:junit4]   2> 241 T1148 oasc.SolrResourceLoader.<init> new SolrResourceLoader
for directory: './org.apache.solr.handler.TestReplicationHandler$SolrInstance-1344678068505/slave/'
[junit4:junit4]   2> 254 T1148 oasc.CoreContainer.load Registering Log Listener
[junit4:junit4]   2> 270 T1148 oasc.CoreContainer.create Creating SolrCore 'collection1'
using instanceDir: ./org.apache.solr.handler.TestReplicationHandler$SolrInstance-1344678068505/slave/collection1
[junit4:junit4]   2> 271 T1148 oasc.SolrResourceLoader.<init> new SolrResourceLoader
for directory: './org.apache.solr.handler.TestReplicationHandler$SolrInstance-1344678068505/slave/collection1/'
[junit4:junit4]   2> 303 T1148 oasc.SolrConfig.<init> Using Lucene MatchVersion:
LUCENE_50
[junit4:junit4]   2> 352 T1148 oasc.SolrConfig.<init> Loaded SolrConfig: solrconfig.xml
[junit4:junit4]   2> 353 T1148 oass.IndexSchema.readSchema Reading Solr Schema
[junit4:junit4]   2> 356 T1148 oass.IndexSchema.readSchema Schema name=test
[junit4:junit4]   2> 373 T1148 oass.IndexSchema.readSchema unique key field: id
[junit4:junit4]   2> 375 T1148 oasc.SolrCore.<init> [collection1] Opening new SolrCore
at ./org.apache.solr.handler.TestReplicationHandler$SolrInstance-1344678068505/slave/collection1/,
dataDir=./org.apache.solr.handler.TestReplicationHandler$SolrInstance-1344678068505/slave/collection1/data/
[junit4:junit4]   2> 376 T1148 oasc.SolrCore.<init> JMX monitoring not detected for
core: collection1
[junit4:junit4]   2> 376 T1148 oasc.SolrCore.getNewIndexDir WARNING New index directory
detected: old=null new=./org.apache.solr.handler.TestReplicationHandler$SolrInstance-1344678068505/slave/collection1/data/index/
[junit4:junit4]   2> 376 T1148 oasc.SolrCore.initIndex WARNING [collection1] Solr index
directory './org.apache.solr.handler.TestReplicationHandler$SolrInstance-1344678068505/slave/collection1/data/index'
doesn't exist. Creating new index...
[junit4:junit4]   2> 408 T1148 oasc.SolrDeletionPolicy.onCommit SolrDeletionPolicy.onCommit:
commits:num=1
[junit4:junit4]   2> 		commit{dir=NRTCachingDirectory(org.apache.lucene.store.NIOFSDirectory@/usr/home/hudson/hudson-slave/workspace/Lucene-Solr-tests-only-trunk-java7/solr/build/solr-core/test/J1/org.apache.solr.handler.TestReplicationHandler$SolrInstance-1344678068505/slave/collection1/data/index
lockFactory=org.apache.lucene.store.SingleInstanceLockFactory@64d8c4c4; maxCacheMB=48.0 maxMergeSizeMB=4.0),segFN=segments_1,generation=1,filenames=[segments_1]
[junit4:junit4]   2> 408 T1148 oasc.SolrDeletionPolicy.updateCommits newest commit = 1
[junit4:junit4]   2> 410 T1148 oasc.RequestHandlers.initHandlersFromConfig created standard:
solr.StandardRequestHandler
[junit4:junit4]   2> 410 T1148 oasc.RequestHandlers.initHandlersFromConfig created defaults:
solr.StandardRequestHandler
[junit4:junit4]   2> 410 T1148 oasc.RequestHandlers.initHandlersFromConfig adding lazy
requestHandler: solr.StandardRequestHandler
[junit4:junit4]   2> 411 T1148 oasc.RequestHandlers.initHandlersFromConfig created lazy:
solr.StandardRequestHandler
[junit4:junit4]   2> 411 T1148 oasc.RequestHandlers.initHandlersFromConfig created /update:
solr.UpdateRequestHandler
[junit4:junit4]   2> 411 T1148 oasc.RequestHandlers.initHandlersFromConfig created /replication:
solr.ReplicationHandler
[junit4:junit4]   2> 413 T1148 oashl.XMLLoader.init xsltCacheLifetimeSeconds=60
[junit4:junit4]   2> 416 T1148 oass.SolrIndexSearcher.<init> Opening Searcher@5568ec10
main
[junit4:junit4]   2> 417 T1148 oasu.CommitTracker.<init> Hard AutoCommit: disabled
[junit4:junit4]   2> 417 T1148 oasu.CommitTracker.<init> Soft AutoCommit: disabled
[junit4:junit4]   2> 418 T1148 oashc.HttpShardHandlerFactory.getParameter Setting socketTimeout
to: 0
[junit4:junit4]   2> 418 T1148 oashc.HttpShardHandlerFactory.getParameter Setting urlScheme
to: http://
[junit4:junit4]   2> 418 T1148 oashc.HttpShardHandlerFactory.getParameter Setting connTimeout
to: 0
[junit4:junit4]   2> 418 T1148 oashc.HttpShardHandlerFactory.getParameter Setting maxConnectionsPerHost
to: 20
[junit4:junit4]   2> 418 T1148 oashc.HttpShardHandlerFactory.getParameter Setting corePoolSize
to: 0
[junit4:junit4]   2> 419 T1148 oashc.HttpShardHandlerFactory.getParameter Setting maximumPoolSize
to: 2147483647
[junit4:junit4]   2> 419 T1148 oashc.HttpShardHandlerFactory.getParameter Setting maxThreadIdleTime
to: 5
[junit4:junit4]   2> 419 T1148 oashc.HttpShardHandlerFactory.getParameter Setting sizeOfQueue
to: -1
[junit4:junit4]   2> 419 T1148 oashc.HttpShardHandlerFactory.getParameter Setting fairnessPolicy
to: false
[junit4:junit4]   2> 420 T1148 oascsi.HttpClientUtil.createClient Creating new http client,
config:maxConnectionsPerHost=20&maxConnections=10000&socketTimeout=0&connTimeout=0&retry=false
[junit4:junit4]   2> 430 T1148 oash.SnapPuller.startExecutorService Poll Scheduled at an
interval of 1000ms
[junit4:junit4]   2> 430 T1148 oasc.CoreContainer.register registering core: collection1
[junit4:junit4]   2> 430 T1168 oasc.SolrCore.registerSearcher [collection1] Registered
new searcher Searcher@5568ec10 main{StandardDirectoryReader(segments_1:1)}
[junit4:junit4]   2> 430 T1148 oass.SolrDispatchFilter.init user.dir=/usr/home/hudson/hudson-slave/workspace/Lucene-Solr-tests-only-trunk-java7/solr/build/solr-core/test/J1
[junit4:junit4]   2> 431 T1148 oass.SolrDispatchFilter.init SolrDispatchFilter.init() done
[junit4:junit4]   2> 431 T1148 oascsi.HttpClientUtil.createClient Creating new http client,
config:maxConnections=128&maxConnectionsPerHost=32&followRedirects=false
[junit4:junit4]   2> 
[junit4:junit4]    > (@AfterClass output)
[junit4:junit4]   2> 33143 T1148 oasc.CoreContainer.shutdown Shutting down CoreContainer
instance=1050829295
[junit4:junit4]   2> 33144 T1148 oasc.SolrCore.close [collection1]  CLOSING SolrCore org.apache.solr.core.SolrCore@76178940
[junit4:junit4]   2> 33144 T1148 oasc.SolrCore.closeSearcher [collection1] Closing main
searcher on request.
[junit4:junit4]   2> 33144 T1148 oasu.DirectUpdateHandler2.close closing DirectUpdateHandler2{commits=1,autocommits=0,soft
autocommits=0,optimizes=0,rollbacks=0,expungeDeletes=0,docsPending=0,adds=0,deletesById=0,deletesByQuery=0,errors=0,cumulative_adds=493,cumulative_deletesById=0,cumulative_deletesByQuery=1,cumulative_errors=0}
[junit4:junit4]   2> 33146 T1148 oejsh.ContextHandler.doStop stopped o.e.j.s.ServletContextHandler{/solr,null}
[junit4:junit4]   2> 33198 T1148 oasc.CoreContainer.shutdown Shutting down CoreContainer
instance=663456232
[junit4:junit4]   2> 33198 T1148 oasc.SolrCore.close [collection1]  CLOSING SolrCore org.apache.solr.core.SolrCore@3d5e39ca
[junit4:junit4]   2> 33199 T1148 oasc.SolrCore.closeSearcher [collection1] Closing main
searcher on request.
[junit4:junit4]   2> 33199 T1148 oasu.DirectUpdateHandler2.close closing DirectUpdateHandler2{commits=2,autocommits=0,soft
autocommits=0,optimizes=0,rollbacks=0,expungeDeletes=0,docsPending=0,adds=0,deletesById=0,deletesByQuery=0,errors=0,cumulative_adds=1,cumulative_deletesById=0,cumulative_deletesByQuery=0,cumulative_errors=0}
[junit4:junit4]   2> 33200 T1148 oejsh.ContextHandler.doStop stopped o.e.j.s.ServletContextHandler{/solr,null}
[junit4:junit4]   2> 33256 T1148 oas.SolrTestCaseJ4.deleteCore ###deleteCore
[junit4:junit4]   2> 35719 T1350 oash.SnapPuller.fetchLatestIndex SEVERE Master at: http://localhost:50878/solr
is not available. Index fetch failed. Exception: org.apache.solr.client.solrj.SolrServerException:
IOException occured when talking to server at: http://localhost:50878/solr
[junit4:junit4]   2> 35721 T1350 oash.SnapPuller.logReplicationTimeAndConfFiles WARNING
Exception while updating statistics java.io.FileNotFoundException: ./org.apache.solr.handler.TestReplicationHandler$SolrInstance-1344678068505/slave/collection1/data/replication.properties
(No such file or directory)
[junit4:junit4]   2> 	at java.io.FileOutputStream.open(Native Method)
[junit4:junit4]   2> 	at java.io.FileOutputStream.<init>(FileOutputStream.java:212)
[junit4:junit4]   2> 	at java.io.FileOutputStream.<init>(FileOutputStream.java:165)
[junit4:junit4]   2> 	at org.apache.solr.handler.SnapPuller.logReplicationTimeAndConfFiles(SnapPuller.java:481)
[junit4:junit4]   2> 	at org.apache.solr.handler.SnapPuller.fetchLatestIndex(SnapPuller.java:407)
[junit4:junit4]   2> 	at org.apache.solr.handler.ReplicationHandler.doFetch(ReplicationHandler.java:297)
[junit4:junit4]   2> 	at org.apache.solr.handler.SnapPuller$1.run(SnapPuller.java:175)
[junit4:junit4]   2> 	at java.util.concurrent.Executors$RunnableAdapter.call(Executors.java:471)
[junit4:junit4]   2> 	at java.util.concurrent.FutureTask$Sync.innerRunAndReset(FutureTask.java:351)
[junit4:junit4]   2> 	at java.util.concurrent.FutureTask.runAndReset(FutureTask.java:178)
[junit4:junit4]   2> 	at java.util.concurrent.ScheduledThreadPoolExecutor$ScheduledFutureTask.access$301(ScheduledThreadPoolExecutor.java:178)
[junit4:junit4]   2> 	at java.util.concurrent.ScheduledThreadPoolExecutor$ScheduledFutureTask.run(ScheduledThreadPoolExecutor.java:293)
[junit4:junit4]   2> 	at java.util.concurrent.ThreadPoolExecutor.runWorker(ThreadPoolExecutor.java:1110)
[junit4:junit4]   2> 	at java.util.concurrent.ThreadPoolExecutor$Worker.run(ThreadPoolExecutor.java:603)
[junit4:junit4]   2> 	at java.lang.Thread.run(Thread.java:722)
[junit4:junit4]   2> 
[junit4:junit4]   2> 154378 T1148 oas.SolrTestCaseJ4.endTrackingSearchers SEVERE ERROR:
SolrIndexSearcher opens=78 closes=77
[junit4:junit4]   2> NOTE: test params are: codec=SimpleText, sim=RandomSimilarityProvider(queryNorm=true,coord=crazy):
{}, locale=de_DE, timezone=America/Creston
[junit4:junit4]   2> NOTE: FreeBSD 9.0-RELEASE amd64/Oracle Corporation 1.7.0_05 (64-bit)/cpus=16,threads=1,free=51198400,total=260046848
[junit4:junit4]   2> NOTE: All tests run in this JVM: [ClusterStateTest, IndexSchemaTest,
TestReversedWildcardFilterFactory, TestBinaryField, TestSolrJ, PrimitiveFieldTypeTest, EchoParamsTest,
BasicFunctionalityTest, TestPropInjectDefaults, TestRTGBase, SignatureUpdateProcessorFactoryTest,
SolrInfoMBeanTest, TestUtils, TestMergePolicyConfig, PrimUtilsTest, FileUtilsTest, StatsComponentTest,
SuggesterTSTTest, DOMUtilTest, SolrCoreTest, LegacyHTMLStripCharFilterTest, LeaderElectionTest,
OpenExchangeRatesOrgProviderTest, TestSolrXMLSerializer, FieldMutatingUpdateProcessorTest,
DocumentBuilderTest, TermVectorComponentTest, TestSolrCoreProperties, TestBM25SimilarityFactory,
FullSolrCloudDistribCmdsTest, SuggesterTest, SyncSliceTest, HighlighterTest, BadIndexSchemaTest,
TestDistributedGrouping, TestCharFilters, TestRemoteStreaming, TestPluginEnable, ShowFileRequestHandlerTest,
OutputWriterTest, StandardRequestHandlerTest, IndexReaderFactoryTest, XmlUpdateRequestHandlerTest,
DirectUpdateHandlerTest, SoftAutoCommitTest, UpdateParamsTest, OverseerTest, TestReplicationHandler]
[junit4:junit4]   2> NOTE: reproduce with: ant test  -Dtestcase=TestReplicationHandler
-Dtests.seed=7BC27597C902F00A -Dtests.multiplier=3 -Dtests.slow=true -Dtests.locale=de_DE
-Dtests.timezone=America/Creston -Dtests.file.encoding=UTF-8
[junit4:junit4]   2> 
[junit4:junit4] ERROR   0.00s J1 | TestReplicationHandler (suite)
[junit4:junit4]    > Throwable #1: java.lang.AssertionError: ERROR: SolrIndexSearcher opens=78
closes=77
[junit4:junit4]    > 	at __randomizedtesting.SeedInfo.seed([7BC27597C902F00A]:0)
[junit4:junit4]    > 	at org.junit.Assert.fail(Assert.java:93)
[junit4:junit4]    > 	at org.apache.solr.SolrTestCaseJ4.endTrackingSearchers(SolrTestCaseJ4.java:216)
[junit4:junit4]    > 	at org.apache.solr.SolrTestCaseJ4.afterClass(SolrTestCaseJ4.java:82)
[junit4:junit4]    > 	at sun.reflect.GeneratedMethodAccessor13.invoke(Unknown Source)
[junit4:junit4]    > 	at sun.reflect.DelegatingMethodAccessorImpl.invoke(DelegatingMethodAccessorImpl.java:43)
[junit4:junit4]    > 	at java.lang.reflect.Method.invoke(Method.java:601)
[junit4:junit4]    > 	at com.carrotsearch.randomizedtesting.RandomizedRunner.invoke(RandomizedRunner.java:1995)
[junit4:junit4]    > 	at com.carrotsearch.randomizedtesting.RandomizedRunner.access$1100(RandomizedRunner.java:132)
[junit4:junit4]    > 	at com.carrotsearch.randomizedtesting.RandomizedRunner$5.evaluate(RandomizedRunner.java:754)
[junit4:junit4]    > 	at com.carrotsearch.randomizedtesting.rules.SystemPropertiesRestoreRule$1.evaluate(SystemPropertiesRestoreRule.java:53)
[junit4:junit4]    > 	at org.apache.lucene.util.AbstractBeforeAfterRule$1.evaluate(AbstractBeforeAfterRule.java:45)
[junit4:junit4]    > 	at org.apache.lucene.util.TestRuleReportUncaughtExceptions$1.evaluate(TestRuleReportUncaughtExceptions.java:68)
[junit4:junit4]    > 	at org.apache.lucene.util.TestRuleStoreClassName$1.evaluate(TestRuleStoreClassName.java:38)
[junit4:junit4]    > 	at com.carrotsearch.randomizedtesting.rules.SystemPropertiesInvariantRule$1.evaluate(SystemPropertiesInvariantRule.java:55)
[junit4:junit4]    > 	at org.apache.lucene.util.TestRuleNoInstanceHooksOverrides$1.evaluate(TestRuleNoInstanceHooksOverrides.java:53)
[junit4:junit4]    > 	at org.apache.lucene.util.TestRuleNoStaticHooksShadowing$1.evaluate(TestRuleNoStaticHooksShadowing.java:52)
[junit4:junit4]    > 	at org.apache.lucene.util.TestRuleAssertionsRequired$1.evaluate(TestRuleAssertionsRequired.java:36)
[junit4:junit4]    > 	at org.apache.lucene.util.TestRuleMarkFailure$1.evaluate(TestRuleMarkFailure.java:48)
[junit4:junit4]    > 	at org.apache.lucene.util.TestRuleIgnoreAfterMaxFailures$1.evaluate(TestRuleIgnoreAfterMaxFailures.java:70)
[junit4:junit4]    > 	at org.apache.lucene.util.TestRuleIgnoreTestSuites$1.evaluate(TestRuleIgnoreTestSuites.java:55)
[junit4:junit4]    > 	at com.carrotsearch.randomizedtesting.RandomizedRunner.runSuite(RandomizedRunner.java:605)
[junit4:junit4]    > 	at com.carrotsearch.randomizedtesting.RandomizedRunner.access$400(RandomizedRunner.java:132)
[junit4:junit4]    > 	at com.carrotsearch.randomizedtesting.RandomizedRunner$2.run(RandomizedRunner.java:551)
[junit4:junit4]    >
[junit4:junit4] Completed on J1 in 154.42s, 1 test, 1 failure <<< FAILURES!

[...truncated 349 lines...]
BUILD FAILED
/usr/home/hudson/hudson-slave/workspace/Lucene-Solr-tests-only-trunk-java7/build.xml:29: The
following error occurred while executing this line:
/usr/home/hudson/hudson-slave/workspace/Lucene-Solr-tests-only-trunk-java7/solr/build.xml:144:
The following error occurred while executing this line:
/usr/home/hudson/hudson-slave/workspace/Lucene-Solr-tests-only-trunk-java7/lucene/module-build.xml:62:
The following error occurred while executing this line:
/usr/home/hudson/hudson-slave/workspace/Lucene-Solr-tests-only-trunk-java7/lucene/common-build.xml:1095:
The following error occurred while executing this line:
/usr/home/hudson/hudson-slave/workspace/Lucene-Solr-tests-only-trunk-java7/lucene/common-build.xml:790:
There were test failures: 224 suites, 901 tests, 1 suite-level error, 6 ignored (1 assumption)

Total time: 32 minutes 33 seconds
Build step 'Invoke Ant' marked build as failure
Recording test results
Email was triggered for: Failure
Sending email for trigger: Failure



Mime
View raw message