lucene-dev mailing list archives

Site index · List index
Message view « Date » · « Thread »
Top « Date » · « Thread »
From Policeman Jenkins Server <jenk...@sd-datasolutions.de>
Subject [JENKINS] Lucene-Solr-4.x-Linux (32bit/jdk1.8.0-ea-b49) - Build # 137 - Failure!
Date Fri, 03 Aug 2012 16:38:18 GMT
Build: http://jenkins.sd-datasolutions.de/job/Lucene-Solr-4.x-Linux/137/
Java: 32bit/jdk1.8.0-ea-b49 -client -XX:+UseG1GC

1 tests failed.
REGRESSION:  org.apache.solr.handler.component.DistributedQueryElevationComponentTest.testDistribSearch

Error Message:
.responseHeader.params.size()==9,9skipped=5,4

Stack Trace:
junit.framework.AssertionFailedError: .responseHeader.params.size()==9,9skipped=5,4
	at __randomizedtesting.SeedInfo.seed([C7D89A39A4A2C37D:463E1421D3FDA341]:0)
	at junit.framework.Assert.fail(Assert.java:50)
	at org.apache.solr.BaseDistributedSearchTestCase.compareResponses(BaseDistributedSearchTestCase.java:670)
	at org.apache.solr.BaseDistributedSearchTestCase.query(BaseDistributedSearchTestCase.java:392)
	at org.apache.solr.handler.component.DistributedQueryElevationComponentTest.doTest(DistributedQueryElevationComponentTest.java:81)
	at org.apache.solr.BaseDistributedSearchTestCase.testDistribSearch(BaseDistributedSearchTestCase.java:679)
	at sun.reflect.NativeMethodAccessorImpl.invoke0(Native Method)
	at sun.reflect.NativeMethodAccessorImpl.invoke(NativeMethodAccessorImpl.java:57)
	at sun.reflect.DelegatingMethodAccessorImpl.invoke(DelegatingMethodAccessorImpl.java:43)
	at java.lang.reflect.Method.invoke(Method.java:474)
	at com.carrotsearch.randomizedtesting.RandomizedRunner.invoke(RandomizedRunner.java:1995)
	at com.carrotsearch.randomizedtesting.RandomizedRunner.access$1100(RandomizedRunner.java:132)
	at com.carrotsearch.randomizedtesting.RandomizedRunner$6.evaluate(RandomizedRunner.java:818)
	at com.carrotsearch.randomizedtesting.RandomizedRunner$7.evaluate(RandomizedRunner.java:877)
	at com.carrotsearch.randomizedtesting.RandomizedRunner$8.evaluate(RandomizedRunner.java:891)
	at com.carrotsearch.randomizedtesting.rules.SystemPropertiesRestoreRule$1.evaluate(SystemPropertiesRestoreRule.java:53)
	at org.apache.lucene.util.TestRuleSetupTeardownChained$1.evaluate(TestRuleSetupTeardownChained.java:50)
	at org.apache.lucene.util.TestRuleFieldCacheSanity$1.evaluate(TestRuleFieldCacheSanity.java:32)
	at org.apache.lucene.util.AbstractBeforeAfterRule$1.evaluate(AbstractBeforeAfterRule.java:45)
	at com.carrotsearch.randomizedtesting.rules.SystemPropertiesInvariantRule$1.evaluate(SystemPropertiesInvariantRule.java:55)
	at org.apache.lucene.util.TestRuleReportUncaughtExceptions$1.evaluate(TestRuleReportUncaughtExceptions.java:68)
	at org.apache.lucene.util.TestRuleThreadAndTestName$1.evaluate(TestRuleThreadAndTestName.java:48)
	at org.apache.lucene.util.TestRuleIgnoreAfterMaxFailures$1.evaluate(TestRuleIgnoreAfterMaxFailures.java:70)
	at org.apache.lucene.util.TestRuleMarkFailure$1.evaluate(TestRuleMarkFailure.java:48)
	at com.carrotsearch.randomizedtesting.RandomizedRunner.runSingleTest(RandomizedRunner.java:825)
	at com.carrotsearch.randomizedtesting.RandomizedRunner.access$700(RandomizedRunner.java:132)
	at com.carrotsearch.randomizedtesting.RandomizedRunner$3$1.run(RandomizedRunner.java:671)
	at com.carrotsearch.randomizedtesting.RandomizedRunner$3.evaluate(RandomizedRunner.java:697)
	at com.carrotsearch.randomizedtesting.RandomizedRunner$4.evaluate(RandomizedRunner.java:736)
	at com.carrotsearch.randomizedtesting.RandomizedRunner$5.evaluate(RandomizedRunner.java:747)
	at com.carrotsearch.randomizedtesting.rules.SystemPropertiesRestoreRule$1.evaluate(SystemPropertiesRestoreRule.java:53)
	at org.apache.lucene.util.AbstractBeforeAfterRule$1.evaluate(AbstractBeforeAfterRule.java:45)
	at org.apache.lucene.util.TestRuleReportUncaughtExceptions$1.evaluate(TestRuleReportUncaughtExceptions.java:68)
	at org.apache.lucene.util.TestRuleStoreClassName$1.evaluate(TestRuleStoreClassName.java:38)
	at com.carrotsearch.randomizedtesting.rules.SystemPropertiesInvariantRule$1.evaluate(SystemPropertiesInvariantRule.java:55)
	at org.apache.lucene.util.TestRuleNoInstanceHooksOverrides$1.evaluate(TestRuleNoInstanceHooksOverrides.java:53)
	at org.apache.lucene.util.TestRuleNoStaticHooksShadowing$1.evaluate(TestRuleNoStaticHooksShadowing.java:52)
	at org.apache.lucene.util.TestRuleAssertionsRequired$1.evaluate(TestRuleAssertionsRequired.java:36)
	at org.apache.lucene.util.TestRuleMarkFailure$1.evaluate(TestRuleMarkFailure.java:48)
	at org.apache.lucene.util.TestRuleIgnoreAfterMaxFailures$1.evaluate(TestRuleIgnoreAfterMaxFailures.java:70)
	at org.apache.lucene.util.TestRuleIgnoreTestSuites$1.evaluate(TestRuleIgnoreTestSuites.java:55)
	at com.carrotsearch.randomizedtesting.RandomizedRunner.runSuite(RandomizedRunner.java:605)
	at com.carrotsearch.randomizedtesting.RandomizedRunner.access$400(RandomizedRunner.java:132)
	at com.carrotsearch.randomizedtesting.RandomizedRunner$2.run(RandomizedRunner.java:551)




Build Log:
[...truncated 7236 lines...]
[junit4:junit4] Suite: org.apache.solr.handler.component.DistributedQueryElevationComponentTest
[junit4:junit4] FAILURE 1.81s J1 | DistributedQueryElevationComponentTest.testDistribSearch
[junit4:junit4]    > Throwable #1: junit.framework.AssertionFailedError: .responseHeader.params.size()==9,9skipped=5,4
[junit4:junit4]    > 	at __randomizedtesting.SeedInfo.seed([C7D89A39A4A2C37D:463E1421D3FDA341]:0)
[junit4:junit4]    > 	at junit.framework.Assert.fail(Assert.java:50)
[junit4:junit4]    > 	at org.apache.solr.BaseDistributedSearchTestCase.compareResponses(BaseDistributedSearchTestCase.java:670)
[junit4:junit4]    > 	at org.apache.solr.BaseDistributedSearchTestCase.query(BaseDistributedSearchTestCase.java:392)
[junit4:junit4]    > 	at org.apache.solr.handler.component.DistributedQueryElevationComponentTest.doTest(DistributedQueryElevationComponentTest.java:81)
[junit4:junit4]    > 	at org.apache.solr.BaseDistributedSearchTestCase.testDistribSearch(BaseDistributedSearchTestCase.java:679)
[junit4:junit4]    > 	at sun.reflect.NativeMethodAccessorImpl.invoke0(Native Method)
[junit4:junit4]    > 	at sun.reflect.NativeMethodAccessorImpl.invoke(NativeMethodAccessorImpl.java:57)
[junit4:junit4]    > 	at sun.reflect.DelegatingMethodAccessorImpl.invoke(DelegatingMethodAccessorImpl.java:43)
[junit4:junit4]    > 	at java.lang.reflect.Method.invoke(Method.java:474)
[junit4:junit4]    > 	at com.carrotsearch.randomizedtesting.RandomizedRunner.invoke(RandomizedRunner.java:1995)
[junit4:junit4]    > 	at com.carrotsearch.randomizedtesting.RandomizedRunner.access$1100(RandomizedRunner.java:132)
[junit4:junit4]    > 	at com.carrotsearch.randomizedtesting.RandomizedRunner$6.evaluate(RandomizedRunner.java:818)
[junit4:junit4]    > 	at com.carrotsearch.randomizedtesting.RandomizedRunner$7.evaluate(RandomizedRunner.java:877)
[junit4:junit4]    > 	at com.carrotsearch.randomizedtesting.RandomizedRunner$8.evaluate(RandomizedRunner.java:891)
[junit4:junit4]    > 	at com.carrotsearch.randomizedtesting.rules.SystemPropertiesRestoreRule$1.evaluate(SystemPropertiesRestoreRule.java:53)
[junit4:junit4]    > 	at org.apache.lucene.util.TestRuleSetupTeardownChained$1.evaluate(TestRuleSetupTeardownChained.java:50)
[junit4:junit4]    > 	at org.apache.lucene.util.TestRuleFieldCacheSanity$1.evaluate(TestRuleFieldCacheSanity.java:32)
[junit4:junit4]    > 	at org.apache.lucene.util.AbstractBeforeAfterRule$1.evaluate(AbstractBeforeAfterRule.java:45)
[junit4:junit4]    > 	at com.carrotsearch.randomizedtesting.rules.SystemPropertiesInvariantRule$1.evaluate(SystemPropertiesInvariantRule.java:55)
[junit4:junit4]    > 	at org.apache.lucene.util.TestRuleReportUncaughtExceptions$1.evaluate(TestRuleReportUncaughtExceptions.java:68)
[junit4:junit4]    > 	at org.apache.lucene.util.TestRuleThreadAndTestName$1.evaluate(TestRuleThreadAndTestName.java:48)
[junit4:junit4]    > 	at org.apache.lucene.util.TestRuleIgnoreAfterMaxFailures$1.evaluate(TestRuleIgnoreAfterMaxFailures.java:70)
[junit4:junit4]    > 	at org.apache.lucene.util.TestRuleMarkFailure$1.evaluate(TestRuleMarkFailure.java:48)
[junit4:junit4]    > 	at com.carrotsearch.randomizedtesting.RandomizedRunner.runSingleTest(RandomizedRunner.java:825)
[junit4:junit4]    > 	at com.carrotsearch.randomizedtesting.RandomizedRunner.access$700(RandomizedRunner.java:132)
[junit4:junit4]    > 	at com.carrotsearch.randomizedtesting.RandomizedRunner$3$1.run(RandomizedRunner.java:671)
[junit4:junit4]    > 	at com.carrotsearch.randomizedtesting.RandomizedRunner$3.evaluate(RandomizedRunner.java:697)
[junit4:junit4]    > 	at com.carrotsearch.randomizedtesting.RandomizedRunner$4.evaluate(RandomizedRunner.java:736)
[junit4:junit4]    > 	at com.carrotsearch.randomizedtesting.RandomizedRunner$5.evaluate(RandomizedRunner.java:747)
[junit4:junit4]    > 	at com.carrotsearch.randomizedtesting.rules.SystemPropertiesRestoreRule$1.evaluate(SystemPropertiesRestoreRule.java:53)
[junit4:junit4]    > 	at org.apache.lucene.util.AbstractBeforeAfterRule$1.evaluate(AbstractBeforeAfterRule.java:45)
[junit4:junit4]    > 	at org.apache.lucene.util.TestRuleReportUncaughtExceptions$1.evaluate(TestRuleReportUncaughtExceptions.java:68)
[junit4:junit4]    > 	at org.apache.lucene.util.TestRuleStoreClassName$1.evaluate(TestRuleStoreClassName.java:38)
[junit4:junit4]    > 	at com.carrotsearch.randomizedtesting.rules.SystemPropertiesInvariantRule$1.evaluate(SystemPropertiesInvariantRule.java:55)
[junit4:junit4]    > 	at org.apache.lucene.util.TestRuleNoInstanceHooksOverrides$1.evaluate(TestRuleNoInstanceHooksOverrides.java:53)
[junit4:junit4]    > 	at org.apache.lucene.util.TestRuleNoStaticHooksShadowing$1.evaluate(TestRuleNoStaticHooksShadowing.java:52)
[junit4:junit4]    > 	at org.apache.lucene.util.TestRuleAssertionsRequired$1.evaluate(TestRuleAssertionsRequired.java:36)
[junit4:junit4]    > 	at org.apache.lucene.util.TestRuleMarkFailure$1.evaluate(TestRuleMarkFailure.java:48)
[junit4:junit4]    > 	at org.apache.lucene.util.TestRuleIgnoreAfterMaxFailures$1.evaluate(TestRuleIgnoreAfterMaxFailures.java:70)
[junit4:junit4]    > 	at org.apache.lucene.util.TestRuleIgnoreTestSuites$1.evaluate(TestRuleIgnoreTestSuites.java:55)
[junit4:junit4]    > 	at com.carrotsearch.randomizedtesting.RandomizedRunner.runSuite(RandomizedRunner.java:605)
[junit4:junit4]    > 	at com.carrotsearch.randomizedtesting.RandomizedRunner.access$400(RandomizedRunner.java:132)
[junit4:junit4]    > 	at com.carrotsearch.randomizedtesting.RandomizedRunner$2.run(RandomizedRunner.java:551)
[junit4:junit4]    > 
[junit4:junit4]   2> 2 T50 oas.SolrTestCaseJ4.setUp ###Starting testDistribSearch
[junit4:junit4]   2> 3 T50 oejs.Server.doStart jetty-8.1.2.v20120308
[junit4:junit4]   2> 6 T50 oejs.AbstractConnector.doStart Started SocketConnector@0.0.0.0:45502
[junit4:junit4]   2> 7 T50 oasc.SolrResourceLoader.locateSolrHome JNDI not configured for solr (NoInitialContextEx)
[junit4:junit4]   2> 7 T50 oasc.SolrResourceLoader.locateSolrHome using system property solr.solr.home: /mnt/ssd/jenkins/workspace/Lucene-Solr-4.x-Linux/checkout/solr/build/solr-core/test-files/solr
[junit4:junit4]   2> 7 T50 oasc.SolrResourceLoader.<init> new SolrResourceLoader for deduced Solr Home: '/mnt/ssd/jenkins/workspace/Lucene-Solr-4.x-Linux/checkout/solr/build/solr-core/test-files/solr/'
[junit4:junit4]   2> 24 T50 oass.SolrDispatchFilter.init SolrDispatchFilter.init()
[junit4:junit4]   2> 24 T50 oasc.SolrResourceLoader.locateSolrHome JNDI not configured for solr (NoInitialContextEx)
[junit4:junit4]   2> 24 T50 oasc.SolrResourceLoader.locateSolrHome using system property solr.solr.home: /mnt/ssd/jenkins/workspace/Lucene-Solr-4.x-Linux/checkout/solr/build/solr-core/test-files/solr
[junit4:junit4]   2> 25 T50 oasc.CoreContainer$Initializer.initialize looking for solr.xml: /mnt/ssd/jenkins/workspace/Lucene-Solr-4.x-Linux/checkout/solr/build/solr-core/test-files/solr/solr.xml
[junit4:junit4]   2> 25 T50 oasc.CoreContainer.<init> New CoreContainer 18224169
[junit4:junit4]   2> 25 T50 oasc.CoreContainer.load Loading CoreContainer using Solr Home: '/mnt/ssd/jenkins/workspace/Lucene-Solr-4.x-Linux/checkout/solr/build/solr-core/test-files/solr/'
[junit4:junit4]   2> 25 T50 oasc.SolrResourceLoader.<init> new SolrResourceLoader for directory: '/mnt/ssd/jenkins/workspace/Lucene-Solr-4.x-Linux/checkout/solr/build/solr-core/test-files/solr/'
[junit4:junit4]   2> 40 T50 oasc.CoreContainer.load Registering Log Listener
[junit4:junit4]   2> 53 T50 oasc.CoreContainer.create Creating SolrCore 'collection1' using instanceDir: /mnt/ssd/jenkins/workspace/Lucene-Solr-4.x-Linux/checkout/solr/build/solr-core/test-files/solr/collection1
[junit4:junit4]   2> 54 T50 oasc.SolrResourceLoader.<init> new SolrResourceLoader for directory: '/mnt/ssd/jenkins/workspace/Lucene-Solr-4.x-Linux/checkout/solr/build/solr-core/test-files/solr/collection1/'
[junit4:junit4]   2> 54 T50 oasc.SolrResourceLoader.replaceClassLoader Adding 'file:/mnt/ssd/jenkins/workspace/Lucene-Solr-4.x-Linux/checkout/solr/build/solr-core/test-files/solr/collection1/lib/README' to classloader
[junit4:junit4]   2> 55 T50 oasc.SolrResourceLoader.replaceClassLoader Adding 'file:/mnt/ssd/jenkins/workspace/Lucene-Solr-4.x-Linux/checkout/solr/build/solr-core/test-files/solr/collection1/lib/classes/' to classloader
[junit4:junit4]   2> 77 T50 oasc.SolrConfig.<init> Using Lucene MatchVersion: LUCENE_40
[junit4:junit4]   2> 112 T50 oasc.SolrConfig.<init> Loaded SolrConfig: solrconfig-elevate.xml
[junit4:junit4]   2> 113 T50 oass.IndexSchema.readSchema Reading Solr Schema
[junit4:junit4]   2> 116 T50 oass.IndexSchema.readSchema Schema name=example
[junit4:junit4]   2> 279 T50 oass.IndexSchema.readSchema default search field in schema is text
[junit4:junit4]   2> 281 T50 oass.IndexSchema.readSchema unique key field: id
[junit4:junit4]   2> 284 T50 oasc.SolrCore.<init> [collection1] Opening new SolrCore at /mnt/ssd/jenkins/workspace/Lucene-Solr-4.x-Linux/checkout/solr/build/solr-core/test-files/solr/collection1/, dataDir=./org.apache.solr.handler.component.DistributedQueryElevationComponentTest-1344011139309/control/data/
[junit4:junit4]   2> 284 T50 oasc.JmxMonitoredMap.<init> JMX monitoring is enabled. Adding Solr mbeans to JMX Server: com.sun.jmx.mbeanserver.JmxMBeanServer@192cb49
[junit4:junit4]   2> 285 T50 oasc.SolrCore.getNewIndexDir WARNING New index directory detected: old=null new=./org.apache.solr.handler.component.DistributedQueryElevationComponentTest-1344011139309/control/data/index/
[junit4:junit4]   2> 285 T50 oasc.SolrCore.initIndex WARNING [collection1] Solr index directory './org.apache.solr.handler.component.DistributedQueryElevationComponentTest-1344011139309/control/data/index' doesn't exist. Creating new index...
[junit4:junit4]   2> 286 T50 oasc.SolrDeletionPolicy.onCommit SolrDeletionPolicy.onCommit: commits:num=1
[junit4:junit4]   2> 		commit{dir=MockDirWrapper(org.apache.lucene.store.RAMDirectory@1c3a684 lockFactory=org.apache.lucene.store.SingleInstanceLockFactory@1112885),segFN=segments_1,generation=1,filenames=[segments_1]
[junit4:junit4]   2> 287 T50 oasc.SolrDeletionPolicy.updateCommits newest commit = 1
[junit4:junit4]   2> 288 T50 oasc.RequestHandlers.initHandlersFromConfig created /update: solr.UpdateRequestHandler
[junit4:junit4]   2> 288 T50 oasc.RequestHandlers.initHandlersFromConfig created /elevate: org.apache.solr.handler.component.SearchHandler
[junit4:junit4]   2> 289 T50 oasc.RequestHandlers.initHandlersFromConfig created /dataElevate: org.apache.solr.handler.component.SearchHandler
[junit4:junit4]   2> 289 T50 oashl.XMLLoader.init xsltCacheLifetimeSeconds=60
[junit4:junit4]   2> 289 T50 oasc.RequestHandlers.initHandlersFromConfig WARNING no default request handler is registered (either '/select' or 'standard')
[junit4:junit4]   2> 291 T50 oasc.SolrCore.initDeprecatedSupport WARNING solrconfig.xml uses deprecated <admin/gettableFiles>, Please update your config to use the ShowFileRequestHandler.
[junit4:junit4]   2> 292 T50 oasc.SolrCore.initDeprecatedSupport WARNING adding ShowFileRequestHandler with hidden files: [SCHEMA-TFIDF.XML, SOLRCONFIG-SCRIPT-UPDATEPROCESSOR.XML, SCHEMA-BM25.XML, SOLRCONFIG-PROPINJECT-INDEXDEFAULT.XML, STOP-2.TXT, BAD-MP-SOLRCONFIG.XML, HUNSPELL-TEST.AFF, SOLRCONFIG-SIMPLELOCK.XML, TRIVIAL.UPDATEPROCESSOR1.JS, WDFTYPES.TXT, ADDFIELDS.UPDATEPROCESSOR.JS, TRIVIAL.UPDATEPROCESSOR0.JS, SCHEMA-NOT-REQUIRED-UNIQUE-KEY.XML, SCHEMA-REQUIRED-FIELDS.XML, SOLRCONFIG-MASTER2.XML, SCHEMA-DFR.XML, BAD-SCHEMA-DUP-FIELDTYPE.XML, SCHEMA-LMDIRICHLET.XML, SCHEMA.XML, BAD-SCHEMA-UNIQUEKEY-MULTIVALUED.XML, SOLRCONFIG-REQHANDLER.INCL, SOLRCONFIG-PHRASESUGGEST.XML, SOLRCONFIG-TRANSFORMERS.XML, PHRASESUGGEST.TXT, BAD-SCHEMA-SIM-GLOBAL-VS-FT-MISMATCH.XML, SOLRCONFIG-SPELLCHECKCOMPONENT.XML, SOLRCONFIG-BASIC.XML, SOLRCONFIG-ELEVATE.XML, COMPOUNDDICTIONARY.TXT, SCHEMA-CHARFILTERS.XML, BAD-SCHEMA-EXTERNAL-FILEFIELD.XML, SCHEMA-STOP-KEEP.XML, SOLRCONFIG-NOCACHE.XML, SOLRCONFIG-SLAVE1.XML, KEEP-2.TXT, SOLRCONFIG_CODEC.XML, SCHEMA-SIM.XML, SOLRCONFIG-FUNCTIONQUERY.XML, SOLRCONFIG-QUERYSENDER-NOQUERY.XML, SCHEMA11.XML, HUNSPELL-TEST.DIC, STOPTYPES-2.TXT, CONDITIONAL.UPDATEPROCESSOR.JS, MAPPING-ISOLATIN1ACCENT.TXT, SOLRCONFIG-MASTER.XML, PROTWORDS.TXT, SCHEMA-TRIE.XML, MISSING.FUNCTIONS.UPDATEPROCESSOR.JS, BAD-SCHEMA-ANALYZER-CLASS-AND-NESTED.XML, SCHEMA-FOLDING.XML, SOLRCONFIG-HIGHLIGHT.XML, SOLRCONFIG-TLOG.XML, SOLRCONFIG-UPDATE-PROCESSOR-CHAINS.XML, SOLRCONFIG-ALTDIRECTORY.XML, BAD-SCHEMA-NOT-INDEXED-BUT-NORMS.XML, SOLRCONFIG-ENABLEPLUGIN.XML, SCHEMA-COLLATEFILTER.XML, STOPWITHBOM.TXT, SOLRCONFIG-NATIVELOCK.XML, SCHEMA_CODEC.XML, SYNONYMS.TXT, SCHEMA12.XML, BAD-SCHEMA-OMIT-TF-BUT-NOT-POS.XML, SCHEMA-COPYFIELD-TEST.XML, STOPWORDS.TXT, SCHEMA-COLLATE.XML, SOLRCONFIG-MASTER1-KEEPONEBACKUP.XML, SOLRCONFIG-DELPOLICY1.XML, SCHEMA-REPLICATION2.XML, SOLRCONFIG-SOLCOREPROPERTIES.XML, KEEP-1.TXT, STEMDICT.TXT, SOLRCONFIG-SPELLCHECKER.XML, STOP-SNOWBALL.TXT, BAD-SCHEMA-DUP-DYNAMICFIELD.XML, SCHEMA-LMJELINEKMERCER.XML, BAD-SCHEMA-DUP-FIELD.XML, SCHEMA-IB.XML, SOLRCONFIG-SOLR-749.XML, SOLRCONFIG-LAZYWRITER.XML, BAD-SCHEMA-UNIQUEKEY-USES-DEFAULT.XML, XSLT, SOLRCONFIG-DELPOLICY2.XML, SCHEMA-BINARYFIELD.XML, SCHEMA-SPELLCHECKER.XML, SOLRCONFIG-PROPINJECT.XML, SCHEMA-MINIMAL.XML, SOLRCONFIG-MASTER3.XML, BAD-SCHEMA-NOT-INDEXED-BUT-TF.XML, OPEN-EXCHANGE-RATES.JSON, HYPHENATION.DTD, FRENCHARTICLES.TXT, SOLRCONFIG-QUERYSENDER.XML, BAD-SCHEMA-NOT-INDEXED-BUT-POS.XML, SOLRCONFIG-SLAVE.XML, SCHEMA-NUMERIC.XML, BAD-SOLRCONFIG-BOGUS-SCRIPTENGINE-NAME.XML, BAD_SOLRCONFIG.XML, SCHEMA-PHRASESUGGEST.XML, SCHEMASURROUND.XML, SOLRCONFIG_PERF.XML, STOPWORDSWRONGENCODING.TXT, SCHEMA-REVERSED.XML, CURRENCY.XML, SOLRCONFIG-REPEATER.XML, BAD-SCHEMA-NONTEXT-ANALYZER.XML, SCHEMA-LUCENEMATCHVERSION.XML, MISSLEADING.EXTENSION.UPDATEPROCESSOR.JS.TXT, DA_COMPOUNDDICTIONARY.TXT, SOLRCONFIG-MERGEPOLICY.XML, OLD_SYNONYMS.TXT, BAD-SOLRCONFIG-MISSING-SCRIPTFILE.XML, SOLRCONFIG-CACHING.XML, BAD-SCHEMA-CODEC-GLOBAL-VS-FT-MISMATCH.XML, SOLRCONFIG-MASTER1.XML, DA_UTF8.XML, BAD-SOLRCONFIG-INVALID-SCRIPTFILE.XML, STOPTYPES-1.TXT, SCHEMA-REPLICATION1.XML, ELEVATE.XML, BAD-SCHEMA-UNIQUEKEY-IS-COPYFIELD-DEST.XML, THROW.ERROR.ON.ADD.UPDATEPROCESSOR.JS, SCHEMA15.XML, SOLRCONFIG-BASIC-LUCENEVERSION31.XML, SOLRCONFIG-XINCLUDE.XML, SOLRCONFIG-TERMINDEX.XML, STOP-1.TXT]
[junit4:junit4]   2> 294 T50 oass.SolrIndexSearcher.<init> Opening Searcher@1843f31 main
[junit4:junit4]   2> 294 T50 oass.SolrIndexSearcher.getIndexDir WARNING WARNING: Directory impl does not support setting indexDir: org.apache.lucene.store.MockDirectoryWrapper
[junit4:junit4]   2> 294 T50 oasu.CommitTracker.<init> Hard AutoCommit: disabled
[junit4:junit4]   2> 295 T50 oasu.CommitTracker.<init> Soft AutoCommit: disabled
[junit4:junit4]   2> 295 T50 oashc.QueryElevationComponent.inform Loading QueryElevation from: /mnt/ssd/jenkins/workspace/Lucene-Solr-4.x-Linux/checkout/solr/build/solr-core/test-files/solr/collection1/conf/elevate.xml
[junit4:junit4]   2> 312 T50 oashc.QueryElevationComponent.inform Loading QueryElevation from: /mnt/ssd/jenkins/workspace/Lucene-Solr-4.x-Linux/checkout/solr/build/solr-core/test-files/solr/collection1/conf/elevate.xml
[junit4:junit4]   2> 319 T50 oashc.HttpShardHandlerFactory.getParameter Setting socketTimeout to: 0
[junit4:junit4]   2> 319 T50 oashc.HttpShardHandlerFactory.getParameter Setting urlScheme to: http://
[junit4:junit4]   2> 319 T50 oashc.HttpShardHandlerFactory.getParameter Setting connTimeout to: 0
[junit4:junit4]   2> 320 T50 oashc.HttpShardHandlerFactory.getParameter Setting maxConnectionsPerHost to: 20
[junit4:junit4]   2> 320 T50 oashc.HttpShardHandlerFactory.getParameter Setting corePoolSize to: 0
[junit4:junit4]   2> 320 T50 oashc.HttpShardHandlerFactory.getParameter Setting maximumPoolSize to: 2147483647
[junit4:junit4]   2> 320 T50 oashc.HttpShardHandlerFactory.getParameter Setting maxThreadIdleTime to: 5
[junit4:junit4]   2> 321 T50 oashc.HttpShardHandlerFactory.getParameter Setting sizeOfQueue to: -1
[junit4:junit4]   2> 321 T50 oashc.HttpShardHandlerFactory.getParameter Setting fairnessPolicy to: false
[junit4:junit4]   2> 321 T50 oascsi.HttpClientUtil.createClient Creating new http client, config:maxConnectionsPerHost=20&maxConnections=10000&socketTimeout=0&connTimeout=0&retry=false
[junit4:junit4]   2> 325 T60 oasc.SolrCore.registerSearcher [collection1] Registered new searcher Searcher@1843f31 main{StandardDirectoryReader(segments_1:1)}
[junit4:junit4]   2> 325 T50 oasc.CoreContainer.register registering core: collection1
[junit4:junit4]   2> 326 T50 oass.SolrDispatchFilter.init user.dir=/mnt/ssd/jenkins/workspace/Lucene-Solr-4.x-Linux/checkout/solr/build/solr-core/test/J1
[junit4:junit4]   2> 326 T50 oass.SolrDispatchFilter.init SolrDispatchFilter.init() done
[junit4:junit4]   2> 326 T50 oascsi.HttpClientUtil.createClient Creating new http client, config:maxConnections=128&maxConnectionsPerHost=32&followRedirects=false
[junit4:junit4]   2> 329 T50 oejs.Server.doStart jetty-8.1.2.v20120308
[junit4:junit4]   2> 331 T50 oejs.AbstractConnector.doStart Started SocketConnector@0.0.0.0:39102
[junit4:junit4]   2> 331 T50 oasc.SolrResourceLoader.locateSolrHome JNDI not configured for solr (NoInitialContextEx)
[junit4:junit4]   2> 331 T50 oasc.SolrResourceLoader.locateSolrHome using system property solr.solr.home: /mnt/ssd/jenkins/workspace/Lucene-Solr-4.x-Linux/checkout/solr/build/solr-core/test-files/solr
[junit4:junit4]   2> 331 T50 oasc.SolrResourceLoader.<init> new SolrResourceLoader for deduced Solr Home: '/mnt/ssd/jenkins/workspace/Lucene-Solr-4.x-Linux/checkout/solr/build/solr-core/test-files/solr/'
[junit4:junit4]   2> 339 T50 oass.SolrDispatchFilter.init SolrDispatchFilter.init()
[junit4:junit4]   2> 339 T50 oasc.SolrResourceLoader.locateSolrHome JNDI not configured for solr (NoInitialContextEx)
[junit4:junit4]   2> 340 T50 oasc.SolrResourceLoader.locateSolrHome using system property solr.solr.home: /mnt/ssd/jenkins/workspace/Lucene-Solr-4.x-Linux/checkout/solr/build/solr-core/test-files/solr
[junit4:junit4]   2> 340 T50 oasc.CoreContainer$Initializer.initialize looking for solr.xml: /mnt/ssd/jenkins/workspace/Lucene-Solr-4.x-Linux/checkout/solr/build/solr-core/test-files/solr/solr.xml
[junit4:junit4]   2> 340 T50 oasc.CoreContainer.<init> New CoreContainer 24659514
[junit4:junit4]   2> 340 T50 oasc.CoreContainer.load Loading CoreContainer using Solr Home: '/mnt/ssd/jenkins/workspace/Lucene-Solr-4.x-Linux/checkout/solr/build/solr-core/test-files/solr/'
[junit4:junit4]   2> 341 T50 oasc.SolrResourceLoader.<init> new SolrResourceLoader for directory: '/mnt/ssd/jenkins/workspace/Lucene-Solr-4.x-Linux/checkout/solr/build/solr-core/test-files/solr/'
[junit4:junit4]   2> 351 T50 oasc.CoreContainer.load Registering Log Listener
[junit4:junit4]   2> 362 T50 oasc.CoreContainer.create Creating SolrCore 'collection1' using instanceDir: /mnt/ssd/jenkins/workspace/Lucene-Solr-4.x-Linux/checkout/solr/build/solr-core/test-files/solr/collection1
[junit4:junit4]   2> 363 T50 oasc.SolrResourceLoader.<init> new SolrResourceLoader for directory: '/mnt/ssd/jenkins/workspace/Lucene-Solr-4.x-Linux/checkout/solr/build/solr-core/test-files/solr/collection1/'
[junit4:junit4]   2> 363 T50 oasc.SolrResourceLoader.replaceClassLoader Adding 'file:/mnt/ssd/jenkins/workspace/Lucene-Solr-4.x-Linux/checkout/solr/build/solr-core/test-files/solr/collection1/lib/README' to classloader
[junit4:junit4]   2> 363 T50 oasc.SolrResourceLoader.replaceClassLoader Adding 'file:/mnt/ssd/jenkins/workspace/Lucene-Solr-4.x-Linux/checkout/solr/build/solr-core/test-files/solr/collection1/lib/classes/' to classloader
[junit4:junit4]   2> 386 T50 oasc.SolrConfig.<init> Using Lucene MatchVersion: LUCENE_40
[junit4:junit4]   2> 421 T50 oasc.SolrConfig.<init> Loaded SolrConfig: solrconfig-elevate.xml
[junit4:junit4]   2> 422 T50 oass.IndexSchema.readSchema Reading Solr Schema
[junit4:junit4]   2> 425 T50 oass.IndexSchema.readSchema Schema name=example
[junit4:junit4]   2> 586 T50 oass.IndexSchema.readSchema default search field in schema is text
[junit4:junit4]   2> 588 T50 oass.IndexSchema.readSchema unique key field: id
[junit4:junit4]   2> 591 T50 oasc.SolrCore.<init> [collection1] Opening new SolrCore at /mnt/ssd/jenkins/workspace/Lucene-Solr-4.x-Linux/checkout/solr/build/solr-core/test-files/solr/collection1/, dataDir=./org.apache.solr.handler.component.DistributedQueryElevationComponentTest-1344011139309/shard0/data/
[junit4:junit4]   2> 591 T50 oasc.JmxMonitoredMap.<init> JMX monitoring is enabled. Adding Solr mbeans to JMX Server: com.sun.jmx.mbeanserver.JmxMBeanServer@192cb49
[junit4:junit4]   2> 592 T50 oasc.SolrCore.getNewIndexDir WARNING New index directory detected: old=null new=./org.apache.solr.handler.component.DistributedQueryElevationComponentTest-1344011139309/shard0/data/index/
[junit4:junit4]   2> 592 T50 oasc.SolrCore.initIndex WARNING [collection1] Solr index directory './org.apache.solr.handler.component.DistributedQueryElevationComponentTest-1344011139309/shard0/data/index' doesn't exist. Creating new index...
[junit4:junit4]   2> 593 T50 oasc.SolrDeletionPolicy.onCommit SolrDeletionPolicy.onCommit: commits:num=1
[junit4:junit4]   2> 		commit{dir=MockDirWrapper(org.apache.lucene.store.RAMDirectory@1db1499 lockFactory=org.apache.lucene.store.SingleInstanceLockFactory@cbebc),segFN=segments_1,generation=1,filenames=[segments_1]
[junit4:junit4]   2> 594 T50 oasc.SolrDeletionPolicy.updateCommits newest commit = 1
[junit4:junit4]   2> 595 T50 oasc.RequestHandlers.initHandlersFromConfig created /update: solr.UpdateRequestHandler
[junit4:junit4]   2> 595 T50 oasc.RequestHandlers.initHandlersFromConfig created /elevate: org.apache.solr.handler.component.SearchHandler
[junit4:junit4]   2> 596 T50 oasc.RequestHandlers.initHandlersFromConfig created /dataElevate: org.apache.solr.handler.component.SearchHandler
[junit4:junit4]   2> 596 T50 oashl.XMLLoader.init xsltCacheLifetimeSeconds=60
[junit4:junit4]   2> 597 T50 oasc.RequestHandlers.initHandlersFromConfig WARNING no default request handler is registered (either '/select' or 'standard')
[junit4:junit4]   2> 598 T50 oasc.SolrCore.initDeprecatedSupport WARNING solrconfig.xml uses deprecated <admin/gettableFiles>, Please update your config to use the ShowFileRequestHandler.
[junit4:junit4]   2> 599 T50 oasc.SolrCore.initDeprecatedSupport WARNING adding ShowFileRequestHandler with hidden files: [SCHEMA-TFIDF.XML, SOLRCONFIG-SCRIPT-UPDATEPROCESSOR.XML, SCHEMA-BM25.XML, SOLRCONFIG-PROPINJECT-INDEXDEFAULT.XML, STOP-2.TXT, BAD-MP-SOLRCONFIG.XML, HUNSPELL-TEST.AFF, SOLRCONFIG-SIMPLELOCK.XML, TRIVIAL.UPDATEPROCESSOR1.JS, WDFTYPES.TXT, ADDFIELDS.UPDATEPROCESSOR.JS, TRIVIAL.UPDATEPROCESSOR0.JS, SCHEMA-NOT-REQUIRED-UNIQUE-KEY.XML, SCHEMA-REQUIRED-FIELDS.XML, SOLRCONFIG-MASTER2.XML, SCHEMA-DFR.XML, BAD-SCHEMA-DUP-FIELDTYPE.XML, SCHEMA-LMDIRICHLET.XML, SCHEMA.XML, BAD-SCHEMA-UNIQUEKEY-MULTIVALUED.XML, SOLRCONFIG-REQHANDLER.INCL, SOLRCONFIG-PHRASESUGGEST.XML, SOLRCONFIG-TRANSFORMERS.XML, PHRASESUGGEST.TXT, BAD-SCHEMA-SIM-GLOBAL-VS-FT-MISMATCH.XML, SOLRCONFIG-SPELLCHECKCOMPONENT.XML, SOLRCONFIG-BASIC.XML, SOLRCONFIG-ELEVATE.XML, COMPOUNDDICTIONARY.TXT, SCHEMA-CHARFILTERS.XML, BAD-SCHEMA-EXTERNAL-FILEFIELD.XML, SCHEMA-STOP-KEEP.XML, SOLRCONFIG-NOCACHE.XML, SOLRCONFIG-SLAVE1.XML, KEEP-2.TXT, SOLRCONFIG_CODEC.XML, SCHEMA-SIM.XML, SOLRCONFIG-FUNCTIONQUERY.XML, SOLRCONFIG-QUERYSENDER-NOQUERY.XML, SCHEMA11.XML, HUNSPELL-TEST.DIC, STOPTYPES-2.TXT, CONDITIONAL.UPDATEPROCESSOR.JS, MAPPING-ISOLATIN1ACCENT.TXT, SOLRCONFIG-MASTER.XML, PROTWORDS.TXT, SCHEMA-TRIE.XML, MISSING.FUNCTIONS.UPDATEPROCESSOR.JS, BAD-SCHEMA-ANALYZER-CLASS-AND-NESTED.XML, SCHEMA-FOLDING.XML, SOLRCONFIG-HIGHLIGHT.XML, SOLRCONFIG-TLOG.XML, SOLRCONFIG-UPDATE-PROCESSOR-CHAINS.XML, SOLRCONFIG-ALTDIRECTORY.XML, BAD-SCHEMA-NOT-INDEXED-BUT-NORMS.XML, SOLRCONFIG-ENABLEPLUGIN.XML, SCHEMA-COLLATEFILTER.XML, STOPWITHBOM.TXT, SOLRCONFIG-NATIVELOCK.XML, SCHEMA_CODEC.XML, SYNONYMS.TXT, SCHEMA12.XML, BAD-SCHEMA-OMIT-TF-BUT-NOT-POS.XML, SCHEMA-COPYFIELD-TEST.XML, STOPWORDS.TXT, SCHEMA-COLLATE.XML, SOLRCONFIG-MASTER1-KEEPONEBACKUP.XML, SOLRCONFIG-DELPOLICY1.XML, SCHEMA-REPLICATION2.XML, SOLRCONFIG-SOLCOREPROPERTIES.XML, KEEP-1.TXT, STEMDICT.TXT, SOLRCONFIG-SPELLCHECKER.XML, STOP-SNOWBALL.TXT, BAD-SCHEMA-DUP-DYNAMICFIELD.XML, SCHEMA-LMJELINEKMERCER.XML, BAD-SCHEMA-DUP-FIELD.XML, SCHEMA-IB.XML, SOLRCONFIG-SOLR-749.XML, SOLRCONFIG-LAZYWRITER.XML, BAD-SCHEMA-UNIQUEKEY-USES-DEFAULT.XML, XSLT, SOLRCONFIG-DELPOLICY2.XML, SCHEMA-BINARYFIELD.XML, SCHEMA-SPELLCHECKER.XML, SOLRCONFIG-PROPINJECT.XML, SCHEMA-MINIMAL.XML, SOLRCONFIG-MASTER3.XML, BAD-SCHEMA-NOT-INDEXED-BUT-TF.XML, OPEN-EXCHANGE-RATES.JSON, HYPHENATION.DTD, FRENCHARTICLES.TXT, SOLRCONFIG-QUERYSENDER.XML, BAD-SCHEMA-NOT-INDEXED-BUT-POS.XML, SOLRCONFIG-SLAVE.XML, SCHEMA-NUMERIC.XML, BAD-SOLRCONFIG-BOGUS-SCRIPTENGINE-NAME.XML, BAD_SOLRCONFIG.XML, SCHEMA-PHRASESUGGEST.XML, SCHEMASURROUND.XML, SOLRCONFIG_PERF.XML, STOPWORDSWRONGENCODING.TXT, SCHEMA-REVERSED.XML, CURRENCY.XML, SOLRCONFIG-REPEATER.XML, BAD-SCHEMA-NONTEXT-ANALYZER.XML, SCHEMA-LUCENEMATCHVERSION.XML, MISSLEADING.EXTENSION.UPDATEPROCESSOR.JS.TXT, DA_COMPOUNDDICTIONARY.TXT, SOLRCONFIG-MERGEPOLICY.XML, OLD_SYNONYMS.TXT, BAD-SOLRCONFIG-MISSING-SCRIPTFILE.XML, SOLRCONFIG-CACHING.XML, BAD-SCHEMA-CODEC-GLOBAL-VS-FT-MISMATCH.XML, SOLRCONFIG-MASTER1.XML, DA_UTF8.XML, BAD-SOLRCONFIG-INVALID-SCRIPTFILE.XML, STOPTYPES-1.TXT, SCHEMA-REPLICATION1.XML, ELEVATE.XML, BAD-SCHEMA-UNIQUEKEY-IS-COPYFIELD-DEST.XML, THROW.ERROR.ON.ADD.UPDATEPROCESSOR.JS, SCHEMA15.XML, SOLRCONFIG-BASIC-LUCENEVERSION31.XML, SOLRCONFIG-XINCLUDE.XML, SOLRCONFIG-TERMINDEX.XML, STOP-1.TXT]
[junit4:junit4]   2> 601 T50 oass.SolrIndexSearcher.<init> Opening Searcher@2da63b main
[junit4:junit4]   2> 602 T50 oass.SolrIndexSearcher.getIndexDir WARNING WARNING: Directory impl does not support setting indexDir: org.apache.lucene.store.MockDirectoryWrapper
[junit4:junit4]   2> 602 T50 oasu.CommitTracker.<init> Hard AutoCommit: disabled
[junit4:junit4]   2> 602 T50 oasu.CommitTracker.<init> Soft AutoCommit: disabled
[junit4:junit4]   2> 603 T50 oashc.QueryElevationComponent.inform Loading QueryElevation from: /mnt/ssd/jenkins/workspace/Lucene-Solr-4.x-Linux/checkout/solr/build/solr-core/test-files/solr/collection1/conf/elevate.xml
[junit4:junit4]   2> 610 T50 oashc.QueryElevationComponent.inform Loading QueryElevation from: /mnt/ssd/jenkins/workspace/Lucene-Solr-4.x-Linux/checkout/solr/build/solr-core/test-files/solr/collection1/conf/elevate.xml
[junit4:junit4]   2> 617 T50 oashc.HttpShardHandlerFactory.getParameter Setting socketTimeout to: 0
[junit4:junit4]   2> 617 T50 oashc.HttpShardHandlerFactory.getParameter Setting urlScheme to: http://
[junit4:junit4]   2> 617 T50 oashc.HttpShardHandlerFactory.getParameter Setting connTimeout to: 0
[junit4:junit4]   2> 618 T50 oashc.HttpShardHandlerFactory.getParameter Setting maxConnectionsPerHost to: 20
[junit4:junit4]   2> 618 T50 oashc.HttpShardHandlerFactory.getParameter Setting corePoolSize to: 0
[junit4:junit4]   2> 618 T50 oashc.HttpShardHandlerFactory.getParameter Setting maximumPoolSize to: 2147483647
[junit4:junit4]   2> 618 T50 oashc.HttpShardHandlerFactory.getParameter Setting maxThreadIdleTime to: 5
[junit4:junit4]   2> 619 T50 oashc.HttpShardHandlerFactory.getParameter Setting sizeOfQueue to: -1
[junit4:junit4]   2> 619 T50 oashc.HttpShardHandlerFactory.getParameter Setting fairnessPolicy to: false
[junit4:junit4]   2> 619 T50 oascsi.HttpClientUtil.createClient Creating new http client, config:maxConnectionsPerHost=20&maxConnections=10000&socketTimeout=0&connTimeout=0&retry=false
[junit4:junit4]   2> 624 T70 oasc.SolrCore.registerSearcher [collection1] Registered new searcher Searcher@2da63b main{StandardDirectoryReader(segments_1:1)}
[junit4:junit4]   2> 624 T50 oasc.CoreContainer.register registering core: collection1
[junit4:junit4]   2> 624 T50 oass.SolrDispatchFilter.init user.dir=/mnt/ssd/jenkins/workspace/Lucene-Solr-4.x-Linux/checkout/solr/build/solr-core/test/J1
[junit4:junit4]   2> 624 T50 oass.SolrDispatchFilter.init SolrDispatchFilter.init() done
[junit4:junit4]   2> 625 T50 oascsi.HttpClientUtil.createClient Creating new http client, config:maxConnections=128&maxConnectionsPerHost=32&followRedirects=false
[junit4:junit4]   2> 627 T50 oejs.Server.doStart jetty-8.1.2.v20120308
[junit4:junit4]   2> 629 T50 oejs.AbstractConnector.doStart Started SocketConnector@0.0.0.0:37474
[junit4:junit4]   2> 629 T50 oasc.SolrResourceLoader.locateSolrHome JNDI not configured for solr (NoInitialContextEx)
[junit4:junit4]   2> 630 T50 oasc.SolrResourceLoader.locateSolrHome using system property solr.solr.home: /mnt/ssd/jenkins/workspace/Lucene-Solr-4.x-Linux/checkout/solr/build/solr-core/test-files/solr
[junit4:junit4]   2> 630 T50 oasc.SolrResourceLoader.<init> new SolrResourceLoader for deduced Solr Home: '/mnt/ssd/jenkins/workspace/Lucene-Solr-4.x-Linux/checkout/solr/build/solr-core/test-files/solr/'
[junit4:junit4]   2> 638 T50 oass.SolrDispatchFilter.init SolrDispatchFilter.init()
[junit4:junit4]   2> 638 T50 oasc.SolrResourceLoader.locateSolrHome JNDI not configured for solr (NoInitialContextEx)
[junit4:junit4]   2> 638 T50 oasc.SolrResourceLoader.locateSolrHome using system property solr.solr.home: /mnt/ssd/jenkins/workspace/Lucene-Solr-4.x-Linux/checkout/solr/build/solr-core/test-files/solr
[junit4:junit4]   2> 639 T50 oasc.CoreContainer$Initializer.initialize looking for solr.xml: /mnt/ssd/jenkins/workspace/Lucene-Solr-4.x-Linux/checkout/solr/build/solr-core/test-files/solr/solr.xml
[junit4:junit4]   2> 639 T50 oasc.CoreContainer.<init> New CoreContainer 21045840
[junit4:junit4]   2> 639 T50 oasc.CoreContainer.load Loading CoreContainer using Solr Home: '/mnt/ssd/jenkins/workspace/Lucene-Solr-4.x-Linux/checkout/solr/build/solr-core/test-files/solr/'
[junit4:junit4]   2> 639 T50 oasc.SolrResourceLoader.<init> new SolrResourceLoader for directory: '/mnt/ssd/jenkins/workspace/Lucene-Solr-4.x-Linux/checkout/solr/build/solr-core/test-files/solr/'
[junit4:junit4]   2> 655 T50 oasc.CoreContainer.load Registering Log Listener
[junit4:junit4]   2> 667 T50 oasc.CoreContainer.create Creating SolrCore 'collection1' using instanceDir: /mnt/ssd/jenkins/workspace/Lucene-Solr-4.x-Linux/checkout/solr/build/solr-core/test-files/solr/collection1
[junit4:junit4]   2> 668 T50 oasc.SolrResourceLoader.<init> new SolrResourceLoader for directory: '/mnt/ssd/jenkins/workspace/Lucene-Solr-4.x-Linux/checkout/solr/build/solr-core/test-files/solr/collection1/'
[junit4:junit4]   2> 668 T50 oasc.SolrResourceLoader.replaceClassLoader Adding 'file:/mnt/ssd/jenkins/workspace/Lucene-Solr-4.x-Linux/checkout/solr/build/solr-core/test-files/solr/collection1/lib/README' to classloader
[junit4:junit4]   2> 669 T50 oasc.SolrResourceLoader.replaceClassLoader Adding 'file:/mnt/ssd/jenkins/workspace/Lucene-Solr-4.x-Linux/checkout/solr/build/solr-core/test-files/solr/collection1/lib/classes/' to classloader
[junit4:junit4]   2> 691 T50 oasc.SolrConfig.<init> Using Lucene MatchVersion: LUCENE_40
[junit4:junit4]   2> 727 T50 oasc.SolrConfig.<init> Loaded SolrConfig: solrconfig-elevate.xml
[junit4:junit4]   2> 727 T50 oass.IndexSchema.readSchema Reading Solr Schema
[junit4:junit4]   2> 730 T50 oass.IndexSchema.readSchema Schema name=example
[junit4:junit4]   2> 900 T50 oass.IndexSchema.readSchema default search field in schema is text
[junit4:junit4]   2> 903 T50 oass.IndexSchema.readSchema unique key field: id
[junit4:junit4]   2> 906 T50 oasc.SolrCore.<init> [collection1] Opening new SolrCore at /mnt/ssd/jenkins/workspace/Lucene-Solr-4.x-Linux/checkout/solr/build/solr-core/test-files/solr/collection1/, dataDir=./org.apache.solr.handler.component.DistributedQueryElevationComponentTest-1344011139309/shard1/data/
[junit4:junit4]   2> 906 T50 oasc.JmxMonitoredMap.<init> JMX monitoring is enabled. Adding Solr mbeans to JMX Server: com.sun.jmx.mbeanserver.JmxMBeanServer@192cb49
[junit4:junit4]   2> 907 T50 oasc.SolrCore.getNewIndexDir WARNING New index directory detected: old=null new=./org.apache.solr.handler.component.DistributedQueryElevationComponentTest-1344011139309/shard1/data/index/
[junit4:junit4]   2> 907 T50 oasc.SolrCore.initIndex WARNING [collection1] Solr index directory './org.apache.solr.handler.component.DistributedQueryElevationComponentTest-1344011139309/shard1/data/index' doesn't exist. Creating new index...
[junit4:junit4]   2> 908 T50 oasc.SolrDeletionPolicy.onCommit SolrDeletionPolicy.onCommit: commits:num=1
[junit4:junit4]   2> 		commit{dir=MockDirWrapper(org.apache.lucene.store.RAMDirectory@19974ba lockFactory=org.apache.lucene.store.SingleInstanceLockFactory@c24109),segFN=segments_1,generation=1,filenames=[segments_1]
[junit4:junit4]   2> 909 T50 oasc.SolrDeletionPolicy.updateCommits newest commit = 1
[junit4:junit4]   2> 914 T50 oasc.RequestHandlers.initHandlersFromConfig created /update: solr.UpdateRequestHandler
[junit4:junit4]   2> 915 T50 oasc.RequestHandlers.initHandlersFromConfig created /elevate: org.apache.solr.handler.component.SearchHandler
[junit4:junit4]   2> 916 T50 oasc.RequestHandlers.initHandlersFromConfig created /dataElevate: org.apache.solr.handler.component.SearchHandler
[junit4:junit4]   2> 916 T50 oashl.XMLLoader.init xsltCacheLifetimeSeconds=60
[junit4:junit4]   2> 917 T50 oasc.RequestHandlers.initHandlersFromConfig WARNING no default request handler is registered (either '/select' or 'standard')
[junit4:junit4]   2> 919 T50 oasc.SolrCore.initDeprecatedSupport WARNING solrconfig.xml uses deprecated <admin/gettableFiles>, Please update your config to use the ShowFileRequestHandler.
[junit4:junit4]   2> 921 T50 oasc.SolrCore.initDeprecatedSupport WARNING adding ShowFileRequestHandler with hidden files: [SCHEMA-TFIDF.XML, SOLRCONFIG-SCRIPT-UPDATEPROCESSOR.XML, SCHEMA-BM25.XML, SOLRCONFIG-PROPINJECT-INDEXDEFAULT.XML, STOP-2.TXT, BAD-MP-SOLRCONFIG.XML, HUNSPELL-TEST.AFF, SOLRCONFIG-SIMPLELOCK.XML, TRIVIAL.UPDATEPROCESSOR1.JS, WDFTYPES.TXT, ADDFIELDS.UPDATEPROCESSOR.JS, TRIVIAL.UPDATEPROCESSOR0.JS, SCHEMA-NOT-REQUIRED-UNIQUE-KEY.XML, SCHEMA-REQUIRED-FIELDS.XML, SOLRCONFIG-MASTER2.XML, SCHEMA-DFR.XML, BAD-SCHEMA-DUP-FIELDTYPE.XML, SCHEMA-LMDIRICHLET.XML, SCHEMA.XML, BAD-SCHEMA-UNIQUEKEY-MULTIVALUED.XML, SOLRCONFIG-REQHANDLER.INCL, SOLRCONFIG-PHRASESUGGEST.XML, SOLRCONFIG-TRANSFORMERS.XML, PHRASESUGGEST.TXT, BAD-SCHEMA-SIM-GLOBAL-VS-FT-MISMATCH.XML, SOLRCONFIG-SPELLCHECKCOMPONENT.XML, SOLRCONFIG-BASIC.XML, SOLRCONFIG-ELEVATE.XML, COMPOUNDDICTIONARY.TXT, SCHEMA-CHARFILTERS.XML, BAD-SCHEMA-EXTERNAL-FILEFIELD.XML, SCHEMA-STOP-KEEP.XML, SOLRCONFIG-NOCACHE.XML, SOLRCONFIG-SLAVE1.XML, KEEP-2.TXT, SOLRCONFIG_CODEC.XML, SCHEMA-SIM.XML, SOLRCONFIG-FUNCTIONQUERY.XML, SOLRCONFIG-QUERYSENDER-NOQUERY.XML, SCHEMA11.XML, HUNSPELL-TEST.DIC, STOPTYPES-2.TXT, CONDITIONAL.UPDATEPROCESSOR.JS, MAPPING-ISOLATIN1ACCENT.TXT, SOLRCONFIG-MASTER.XML, PROTWORDS.TXT, SCHEMA-TRIE.XML, MISSING.FUNCTIONS.UPDATEPROCESSOR.JS, BAD-SCHEMA-ANALYZER-CLASS-AND-NESTED.XML, SCHEMA-FOLDING.XML, SOLRCONFIG-HIGHLIGHT.XML, SOLRCONFIG-TLOG.XML, SOLRCONFIG-UPDATE-PROCESSOR-CHAINS.XML, SOLRCONFIG-ALTDIRECTORY.XML, BAD-SCHEMA-NOT-INDEXED-BUT-NORMS.XML, SOLRCONFIG-ENABLEPLUGIN.XML, SCHEMA-COLLATEFILTER.XML, STOPWITHBOM.TXT, SOLRCONFIG-NATIVELOCK.XML, SCHEMA_CODEC.XML, SYNONYMS.TXT, SCHEMA12.XML, BAD-SCHEMA-OMIT-TF-BUT-NOT-POS.XML, SCHEMA-COPYFIELD-TEST.XML, STOPWORDS.TXT, SCHEMA-COLLATE.XML, SOLRCONFIG-MASTER1-KEEPONEBACKUP.XML, SOLRCONFIG-DELPOLICY1.XML, SCHEMA-REPLICATION2.XML, SOLRCONFIG-SOLCOREPROPERTIES.XML, KEEP-1.TXT, STEMDICT.TXT, SOLRCONFIG-SPELLCHECKER.XML, STOP-SNOWBALL.TXT, BAD-SCHEMA-DUP-DYNAMICFIELD.XML, SCHEMA-LMJELINEKMERCER.XML, BAD-SCHEMA-DUP-FIELD.XML, SCHEMA-IB.XML, SOLRCONFIG-SOLR-749.XML, SOLRCONFIG-LAZYWRITER.XML, BAD-SCHEMA-UNIQUEKEY-USES-DEFAULT.XML, XSLT, SOLRCONFIG-DELPOLICY2.XML, SCHEMA-BINARYFIELD.XML, SCHEMA-SPELLCHECKER.XML, SOLRCONFIG-PROPINJECT.XML, SCHEMA-MINIMAL.XML, SOLRCONFIG-MASTER3.XML, BAD-SCHEMA-NOT-INDEXED-BUT-TF.XML, OPEN-EXCHANGE-RATES.JSON, HYPHENATION.DTD, FRENCHARTICLES.TXT, SOLRCONFIG-QUERYSENDER.XML, BAD-SCHEMA-NOT-INDEXED-BUT-POS.XML, SOLRCONFIG-SLAVE.XML, SCHEMA-NUMERIC.XML, BAD-SOLRCONFIG-BOGUS-SCRIPTENGINE-NAME.XML, BAD_SOLRCONFIG.XML, SCHEMA-PHRASESUGGEST.XML, SCHEMASURROUND.XML, SOLRCONFIG_PERF.XML, STOPWORDSWRONGENCODING.TXT, SCHEMA-REVERSED.XML, CURRENCY.XML, SOLRCONFIG-REPEATER.XML, BAD-SCHEMA-NONTEXT-ANALYZER.XML, SCHEMA-LUCENEMATCHVERSION.XML, MISSLEADING.EXTENSION.UPDATEPROCESSOR.JS.TXT, DA_COMPOUNDDICTIONARY.TXT, SOLRCONFIG-MERGEPOLICY.XML, OLD_SYNONYMS.TXT, BAD-SOLRCONFIG-MISSING-SCRIPTFILE.XML, SOLRCONFIG-CACHING.XML, BAD-SCHEMA-CODEC-GLOBAL-VS-FT-MISMATCH.XML, SOLRCONFIG-MASTER1.XML, DA_UTF8.XML, BAD-SOLRCONFIG-INVALID-SCRIPTFILE.XML, STOPTYPES-1.TXT, SCHEMA-REPLICATION1.XML, ELEVATE.XML, BAD-SCHEMA-UNIQUEKEY-IS-COPYFIELD-DEST.XML, THROW.ERROR.ON.ADD.UPDATEPROCESSOR.JS, SCHEMA15.XML, SOLRCONFIG-BASIC-LUCENEVERSION31.XML, SOLRCONFIG-XINCLUDE.XML, SOLRCONFIG-TERMINDEX.XML, STOP-1.TXT]
[junit4:junit4]   2> 924 T50 oass.SolrIndexSearcher.<init> Opening Searcher@143c7dc main
[junit4:junit4]   2> 924 T50 oass.SolrIndexSearcher.getIndexDir WARNING WARNING: Directory impl does not support setting indexDir: org.apache.lucene.store.MockDirectoryWrapper
[junit4:junit4]   2> 925 T50 oasu.CommitTracker.<init> Hard AutoCommit: disabled
[junit4:junit4]   2> 925 T50 oasu.CommitTracker.<init> Soft AutoCommit: disabled
[junit4:junit4]   2> 926 T50 oashc.QueryElevationComponent.inform Loading QueryElevation from: /mnt/ssd/jenkins/workspace/Lucene-Solr-4.x-Linux/checkout/solr/build/solr-core/test-files/solr/collection1/conf/elevate.xml
[junit4:junit4]   2> 934 T50 oashc.QueryElevationComponent.inform Loading QueryElevation from: /mnt/ssd/jenkins/workspace/Lucene-Solr-4.x-Linux/checkout/solr/build/solr-core/test-files/solr/collection1/conf/elevate.xml
[junit4:junit4]   2> 941 T50 oashc.HttpShardHandlerFactory.getParameter Setting socketTimeout to: 0
[junit4:junit4]   2> 942 T50 oashc.HttpShardHandlerFactory.getParameter Setting urlScheme to: http://
[junit4:junit4]   2> 942 T50 oashc.HttpShardHandlerFactory.getParameter Setting connTimeout to: 0
[junit4:junit4]   2> 942 T50 oashc.HttpShardHandlerFactory.getParameter Setting maxConnectionsPerHost to: 20
[junit4:junit4]   2> 942 T50 oashc.HttpShardHandlerFactory.getParameter Setting corePoolSize to: 0
[junit4:junit4]   2> 943 T50 oashc.HttpShardHandlerFactory.getParameter Setting maximumPoolSize to: 2147483647
[junit4:junit4]   2> 943 T50 oashc.HttpShardHandlerFactory.getParameter Setting maxThreadIdleTime to: 5
[junit4:junit4]   2> 943 T50 oashc.HttpShardHandlerFactory.getParameter Setting sizeOfQueue to: -1
[junit4:junit4]   2> 943 T50 oashc.HttpShardHandlerFactory.getParameter Setting fairnessPolicy to: false
[junit4:junit4]   2> 944 T50 oascsi.HttpClientUtil.createClient Creating new http client, config:maxConnectionsPerHost=20&maxConnections=10000&socketTimeout=0&connTimeout=0&retry=false
[junit4:junit4]   2> 947 T50 oasc.CoreContainer.register registering core: collection1
[junit4:junit4]   2> 947 T80 oasc.SolrCore.registerSearcher [collection1] Registered new searcher Searcher@143c7dc main{StandardDirectoryReader(segments_1:1)}
[junit4:junit4]   2> 947 T50 oass.SolrDispatchFilter.init user.dir=/mnt/ssd/jenkins/workspace/Lucene-Solr-4.x-Linux/checkout/solr/build/solr-core/test/J1
[junit4:junit4]   2> 948 T50 oass.SolrDispatchFilter.init SolrDispatchFilter.init() done
[junit4:junit4]   2> 948 T50 oascsi.HttpClientUtil.createClient Creating new http client, config:maxConnections=128&maxConnectionsPerHost=32&followRedirects=false
[junit4:junit4]   2> 951 T50 oejs.Server.doStart jetty-8.1.2.v20120308
[junit4:junit4]   2> 952 T50 oejs.AbstractConnector.doStart Started SocketConnector@0.0.0.0:46172
[junit4:junit4]   2> 953 T50 oasc.SolrResourceLoader.locateSolrHome JNDI not configured for solr (NoInitialContextEx)
[junit4:junit4]   2> 953 T50 oasc.SolrResourceLoader.locateSolrHome using system property solr.solr.home: /mnt/ssd/jenkins/workspace/Lucene-Solr-4.x-Linux/checkout/solr/build/solr-core/test-files/solr
[junit4:junit4]   2> 953 T50 oasc.SolrResourceLoader.<init> new SolrResourceLoader for deduced Solr Home: '/mnt/ssd/jenkins/workspace/Lucene-Solr-4.x-Linux/checkout/solr/build/solr-core/test-files/solr/'
[junit4:junit4]   2> 961 T50 oass.SolrDispatchFilter.init SolrDispatchFilter.init()
[junit4:junit4]   2> 961 T50 oasc.SolrResourceLoader.locateSolrHome JNDI not configured for solr (NoInitialContextEx)
[junit4:junit4]   2> 962 T50 oasc.SolrResourceLoader.locateSolrHome using system property solr.solr.home: /mnt/ssd/jenkins/workspace/Lucene-Solr-4.x-Linux/checkout/solr/build/solr-core/test-files/solr
[junit4:junit4]   2> 962 T50 oasc.CoreContainer$Initializer.initialize looking for solr.xml: /mnt/ssd/jenkins/workspace/Lucene-Solr-4.x-Linux/checkout/solr/build/solr-core/test-files/solr/solr.xml
[junit4:junit4]   2> 962 T50 oasc.CoreContainer.<init> New CoreContainer 12383647
[junit4:junit4]   2> 962 T50 oasc.CoreContainer.load Loading CoreContainer using Solr Home: '/mnt/ssd/jenkins/workspace/Lucene-Solr-4.x-Linux/checkout/solr/build/solr-core/test-files/solr/'
[junit4:junit4]   2> 963 T50 oasc.SolrResourceLoader.<init> new SolrResourceLoader for directory: '/mnt/ssd/jenkins/workspace/Lucene-Solr-4.x-Linux/checkout/solr/build/solr-core/test-files/solr/'
[junit4:junit4]   2> 973 T50 oasc.CoreContainer.load Registering Log Listener
[junit4:junit4]   2> 985 T50 oasc.CoreContainer.create Creating SolrCore 'collection1' using instanceDir: /mnt/ssd/jenkins/workspace/Lucene-Solr-4.x-Linux/checkout/solr/build/solr-core/test-files/solr/collection1
[junit4:junit4]   2> 985 T50 oasc.SolrResourceLoader.<init> new SolrResourceLoader for directory: '/mnt/ssd/jenkins/workspace/Lucene-Solr-4.x-Linux/checkout/solr/build/solr-core/test-files/solr/collection1/'
[junit4:junit4]   2> 986 T50 oasc.SolrResourceLoader.replaceClassLoader Adding 'file:/mnt/ssd/jenkins/workspace/Lucene-Solr-4.x-Linux/checkout/solr/build/solr-core/test-files/solr/collection1/lib/README' to classloader
[junit4:junit4]   2> 986 T50 oasc.SolrResourceLoader.replaceClassLoader Adding 'file:/mnt/ssd/jenkins/workspace/Lucene-Solr-4.x-Linux/checkout/solr/build/solr-core/test-files/solr/collection1/lib/classes/' to classloader
[junit4:junit4]   2> 1008 T50 oasc.SolrConfig.<init> Using Lucene MatchVersion: LUCENE_40
[junit4:junit4]   2> 1044 T50 oasc.SolrConfig.<init> Loaded SolrConfig: solrconfig-elevate.xml
[junit4:junit4]   2> 1045 T50 oass.IndexSchema.readSchema Reading Solr Schema
[junit4:junit4]   2> 1048 T50 oass.IndexSchema.readSchema Schema name=example
[junit4:junit4]   2> 1225 T50 oass.IndexSchema.readSchema default search field in schema is text
[junit4:junit4]   2> 1228 T50 oass.IndexSchema.readSchema unique key field: id
[junit4:junit4]   2> 1232 T50 oasc.SolrCore.<init> [collection1] Opening new SolrCore at /mnt/ssd/jenkins/workspace/Lucene-Solr-4.x-Linux/checkout/solr/build/solr-core/test-files/solr/collection1/, dataDir=./org.apache.solr.handler.component.DistributedQueryElevationComponentTest-1344011139309/shard2/data/
[junit4:junit4]   2> 1233 T50 oasc.JmxMonitoredMap.<init> JMX monitoring is enabled. Adding Solr mbeans to JMX Server: com.sun.jmx.mbeanserver.JmxMBeanServer@192cb49
[junit4:junit4]   2> 1233 T50 oasc.SolrCore.getNewIndexDir WARNING New index directory detected: old=null new=./org.apache.solr.handler.component.DistributedQueryElevationComponentTest-1344011139309/shard2/data/index/
[junit4:junit4]   2> 1234 T50 oasc.SolrCore.initIndex WARNING [collection1] Solr index directory './org.apache.solr.handler.component.DistributedQueryElevationComponentTest-1344011139309/shard2/data/index' doesn't exist. Creating new index...
[junit4:junit4]   2> 1235 T50 oasc.SolrDeletionPolicy.onCommit SolrDeletionPolicy.onCommit: commits:num=1
[junit4:junit4]   2> 		commit{dir=MockDirWrapper(org.apache.lucene.store.RAMDirectory@17d01cc lockFactory=org.apache.lucene.store.SingleInstanceLockFactory@57b8cb),segFN=segments_1,generation=1,filenames=[segments_1]
[junit4:junit4]   2> 1235 T50 oasc.SolrDeletionPolicy.updateCommits newest commit = 1
[junit4:junit4]   2> 1237 T50 oasc.RequestHandlers.initHandlersFromConfig created /update: solr.UpdateRequestHandler
[junit4:junit4]   2> 1238 T50 oasc.RequestHandlers.initHandlersFromConfig created /elevate: org.apache.solr.handler.component.SearchHandler
[junit4:junit4]   2> 1238 T50 oasc.RequestHandlers.initHandlersFromConfig created /dataElevate: org.apache.solr.handler.component.SearchHandler
[junit4:junit4]   2> 1239 T50 oashl.XMLLoader.init xsltCacheLifetimeSeconds=60
[junit4:junit4]   2> 1239 T50 oasc.RequestHandlers.initHandlersFromConfig WARNING no default request handler is registered (either '/select' or 'standard')
[junit4:junit4]   2> 1241 T50 oasc.SolrCore.initDeprecatedSupport WARNING solrconfig.xml uses deprecated <admin/gettableFiles>, Please update your config to use the ShowFileRequestHandler.
[junit4:junit4]   2> 1242 T50 oasc.SolrCore.initDeprecatedSupport WARNING adding ShowFileRequestHandler with hidden files: [SCHEMA-TFIDF.XML, SOLRCONFIG-SCRIPT-UPDATEPROCESSOR.XML, SCHEMA-BM25.XML, SOLRCONFIG-PROPINJECT-INDEXDEFAULT.XML, STOP-2.TXT, BAD-MP-SOLRCONFIG.XML, HUNSPELL-TEST.AFF, SOLRCONFIG-SIMPLELOCK.XML, TRIVIAL.UPDATEPROCESSOR1.JS, WDFTYPES.TXT, ADDFIELDS.UPDATEPROCESSOR.JS, TRIVIAL.UPDATEPROCESSOR0.JS, SCHEMA-NOT-REQUIRED-UNIQUE-KEY.XML, SCHEMA-REQUIRED-FIELDS.XML, SOLRCONFIG-MASTER2.XML, SCHEMA-DFR.XML, BAD-SCHEMA-DUP-FIELDTYPE.XML, SCHEMA-LMDIRICHLET.XML, SCHEMA.XML, BAD-SCHEMA-UNIQUEKEY-MULTIVALUED.XML, SOLRCONFIG-REQHANDLER.INCL, SOLRCONFIG-PHRASESUGGEST.XML, SOLRCONFIG-TRANSFORMERS.XML, PHRASESUGGEST.TXT, BAD-SCHEMA-SIM-GLOBAL-VS-FT-MISMATCH.XML, SOLRCONFIG-SPELLCHECKCOMPONENT.XML, SOLRCONFIG-BASIC.XML, SOLRCONFIG-ELEVATE.XML, COMPOUNDDICTIONARY.TXT, SCHEMA-CHARFILTERS.XML, BAD-SCHEMA-EXTERNAL-FILEFIELD.XML, SCHEMA-STOP-KEEP.XML, SOLRCONFIG-NOCACHE.XML, SOLRCONFIG-SLAVE1.XML, KEEP-2.TXT, SOLRCONFIG_CODEC.XML, SCHEMA-SIM.XML, SOLRCONFIG-FUNCTIONQUERY.XML, SOLRCONFIG-QUERYSENDER-NOQUERY.XML, SCHEMA11.XML, HUNSPELL-TEST.DIC, STOPTYPES-2.TXT, CONDITIONAL.UPDATEPROCESSOR.JS, MAPPING-ISOLATIN1ACCENT.TXT, SOLRCONFIG-MASTER.XML, PROTWORDS.TXT, SCHEMA-TRIE.XML, MISSING.FUNCTIONS.UPDATEPROCESSOR.JS, BAD-SCHEMA-ANALYZER-CLASS-AND-NESTED.XML, SCHEMA-FOLDING.XML, SOLRCONFIG-HIGHLIGHT.XML, SOLRCONFIG-TLOG.XML, SOLRCONFIG-UPDATE-PROCESSOR-CHAINS.XML, SOLRCONFIG-ALTDIRECTORY.XML, BAD-SCHEMA-NOT-INDEXED-BUT-NORMS.XML, SOLRCONFIG-ENABLEPLUGIN.XML, SCHEMA-COLLATEFILTER.XML, STOPWITHBOM.TXT, SOLRCONFIG-NATIVELOCK.XML, SCHEMA_CODEC.XML, SYNONYMS.TXT, SCHEMA12.XML, BAD-SCHEMA-OMIT-TF-BUT-NOT-POS.XML, SCHEMA-COPYFIELD-TEST.XML, STOPWORDS.TXT, SCHEMA-COLLATE.XML, SOLRCONFIG-MASTER1-KEEPONEBACKUP.XML, SOLRCONFIG-DELPOLICY1.XML, SCHEMA-REPLICATION2.XML, SOLRCONFIG-SOLCOREPROPERTIES.XML, KEEP-1.TXT, STEMDICT.TXT, SOLRCONFIG-SPELLCHECKER.XML, STOP-SNOWBALL.TXT, BAD-SCHEMA-DUP-DYNAMICFIELD.XML, SCHEMA-LMJELINEKMERCER.XML, BAD-SCHEMA-DUP-FIELD.XML, SCHEMA-IB.XML, SOLRCONFIG-SOLR-749.XML, SOLRCONFIG-LAZYWRITER.XML, BAD-SCHEMA-UNIQUEKEY-USES-DEFAULT.XML, XSLT, SOLRCONFIG-DELPOLICY2.XML, SCHEMA-BINARYFIELD.XML, SCHEMA-SPELLCHECKER.XML, SOLRCONFIG-PROPINJECT.XML, SCHEMA-MINIMAL.XML, SOLRCONFIG-MASTER3.XML, BAD-SCHEMA-NOT-INDEXED-BUT-TF.XML, OPEN-EXCHANGE-RATES.JSON, HYPHENATION.DTD, FRENCHARTICLES.TXT, SOLRCONFIG-QUERYSENDER.XML, BAD-SCHEMA-NOT-INDEXED-BUT-POS.XML, SOLRCONFIG-SLAVE.XML, SCHEMA-NUMERIC.XML, BAD-SOLRCONFIG-BOGUS-SCRIPTENGINE-NAME.XML, BAD_SOLRCONFIG.XML, SCHEMA-PHRASESUGGEST.XML, SCHEMASURROUND.XML, SOLRCONFIG_PERF.XML, STOPWORDSWRONGENCODING.TXT, SCHEMA-REVERSED.XML, CURRENCY.XML, SOLRCONFIG-REPEATER.XML, BAD-SCHEMA-NONTEXT-ANALYZER.XML, SCHEMA-LUCENEMATCHVERSION.XML, MISSLEADING.EXTENSION.UPDATEPROCESSOR.JS.TXT, DA_COMPOUNDDICTIONARY.TXT, SOLRCONFIG-MERGEPOLICY.XML, OLD_SYNONYMS.TXT, BAD-SOLRCONFIG-MISSING-SCRIPTFILE.XML, SOLRCONFIG-CACHING.XML, BAD-SCHEMA-CODEC-GLOBAL-VS-FT-MISMATCH.XML, SOLRCONFIG-MASTER1.XML, DA_UTF8.XML, BAD-SOLRCONFIG-INVALID-SCRIPTFILE.XML, STOPTYPES-1.TXT, SCHEMA-REPLICATION1.XML, ELEVATE.XML, BAD-SCHEMA-UNIQUEKEY-IS-COPYFIELD-DEST.XML, THROW.ERROR.ON.ADD.UPDATEPROCESSOR.JS, SCHEMA15.XML, SOLRCONFIG-BASIC-LUCENEVERSION31.XML, SOLRCONFIG-XINCLUDE.XML, SOLRCONFIG-TERMINDEX.XML, STOP-1.TXT]
[junit4:junit4]   2> 1245 T50 oass.SolrIndexSearcher.<init> Opening Searcher@308d8b main
[junit4:junit4]   2> 1245 T50 oass.SolrIndexSearcher.getIndexDir WARNING WARNING: Directory impl does not support setting indexDir: org.apache.lucene.store.MockDirectoryWrapper
[junit4:junit4]   2> 1246 T50 oasu.CommitTracker.<init> Hard AutoCommit: disabled
[junit4:junit4]   2> 1247 T50 oasu.CommitTracker.<init> Soft AutoCommit: disabled
[junit4:junit4]   2> 1247 T50 oashc.QueryElevationComponent.inform Loading QueryElevation from: /mnt/ssd/jenkins/workspace/Lucene-Solr-4.x-Linux/checkout/solr/build/solr-core/test-files/solr/collection1/conf/elevate.xml
[junit4:junit4]   2> 1257 T50 oashc.QueryElevationComponent.inform Loading QueryElevation from: /mnt/ssd/jenkins/workspace/Lucene-Solr-4.x-Linux/checkout/solr/build/solr-core/test-files/solr/collection1/conf/elevate.xml
[junit4:junit4]   2> 1267 T50 oashc.HttpShardHandlerFactory.getParameter Setting socketTimeout to: 0
[junit4:junit4]   2> 1267 T50 oashc.HttpShardHandlerFactory.getParameter Setting urlScheme to: http://
[junit4:junit4]   2> 1268 T50 oashc.HttpShardHandlerFactory.getParameter Setting connTimeout to: 0
[junit4:junit4]   2> 1268 T50 oashc.HttpShardHandlerFactory.getParameter Setting maxConnectionsPerHost to: 20
[junit4:junit4]   2> 1268 T50 oashc.HttpShardHandlerFactory.getParameter Setting corePoolSize to: 0
[junit4:junit4]   2> 1268 T50 oashc.HttpShardHandlerFactory.getParameter Setting maximumPoolSize to: 2147483647
[junit4:junit4]   2> 1269 T50 oashc.HttpShardHandlerFactory.getParameter Setting maxThreadIdleTime to: 5
[junit4:junit4]   2> 1269 T50 oashc.HttpShardHandlerFactory.getParameter Setting sizeOfQueue to: -1
[junit4:junit4]   2> 1270 T50 oashc.HttpShardHandlerFactory.getParameter Setting fairnessPolicy to: false
[junit4:junit4]   2> 1270 T50 oascsi.HttpClientUtil.createClient Creating new http client, config:maxConnectionsPerHost=20&maxConnections=10000&socketTimeout=0&connTimeout=0&retry=false
[junit4:junit4]   2> 1274 T90 oasc.SolrCore.registerSearcher [collection1] Registered new searcher Searcher@308d8b main{StandardDirectoryReader(segments_1:1)}
[junit4:junit4]   2> 1274 T50 oasc.CoreContainer.register registering core: collection1
[junit4:junit4]   2> 1274 T50 oass.SolrDispatchFilter.init user.dir=/mnt/ssd/jenkins/workspace/Lucene-Solr-4.x-Linux/checkout/solr/build/solr-core/test/J1
[junit4:junit4]   2> 1274 T50 oass.SolrDispatchFilter.init SolrDispatchFilter.init() done
[junit4:junit4]   2> 1275 T50 oascsi.HttpClientUtil.createClient Creating new http client, config:maxConnections=128&maxConnectionsPerHost=32&followRedirects=false
[junit4:junit4]   2> ASYNC  NEW_CORE C5 name=collection1 org.apache.solr.core.SolrCore@72e5d6
[junit4:junit4]   2> 1297 T53 C5 oasu.DirectUpdateHandler2.deleteAll [collection1] REMOVING ALL DOCUMENTS FROM INDEX
[junit4:junit4]   2> 1299 T53 C5 oasc.SolrDeletionPolicy.onInit SolrDeletionPolicy.onInit: commits:num=1
[junit4:junit4]   2> 		commit{dir=MockDirWrapper(org.apache.lucene.store.RAMDirectory@1c3a684 lockFactory=org.apache.lucene.store.SingleInstanceLockFactory@1112885),segFN=segments_1,generation=1,filenames=[segments_1]
[junit4:junit4]   2> 1299 T53 C5 oasc.SolrDeletionPolicy.updateCommits newest commit = 1
[junit4:junit4]   2> 1300 T53 C5 UPDATE [collection1] webapp=/solr path=/update params={wt=javabin&version=2} {deleteByQuery=*:*} 0 8
[junit4:junit4]   2> ASYNC  NEW_CORE C6 name=collection1 org.apache.solr.core.SolrCore@e1c345
[junit4:junit4]   2> 1306 T63 C6 oasu.DirectUpdateHandler2.deleteAll [collection1] REMOVING ALL DOCUMENTS FROM INDEX
[junit4:junit4]   2> 1307 T63 C6 oasc.SolrDeletionPolicy.onInit SolrDeletionPolicy.onInit: commits:num=1
[junit4:junit4]   2> 		commit{dir=MockDirWrapper(org.apache.lucene.store.RAMDirectory@1db1499 lockFactory=org.apache.lucene.store.SingleInstanceLockFactory@cbebc),segFN=segments_1,generation=1,filenames=[segments_1]
[junit4:junit4]   2> 1308 T63 C6 oasc.SolrDeletionPolicy.updateCommits newest commit = 1
[junit4:junit4]   2> 1308 T63 C6 UPDATE [collection1] webapp=/solr path=/update params={wt=javabin&version=2} {deleteByQuery=*:*} 0 2
[junit4:junit4]   2> ASYNC  NEW_CORE C7 name=collection1 org.apache.solr.core.SolrCore@192dfa7
[junit4:junit4]   2> 1313 T73 C7 oasu.DirectUpdateHandler2.deleteAll [collection1] REMOVING ALL DOCUMENTS FROM INDEX
[junit4:junit4]   2> 1314 T73 C7 oasc.SolrDeletionPolicy.onInit SolrDeletionPolicy.onInit: commits:num=1
[junit4:junit4]   2> 		commit{dir=MockDirWrapper(org.apache.lucene.store.RAMDirectory@19974ba lockFactory=org.apache.lucene.store.SingleInstanceLockFactory@c24109),segFN=segments_1,generation=1,filenames=[segments_1]
[junit4:junit4]   2> 1314 T73 C7 oasc.SolrDeletionPolicy.updateCommits newest commit = 1
[junit4:junit4]   2> 1315 T73 C7 UPDATE [collection1] webapp=/solr path=/update params={wt=javabin&version=2} {deleteByQuery=*:*} 0 2
[junit4:junit4]   2> ASYNC  NEW_CORE C8 name=collection1 org.apache.solr.core.SolrCore@a25509
[junit4:junit4]   2> 1320 T83 C8 oasu.DirectUpdateHandler2.deleteAll [collection1] REMOVING ALL DOCUMENTS FROM INDEX
[junit4:junit4]   2> 1321 T83 C8 oasc.SolrDeletionPolicy.onInit SolrDeletionPolicy.onInit: commits:num=1
[junit4:junit4]   2> 		commit{dir=MockDirWrapper(org.apache.lucene.store.RAMDirectory@17d01cc lockFactory=org.apache.lucene.store.SingleInstanceLockFactory@57b8cb),segFN=segments_1,generation=1,filenames=[segments_1]
[junit4:junit4]   2> 1321 T83 C8 oasc.SolrDeletionPolicy.updateCommits newest commit = 1
[junit4:junit4]   2> 1322 T83 C8 UPDATE [collection1] webapp=/solr path=/update params={wt=javabin&version=2} {deleteByQuery=*:*} 0 3
[junit4:junit4]   2> 1326 T53 C5 UPDATE [collection1] webapp=/solr path=/update params={wt=javabin&version=2} {add=[1]} 0 2
[junit4:junit4]   2> 1330 T63 C6 UPDATE [collection1] webapp=/solr path=/update params={wt=javabin&version=2} {add=[1]} 0 1
[junit4:junit4]   2> 1333 T53 C5 UPDATE [collection1] webapp=/solr path=/update params={wt=javabin&version=2} {add=[2]} 0 1
[junit4:junit4]   2> 1336 T73 C7 UPDATE [collection1] webapp=/solr path=/update params={wt=javabin&version=2} {add=[2]} 0 1
[junit4:junit4]   2> 1339 T53 C5 UPDATE [collection1] webapp=/solr path=/update params={wt=javabin&version=2} {add=[3]} 0 0
[junit4:junit4]   2> 1343 T83 C8 UPDATE [collection1] webapp=/solr path=/update params={wt=javabin&version=2} {add=[3]} 0 1
[junit4:junit4]   2> 1345 T53 C5 UPDATE [collection1] webapp=/solr path=/update params={wt=javabin&version=2} {add=[4]} 0 0
[junit4:junit4]   2> 1348 T63 C6 UPDATE [collection1] webapp=/solr path=/update params={wt=javabin&version=2} {add=[4]} 0 0
[junit4:junit4]   2> 1351 T53 C5 UPDATE [collection1] webapp=/solr path=/update params={wt=javabin&version=2} {add=[5]} 0 1
[junit4:junit4]   2> 1354 T73 C7 UPDATE [collection1] webapp=/solr path=/update params={wt=javabin&version=2} {add=[5]} 0 0
[junit4:junit4]   2> 1357 T53 C5 UPDATE [collection1] webapp=/solr path=/update params={wt=javabin&version=2} {add=[6]} 0 0
[junit4:junit4]   2> 1360 T83 C8 UPDATE [collection1] webapp=/solr path=/update params={wt=javabin&version=2} {add=[6]} 0 0
[junit4:junit4]   2> 1362 T53 C5 UPDATE [collection1] webapp=/solr path=/update params={wt=javabin&version=2} {add=[7]} 0 0
[junit4:junit4]   2> 1365 T83 C8 UPDATE [collection1] webapp=/solr path=/update params={wt=javabin&version=2} {add=[7]} 0 0
[junit4:junit4]   2> 1370 T53 C5 oasu.DirectUpdateHandler2.commit start commit{flags=0,_version_=0,optimize=false,openSearcher=true,waitSearcher=true,expungeDeletes=false,softCommit=false}
[junit4:junit4]   2> 1372 T53 C5 oasc.SolrDeletionPolicy.onCommit SolrDeletionPolicy.onCommit: commits:num=2
[junit4:junit4]   2> 		commit{dir=MockDirWrapper(org.apache.lucene.store.RAMDirectory@1c3a684 lockFactory=org.apache.lucene.store.SingleInstanceLockFactory@1112885),segFN=segments_1,generation=1,filenames=[segments_1]
[junit4:junit4]   2> 		commit{dir=MockDirWrapper(org.apache.lucene.store.RAMDirectory@1c3a684 lockFactory=org.apache.lucene.store.SingleInstanceLockFactory@1112885),segFN=segments_2,generation=2,filenames=[_0.si, _0_nrm.cfe, _0.tip, _0.tim, _0.fdt, _0_nrm.cfs, _0.fdx, _0.fnm, _0.prx, _0.frq, segments_2]
[junit4:junit4]   2> 1372 T53 C5 oasc.SolrDeletionPolicy.updateCommits newest commit = 2
[junit4:junit4]   2> 1373 T53 C5 oass.SolrIndexSearcher.<init> Opening Searcher@1ca3cde main
[junit4:junit4]   2> 1373 T53 C5 oass.SolrIndexSearcher.getIndexDir WARNING WARNING: Directory impl does not support setting indexDir: org.apache.lucene.store.MockDirectoryWrapper
[junit4:junit4]   2> 1375 T53 C5 oasu.DirectUpdateHandler2.commit end_commit_flush
[junit4:junit4]   2> 1375 T60 oasc.SolrCore.registerSearcher [collection1] Registered new searcher Searcher@1ca3cde main{StandardDirectoryReader(segments_2:4 _0(4.0.0.1):C7)}
[junit4:junit4]   2> 1376 T53 C5 UPDATE [collection1] webapp=/solr path=/update params={softCommit=false&wt=javabin&commit=true&version=2&waitSearcher=true} {commit=} 0 6
[junit4:junit4]   2> 1378 T63 C6 oasu.DirectUpdateHandler2.commit start commit{flags=0,_version_=0,optimize=false,openSearcher=true,waitSearcher=true,expungeDeletes=false,softCommit=false}
[junit4:junit4]   2> 1380 T63 C6 oasc.SolrDeletionPolicy.onCommit SolrDeletionPolicy.onCommit: commits:num=2
[junit4:junit4]   2> 		commit{dir=MockDirWrapper(org.apache.lucene.store.RAMDirectory@1db1499 lockFactory=org.apache.lucene.store.SingleInstanceLockFactory@cbebc),segFN=segments_1,generation=1,filenames=[segments_1]
[junit4:junit4]   2> 		commit{dir=MockDirWrapper(org.apache.lucene.store.RAMDirectory@1db1499 lockFactory=org.apache.lucene.store.SingleInstanceLockFactory@cbebc),segFN=segments_2,generation=2,filenames=[_0.si, _0_nrm.cfe, _0.tip, _0.tim, _0.fdt, _0_nrm.cfs, _0.fdx, _0.fnm, _0.prx, _0.frq, segments_2]
[junit4:junit4]   2> 1380 T63 C6 oasc.SolrDeletionPolicy.updateCommits newest commit = 2
[junit4:junit4]   2> 1381 T63 C6 oass.SolrIndexSearcher.<init> Opening Searcher@1f82422 main
[junit4:junit4]   2> 1381 T63 C6 oass.SolrIndexSearcher.getIndexDir WARNING WARNING: Directory impl does not support setting indexDir: org.apache.lucene.store.MockDirectoryWrapper
[junit4:junit4]   2> 1381 T63 C6 oasu.DirectUpdateHandler2.commit end_commit_flush
[junit4:junit4]   2> 1382 T70 oasc.SolrCore.registerSearcher [collection1] Registered new searcher Searcher@1f82422 main{StandardDirectoryReader(segments_2:4 _0(4.0.0.1):C2)}
[junit4:junit4]   2> 1382 T63 C6 UPDATE [collection1] webapp=/solr path=/update params={softCommit=false&wt=javabin&commit=true&version=2&waitSearcher=true} {commit=} 0 4
[junit4:junit4]   2> 1385 T73 C7 oasu.DirectUpdateHandler2.commit start commit{flags=0,_version_=0,optimize=false,openSearcher=true,waitSearcher=true,expungeDeletes=false,softCommit=false}
[junit4:junit4]   2> 1386 T73 C7 oasc.SolrDeletionPolicy.onCommit SolrDeletionPolicy.onCommit: commits:num=2
[junit4:junit4]   2> 		commit{dir=MockDirWrapper(org.apache.lucene.store.RAMDirectory@19974ba lockFactory=org.apache.lucene.store.SingleInstanceLockFactory@c24109),segFN=segments_1,generation=1,filenames=[segments_1]
[junit4:junit4]   2> 		commit{dir=MockDirWrapper(org.apache.lucene.store.RAMDirectory@19974ba lockFactory=org.apache.lucene.store.SingleInstanceLockFactory@c24109),segFN=segments_2,generation=2,filenames=[_0.si, _0_nrm.cfe, _0.tip, _0.tim, _0.fdt, _0_nrm.cfs, _0.fdx, _0.fnm, _0.prx, _0.frq, segments_2]
[junit4:junit4]   2> 1386 T73 C7 oasc.SolrDeletionPolicy.updateCommits newest commit = 2
[junit4:junit4]   2> 1387 T73 C7 oass.SolrIndexSearcher.<init> Opening Searcher@88c229 main
[junit4:junit4]   2> 1387 T73 C7 oass.SolrIndexSearcher.getIndexDir WARNING WARNING: Directory impl does not support setting indexDir: org.apache.lucene.store.MockDirectoryWrapper
[junit4:junit4]   2> 1388 T73 C7 oasu.DirectUpdateHandler2.commit end_commit_flush
[junit4:junit4]   2> 1388 T80 oasc.SolrCore.registerSearcher [collection1] Registered new searcher Searcher@88c229 main{StandardDirectoryReader(segments_2:4 _0(4.0.0.1):C2)}
[junit4:junit4]   2> 1389 T73 C7 UPDATE [collection1] webapp=/solr path=/update params={softCommit=false&wt=javabin&commit=true&version=2&waitSearcher=true} {commit=} 0 4
[junit4:junit4]   2> 1391 T83 C8 oasu.DirectUpdateHandler2.commit start commit{flags=0,_version_=0,optimize=false,openSearcher=true,waitSearcher=true,expungeDeletes=false,softCommit=false}
[junit4:junit4]   2> 1393 T83 C8 oasc.SolrDeletionPolicy.onCommit SolrDeletionPolicy.onCommit: commits:num=2
[junit4:junit4]   2> 		commit{dir=MockDirWrapper(org.apache.lucene.store.RAMDirectory@17d01cc lockFactory=org.apache.lucene.store.SingleInstanceLockFactory@57b8cb),segFN=segments_1,generation=1,filenames=[segments_1]
[junit4:junit4]   2> 		commit{dir=MockDirWrapper(org.apache.lucene.store.RAMDirectory@17d01cc lockFactory=org.apache.lucene.store.SingleInstanceLockFactory@57b8cb),segFN=segments_2,generation=2,filenames=[_0.si, _0_nrm.cfe, _0.tip, _0.tim, _0.fdt, _0_nrm.cfs, _0.fdx, _0.fnm, _0.prx, _0.frq, segments_2]
[junit4:junit4]   2> 1393 T83 C8 oasc.SolrDeletionPolicy.updateCommits newest commit = 2
[junit4:junit4]   2> 1394 T83 C8 oass.SolrIndexSearcher.<init> Opening Searcher@1623b89 main
[junit4:junit4]   2> 1394 T83 C8 oass.SolrIndexSearcher.getIndexDir WARNING WARNING: Directory impl does not support setting indexDir: org.apache.lucene.store.MockDirectoryWrapper
[junit4:junit4]   2> 1394 T83 C8 oasu.DirectUpdateHandler2.commit end_commit_flush
[junit4:junit4]   2> 1395 T90 oasc.SolrCore.registerSearcher [collection1] Registered new searcher Searcher@1623b89 main{StandardDirectoryReader(segments_2:4 _0(4.0.0.1):C3)}
[junit4:junit4]   2> 1395 T83 C8 UPDATE [collection1] webapp=/solr path=/update params={softCommit=false&wt=javabin&commit=true&version=2&waitSearcher=true} {commit=} 0 4
[junit4:junit4]   2> 1425 T53 C5 REQ [collection1] webapp=/solr path=/elevate params={sort=id+desc&wt=javabin&rows=500&qt=/elevate&version=2&q=*:*&shards.qt=/elevate&fl=id,+score,+[elevated]&distrib=false} hits=7 status=0 QTime=25 
[junit4:junit4]   2> 1436 T84 C8 REQ [collection1] webapp=/solr path=/elevate params={sort=id+desc&shard.url=[::1]:33332/solr|localhost:46172/solr&NOW=1344011140735&rows=500&q=*:*&start=0&fl=id,score&distrib=false&wt=javabin&qt=/elevate&isShard=true&version=2&fsv=true&shards.qt=/elevate} hits=3 status=0 QTime=1 
[junit4:junit4]   2> 1438 T64 C6 REQ [collection1] webapp=/solr path=/elevate params={sort=id+desc&shard.url=[::1]:33332/solr|localhost:39102/solr&NOW=1344011140735&rows=500&q=*:*&start=0&fl=id,score&distrib=false&wt=javabin&qt=/elevate&isShard=true&version=2&fsv=true&shards.qt=/elevate} hits=2 status=0 QTime=0 
[junit4:junit4]   2> 1440 T74 C7 REQ [collection1] webapp=/solr path=/elevate params={sort=id+desc&shard.url=localhost:37474/solr|[::1]:33332/solr&NOW=1344011140735&rows=500&q=*:*&start=0&fl=id,score&distrib=false&wt=javabin&qt=/elevate&isShard=true&version=2&fsv=true&shards.qt=/elevate} hits=2 status=0 QTime=1 
[junit4:junit4]   2> 1446 T74 C7 REQ [collection1] webapp=/solr path=/elevate params={shard.url=localhost:37474/solr|[::1]:33332/solr&NOW=1344011140735&rows=500&q=*:*&ids=5.0,2.0&fl=id,+score,+[elevated]&distrib=false&wt=javabin&qt=/elevate&isShard=true&version=2&shards.qt=/elevate} status=0 QTime=1 
[junit4:junit4]   2> 1446 T64 C6 REQ [collection1] webapp=/solr path=/elevate params={shard.url=[::1]:33332/solr|localhost:39102/solr&NOW=1344011140735&rows=500&q=*:*&ids=1.0,4.0&fl=id,+score,+[elevated]&distrib=false&wt=javabin&qt=/elevate&isShard=true&version=2&shards.qt=/elevate} status=0 QTime=1 
[junit4:junit4]   2> 1446 T84 C8 REQ [collection1] webapp=/solr path=/elevate params={shard.url=[::1]:33332/solr|localhost:46172/solr&NOW=1344011140735&rows=500&q=*:*&ids=3.0,6.0,7.0&fl=id,+score,+[elevated]&distrib=false&wt=javabin&qt=/elevate&isShard=true&version=2&shards.qt=/elevate} status=0 QTime=1 
[junit4:junit4]   2> 1447 T83 C8 REQ [collection1] webapp=/solr path=/elevate params={shards=[::1]:33332/solr|localhost:39102/solr,localhost:37474/solr|[::1]:33332/solr,[::1]:33332/solr|localhost:46172/solr&sort=id+desc&wt=javabin&rows=500&qt=/elevate&version=2&q=*:*&shards.qt=/elevate&fl=id,+score,+[elevated]} status=0 QTime=18 
[junit4:junit4]   2> 1448 T50 oas.BaseDistributedSearchTestCase.compareResponses SEVERE Mismatched responses:
[junit4:junit4]   2> 	{responseHeader={status=0,QTime=18,params={shards=[::1]:33332/solr|localhost:39102/solr,localhost:37474/solr|[::1]:33332/solr,[::1]:33332/solr|localhost:46172/solr,sort=id desc,wt=javabin,rows=500,qt=/elevate,version=2,q=*:*,shards.qt=/elevate,fl=id, score, [elevated]}},response={numFound=7,start=0,maxScore=1.0,docs=[SolrDocument{id=7.0, [elevated]=false, score=1.0}, SolrDocument{id=6.0, [elevated]=false, score=1.0}, SolrDocument{id=5.0, [elevated]=false, score=1.0}, SolrDocument{id=4.0, [elevated]=false, score=1.0}, SolrDocument{id=3.0, [elevated]=false, score=1.0}, SolrDocument{id=2.0, [elevated]=false, score=1.0}, SolrDocument{id=1.0, [elevated]=false, score=1.0}]}}
[junit4:junit4]   2> 	{responseHeader={status=0,QTime=25,params={sort=id desc,wt=javabin,rows=500,qt=/elevate,version=2,q=*:*,shards.qt=/elevate,fl=id, score, [elevated],distrib=false}},response={numFound=7,start=0,maxScore=1.0,docs=[SolrDocument{id=7.0, score=1.0, [elevated]=false}, SolrDocument{id=6.0, score=1.0, [elevated]=false}, SolrDocument{id=5.0, score=1.0, [elevated]=false}, SolrDocument{id=4.0, score=1.0, [elevated]=false}, SolrDocument{id=3.0, score=1.0, [elevated]=false}, SolrDocument{id=2.0, score=1.0, [elevated]=false}, SolrDocument{id=1.0, score=1.0, [elevated]=false}]}}
[junit4:junit4]   2> 1449 T50 oasc.CoreContainer.shutdown Shutting down CoreContainer instance=18224169
[junit4:junit4]   2> 1449 T50 oasc.SolrCore.close [collection1]  CLOSING SolrCore org.apache.solr.core.SolrCore@72e5d6
[junit4:junit4]   2> 1450 T50 oasc.SolrCore.closeSearcher [collection1] Closing main searcher on request.
[junit4:junit4]   2> 1451 T50 oasu.DirectUpdateHandler2.close closing DirectUpdateHandler2{commits=1,autocommits=0,soft autocommits=0,optimizes=0,rollbacks=0,expungeDeletes=0,docsPending=0,adds=0,deletesById=0,deletesByQuery=0,errors=0,cumulative_adds=7,cumulative_deletesById=0,cumulative_deletesByQuery=1,cumulative_errors=0}
[junit4:junit4]   2> 1453 T50 oejsh.ContextHandler.doStop stopped o.e.j.s.ServletContextHandler{/solr,null}
[junit4:junit4]   2> 1505 T50 oasc.CoreContainer.shutdown Shutting down CoreContainer instance=24659514
[junit4:junit4]   2> 1505 T50 oasc.SolrCore.close [collection1]  CLOSING SolrCore org.apache.solr.core.SolrCore@e1c345
[junit4:junit4]   2> 1506 T50 oasc.SolrCore.closeSearcher [collection1] Closing main searcher on request.
[junit4:junit4]   2> 1507 T50 oasu.DirectUpdateHandler2.close closing DirectUpdateHandler2{commits=1,autocommits=0,soft autocommits=0,optimizes=0,rollbacks=0,expungeDeletes=0,docsPending=0,adds=0,deletesById=0,deletesByQuery=0,errors=0,cumulative_adds=2,cumulative_deletesById=0,cumulative_deletesByQuery=1,cumulative_errors=0}
[junit4:junit4]   2> 1511 T50 oejsh.ContextHandler.doStop stopped o.e.j.s.ServletContextHandler{/solr,null}
[junit4:junit4]   2> 1563 T50 oasc.CoreContainer.shutdown Shutting down CoreContainer instance=21045840
[junit4:junit4]   2> 1563 T50 oasc.SolrCore.close [collection1]  CLOSING SolrCore org.apache.solr.core.SolrCore@192dfa7
[junit4:junit4]   2> 1564 T50 oasc.SolrCore.closeSearcher [collection1] Closing main searcher on request.
[junit4:junit4]   2> 1564 T50 oasu.DirectUpdateHandler2.close closing DirectUpdateHandler2{commits=1,autocommits=0,soft autocommits=0,optimizes=0,rollbacks=0,expungeDeletes=0,docsPending=0,adds=0,deletesById=0,deletesByQuery=0,errors=0,cumulative_adds=2,cumulative_deletesById=0,cumulative_deletesByQuery=1,cumulative_errors=0}
[junit4:junit4]   2> 1567 T50 oejsh.ContextHandler.doStop stopped o.e.j.s.ServletContextHandler{/solr,null}
[junit4:junit4]   2> 1619 T50 oasc.CoreContainer.shutdown Shutting down CoreContainer instance=12383647
[junit4:junit4]   2> 1619 T50 oasc.SolrCore.close [collection1]  CLOSING SolrCore org.apache.solr.core.SolrCore@a25509
[junit4:junit4]   2> 1620 T50 oasc.SolrCore.closeSearcher [collection1] Closing main searcher on request.
[junit4:junit4]   2> 1621 T50 oasu.DirectUpdateHandler2.close closing DirectUpdateHandler2{commits=1,autocommits=0,soft autocommits=0,optimizes=0,rollbacks=0,expungeDeletes=0,docsPending=0,adds=0,deletesById=0,deletesByQuery=0,errors=0,cumulative_adds=3,cumulative_deletesById=0,cumulative_deletesByQuery=1,cumulative_errors=0}
[junit4:junit4]   2> 1624 T50 oejsh.ContextHandler.doStop stopped o.e.j.s.ServletContextHandler{/solr,null}
[junit4:junit4]   2> 1676 T50 oas.SolrTestCaseJ4.tearDown ###Ending testDistribSearch
[junit4:junit4]   2> NOTE: reproduce with: ant test  -Dtestcase=DistributedQueryElevationComponentTest -Dtests.method=testDistribSearch -Dtests.seed=C7D89A39A4A2C37D -Dtests.multiplier=3 -Dtests.slow=true -Dtests.locale=es_PR -Dtests.timezone=GMT -Dtests.file.encoding=UTF-8
[junit4:junit4]   2>
[junit4:junit4]    > (@AfterClass output)
[junit4:junit4]   2> 1808 T50 oas.SolrTestCaseJ4.deleteCore ###deleteCore
[junit4:junit4]   2> NOTE: test params are: codec=Appending, sim=DefaultSimilarity, locale=es_PR, timezone=GMT
[junit4:junit4]   2> NOTE: Linux 3.2.0-27-generic i386/Oracle Corporation 1.8.0-ea (32-bit)/cpus=8,threads=1,free=118914208,total=213909504
[junit4:junit4]   2> NOTE: All tests run in this JVM: [TestHashPartitioner, TestCodecSupport, BasicFunctionalityTest, SpellingQueryConverterTest, OpenExchangeRatesOrgProviderTest, FileUtilsTest, QueryEqualityTest, SolrIndexConfigTest, TestSuggestSpellingConverter, PolyFieldTest, CoreContainerCoreInitFailuresTest, TestBinaryResponseWriter, MultiTermTest, ShowFileRequestHandlerTest, FieldMutatingUpdateProcessorTest, DirectUpdateHandlerOptimizeTest, DistributedQueryElevationComponentTest]
[junit4:junit4]   2> 
[junit4:junit4] Completed on J1 in 1.83s, 1 test, 1 failure <<< FAILURES!

[...truncated 600 lines...]
BUILD FAILED
/mnt/ssd/jenkins/workspace/Lucene-Solr-4.x-Linux/checkout/build.xml:29: The following error occurred while executing this line:
/mnt/ssd/jenkins/workspace/Lucene-Solr-4.x-Linux/checkout/solr/build.xml:144: The following error occurred while executing this line:
/mnt/ssd/jenkins/workspace/Lucene-Solr-4.x-Linux/checkout/lucene/module-build.xml:62: The following error occurred while executing this line:
/mnt/ssd/jenkins/workspace/Lucene-Solr-4.x-Linux/checkout/lucene/common-build.xml:1095: The following error occurred while executing this line:
/mnt/ssd/jenkins/workspace/Lucene-Solr-4.x-Linux/checkout/lucene/common-build.xml:790: There were test failures: 224 suites, 903 tests, 1 failure, 6 ignored (1 assumption)

Total time: 31 minutes 54 seconds
Build step 'Execute shell' marked build as failure
Archiving artifacts
Recording test results
Email was triggered for: Failure
Sending email for trigger: Failure



Mime
View raw message