lucene-dev mailing list archives

Site index · List index
Message view « Date » · « Thread »
Top « Date » · « Thread »
From Policeman Jenkins Server <jenk...@sd-datasolutions.de>
Subject [JENKINS] Lucene-Solr-trunk-Linux (64bit/jrockit-jdk1.6.0_33-R28.2.4-4.1.0) - Build # 79 - Still Failing!
Date Wed, 01 Aug 2012 09:32:54 GMT
Build: http://jenkins.sd-datasolutions.de/job/Lucene-Solr-trunk-Linux/79/
Java: 64bit/jrockit-jdk1.6.0_33-R28.2.4-4.1.0 

1 tests failed.
REGRESSION:  org.apache.lucene.index.TestPostingsOffsets.testBackwardsOffsets

Error Message:


Stack Trace:
java.lang.AssertionError
	at __randomizedtesting.SeedInfo.seed([C068769794D3F462:B5789ED02135851F]:0)
	at org.apache.lucene.index.FreqProxTermsWriterPerField.writeOffsets(FreqProxTermsWriterPerField.java:157)
	at org.apache.lucene.index.FreqProxTermsWriterPerField.addTerm(FreqProxTermsWriterPerField.java:241)
	at org.apache.lucene.index.TermsHashPerField.add(TermsHashPerField.java:235)
	at org.apache.lucene.index.DocInverterPerField.processFields(DocInverterPerField.java:167)
	at org.apache.lucene.index.DocFieldProcessor.processDocument(DocFieldProcessor.java:305)
	at org.apache.lucene.index.DocumentsWriterPerThread.updateDocument(DocumentsWriterPerThread.java:243)
	at org.apache.lucene.index.DocumentsWriter.updateDocument(DocumentsWriter.java:374)
	at org.apache.lucene.index.IndexWriter.updateDocument(IndexWriter.java:1357)
	at org.apache.lucene.index.IndexWriter.addDocument(IndexWriter.java:1108)
	at org.apache.lucene.index.RandomIndexWriter.addDocument(RandomIndexWriter.java:186)
	at org.apache.lucene.index.RandomIndexWriter.addDocument(RandomIndexWriter.java:146)
	at org.apache.lucene.index.TestPostingsOffsets.checkTokens(TestPostingsOffsets.java:491)
	at org.apache.lucene.index.TestPostingsOffsets.testBackwardsOffsets(TestPostingsOffsets.java:436)
	at sun.reflect.NativeMethodAccessorImpl.invoke0(Native Method)
	at sun.reflect.NativeMethodAccessorImpl.invoke(NativeMethodAccessorImpl.java:39)
	at sun.reflect.DelegatingMethodAccessorImpl.invoke(DelegatingMethodAccessorImpl.java:25)
	at java.lang.reflect.Method.invoke(Method.java:597)
	at com.carrotsearch.randomizedtesting.RandomizedRunner.invoke(RandomizedRunner.java:1995)
	at com.carrotsearch.randomizedtesting.RandomizedRunner.access$1100(RandomizedRunner.java:132)
	at com.carrotsearch.randomizedtesting.RandomizedRunner$6.evaluate(RandomizedRunner.java:819)
	at com.carrotsearch.randomizedtesting.RandomizedRunner$7.evaluate(RandomizedRunner.java:878)
	at com.carrotsearch.randomizedtesting.RandomizedRunner$8.evaluate(RandomizedRunner.java:891)
	at org.apache.lucene.util.TestRuleSetupTeardownChained$1.evaluate(TestRuleSetupTeardownChained.java:50)
	at org.apache.lucene.util.TestRuleFieldCacheSanity$1.evaluate(TestRuleFieldCacheSanity.java:32)
	at org.apache.lucene.util.AbstractBeforeAfterRule$1.evaluate(AbstractBeforeAfterRule.java:45)
	at com.carrotsearch.randomizedtesting.rules.SystemPropertiesInvariantRule$1.evaluate(SystemPropertiesInvariantRule.java:55)
	at org.apache.lucene.util.TestRuleReportUncaughtExceptions$1.evaluate(TestRuleReportUncaughtExceptions.java:68)
	at org.apache.lucene.util.TestRuleThreadAndTestName$1.evaluate(TestRuleThreadAndTestName.java:48)
	at org.apache.lucene.util.TestRuleIgnoreAfterMaxFailures$1.evaluate(TestRuleIgnoreAfterMaxFailures.java:70)
	at org.apache.lucene.util.TestRuleMarkFailure$1.evaluate(TestRuleMarkFailure.java:48)
	at com.carrotsearch.randomizedtesting.RandomizedRunner.runSingleTest(RandomizedRunner.java:825)
	at com.carrotsearch.randomizedtesting.RandomizedRunner.access$700(RandomizedRunner.java:132)
	at com.carrotsearch.randomizedtesting.RandomizedRunner$3$1.run(RandomizedRunner.java:671)
	at com.carrotsearch.randomizedtesting.RandomizedRunner$3.evaluate(RandomizedRunner.java:697)
	at com.carrotsearch.randomizedtesting.RandomizedRunner$4.evaluate(RandomizedRunner.java:737)
	at com.carrotsearch.randomizedtesting.RandomizedRunner$5.evaluate(RandomizedRunner.java:747)
	at org.apache.lucene.util.AbstractBeforeAfterRule$1.evaluate(AbstractBeforeAfterRule.java:45)
	at org.apache.lucene.util.TestRuleReportUncaughtExceptions$1.evaluate(TestRuleReportUncaughtExceptions.java:68)
	at org.apache.lucene.util.TestRuleStoreClassName$1.evaluate(TestRuleStoreClassName.java:38)
	at com.carrotsearch.randomizedtesting.rules.SystemPropertiesInvariantRule$1.evaluate(SystemPropertiesInvariantRule.java:55)
	at org.apache.lucene.util.TestRuleNoInstanceHooksOverrides$1.evaluate(TestRuleNoInstanceHooksOverrides.java:54)
	at org.apache.lucene.util.TestRuleNoStaticHooksShadowing$1.evaluate(TestRuleNoStaticHooksShadowing.java:53)
	at org.apache.lucene.util.TestRuleAssertionsRequired$1.evaluate(TestRuleAssertionsRequired.java:37)
	at org.apache.lucene.util.TestRuleMarkFailure$1.evaluate(TestRuleMarkFailure.java:48)
	at org.apache.lucene.util.TestRuleIgnoreAfterMaxFailures$1.evaluate(TestRuleIgnoreAfterMaxFailures.java:70)
	at org.apache.lucene.util.TestRuleIgnoreTestSuites$1.evaluate(TestRuleIgnoreTestSuites.java:56)
	at com.carrotsearch.randomizedtesting.RandomizedRunner.runSuite(RandomizedRunner.java:605)
	at com.carrotsearch.randomizedtesting.RandomizedRunner.access$400(RandomizedRunner.java:132)
	at com.carrotsearch.randomizedtesting.RandomizedRunner$2.run(RandomizedRunner.java:551)




Build Log:
[...truncated 604 lines...]
[junit4:junit4] Suite: org.apache.lucene.index.TestPostingsOffsets
[junit4:junit4] FAILURE 0.02s J1 | TestPostingsOffsets.testBackwardsOffsets
[junit4:junit4]    > Throwable #1: java.lang.AssertionError
[junit4:junit4]    > 	at __randomizedtesting.SeedInfo.seed([C068769794D3F462:B5789ED02135851F]:0)
[junit4:junit4]    > 	at org.apache.lucene.index.FreqProxTermsWriterPerField.writeOffsets(FreqProxTermsWriterPerField.java:157)
[junit4:junit4]    > 	at org.apache.lucene.index.FreqProxTermsWriterPerField.addTerm(FreqProxTermsWriterPerField.java:241)
[junit4:junit4]    > 	at org.apache.lucene.index.TermsHashPerField.add(TermsHashPerField.java:235)
[junit4:junit4]    > 	at org.apache.lucene.index.DocInverterPerField.processFields(DocInverterPerField.java:167)
[junit4:junit4]    > 	at org.apache.lucene.index.DocFieldProcessor.processDocument(DocFieldProcessor.java:305)
[junit4:junit4]    > 	at org.apache.lucene.index.DocumentsWriterPerThread.updateDocument(DocumentsWriterPerThread.java:243)
[junit4:junit4]    > 	at org.apache.lucene.index.DocumentsWriter.updateDocument(DocumentsWriter.java:374)
[junit4:junit4]    > 	at org.apache.lucene.index.IndexWriter.updateDocument(IndexWriter.java:1357)
[junit4:junit4]    > 	at org.apache.lucene.index.IndexWriter.addDocument(IndexWriter.java:1108)
[junit4:junit4]    > 	at org.apache.lucene.index.RandomIndexWriter.addDocument(RandomIndexWriter.java:186)
[junit4:junit4]    > 	at org.apache.lucene.index.RandomIndexWriter.addDocument(RandomIndexWriter.java:146)
[junit4:junit4]    > 	at org.apache.lucene.index.TestPostingsOffsets.checkTokens(TestPostingsOffsets.java:491)
[junit4:junit4]    > 	at org.apache.lucene.index.TestPostingsOffsets.testBackwardsOffsets(TestPostingsOffsets.java:436)
[junit4:junit4]    > 	at sun.reflect.NativeMethodAccessorImpl.invoke0(Native Method)
[junit4:junit4]    > 	at sun.reflect.NativeMethodAccessorImpl.invoke(NativeMethodAccessorImpl.java:39)
[junit4:junit4]    > 	at sun.reflect.DelegatingMethodAccessorImpl.invoke(DelegatingMethodAccessorImpl.java:25)
[junit4:junit4]    > 	at java.lang.reflect.Method.invoke(Method.java:597)
[junit4:junit4]    > 	at com.carrotsearch.randomizedtesting.RandomizedRunner.invoke(RandomizedRunner.java:1995)
[junit4:junit4]    > 	at com.carrotsearch.randomizedtesting.RandomizedRunner.access$1100(RandomizedRunner.java:132)
[junit4:junit4]    > 	at com.carrotsearch.randomizedtesting.RandomizedRunner$6.evaluate(RandomizedRunner.java:819)
[junit4:junit4]    > 	at com.carrotsearch.randomizedtesting.RandomizedRunner$7.evaluate(RandomizedRunner.java:878)
[junit4:junit4]    > 	at com.carrotsearch.randomizedtesting.RandomizedRunner$8.evaluate(RandomizedRunner.java:891)
[junit4:junit4]    > 	at org.apache.lucene.util.TestRuleSetupTeardownChained$1.evaluate(TestRuleSetupTeardownChained.java:50)
[junit4:junit4]    > 	at org.apache.lucene.util.TestRuleFieldCacheSanity$1.evaluate(TestRuleFieldCacheSanity.java:32)
[junit4:junit4]    > 	at org.apache.lucene.util.AbstractBeforeAfterRule$1.evaluate(AbstractBeforeAfterRule.java:45)
[junit4:junit4]    > 	at com.carrotsearch.randomizedtesting.rules.SystemPropertiesInvariantRule$1.evaluate(SystemPropertiesInvariantRule.java:55)
[junit4:junit4]    > 	at org.apache.lucene.util.TestRuleReportUncaughtExceptions$1.evaluate(TestRuleReportUncaughtExceptions.java:68)
[junit4:junit4]    > 	at org.apache.lucene.util.TestRuleThreadAndTestName$1.evaluate(TestRuleThreadAndTestName.java:48)
[junit4:junit4]    > 	at org.apache.lucene.util.TestRuleIgnoreAfterMaxFailures$1.evaluate(TestRuleIgnoreAfterMaxFailures.java:70)
[junit4:junit4]    > 	at org.apache.lucene.util.TestRuleMarkFailure$1.evaluate(TestRuleMarkFailure.java:48)
[junit4:junit4]    > 	at com.carrotsearch.randomizedtesting.RandomizedRunner.runSingleTest(RandomizedRunner.java:825)
[junit4:junit4]    > 	at com.carrotsearch.randomizedtesting.RandomizedRunner.access$700(RandomizedRunner.java:132)
[junit4:junit4]    > 	at com.carrotsearch.randomizedtesting.RandomizedRunner$3$1.run(RandomizedRunner.java:671)
[junit4:junit4]    > 	at com.carrotsearch.randomizedtesting.RandomizedRunner$3.evaluate(RandomizedRunner.java:697)
[junit4:junit4]    > 	at com.carrotsearch.randomizedtesting.RandomizedRunner$4.evaluate(RandomizedRunner.java:737)
[junit4:junit4]    > 	at com.carrotsearch.randomizedtesting.RandomizedRunner$5.evaluate(RandomizedRunner.java:747)
[junit4:junit4]    > 	at org.apache.lucene.util.AbstractBeforeAfterRule$1.evaluate(AbstractBeforeAfterRule.java:45)
[junit4:junit4]    > 	at org.apache.lucene.util.TestRuleReportUncaughtExceptions$1.evaluate(TestRuleReportUncaughtExceptions.java:68)
[junit4:junit4]    > 	at org.apache.lucene.util.TestRuleStoreClassName$1.evaluate(TestRuleStoreClassName.java:38)
[junit4:junit4]    > 	at com.carrotsearch.randomizedtesting.rules.SystemPropertiesInvariantRule$1.evaluate(SystemPropertiesInvariantRule.java:55)
[junit4:junit4]    > 	at org.apache.lucene.util.TestRuleNoInstanceHooksOverrides$1.evaluate(TestRuleNoInstanceHooksOverrides.java:54)
[junit4:junit4]    > 	at org.apache.lucene.util.TestRuleNoStaticHooksShadowing$1.evaluate(TestRuleNoStaticHooksShadowing.java:53)
[junit4:junit4]    > 	at org.apache.lucene.util.TestRuleAssertionsRequired$1.evaluate(TestRuleAssertionsRequired.java:37)
[junit4:junit4]    > 	at org.apache.lucene.util.TestRuleMarkFailure$1.evaluate(TestRuleMarkFailure.java:48)
[junit4:junit4]    > 	at org.apache.lucene.util.TestRuleIgnoreAfterMaxFailures$1.evaluate(TestRuleIgnoreAfterMaxFailures.java:70)
[junit4:junit4]    > 	at org.apache.lucene.util.TestRuleIgnoreTestSuites$1.evaluate(TestRuleIgnoreTestSuites.java:56)
[junit4:junit4]    > 	at com.carrotsearch.randomizedtesting.RandomizedRunner.runSuite(RandomizedRunner.java:605)
[junit4:junit4]    > 	at com.carrotsearch.randomizedtesting.RandomizedRunner.access$400(RandomizedRunner.java:132)
[junit4:junit4]    > 	at com.carrotsearch.randomizedtesting.RandomizedRunner$2.run(RandomizedRunner.java:551)
[junit4:junit4]    > 
[junit4:junit4]   2> NOTE: reproduce with: ant test  -Dtestcase=TestPostingsOffsets -Dtests.method=testBackwardsOffsets
-Dtests.seed=C068769794D3F462 -Dtests.multiplier=3 -Dtests.slow=true -Dtests.locale=ar_YE
-Dtests.timezone=Asia/Choibalsan -Dtests.file.encoding=UTF-8
[junit4:junit4]   2>
[junit4:junit4]    > (@AfterClass output)
[junit4:junit4]   2> NOTE: test params are: codec=Lucene40: {oddeven=Pulsing40(freqCutoff=11
minBlockSize=8 maxBlockSize=113), id=Pulsing40(freqCutoff=11 minBlockSize=8 maxBlockSize=113),
content=PostingsFormat(name=NestedPulsing), body=Lucene40(minBlockSize=8 maxBlockSize=113),
numbers=Lucene40(minBlockSize=8 maxBlockSize=113), foo=Lucene40(minBlockSize=8 maxBlockSize=113),
content3=Lucene40(minBlockSize=8 maxBlockSize=113)}, sim=RandomSimilarityProvider(queryNorm=false,coord=true):
{oddeven=IB LL-L3(800.0), content=DFR GL1, body=LM Jelinek-Mercer(0.100000), numbers=DFR I(F)2,
foo=IB SPL-DZ(0.3), content3=DFR I(n)B1}, locale=ar_YE, timezone=Asia/Choibalsan
[junit4:junit4]   2> NOTE: Linux 3.2.0-27-generic amd64/Oracle Corporation 1.6.0_33 (64-bit)/cpus=8,threads=1,free=264194760,total=288587776
[junit4:junit4]   2> NOTE: All tests run in this JVM: [TestSameTokenSamePosition, TestParallelTermEnum,
TestRecyclingByteBlockAllocator, TestBooleanMinShouldMatch, TestUTF32ToUTF8, TestSearchWithThreads,
TestTermVectorsWriter, TestDocValuesTypeCompatibility, TestNoMergeScheduler, TestUniqueTermCount,
TestMultiTermQueryRewrites, TestIOUtils, TestIntBlockCodec, TestSimilarity, Nested1, Nested2,
Nested3, TestExplanations, TestConsistentFieldNumbers, TestNRTManager, TestAutomatonQuery,
TestBasics, TestCachingTokenFilter, TestSimpleSearchEquivalence, TestCachingWrapperFilter,
TestNorms, TestSegmentMerger, Test10KPulsings, TestCharTermAttributeImpl, TestToken, TestIndexWriterMerging,
TestPhrasePrefixQuery, TestSegmentTermEnum, Before3, Before3, TestIndexWriterConfig, TestNoMergePolicy,
TestPrefixFilter, TestFieldValueFilter, TestTypePromotion, TestFSTs, Test2BPostings, TestTermsEnum,
TestReuseDocsEnum, TestDuelingCodecs, TestDocValuesScoring, TestIndexWriterMergePolicy, TestLookaheadTokenFilter,
TestLock, TestSimpleExplanations, TestBooleanQueryVisitSubscorers, TestDocumentsWriterStallControl,
TestIntsRef, TestSegmentTermDocs, TestDirectory, TestRollingBuffer, TestBoolean2, TestLucene40PostingsReader,
TestPostingsOffsets]
[junit4:junit4]   2> 
[junit4:junit4] Completed on J1 in 1.37s, 11 tests, 1 failure <<< FAILURES!

[...truncated 516 lines...]
BUILD FAILED
/mnt/ssd/jenkins/workspace/Lucene-Solr-trunk-Linux/checkout/build.xml:29: The following error
occurred while executing this line:
/mnt/ssd/jenkins/workspace/Lucene-Solr-trunk-Linux/checkout/lucene/build.xml:50: The following
error occurred while executing this line:
/mnt/ssd/jenkins/workspace/Lucene-Solr-trunk-Linux/checkout/lucene/common-build.xml:1095:
The following error occurred while executing this line:
/mnt/ssd/jenkins/workspace/Lucene-Solr-trunk-Linux/checkout/lucene/common-build.xml:790: There
were test failures: 306 suites, 1724 tests, 1 failure, 13 ignored (11 assumptions)

Total time: 9 minutes 18 seconds
Build step 'Execute shell' marked build as failure
Archiving artifacts
Recording test results
Email was triggered for: Failure
Sending email for trigger: Failure



Mime
View raw message