lucene-dev mailing list archives

Site index · List index
Message view « Date » · « Thread »
Top « Date » · « Thread »
From Apache Jenkins Server <jenk...@builds.apache.org>
Subject [JENKINS] Lucene-Solr-SmokeRelease-trunk - Build # 11 - Failure
Date Sun, 19 Aug 2012 04:05:25 GMT
Build: https://builds.apache.org/job/Lucene-Solr-SmokeRelease-trunk/11/

No tests ran.

Build Log:
[...truncated 32341 lines...]
prepare-release-no-sign:
    [mkdir] Created dir: /usr/home/hudson/hudson-slave/workspace/Lucene-Solr-SmokeRelease-trunk/lucene/build/fakeRelease
     [copy] Copying 366 files to /usr/home/hudson/hudson-slave/workspace/Lucene-Solr-SmokeRelease-trunk/lucene/build/fakeRelease/lucene
     [copy] Copying 4 files to /usr/home/hudson/hudson-slave/workspace/Lucene-Solr-SmokeRelease-trunk/lucene/build/fakeRelease/lucene/changes
      [get] Getting: http://people.apache.org/keys/group/lucene.asc
      [get] To: /usr/home/hudson/hudson-slave/workspace/Lucene-Solr-SmokeRelease-trunk/lucene/build/fakeRelease/lucene/KEYS
     [copy] Copying 189 files to /usr/home/hudson/hudson-slave/workspace/Lucene-Solr-SmokeRelease-trunk/lucene/build/fakeRelease/solr
     [copy] Copying 1 file to /usr/home/hudson/hudson-slave/workspace/Lucene-Solr-SmokeRelease-trunk/lucene/build/fakeRelease/solr
     [exec] 
     [exec] Load release URL "file:/usr/home/hudson/hudson-slave/workspace/Lucene-Solr-SmokeRelease-trunk/lucene/build/fakeRelease/"...
     [exec] 
     [exec] Test Lucene...
     [exec]   test basics...
     [exec]   get KEYS
     [exec]     0.1 MB
     [exec]   check changes HTML...
     [exec]   download lucene-5.0-src.tgz...
     [exec]     26.0 MB
     [exec]     verify md5/sha1 digests
     [exec]   download lucene-5.0.tgz...
     [exec]     47.3 MB
     [exec]     verify md5/sha1 digests
     [exec]   download lucene-5.0.zip...
     [exec]     56.4 MB
     [exec]     verify md5/sha1 digests
     [exec]     unpack lucene-5.0.tgz...
     [exec]     test demo...
     [exec]       got 5147 hits for query "lucene"
     [exec]     check Lucene's javadoc JAR
     [exec] 
     [exec] /usr/home/hudson/hudson-slave/workspace/Lucene-Solr-SmokeRelease-trunk/lucene/build/fakeReleaseTmp/unpack/lucene-5.0/docs/queryparser/org/apache/lucene/queryparser/flexible/core/util/package-summary.html
     [exec]   missing: StringUtils
     [exec] 
     [exec] /usr/home/hudson/hudson-slave/workspace/Lucene-Solr-SmokeRelease-trunk/lucene/build/fakeReleaseTmp/unpack/lucene-5.0/docs/queryparser/org/apache/lucene/queryparser/flexible/core/nodes/package-summary.html
     [exec]   missing: TextableQueryNode
     [exec]   missing: PathQueryNode.QueryText
     [exec]   missing: PhraseSlopQueryNode
     [exec]   missing: ProximityQueryNode.ProximityType
     [exec]   missing: ModifierQueryNode.Modifier
     [exec]   missing: ProximityQueryNode.Type
     [exec] 
     [exec] /usr/home/hudson/hudson-slave/workspace/Lucene-Solr-SmokeRelease-trunk/lucene/build/fakeReleaseTmp/unpack/lucene-5.0/docs/queryparser/org/apache/lucene/queryparser/flexible/core/parser/package-summary.html
     [exec]   missing: EscapeQuerySyntax.Type
     [exec] 
     [exec] /usr/home/hudson/hudson-slave/workspace/Lucene-Solr-SmokeRelease-trunk/lucene/build/fakeReleaseTmp/unpack/lucene-5.0/docs/queryparser/org/apache/lucene/queryparser/flexible/standard/package-summary.html
     [exec]   missing: CommonQueryParserConfiguration
     [exec] 
     [exec] /usr/home/hudson/hudson-slave/workspace/Lucene-Solr-SmokeRelease-trunk/lucene/build/fakeReleaseTmp/unpack/lucene-5.0/docs/queryparser/org/apache/lucene/queryparser/flexible/standard/processors/package-summary.html
     [exec]   missing: OpenRangeQueryNodeProcessor
     [exec] 
     [exec] /usr/home/hudson/hudson-slave/workspace/Lucene-Solr-SmokeRelease-trunk/lucene/build/fakeReleaseTmp/unpack/lucene-5.0/docs/queryparser/org/apache/lucene/queryparser/flexible/standard/parser/package-summary.html
     [exec]   missing: EscapeQuerySyntaxImpl
     [exec]   missing: StandardSyntaxParser
     [exec] 
     [exec] /usr/home/hudson/hudson-slave/workspace/Lucene-Solr-SmokeRelease-trunk/lucene/build/fakeReleaseTmp/unpack/lucene-5.0/docs/queryparser/org/apache/lucene/queryparser/flexible/standard/builders/package-summary.html
     [exec]   missing: AnyQueryNodeBuilder
     [exec] 
     [exec] /usr/home/hudson/hudson-slave/workspace/Lucene-Solr-SmokeRelease-trunk/lucene/build/fakeReleaseTmp/unpack/lucene-5.0/docs/queryparser/org/apache/lucene/queryparser/flexible/standard/config/package-summary.html
     [exec]   missing: FuzzyConfig
     [exec]   missing: StandardQueryConfigHandler.ConfigurationKeys
     [exec]   missing: StandardQueryConfigHandler.Operator
     [exec] 
     [exec] /usr/home/hudson/hudson-slave/workspace/Lucene-Solr-SmokeRelease-trunk/lucene/build/fakeReleaseTmp/unpack/lucene-5.0/docs/queryparser/org/apache/lucene/queryparser/xml/package-summary.html
     [exec]   missing: FilterBuilder
     [exec]   missing: CorePlusExtensionsParser
     [exec]   missing: DOMUtils
     [exec]   missing: FilterBuilderFactory
     [exec]   missing: QueryBuilderFactory
     [exec]   missing: ParserException
     [exec] 
     [exec] /usr/home/hudson/hudson-slave/workspace/Lucene-Solr-SmokeRelease-trunk/lucene/build/fakeReleaseTmp/unpack/lucene-5.0/docs/queryparser/org/apache/lucene/queryparser/xml/builders/package-summary.html
     [exec]   missing: SpanQueryBuilder
     [exec]   missing: BooleanFilterBuilder
     [exec]   missing: BooleanQueryBuilder
     [exec]   missing: BoostingQueryBuilder
     [exec]   missing: BoostingTermBuilder
     [exec]   missing: ConstantScoreQueryBuilder
     [exec]   missing: DuplicateFilterBuilder
     [exec]   missing: FilteredQueryBuilder
     [exec]   missing: FuzzyLikeThisQueryBuilder
     [exec]   missing: LikeThisQueryBuilder
     [exec]   missing: MatchAllDocsQueryBuilder
     [exec]   missing: RangeFilterBuilder
     [exec]   missing: SpanBuilderBase
     [exec]   missing: SpanFirstBuilder
     [exec]   missing: SpanNearBuilder
     [exec]   missing: SpanNotBuilder
     [exec]   missing: SpanOrBuilder
     [exec]   missing: SpanOrTermsBuilder
     [exec]   missing: SpanQueryBuilderFactory
     [exec]   missing: SpanTermBuilder
     [exec]   missing: TermQueryBuilder
     [exec]   missing: TermsFilterBuilder
     [exec] 
     [exec] /usr/home/hudson/hudson-slave/workspace/Lucene-Solr-SmokeRelease-trunk/lucene/build/fakeReleaseTmp/unpack/lucene-5.0/docs/queryparser/org/apache/lucene/queryparser/surround/query/package-summary.html
     [exec]   missing: DistanceSubQuery
     [exec]   missing: SimpleTerm.MatchingTermVisitor
     [exec]   missing: AndQuery
     [exec]   missing: BasicQueryFactory
     [exec]   missing: ComposedQuery
     [exec]   missing: DistanceQuery
     [exec]   missing: FieldsQuery
     [exec]   missing: NotQuery
     [exec]   missing: OrQuery
     [exec]   missing: SimpleTerm
     [exec]   missing: SpanNearClauseFactory
     [exec]   missing: SrndPrefixQuery
     [exec]   missing: SrndQuery
     [exec]   missing: SrndTermQuery
     [exec]   missing: SrndTruncQuery
     [exec]   missing: TooManyBasicQueries
     [exec] 
     [exec] /usr/home/hudson/hudson-slave/workspace/Lucene-Solr-SmokeRelease-trunk/lucene/build/fakeReleaseTmp/unpack/lucene-5.0/docs/spatial/org/apache/lucene/spatial/prefix/package-summary.html
     [exec]   missing: PointPrefixTreeFieldCacheProvider
     [exec]   missing: PrefixTreeStrategy
     [exec] 
     [exec] /usr/home/hudson/hudson-slave/workspace/Lucene-Solr-SmokeRelease-trunk/lucene/build/fakeReleaseTmp/unpack/lucene-5.0/docs/spatial/org/apache/lucene/spatial/prefix/tree/package-summary.html
     [exec]   missing: GeohashPrefixTree.Factory
     [exec]   missing: QuadPrefixTree
     [exec]   missing: QuadPrefixTree.Factory
     [exec]   missing: SpatialPrefixTreeFactory
     [exec] 
     [exec] /usr/home/hudson/hudson-slave/workspace/Lucene-Solr-SmokeRelease-trunk/lucene/build/fakeReleaseTmp/unpack/lucene-5.0/docs/spatial/org/apache/lucene/spatial/query/package-summary.html
     [exec]   missing: UnsupportedSpatialOperation
     [exec] 
     [exec] /usr/home/hudson/hudson-slave/workspace/Lucene-Solr-SmokeRelease-trunk/lucene/build/fakeReleaseTmp/unpack/lucene-5.0/docs/spatial/org/apache/lucene/spatial/util/package-summary.html
     [exec]   missing: CachingDoubleValueSource
     [exec]   missing: ShapeFieldCache<T extends Shape>
     [exec]   missing: ShapeFieldCacheProvider<T extends Shape>
     [exec]   missing: ValueSourceFilter
     [exec] 
     [exec] /usr/home/hudson/hudson-slave/workspace/Lucene-Solr-SmokeRelease-trunk/lucene/build/fakeReleaseTmp/unpack/lucene-5.0/docs/spatial/org/apache/lucene/spatial/vector/package-summary.html
     [exec]   missing: TwoDoublesStrategy
     [exec] 
     [exec] /usr/home/hudson/hudson-slave/workspace/Lucene-Solr-SmokeRelease-trunk/lucene/build/fakeReleaseTmp/unpack/lucene-5.0/docs/spatial/org/apache/lucene/spatial/bbox/package-summary.html
     [exec]   missing: BBoxSimilarity
     [exec] 
     [exec] /usr/home/hudson/hudson-slave/workspace/Lucene-Solr-SmokeRelease-trunk/lucene/build/fakeReleaseTmp/unpack/lucene-5.0/docs/queries/org/apache/lucene/queries/function/package-summary.html
     [exec]   missing: FunctionValues.ValueFiller
     [exec]   missing: ValueSourceScorer
     [exec] 
     [exec] /usr/home/hudson/hudson-slave/workspace/Lucene-Solr-SmokeRelease-trunk/lucene/build/fakeReleaseTmp/unpack/lucene-5.0/docs/queries/org/apache/lucene/queries/function/docvalues/package-summary.html
     [exec]   missing: BoolDocValues
     [exec]   missing: DoubleDocValues
     [exec]   missing: FloatDocValues
     [exec]   missing: IntDocValues
     [exec]   missing: LongDocValues
     [exec]   missing: StrDocValues
     [exec]   missing: DocTermsIndexDocValues.DocTermsIndexException
     [exec] 
     [exec] /usr/home/hudson/hudson-slave/workspace/Lucene-Solr-SmokeRelease-trunk/lucene/build/fakeReleaseTmp/unpack/lucene-5.0/docs/queries/org/apache/lucene/queries/function/valuesource/package-summary.html
     [exec]   missing: BoolFunction
     [exec]   missing: DefFunction
     [exec]   missing: DualFloatFunction
     [exec]   missing: MultiBoolFunction
     [exec]   missing: MultiFloatFunction
     [exec]   missing: MultiFunction
     [exec]   missing: NumDocsValueSource
     [exec]   missing: ShortFieldSource
     [exec]   missing: SimpleBoolFunction
     [exec] 
     [exec] /usr/home/hudson/hudson-slave/workspace/Lucene-Solr-SmokeRelease-trunk/lucene/build/fakeReleaseTmp/unpack/lucene-5.0/docs/highlighter/org/apache/lucene/search/vectorhighlight/package-summary.html
     [exec]   missing: BoundaryScanner
     [exec]   missing: BaseFragmentsBuilder
     [exec]   missing: FieldFragList.WeightedFragInfo
     [exec]   missing: FieldFragList.WeightedFragInfo.SubInfo
     [exec]   missing: FieldPhraseList.WeightedPhraseInfo
     [exec]   missing: FieldPhraseList.WeightedPhraseInfo.Toffs
     [exec]   missing: FieldQuery.QueryPhraseMap
     [exec]   missing: FieldTermStack.TermInfo
     [exec]   missing: ScoreOrderFragmentsBuilder.ScoreComparator
     [exec]   missing: SimpleBoundaryScanner
     [exec] 
     [exec] /usr/home/hudson/hudson-slave/workspace/Lucene-Solr-SmokeRelease-trunk/lucene/build/fakeReleaseTmp/unpack/lucene-5.0/docs/highlighter/org/apache/lucene/search/highlight/package-summary.html
     [exec]   missing: TokenStreamFromTermPositionVector
     [exec] 
     [exec] ***WARNING***: javadocs want to fail!
     [exec] 
     [exec] 
     [exec] Crawl/parse...
     [exec] 
     [exec]   /usr/home/hudson/hudson-slave/workspace/Lucene-Solr-SmokeRelease-trunk/lucene/build/fakeReleaseTmp/unpack/lucene-5.0/docs/core/org/apache/lucene/store/package-use.html
     [exec]     WARNING: anchor "../../../../org/apache/lucene/store/subclasses" appears more
than once
     [exec] 
     [exec] Verify...
     [exec]     unpack lucene-5.0.zip...
     [exec]     test demo...
     [exec]       got 5147 hits for query "lucene"
     [exec]     check Lucene's javadoc JAR
     [exec] 
     [exec] /usr/home/hudson/hudson-slave/workspace/Lucene-Solr-SmokeRelease-trunk/lucene/build/fakeReleaseTmp/unpack/lucene-5.0/docs/queryparser/org/apache/lucene/queryparser/xml/package-summary.html
     [exec]   missing: FilterBuilder
     [exec]   missing: CorePlusExtensionsParser
     [exec]   missing: DOMUtils
     [exec]   missing: FilterBuilderFactory
     [exec]   missing: QueryBuilderFactory
     [exec]   missing: ParserException
     [exec] 
     [exec] /usr/home/hudson/hudson-slave/workspace/Lucene-Solr-SmokeRelease-trunk/lucene/build/fakeReleaseTmp/unpack/lucene-5.0/docs/queryparser/org/apache/lucene/queryparser/xml/builders/package-summary.html
     [exec]   missing: SpanQueryBuilder
     [exec]   missing: BooleanFilterBuilder
     [exec]   missing: BooleanQueryBuilder
     [exec]   missing: BoostingQueryBuilder
     [exec]   missing: BoostingTermBuilder
     [exec]   missing: ConstantScoreQueryBuilder
     [exec]   missing: DuplicateFilterBuilder
     [exec]   missing: FilteredQueryBuilder
     [exec]   missing: FuzzyLikeThisQueryBuilder
     [exec]   missing: LikeThisQueryBuilder
     [exec]   missing: MatchAllDocsQueryBuilder
     [exec]   missing: RangeFilterBuilder
     [exec]   missing: SpanBuilderBase
     [exec]   missing: SpanFirstBuilder
     [exec]   missing: SpanNearBuilder
     [exec]   missing: SpanNotBuilder
     [exec]   missing: SpanOrBuilder
     [exec]   missing: SpanOrTermsBuilder
     [exec]   missing: SpanQueryBuilderFactory
     [exec]   missing: SpanTermBuilder
     [exec]   missing: TermQueryBuilder
     [exec]   missing: TermsFilterBuilder
     [exec] 
     [exec] /usr/home/hudson/hudson-slave/workspace/Lucene-Solr-SmokeRelease-trunk/lucene/build/fakeReleaseTmp/unpack/lucene-5.0/docs/queryparser/org/apache/lucene/queryparser/surround/query/package-summary.html
     [exec]   missing: DistanceSubQuery
     [exec]   missing: SimpleTerm.MatchingTermVisitor
     [exec]   missing: AndQuery
     [exec]   missing: BasicQueryFactory
     [exec]   missing: ComposedQuery
     [exec]   missing: DistanceQuery
     [exec]   missing: FieldsQuery
     [exec]   missing: NotQuery
     [exec]   missing: OrQuery
     [exec]   missing: SimpleTerm
     [exec]   missing: SpanNearClauseFactory
     [exec]   missing: SrndPrefixQuery
     [exec]   missing: SrndQuery
     [exec]   missing: SrndTermQuery
     [exec]   missing: SrndTruncQuery
     [exec]   missing: TooManyBasicQueries
     [exec] 
     [exec] /usr/home/hudson/hudson-slave/workspace/Lucene-Solr-SmokeRelease-trunk/lucene/build/fakeReleaseTmp/unpack/lucene-5.0/docs/queryparser/org/apache/lucene/queryparser/flexible/standard/package-summary.html
     [exec]   missing: CommonQueryParserConfiguration
     [exec] 
     [exec] /usr/home/hudson/hudson-slave/workspace/Lucene-Solr-SmokeRelease-trunk/lucene/build/fakeReleaseTmp/unpack/lucene-5.0/docs/queryparser/org/apache/lucene/queryparser/flexible/standard/processors/package-summary.html
     [exec]   missing: OpenRangeQueryNodeProcessor
     [exec] 
     [exec] /usr/home/hudson/hudson-slave/workspace/Lucene-Solr-SmokeRelease-trunk/lucene/build/fakeReleaseTmp/unpack/lucene-5.0/docs/queryparser/org/apache/lucene/queryparser/flexible/standard/parser/package-summary.html
     [exec]   missing: EscapeQuerySyntaxImpl
     [exec]   missing: StandardSyntaxParser
     [exec] 
     [exec] /usr/home/hudson/hudson-slave/workspace/Lucene-Solr-SmokeRelease-trunk/lucene/build/fakeReleaseTmp/unpack/lucene-5.0/docs/queryparser/org/apache/lucene/queryparser/flexible/standard/builders/package-summary.html
     [exec]   missing: AnyQueryNodeBuilder
     [exec] 
     [exec] /usr/home/hudson/hudson-slave/workspace/Lucene-Solr-SmokeRelease-trunk/lucene/build/fakeReleaseTmp/unpack/lucene-5.0/docs/queryparser/org/apache/lucene/queryparser/flexible/standard/config/package-summary.html
     [exec]   missing: FuzzyConfig
     [exec]   missing: StandardQueryConfigHandler.ConfigurationKeys
     [exec]   missing: StandardQueryConfigHandler.Operator
     [exec] 
     [exec] /usr/home/hudson/hudson-slave/workspace/Lucene-Solr-SmokeRelease-trunk/lucene/build/fakeReleaseTmp/unpack/lucene-5.0/docs/queryparser/org/apache/lucene/queryparser/flexible/core/nodes/package-summary.html
     [exec]   missing: TextableQueryNode
     [exec]   missing: PathQueryNode.QueryText
     [exec]   missing: PhraseSlopQueryNode
     [exec]   missing: ProximityQueryNode.ProximityType
     [exec]   missing: ModifierQueryNode.Modifier
     [exec]   missing: ProximityQueryNode.Type
     [exec] 
     [exec] /usr/home/hudson/hudson-slave/workspace/Lucene-Solr-SmokeRelease-trunk/lucene/build/fakeReleaseTmp/unpack/lucene-5.0/docs/queryparser/org/apache/lucene/queryparser/flexible/core/parser/package-summary.html
     [exec]   missing: EscapeQuerySyntax.Type
     [exec] 
     [exec] /usr/home/hudson/hudson-slave/workspace/Lucene-Solr-SmokeRelease-trunk/lucene/build/fakeReleaseTmp/unpack/lucene-5.0/docs/queryparser/org/apache/lucene/queryparser/flexible/core/util/package-summary.html
     [exec]   missing: StringUtils
     [exec] 
     [exec] /usr/home/hudson/hudson-slave/workspace/Lucene-Solr-SmokeRelease-trunk/lucene/build/fakeReleaseTmp/unpack/lucene-5.0/docs/queries/org/apache/lucene/queries/function/package-summary.html
     [exec]   missing: FunctionValues.ValueFiller
     [exec]   missing: ValueSourceScorer
     [exec] 
     [exec] /usr/home/hudson/hudson-slave/workspace/Lucene-Solr-SmokeRelease-trunk/lucene/build/fakeReleaseTmp/unpack/lucene-5.0/docs/queries/org/apache/lucene/queries/function/docvalues/package-summary.html
     [exec]   missing: BoolDocValues
     [exec]   missing: DoubleDocValues
     [exec]   missing: FloatDocValues
     [exec]   missing: IntDocValues
     [exec]   missing: LongDocValues
     [exec]   missing: StrDocValues
     [exec]   missing: DocTermsIndexDocValues.DocTermsIndexException
     [exec] 
     [exec] /usr/home/hudson/hudson-slave/workspace/Lucene-Solr-SmokeRelease-trunk/lucene/build/fakeReleaseTmp/unpack/lucene-5.0/docs/queries/org/apache/lucene/queries/function/valuesource/package-summary.html
     [exec]   missing: BoolFunction
     [exec]   missing: DefFunction
     [exec]   missing: DualFloatFunction
     [exec]   missing: MultiBoolFunction
     [exec]   missing: MultiFloatFunction
     [exec]   missing: MultiFunction
     [exec]   missing: NumDocsValueSource
     [exec]   missing: ShortFieldSource
     [exec]   missing: SimpleBoolFunction
     [exec] 
     [exec] /usr/home/hudson/hudson-slave/workspace/Lucene-Solr-SmokeRelease-trunk/lucene/build/fakeReleaseTmp/unpack/lucene-5.0/docs/spatial/org/apache/lucene/spatial/prefix/package-summary.html
     [exec]   missing: PointPrefixTreeFieldCacheProvider
     [exec]   missing: PrefixTreeStrategy
     [exec] 
     [exec] /usr/home/hudson/hudson-slave/workspace/Lucene-Solr-SmokeRelease-trunk/lucene/build/fakeReleaseTmp/unpack/lucene-5.0/docs/spatial/org/apache/lucene/spatial/prefix/tree/package-summary.html
     [exec]   missing: GeohashPrefixTree.Factory
     [exec]   missing: QuadPrefixTree
     [exec]   missing: QuadPrefixTree.Factory
     [exec]   missing: SpatialPrefixTreeFactory
     [exec] 
     [exec] /usr/home/hudson/hudson-slave/workspace/Lucene-Solr-SmokeRelease-trunk/lucene/build/fakeReleaseTmp/unpack/lucene-5.0/docs/spatial/org/apache/lucene/spatial/bbox/package-summary.html
     [exec]   missing: BBoxSimilarity
     [exec] 
     [exec] /usr/home/hudson/hudson-slave/workspace/Lucene-Solr-SmokeRelease-trunk/lucene/build/fakeReleaseTmp/unpack/lucene-5.0/docs/spatial/org/apache/lucene/spatial/util/package-summary.html
     [exec]   missing: CachingDoubleValueSource
     [exec]   missing: ShapeFieldCache<T extends Shape>
     [exec]   missing: ShapeFieldCacheProvider<T extends Shape>
     [exec]   missing: ValueSourceFilter
     [exec] 
     [exec] /usr/home/hudson/hudson-slave/workspace/Lucene-Solr-SmokeRelease-trunk/lucene/build/fakeReleaseTmp/unpack/lucene-5.0/docs/spatial/org/apache/lucene/spatial/query/package-summary.html
     [exec]   missing: UnsupportedSpatialOperation
     [exec] 
     [exec] /usr/home/hudson/hudson-slave/workspace/Lucene-Solr-SmokeRelease-trunk/lucene/build/fakeReleaseTmp/unpack/lucene-5.0/docs/spatial/org/apache/lucene/spatial/vector/package-summary.html
     [exec]   missing: TwoDoublesStrategy
     [exec] 
     [exec] /usr/home/hudson/hudson-slave/workspace/Lucene-Solr-SmokeRelease-trunk/lucene/build/fakeReleaseTmp/unpack/lucene-5.0/docs/highlighter/org/apache/lucene/search/highlight/package-summary.html
     [exec]   missing: TokenStreamFromTermPositionVector
     [exec] 
     [exec] /usr/home/hudson/hudson-slave/workspace/Lucene-Solr-SmokeRelease-trunk/lucene/build/fakeReleaseTmp/unpack/lucene-5.0/docs/highlighter/org/apache/lucene/search/vectorhighlight/package-summary.html
     [exec]   missing: BoundaryScanner
     [exec]   missing: BaseFragmentsBuilder
     [exec]   missing: FieldFragList.WeightedFragInfo
     [exec]   missing: FieldFragList.WeightedFragInfo.SubInfo
     [exec]   missing: FieldPhraseList.WeightedPhraseInfo
     [exec]   missing: FieldPhraseList.WeightedPhraseInfo.Toffs
     [exec]   missing: FieldQuery.QueryPhraseMap
     [exec]   missing: FieldTermStack.TermInfo
     [exec]   missing: ScoreOrderFragmentsBuilder.ScoreComparator
     [exec]   missing: SimpleBoundaryScanner
     [exec] 
     [exec] ***WARNING***: javadocs want to fail!
     [exec] 
     [exec] 
     [exec] Crawl/parse...
     [exec] 
     [exec]   /usr/home/hudson/hudson-slave/workspace/Lucene-Solr-SmokeRelease-trunk/lucene/build/fakeReleaseTmp/unpack/lucene-5.0/docs/core/org/apache/lucene/store/package-use.html
     [exec]     WARNING: anchor "../../../../org/apache/lucene/store/subclasses" appears more
than once
     [exec] 
     [exec] Verify...
     [exec]     unpack lucene-5.0-src.tgz...
     [exec]     make sure no JARs/WARs in src dist...
     [exec]     run "ant validate"
     [exec]     run tests w/ Java 6...
     [exec]     test demo...
     [exec]       got 196 hits for query "lucene"
     [exec]     generate javadocs w/ Java 6...
     [exec] 
     [exec] /usr/home/hudson/hudson-slave/workspace/Lucene-Solr-SmokeRelease-trunk/lucene/build/fakeReleaseTmp/unpack/lucene-5.0/build/docs/queries/org/apache/lucene/queries/function/package-summary.html
     [exec]   missing: FunctionValues.ValueFiller
     [exec]   missing: ValueSourceScorer
     [exec] 
     [exec] /usr/home/hudson/hudson-slave/workspace/Lucene-Solr-SmokeRelease-trunk/lucene/build/fakeReleaseTmp/unpack/lucene-5.0/build/docs/queries/org/apache/lucene/queries/function/docvalues/package-summary.html
     [exec]   missing: BoolDocValues
     [exec]   missing: DoubleDocValues
     [exec]   missing: FloatDocValues
     [exec]   missing: IntDocValues
     [exec]   missing: LongDocValues
     [exec]   missing: StrDocValues
     [exec]   missing: DocTermsIndexDocValues.DocTermsIndexException
     [exec] 
     [exec] /usr/home/hudson/hudson-slave/workspace/Lucene-Solr-SmokeRelease-trunk/lucene/build/fakeReleaseTmp/unpack/lucene-5.0/build/docs/queries/org/apache/lucene/queries/function/valuesource/package-summary.html
     [exec]   missing: BoolFunction
     [exec]   missing: DefFunction
     [exec]   missing: DualFloatFunction
     [exec]   missing: MultiBoolFunction
     [exec]   missing: MultiFloatFunction
     [exec]   missing: MultiFunction
     [exec]   missing: NumDocsValueSource
     [exec]   missing: ShortFieldSource
     [exec]   missing: SimpleBoolFunction
     [exec] 
     [exec] /usr/home/hudson/hudson-slave/workspace/Lucene-Solr-SmokeRelease-trunk/lucene/build/fakeReleaseTmp/unpack/lucene-5.0/build/docs/queryparser/org/apache/lucene/queryparser/flexible/standard/package-summary.html
     [exec]   missing: CommonQueryParserConfiguration
     [exec] 
     [exec] /usr/home/hudson/hudson-slave/workspace/Lucene-Solr-SmokeRelease-trunk/lucene/build/fakeReleaseTmp/unpack/lucene-5.0/build/docs/queryparser/org/apache/lucene/queryparser/flexible/standard/builders/package-summary.html
     [exec]   missing: AnyQueryNodeBuilder
     [exec] 
     [exec] /usr/home/hudson/hudson-slave/workspace/Lucene-Solr-SmokeRelease-trunk/lucene/build/fakeReleaseTmp/unpack/lucene-5.0/build/docs/queryparser/org/apache/lucene/queryparser/flexible/standard/parser/package-summary.html
     [exec]   missing: EscapeQuerySyntaxImpl
     [exec]   missing: StandardSyntaxParser
     [exec] 
     [exec] /usr/home/hudson/hudson-slave/workspace/Lucene-Solr-SmokeRelease-trunk/lucene/build/fakeReleaseTmp/unpack/lucene-5.0/build/docs/queryparser/org/apache/lucene/queryparser/flexible/standard/processors/package-summary.html
     [exec]   missing: OpenRangeQueryNodeProcessor
     [exec] 
     [exec] /usr/home/hudson/hudson-slave/workspace/Lucene-Solr-SmokeRelease-trunk/lucene/build/fakeReleaseTmp/unpack/lucene-5.0/build/docs/queryparser/org/apache/lucene/queryparser/flexible/standard/config/package-summary.html
     [exec]   missing: FuzzyConfig
     [exec]   missing: StandardQueryConfigHandler.ConfigurationKeys
     [exec]   missing: StandardQueryConfigHandler.Operator
     [exec] 
     [exec] /usr/home/hudson/hudson-slave/workspace/Lucene-Solr-SmokeRelease-trunk/lucene/build/fakeReleaseTmp/unpack/lucene-5.0/build/docs/queryparser/org/apache/lucene/queryparser/flexible/core/nodes/package-summary.html
     [exec]   missing: TextableQueryNode
     [exec]   missing: PathQueryNode.QueryText
     [exec]   missing: PhraseSlopQueryNode
     [exec]   missing: ProximityQueryNode.ProximityType
     [exec]   missing: ModifierQueryNode.Modifier
     [exec]   missing: ProximityQueryNode.Type
     [exec] 
     [exec] /usr/home/hudson/hudson-slave/workspace/Lucene-Solr-SmokeRelease-trunk/lucene/build/fakeReleaseTmp/unpack/lucene-5.0/build/docs/queryparser/org/apache/lucene/queryparser/flexible/core/parser/package-summary.html
     [exec]   missing: EscapeQuerySyntax.Type
     [exec] 
     [exec] /usr/home/hudson/hudson-slave/workspace/Lucene-Solr-SmokeRelease-trunk/lucene/build/fakeReleaseTmp/unpack/lucene-5.0/build/docs/queryparser/org/apache/lucene/queryparser/flexible/core/util/package-summary.html
     [exec]   missing: StringUtils
     [exec] 
     [exec] /usr/home/hudson/hudson-slave/workspace/Lucene-Solr-SmokeRelease-trunk/lucene/build/fakeReleaseTmp/unpack/lucene-5.0/build/docs/queryparser/org/apache/lucene/queryparser/xml/package-summary.html
     [exec]   missing: FilterBuilder
     [exec]   missing: CorePlusExtensionsParser
     [exec]   missing: DOMUtils
     [exec]   missing: FilterBuilderFactory
     [exec]   missing: QueryBuilderFactory
     [exec]   missing: ParserException
     [exec] 
     [exec] /usr/home/hudson/hudson-slave/workspace/Lucene-Solr-SmokeRelease-trunk/lucene/build/fakeReleaseTmp/unpack/lucene-5.0/build/docs/queryparser/org/apache/lucene/queryparser/xml/builders/package-summary.html
     [exec]   missing: SpanQueryBuilder
     [exec]   missing: BooleanFilterBuilder
     [exec]   missing: BooleanQueryBuilder
     [exec]   missing: BoostingQueryBuilder
     [exec]   missing: BoostingTermBuilder
     [exec]   missing: ConstantScoreQueryBuilder
     [exec]   missing: DuplicateFilterBuilder
     [exec]   missing: FilteredQueryBuilder
     [exec]   missing: FuzzyLikeThisQueryBuilder
     [exec]   missing: LikeThisQueryBuilder
     [exec]   missing: MatchAllDocsQueryBuilder
     [exec]   missing: RangeFilterBuilder
     [exec]   missing: SpanBuilderBase
     [exec]   missing: SpanFirstBuilder
     [exec]   missing: SpanNearBuilder
     [exec]   missing: SpanNotBuilder
     [exec]   missing: SpanOrBuilder
     [exec]   missing: SpanOrTermsBuilder
     [exec]   missing: SpanQueryBuilderFactory
     [exec]   missing: SpanTermBuilder
     [exec]   missing: TermQueryBuilder
     [exec]   missing: TermsFilterBuilder
     [exec] 
     [exec] /usr/home/hudson/hudson-slave/workspace/Lucene-Solr-SmokeRelease-trunk/lucene/build/fakeReleaseTmp/unpack/lucene-5.0/build/docs/queryparser/org/apache/lucene/queryparser/surround/query/package-summary.html
     [exec]   missing: DistanceSubQuery
     [exec]   missing: SimpleTerm.MatchingTermVisitor
     [exec]   missing: AndQuery
     [exec]   missing: BasicQueryFactory
     [exec]   missing: ComposedQuery
     [exec]   missing: DistanceQuery
     [exec]   missing: FieldsQuery
     [exec]   missing: NotQuery
     [exec]   missing: OrQuery
     [exec]   missing: SimpleTerm
     [exec]   missing: SpanNearClauseFactory
     [exec]   missing: SrndPrefixQuery
     [exec]   missing: SrndQuery
     [exec]   missing: SrndTermQuery
     [exec]   missing: SrndTruncQuery
     [exec]   missing: TooManyBasicQueries
     [exec] 
     [exec] /usr/home/hudson/hudson-slave/workspace/Lucene-Solr-SmokeRelease-trunk/lucene/build/fakeReleaseTmp/unpack/lucene-5.0/build/docs/highlighter/org/apache/lucene/search/vectorhighlight/package-summary.html
     [exec]   missing: BoundaryScanner
     [exec]   missing: BaseFragmentsBuilder
     [exec]   missing: FieldFragList.WeightedFragInfo
     [exec]   missing: FieldFragList.WeightedFragInfo.SubInfo
     [exec]   missing: FieldPhraseList.WeightedPhraseInfo
     [exec]   missing: FieldPhraseList.WeightedPhraseInfo.Toffs
     [exec]   missing: FieldQuery.QueryPhraseMap
     [exec]   missing: FieldTermStack.TermInfo
     [exec]   missing: ScoreOrderFragmentsBuilder.ScoreComparator
     [exec]   missing: SimpleBoundaryScanner
     [exec] 
     [exec] /usr/home/hudson/hudson-slave/workspace/Lucene-Solr-SmokeRelease-trunk/lucene/build/fakeReleaseTmp/unpack/lucene-5.0/build/docs/highlighter/org/apache/lucene/search/highlight/package-summary.html
     [exec]   missing: TokenStreamFromTermPositionVector
     [exec] 
     [exec] /usr/home/hudson/hudson-slave/workspace/Lucene-Solr-SmokeRelease-trunk/lucene/build/fakeReleaseTmp/unpack/lucene-5.0/build/docs/spatial/org/apache/lucene/spatial/util/package-summary.html
     [exec]   missing: CachingDoubleValueSource
     [exec]   missing: ShapeFieldCache<T extends Shape>
     [exec]   missing: ShapeFieldCacheProvider<T extends Shape>
     [exec]   missing: ValueSourceFilter
     [exec] 
     [exec] /usr/home/hudson/hudson-slave/workspace/Lucene-Solr-SmokeRelease-trunk/lucene/build/fakeReleaseTmp/unpack/lucene-5.0/build/docs/spatial/org/apache/lucene/spatial/bbox/package-summary.html
     [exec]   missing: BBoxSimilarity
     [exec] 
     [exec] /usr/home/hudson/hudson-slave/workspace/Lucene-Solr-SmokeRelease-trunk/lucene/build/fakeReleaseTmp/unpack/lucene-5.0/build/docs/spatial/org/apache/lucene/spatial/vector/package-summary.html
     [exec]   missing: TwoDoublesStrategy
     [exec] 
     [exec] /usr/home/hudson/hudson-slave/workspace/Lucene-Solr-SmokeRelease-trunk/lucene/build/fakeReleaseTmp/unpack/lucene-5.0/build/docs/spatial/org/apache/lucene/spatial/prefix/package-summary.html
     [exec]   missing: PointPrefixTreeFieldCacheProvider
     [exec]   missing: PrefixTreeStrategy
     [exec] 
     [exec] /usr/home/hudson/hudson-slave/workspace/Lucene-Solr-SmokeRelease-trunk/lucene/build/fakeReleaseTmp/unpack/lucene-5.0/build/docs/spatial/org/apache/lucene/spatial/prefix/tree/package-summary.html
     [exec]   missing: GeohashPrefixTree.Factory
     [exec]   missing: QuadPrefixTree
     [exec]   missing: QuadPrefixTree.Factory
     [exec]   missing: SpatialPrefixTreeFactory
     [exec] 
     [exec] /usr/home/hudson/hudson-slave/workspace/Lucene-Solr-SmokeRelease-trunk/lucene/build/fakeReleaseTmp/unpack/lucene-5.0/build/docs/spatial/org/apache/lucene/spatial/query/package-summary.html
     [exec]   missing: UnsupportedSpatialOperation
     [exec] 
     [exec] ***WARNING***: javadocs want to fail!
     [exec] 
     [exec] 
     [exec] Crawl/parse...
     [exec] 
     [exec]   /usr/home/hudson/hudson-slave/workspace/Lucene-Solr-SmokeRelease-trunk/lucene/build/fakeReleaseTmp/unpack/lucene-5.0/build/docs/core/org/apache/lucene/store/package-use.html
     [exec]     WARNING: anchor "../../../../org/apache/lucene/store/subclasses" appears more
than once
     [exec] 
     [exec] Verify...
     [exec] 
     [exec] Test Solr...
     [exec]   test basics...
     [exec]   get KEYS
     [exec]     0.1 MB
     [exec]   download apache-solr-5.0-src.tgz...
     [exec]     29.3 MB
     [exec]     verify md5/sha1 digests
     [exec]   download apache-solr-5.0.tgz...
     [exec]     99.7 MB
     [exec]     verify md5/sha1 digests
     [exec]   download apache-solr-5.0.zip...
     [exec]     104.4 MB
     [exec]     verify md5/sha1 digests
     [exec]     unpack apache-solr-5.0.tgz...
     [exec]     test solr example w/ Java 6...
     [exec]       start Solr instance (log=/usr/home/hudson/hudson-slave/workspace/Lucene-Solr-SmokeRelease-trunk/lucene/build/fakeReleaseTmp/unpack/apache-solr-5.0/solr-example.log)...
     [exec]       startup done
     [exec]       test utf8...
     [exec] Exception in thread Thread-1:
     [exec] Traceback (most recent call last):
     [exec]   File "/usr/local/lib/python3.2/threading.py", line 740, in _bootstrap_inner
     [exec]     self.run()
     [exec]   File "/usr/local/lib/python3.2/threading.py", line 693, in run
     [exec]     self._target(*self._args, **self._kwargs)
     [exec]   File "dev-tools/scripts/smokeTestRelease.py", line 559, in readSolrOutput
     [exec] UnicodeDecodeError: 'utf-8' codec can't decode byte 0xe9 in position 67: invalid
continuation byte
     [exec] 
     [exec]       index example docs...
     [exec]       run query...
     [exec]       stop server (SIGINT)...
     [exec]     test solr example w/ Java 7...
     [exec]       start Solr instance (log=/usr/home/hudson/hudson-slave/workspace/Lucene-Solr-SmokeRelease-trunk/lucene/build/fakeReleaseTmp/unpack/apache-solr-5.0/solr-example.log)...
     [exec]       startup done
     [exec]       test utf8...
     [exec]       index example docs...
     [exec]       run query...
     [exec]       stop server (SIGINT)...
     [exec]     unpack apache-solr-5.0.zip...
     [exec]     test solr example w/ Java 6...
     [exec]       start Solr instance (log=/usr/home/hudson/hudson-slave/workspace/Lucene-Solr-SmokeRelease-trunk/lucene/build/fakeReleaseTmp/unpack/apache-solr-5.0/solr-example.log)...
     [exec]       startup done
     [exec]       test utf8...
     [exec] Exception in thread Thread-3:
     [exec] Traceback (most recent call last):
     [exec]   File "/usr/local/lib/python3.2/threading.py", line 740, in _bootstrap_inner
     [exec]     self.run()
     [exec]   File "/usr/local/lib/python3.2/threading.py", line 693, in run
     [exec]     self._target(*self._args, **self._kwargs)
     [exec]   File "dev-tools/scripts/smokeTestRelease.py", line 559, in readSolrOutput
     [exec] UnicodeDecodeError: 'utf-8' codec can't decode byte 0xe9 in position 67: invalid
continuation byte
     [exec] 
     [exec]       index example docs...
     [exec]       run query...
     [exec]       stop server (SIGINT)...
     [exec]     test solr example w/ Java 7...
     [exec]       start Solr instance (log=/usr/home/hudson/hudson-slave/workspace/Lucene-Solr-SmokeRelease-trunk/lucene/build/fakeReleaseTmp/unpack/apache-solr-5.0/solr-example.log)...
     [exec]       startup done
     [exec]       test utf8...
     [exec]       index example docs...
     [exec]       run query...
     [exec]       stop server (SIGINT)...
     [exec]     unpack apache-solr-5.0-src.tgz...
     [exec]     make sure no JARs/WARs in src dist...
     [exec]     run "ant validate"
     [exec]     run tests w/ Java 6...
     [exec]     generate javadocs w/ Java 6...
     [exec] 
     [exec] Crawl/parse...
     [exec] 
     [exec] Verify...
     [exec]     run tests w/ Java 7...
     [exec] Traceback (most recent call last):
     [exec]   File "dev-tools/scripts/smokeTestRelease.py", line 1096, in <module>
     [exec]     main()
     [exec]   File "dev-tools/scripts/smokeTestRelease.py", line 1046, in main
     [exec]     smokeTest(baseURL, version, tmpDir, isSigned)
     [exec]   File "dev-tools/scripts/smokeTestRelease.py", line 1089, in smokeTest
     [exec]     unpack('solr', tmpDir, 'apache-solr-%s-src.tgz' % version, version)
     [exec]   File "dev-tools/scripts/smokeTestRelease.py", line 412, in unpack
     [exec]     verifyUnpacked(project, artifact, unpackPath, version, tmpDir)
     [exec]   File "dev-tools/scripts/smokeTestRelease.py", line 498, in verifyUnpacked
     [exec]     run('%s; ant test' % javaExe('1.7'), '%s/test.log' % unpackPath)
     [exec]   File "dev-tools/scripts/smokeTestRelease.py", line 336, in run
     [exec]     raise RuntimeError('command "%s" failed; see log file %s' % (command, logPath))
     [exec] RuntimeError: command "export JAVA_HOME="/home/hudson/tools/java/latest1.7" PATH="/home/hudson/tools/java/latest1.7/bin:/sbin:/bin:/usr/sbin:/usr/bin:/usr/games:/usr/local/sbin:/usr/local/bin:/home/hudson/bin";
ant test" failed; see log file /usr/home/hudson/hudson-slave/workspace/Lucene-Solr-SmokeRelease-trunk/lucene/build/fakeReleaseTmp/unpack/apache-solr-5.0/test.log

BUILD FAILED
/usr/home/hudson/hudson-slave/workspace/Lucene-Solr-SmokeRelease-trunk/build.xml:236: exec
returned: 1

Total time: 71 minutes 50 seconds
Build step 'Invoke Ant' marked build as failure
Email was triggered for: Failure
Sending email for trigger: Failure



Mime
View raw message