lucene-dev mailing list archives

Site index · List index
Message view « Date » · « Thread »
Top « Date » · « Thread »
From Policeman Jenkins Server <jenk...@sd-datasolutions.de>
Subject [JENKINS] Lucene-Solr-trunk-Windows (64bit/jdk1.7.0_06) - Build # 390 - Failure!
Date Wed, 22 Aug 2012 09:50:42 GMT
Build: http://jenkins.sd-datasolutions.de/job/Lucene-Solr-trunk-Windows/390/
Java: 64bit/jdk1.7.0_06 -XX:+UseG1GC

1 tests failed.
REGRESSION:  org.apache.solr.spelling.suggest.SuggesterTSTTest.testSuggestions

Error Message:
Exception during query

Stack Trace:
java.lang.RuntimeException: Exception during query
	at __randomizedtesting.SeedInfo.seed([52FBD939A8B3C48A:F427E0CC66879374]:0)
	at org.apache.solr.SolrTestCaseJ4.assertQ(SolrTestCaseJ4.java:493)
	at org.apache.solr.SolrTestCaseJ4.assertQ(SolrTestCaseJ4.java:460)
	at org.apache.solr.spelling.suggest.SuggesterTest.testSuggestions(SuggesterTest.java:71)
	at sun.reflect.NativeMethodAccessorImpl.invoke0(Native Method)
	at sun.reflect.NativeMethodAccessorImpl.invoke(NativeMethodAccessorImpl.java:57)
	at sun.reflect.DelegatingMethodAccessorImpl.invoke(DelegatingMethodAccessorImpl.java:43)
	at java.lang.reflect.Method.invoke(Method.java:601)
	at com.carrotsearch.randomizedtesting.RandomizedRunner.invoke(RandomizedRunner.java:1559)
	at com.carrotsearch.randomizedtesting.RandomizedRunner.access$600(RandomizedRunner.java:79)
	at com.carrotsearch.randomizedtesting.RandomizedRunner$6.evaluate(RandomizedRunner.java:737)
	at com.carrotsearch.randomizedtesting.RandomizedRunner$7.evaluate(RandomizedRunner.java:773)
	at com.carrotsearch.randomizedtesting.RandomizedRunner$8.evaluate(RandomizedRunner.java:787)
	at com.carrotsearch.randomizedtesting.rules.SystemPropertiesRestoreRule$1.evaluate(SystemPropertiesRestoreRule.java:53)
	at org.apache.lucene.util.TestRuleSetupTeardownChained$1.evaluate(TestRuleSetupTeardownChained.java:50)
	at org.apache.lucene.util.TestRuleFieldCacheSanity$1.evaluate(TestRuleFieldCacheSanity.java:51)
	at org.apache.lucene.util.AbstractBeforeAfterRule$1.evaluate(AbstractBeforeAfterRule.java:45)
	at com.carrotsearch.randomizedtesting.rules.SystemPropertiesInvariantRule$1.evaluate(SystemPropertiesInvariantRule.java:55)
	at org.apache.lucene.util.TestRuleThreadAndTestName$1.evaluate(TestRuleThreadAndTestName.java:48)
	at org.apache.lucene.util.TestRuleIgnoreAfterMaxFailures$1.evaluate(TestRuleIgnoreAfterMaxFailures.java:70)
	at org.apache.lucene.util.TestRuleMarkFailure$1.evaluate(TestRuleMarkFailure.java:48)
	at com.carrotsearch.randomizedtesting.rules.StatementAdapter.evaluate(StatementAdapter.java:36)
	at com.carrotsearch.randomizedtesting.ThreadLeakControl$StatementRunner.run(ThreadLeakControl.java:345)
	at com.carrotsearch.randomizedtesting.ThreadLeakControl.forkTimeoutingTask(ThreadLeakControl.java:769)
	at com.carrotsearch.randomizedtesting.ThreadLeakControl$3.evaluate(ThreadLeakControl.java:429)
	at com.carrotsearch.randomizedtesting.RandomizedRunner.runSingleTest(RandomizedRunner.java:746)
	at com.carrotsearch.randomizedtesting.RandomizedRunner$3.evaluate(RandomizedRunner.java:648)
	at com.carrotsearch.randomizedtesting.RandomizedRunner$4.evaluate(RandomizedRunner.java:682)
	at com.carrotsearch.randomizedtesting.RandomizedRunner$5.evaluate(RandomizedRunner.java:693)
	at com.carrotsearch.randomizedtesting.rules.StatementAdapter.evaluate(StatementAdapter.java:36)
	at com.carrotsearch.randomizedtesting.rules.SystemPropertiesRestoreRule$1.evaluate(SystemPropertiesRestoreRule.java:53)
	at org.apache.lucene.util.AbstractBeforeAfterRule$1.evaluate(AbstractBeforeAfterRule.java:45)
	at org.apache.lucene.util.TestRuleStoreClassName$1.evaluate(TestRuleStoreClassName.java:42)
	at com.carrotsearch.randomizedtesting.rules.SystemPropertiesInvariantRule$1.evaluate(SystemPropertiesInvariantRule.java:55)
	at com.carrotsearch.randomizedtesting.rules.NoShadowingOrOverridesOnMethodsRule$1.evaluate(NoShadowingOrOverridesOnMethodsRule.java:39)
	at com.carrotsearch.randomizedtesting.rules.NoShadowingOrOverridesOnMethodsRule$1.evaluate(NoShadowingOrOverridesOnMethodsRule.java:39)
	at org.apache.lucene.util.TestRuleAssertionsRequired$1.evaluate(TestRuleAssertionsRequired.java:40)
	at org.apache.lucene.util.TestRuleMarkFailure$1.evaluate(TestRuleMarkFailure.java:48)
	at org.apache.lucene.util.TestRuleIgnoreAfterMaxFailures$1.evaluate(TestRuleIgnoreAfterMaxFailures.java:70)
	at org.apache.lucene.util.TestRuleIgnoreTestSuites$1.evaluate(TestRuleIgnoreTestSuites.java:55)
	at com.carrotsearch.randomizedtesting.rules.StatementAdapter.evaluate(StatementAdapter.java:36)
	at com.carrotsearch.randomizedtesting.ThreadLeakControl$StatementRunner.run(ThreadLeakControl.java:345)
	at java.lang.Thread.run(Thread.java:722)
Caused by: java.lang.RuntimeException: REQUEST FAILED: xpath=//lst[@name='spellcheck']/lst[@name='suggestions']/lst[@name='ac']/int[@name='numFound'][.='2']
	xml response was: <?xml version="1.0" encoding="UTF-8"?>
<response>
<lst name="responseHeader"><int name="status">0</int><int name="QTime">0</int></lst><lst name="spellcheck"><lst name="suggestions"/></lst>
</response>

	request was:q=ac&spellcheck.count=2&qt=/suggest_tst&spellcheck.onlyMorePopular=true
	at org.apache.solr.SolrTestCaseJ4.assertQ(SolrTestCaseJ4.java:486)
	... 41 more




Build Log:
[...truncated 7508 lines...]
[junit4:junit4] Suite: org.apache.solr.spelling.suggest.SuggesterTSTTest
[junit4:junit4]   2> 0 T3411 oas.SolrTestCaseJ4.initCore ####initCore
[junit4:junit4]   2> Creating dataDir: C:\Jenkins\workspace\Lucene-Solr-trunk-Windows\solr\build\solr-core\test\J0\.\solrtest-SuggesterTSTTest-1345628906698
[junit4:junit4]   2> 1 T3411 oasc.SolrResourceLoader.<init> new SolrResourceLoader for directory: 'C:\Jenkins\workspace\Lucene-Solr-trunk-Windows\solr\build\solr-core\test-files\solr\collection1\'
[junit4:junit4]   2> 1 T3411 oasc.SolrResourceLoader.replaceClassLoader Adding 'file:/C:/Jenkins/workspace/Lucene-Solr-trunk-Windows/solr/build/solr-core/test-files/solr/collection1/lib/classes/' to classloader
[junit4:junit4]   2> 2 T3411 oasc.SolrResourceLoader.replaceClassLoader Adding 'file:/C:/Jenkins/workspace/Lucene-Solr-trunk-Windows/solr/build/solr-core/test-files/solr/collection1/lib/README' to classloader
[junit4:junit4]   2> 42 T3411 oasc.SolrConfig.<init> Using Lucene MatchVersion: LUCENE_50
[junit4:junit4]   2> 103 T3411 oasc.SolrConfig.<init> Loaded SolrConfig: solrconfig-spellchecker.xml
[junit4:junit4]   2> 103 T3411 oass.IndexSchema.readSchema Reading Solr Schema
[junit4:junit4]   2> 106 T3411 oass.IndexSchema.readSchema Schema name=Solr SpellCheck Test
[junit4:junit4]   2> 134 T3411 oass.IndexSchema.readSchema default search field in schema is text
[junit4:junit4]   2> 137 T3411 oass.IndexSchema.readSchema query parser default operator is OR
[junit4:junit4]   2> 137 T3411 oass.IndexSchema.readSchema unique key field: id
[junit4:junit4]   2> 140 T3411 oasc.SolrResourceLoader.locateSolrHome JNDI not configured for solr (NoInitialContextEx)
[junit4:junit4]   2> 140 T3411 oasc.SolrResourceLoader.locateSolrHome using system property solr.solr.home: C:\Jenkins\workspace\Lucene-Solr-trunk-Windows\solr\build\solr-core\test-files\solr
[junit4:junit4]   2> 140 T3411 oasc.SolrResourceLoader.<init> new SolrResourceLoader for directory: 'C:\Jenkins\workspace\Lucene-Solr-trunk-Windows\solr\build\solr-core\test-files\solr\'
[junit4:junit4]   2> 148 T3411 oasc.CoreContainer.<init> New CoreContainer 1020896195
[junit4:junit4]   2> 149 T3411 oasc.SolrCore.<init> [collection1] Opening new SolrCore at C:\Jenkins\workspace\Lucene-Solr-trunk-Windows\solr\build\solr-core\test-files\solr\collection1\, dataDir=C:\Jenkins\workspace\Lucene-Solr-trunk-Windows\solr\build\solr-core\test\J0\.\solrtest-SuggesterTSTTest-1345628906698\
[junit4:junit4]   2> 149 T3411 oasc.SolrCore.<init> JMX monitoring not detected for core: collection1
[junit4:junit4]   2> 149 T3411 oasc.SolrCore.getNewIndexDir WARNING New index directory detected: old=null new=C:\Jenkins\workspace\Lucene-Solr-trunk-Windows\solr\build\solr-core\test\J0\.\solrtest-SuggesterTSTTest-1345628906698\index/
[junit4:junit4]   2> 149 T3411 oasc.SolrCore.initIndex WARNING [collection1] Solr index directory 'C:\Jenkins\workspace\Lucene-Solr-trunk-Windows\solr\build\solr-core\test\J0\.\solrtest-SuggesterTSTTest-1345628906698\index' doesn't exist. Creating new index...
[junit4:junit4]   2> 152 T3411 oasc.CachingDirectoryFactory.get return new directory for C:\Jenkins\workspace\Lucene-Solr-trunk-Windows\solr\build\solr-core\test\J0\.\solrtest-SuggesterTSTTest-1345628906698\index forceNew:false
[junit4:junit4]   2> 153 T3411 oasc.SolrDeletionPolicy.onCommit SolrDeletionPolicy.onCommit: commits:num=1
[junit4:junit4]   2> 		commit{dir=MockDirWrapper(org.apache.lucene.store.NIOFSDirectory@C:\Jenkins\workspace\Lucene-Solr-trunk-Windows\solr\build\solr-core\test\J0\solrtest-SuggesterTSTTest-1345628906698\index lockFactory=org.apache.lucene.store.NativeFSLockFactory@2ce26071),segFN=segments_1,generation=1,filenames=[segments_1]
[junit4:junit4]   2> 153 T3411 oasc.SolrDeletionPolicy.updateCommits newest commit = 1
[junit4:junit4]   2> 155 T3411 oasc.RequestHandlers.initHandlersFromConfig created standard: solr.StandardRequestHandler
[junit4:junit4]   2> 155 T3411 oasc.RequestHandlers.initHandlersFromConfig created /suggest: org.apache.solr.handler.component.SearchHandler
[junit4:junit4]   2> 155 T3411 oasc.RequestHandlers.initHandlersFromConfig created /suggest_tst: org.apache.solr.handler.component.SearchHandler
[junit4:junit4]   2> 156 T3411 oasc.RequestHandlers.initHandlersFromConfig created /suggest_fst: org.apache.solr.handler.component.SearchHandler
[junit4:junit4]   2> 156 T3411 oasc.RequestHandlers.initHandlersFromConfig created /suggest_wfst: org.apache.solr.handler.component.SearchHandler
[junit4:junit4]   2> 159 T3411 oass.SolrIndexSearcher.<init> Opening Searcher@6eedcaa4 main
[junit4:junit4]   2> 159 T3411 oass.SolrIndexSearcher.getIndexDir WARNING WARNING: Directory impl does not support setting indexDir: org.apache.lucene.store.MockDirectoryWrapper
[junit4:junit4]   2> 159 T3411 oasu.CommitTracker.<init> Hard AutoCommit: disabled
[junit4:junit4]   2> 159 T3411 oasu.CommitTracker.<init> Soft AutoCommit: disabled
[junit4:junit4]   2> 160 T3411 oashc.SpellCheckComponent.inform Initializing spell checkers
[junit4:junit4]   2> 161 T3411 oasss.Suggester.init init: {name=suggest,classname=org.apache.solr.spelling.suggest.Suggester,lookupImpl=org.apache.solr.spelling.suggest.jaspell.JaspellLookup,field=suggest,storeDir=suggest,buildOnCommit=true,threshold=0.0}
[junit4:junit4]   2> 161 T3411 oasssj.JaspellLookupFactory.create init: {name=suggest,classname=org.apache.solr.spelling.suggest.Suggester,lookupImpl=org.apache.solr.spelling.suggest.jaspell.JaspellLookup,field=suggest,storeDir=suggest,buildOnCommit=true,threshold=0.0}
[junit4:junit4]   2> 161 T3411 oashc.SpellCheckComponent.inform Registering newSearcher listener for spellchecker: suggest
[junit4:junit4]   2> 161 T3411 oashc.SpellCheckComponent.inform No queryConverter defined, using default converter
[junit4:junit4]   2> 162 T3411 oashc.SpellCheckComponent.inform Initializing spell checkers
[junit4:junit4]   2> 162 T3411 oasss.Suggester.init init: {name=suggest_tst,classname=org.apache.solr.spelling.suggest.Suggester,lookupImpl=org.apache.solr.spelling.suggest.tst.TSTLookup,field=suggest,storeDir=suggest_tst,buildOnCommit=true,threshold=0.0}
[junit4:junit4]   2> 162 T3411 oashc.SpellCheckComponent.inform Registering newSearcher listener for spellchecker: suggest_tst
[junit4:junit4]   2> 162 T3411 oashc.SpellCheckComponent.inform No queryConverter defined, using default converter
[junit4:junit4]   2> 162 T3411 oashc.SpellCheckComponent.inform Initializing spell checkers
[junit4:junit4]   2> 162 T3411 oasss.Suggester.init init: {name=suggest_fst,classname=org.apache.solr.spelling.suggest.Suggester,lookupImpl=org.apache.solr.spelling.suggest.fst.FSTLookup,field=suggest,storeDir=suggest_fst,buildOnCommit=true,weightBuckets=5,exactMatchFirst=true}
[junit4:junit4]   2> 163 T3411 oashc.SpellCheckComponent.inform Registering newSearcher listener for spellchecker: suggest_fst
[junit4:junit4]   2> 163 T3411 oashc.SpellCheckComponent.inform No queryConverter defined, using default converter
[junit4:junit4]   2> 163 T3411 oashc.SpellCheckComponent.inform Initializing spell checkers
[junit4:junit4]   2> 163 T3411 oasss.Suggester.init init: {name=suggest_wfst,classname=org.apache.solr.spelling.suggest.Suggester,lookupImpl=org.apache.solr.spelling.suggest.fst.WFSTLookupFactory,field=suggest,storeDir=suggest_wfst,buildOnCommit=true,exactMatchFirst=true}
[junit4:junit4]   2> 164 T3411 oashc.SpellCheckComponent.inform Registering newSearcher listener for spellchecker: suggest_wfst
[junit4:junit4]   2> 164 T3411 oashc.SpellCheckComponent.inform No queryConverter defined, using default converter
[junit4:junit4]   2> 165 T3411 oashc.HttpShardHandlerFactory.getParameter Setting socketTimeout to: 0
[junit4:junit4]   2> 165 T3411 oashc.HttpShardHandlerFactory.getParameter Setting urlScheme to: http://
[junit4:junit4]   2> 165 T3411 oashc.HttpShardHandlerFactory.getParameter Setting connTimeout to: 0
[junit4:junit4]   2> 165 T3411 oashc.HttpShardHandlerFactory.getParameter Setting maxConnectionsPerHost to: 20
[junit4:junit4]   2> 166 T3411 oashc.HttpShardHandlerFactory.getParameter Setting corePoolSize to: 0
[junit4:junit4]   2> 166 T3411 oashc.HttpShardHandlerFactory.getParameter Setting maximumPoolSize to: 2147483647
[junit4:junit4]   2> 166 T3411 oashc.HttpShardHandlerFactory.getParameter Setting maxThreadIdleTime to: 5
[junit4:junit4]   2> 166 T3411 oashc.HttpShardHandlerFactory.getParameter Setting sizeOfQueue to: -1
[junit4:junit4]   2> 166 T3411 oashc.HttpShardHandlerFactory.getParameter Setting fairnessPolicy to: false
[junit4:junit4]   2> 166 T3411 oascsi.HttpClientUtil.createClient Creating new http client, config:maxConnectionsPerHost=20&maxConnections=10000&socketTimeout=0&connTimeout=0&retry=false
[junit4:junit4]   2> 169 T3411 oasc.CoreContainer.register registering core: collection1
[junit4:junit4]   2> 170 T3411 oas.SolrTestCaseJ4.initCore ####initCore end
[junit4:junit4]   2> 177 T3411 oas.SolrTestCaseJ4.setUp ###Starting testSuggestions
[junit4:junit4]   2> ASYNC  NEW_CORE C271 name=collection1 org.apache.solr.core.SolrCore@7ba2d4f1
[junit4:junit4]   2> 186 T3411 C271 oasc.SolrDeletionPolicy.onInit SolrDeletionPolicy.onInit: commits:num=1
[junit4:junit4]   2> 		commit{dir=MockDirWrapper(org.apache.lucene.store.NIOFSDirectory@C:\Jenkins\workspace\Lucene-Solr-trunk-Windows\solr\build\solr-core\test\J0\solrtest-SuggesterTSTTest-1345628906698\index lockFactory=org.apache.lucene.store.NativeFSLockFactory@2ce26071),segFN=segments_1,generation=1,filenames=[segments_1]
[junit4:junit4]   2> 187 T3411 C271 oasc.SolrDeletionPolicy.updateCommits newest commit = 1
[junit4:junit4]   2> 189 T3411 C271 UPDATE [collection1] webapp=null path=null params={} {add=[1]} 0 8
[junit4:junit4]   2> 195 T3411 C271 UPDATE [collection1] webapp=null path=null params={} {add=[2]} 0 0
[junit4:junit4]   2> 202 T3411 C271 UPDATE [collection1] webapp=null path=null params={} {add=[3]} 0 1
[junit4:junit4]   2> 206 T3411 C271 oasu.DirectUpdateHandler2.commit start commit{flags=0,_version_=0,optimize=false,openSearcher=true,waitSearcher=true,expungeDeletes=false,softCommit=false}
[junit4:junit4]   2> 214 T3411 C271 oasc.SolrDeletionPolicy.onCommit SolrDeletionPolicy.onCommit: commits:num=2
[junit4:junit4]   2> 		commit{dir=MockDirWrapper(org.apache.lucene.store.NIOFSDirectory@C:\Jenkins\workspace\Lucene-Solr-trunk-Windows\solr\build\solr-core\test\J0\solrtest-SuggesterTSTTest-1345628906698\index lockFactory=org.apache.lucene.store.NativeFSLockFactory@2ce26071),segFN=segments_1,generation=1,filenames=[segments_1]
[junit4:junit4]   2> 		commit{dir=MockDirWrapper(org.apache.lucene.store.NIOFSDirectory@C:\Jenkins\workspace\Lucene-Solr-trunk-Windows\solr\build\solr-core\test\J0\solrtest-SuggesterTSTTest-1345628906698\index lockFactory=org.apache.lucene.store.NativeFSLockFactory@2ce26071),segFN=segments_2,generation=2,filenames=[_0_Asserting_0.tim, _0.fnm, _0_Asserting_0.tip, _0_Memory_0.ram, _0_nrm.cfs, _0_Direct_0.frq, _0_Asserting_0.prx, _0_Asserting_0.frq, _0_nrm.cfe, _0_SimpleText_0.pst, segments_2, _0_Direct_0.tip, _0.fdx, _0_Direct_0.prx, _0.si, _0_Direct_0.tim, _0.fdt]
[junit4:junit4]   2> 214 T3411 C271 oasc.SolrDeletionPolicy.updateCommits newest commit = 2
[junit4:junit4]   2> 215 T3411 C271 oasc.SolrCore.getSearcher WARNING [collection1] PERFORMANCE WARNING: Overlapping onDeckSearchers=2
[junit4:junit4]   2> 219 T3411 C271 oass.SolrIndexSearcher.<init> Opening Searcher@4e6642e7 main
[junit4:junit4]   2> 220 T3411 C271 oass.SolrIndexSearcher.getIndexDir WARNING WARNING: Directory impl does not support setting indexDir: org.apache.lucene.store.MockDirectoryWrapper
[junit4:junit4]   2> 221 T3411 C271 oasu.DirectUpdateHandler2.commit end_commit_flush
[junit4:junit4]   2> 221 T3412 oasc.SolrCore.registerSearcher [collection1] Registered new searcher Searcher@6eedcaa4 main{StandardDirectoryReader(segments_1:1)}
[junit4:junit4]   2> 221 T3412 oashc.SpellCheckComponent$SpellCheckerListener.newSearcher Loading spell index for spellchecker: suggest
[junit4:junit4]   2> 221 T3412 oasss.Suggester.reload reload()
[junit4:junit4]   2> 222 T3412 oashc.SpellCheckComponent$SpellCheckerListener.newSearcher SEVERE Exception in reloading spell check index for spellchecker: suggest java.io.FileNotFoundException: C:\Jenkins\workspace\Lucene-Solr-trunk-Windows\solr\build\solr-core\test\J0\.\solrtest-SuggesterTSTTest-1345628906698\suggest\jaspell.dat (The system cannot find the file specified)
[junit4:junit4]   2> 	at java.io.FileInputStream.open(Native Method)
[junit4:junit4]   2> 	at java.io.FileInputStream.<init>(FileInputStream.java:138)
[junit4:junit4]   2> 	at org.apache.solr.spelling.suggest.Suggester.reload(Suggester.java:161)
[junit4:junit4]   2> 	at org.apache.solr.handler.component.SpellCheckComponent$SpellCheckerListener.newSearcher(SpellCheckComponent.java:673)
[junit4:junit4]   2> 	at org.apache.solr.core.SolrCore$5.call(SolrCore.java:1452)
[junit4:junit4]   2> 	at java.util.concurrent.FutureTask$Sync.innerRun(FutureTask.java:334)
[junit4:junit4]   2> 	at java.util.concurrent.FutureTask.run(FutureTask.java:166)
[junit4:junit4]   2> 	at java.util.concurrent.ThreadPoolExecutor.runWorker(ThreadPoolExecutor.java:1110)
[junit4:junit4]   2> 	at java.util.concurrent.ThreadPoolExecutor$Worker.run(ThreadPoolExecutor.java:603)
[junit4:junit4]   2> 	at java.lang.Thread.run(Thread.java:722)
[junit4:junit4]   2> 
[junit4:junit4]   2> 235 T3412 oashc.SpellCheckComponent$SpellCheckerListener.newSearcher Loading spell index for spellchecker: suggest_tst
[junit4:junit4]   2> 235 T3412 oasss.Suggester.reload reload()
[junit4:junit4]   2> 236 T3412 oashc.SpellCheckComponent$SpellCheckerListener.newSearcher SEVERE Exception in reloading spell check index for spellchecker: suggest_tst java.io.FileNotFoundException: C:\Jenkins\workspace\Lucene-Solr-trunk-Windows\solr\build\solr-core\test\J0\.\solrtest-SuggesterTSTTest-1345628906698\suggest_tst\tst.dat (The system cannot find the file specified)
[junit4:junit4]   2> 	at java.io.FileInputStream.open(Native Method)
[junit4:junit4]   2> 	at java.io.FileInputStream.<init>(FileInputStream.java:138)
[junit4:junit4]   2> 	at org.apache.solr.spelling.suggest.Suggester.reload(Suggester.java:161)
[junit4:junit4]   2> 	at org.apache.solr.handler.component.SpellCheckComponent$SpellCheckerListener.newSearcher(SpellCheckComponent.java:673)
[junit4:junit4]   2> 	at org.apache.solr.core.SolrCore$5.call(SolrCore.java:1452)
[junit4:junit4]   2> 	at java.util.concurrent.FutureTask$Sync.innerRun(FutureTask.java:334)
[junit4:junit4]   2> 	at java.util.concurrent.FutureTask.run(FutureTask.java:166)
[junit4:junit4]   2> 	at java.util.concurrent.ThreadPoolExecutor.runWorker(ThreadPoolExecutor.java:1110)
[junit4:junit4]   2> 	at java.util.concurrent.ThreadPoolExecutor$Worker.run(ThreadPoolExecutor.java:603)
[junit4:junit4]   2> 	at java.lang.Thread.run(Thread.java:722)
[junit4:junit4]   2> 
[junit4:junit4]   2> 236 T3412 oashc.SpellCheckComponent$SpellCheckerListener.newSearcher Loading spell index for spellchecker: suggest_fst
[junit4:junit4]   2> 236 T3412 oasss.Suggester.reload reload()
[junit4:junit4]   2> 236 T3412 oashc.SpellCheckComponent$SpellCheckerListener.newSearcher SEVERE Exception in reloading spell check index for spellchecker: suggest_fst java.io.FileNotFoundException: C:\Jenkins\workspace\Lucene-Solr-trunk-Windows\solr\build\solr-core\test\J0\.\solrtest-SuggesterTSTTest-1345628906698\suggest_fst\fst.bin (The system cannot find the file specified)
[junit4:junit4]   2> 	at java.io.FileInputStream.open(Native Method)
[junit4:junit4]   2> 	at java.io.FileInputStream.<init>(FileInputStream.java:138)
[junit4:junit4]   2> 	at org.apache.solr.spelling.suggest.Suggester.reload(Suggester.java:161)
[junit4:junit4]   2> 	at org.apache.solr.handler.component.SpellCheckComponent$SpellCheckerListener.newSearcher(SpellCheckComponent.java:673)
[junit4:junit4]   2> 	at org.apache.solr.core.SolrCore$5.call(SolrCore.java:1452)
[junit4:junit4]   2> 	at java.util.concurrent.FutureTask$Sync.innerRun(FutureTask.java:334)
[junit4:junit4]   2> 	at java.util.concurrent.FutureTask.run(FutureTask.java:166)
[junit4:junit4]   2> 	at java.util.concurrent.ThreadPoolExecutor.runWorker(ThreadPoolExecutor.java:1110)
[junit4:junit4]   2> 	at java.util.concurrent.ThreadPoolExecutor$Worker.run(ThreadPoolExecutor.java:603)
[junit4:junit4]   2> 	at java.lang.Thread.run(Thread.java:722)
[junit4:junit4]   2> 
[junit4:junit4]   2> 236 T3412 oashc.SpellCheckComponent$SpellCheckerListener.newSearcher Loading spell index for spellchecker: suggest_wfst
[junit4:junit4]   2> 236 T3412 oasss.Suggester.reload reload()
[junit4:junit4]   2> 236 T3412 oashc.SpellCheckComponent$SpellCheckerListener.newSearcher SEVERE Exception in reloading spell check index for spellchecker: suggest_wfst java.io.FileNotFoundException: C:\Jenkins\workspace\Lucene-Solr-trunk-Windows\solr\build\solr-core\test\J0\.\solrtest-SuggesterTSTTest-1345628906698\suggest_wfst\wfst.bin (The system cannot find the file specified)
[junit4:junit4]   2> 	at java.io.FileInputStream.open(Native Method)
[junit4:junit4]   2> 	at java.io.FileInputStream.<init>(FileInputStream.java:138)
[junit4:junit4]   2> 	at org.apache.solr.spelling.suggest.Suggester.reload(Suggester.java:161)
[junit4:junit4]   2> 	at org.apache.solr.handler.component.SpellCheckComponent$SpellCheckerListener.newSearcher(SpellCheckComponent.java:673)
[junit4:junit4]   2> 	at org.apache.solr.core.SolrCore$5.call(SolrCore.java:1452)
[junit4:junit4]   2> 	at java.util.concurrent.FutureTask$Sync.innerRun(FutureTask.java:334)
[junit4:junit4]   2> 	at java.util.concurrent.FutureTask.run(FutureTask.java:166)
[junit4:junit4]   2> 	at java.util.concurrent.ThreadPoolExecutor.runWorker(ThreadPoolExecutor.java:1110)
[junit4:junit4]   2> 	at java.util.concurrent.ThreadPoolExecutor$Worker.run(ThreadPoolExecutor.java:603)
[junit4:junit4]   2> 	at java.lang.Thread.run(Thread.java:722)
[junit4:junit4]   2> 
[junit4:junit4]   2> 239 T3412 oasc.SolrCore.registerSearcher [collection1] Registered new searcher Searcher@4e6642e7 main{StandardDirectoryReader(segments_2:3 _0(5.0):C3)}
[junit4:junit4]   2> 239 T3411 C271 UPDATE [collection1] webapp=null path=null params={} {commit=} 0 33
[junit4:junit4]   2> 241 T3411 C271 REQ [collection1] webapp=null path=null params={q=ac&spellcheck.count=2&qt=/suggest_tst&spellcheck.onlyMorePopular=true} status=0 QTime=0 
[junit4:junit4]   2> 242 T3411 oas.SolrTestCaseJ4.assertQ SEVERE REQUEST FAILED: xpath=//lst[@name='spellcheck']/lst[@name='suggestions']/lst[@name='ac']/int[@name='numFound'][.='2']
[junit4:junit4]   2> 		xml response was: <?xml version="1.0" encoding="UTF-8"?>
[junit4:junit4]   2> 	<response>
[junit4:junit4]   2> 	<lst name="responseHeader"><int name="status">0</int><int name="QTime">0</int></lst><lst name="spellcheck"><lst name="suggestions"/></lst>
[junit4:junit4]   2> 	</response>
[junit4:junit4]   2> 	
[junit4:junit4]   2> 		request was:q=ac&spellcheck.count=2&qt=/suggest_tst&spellcheck.onlyMorePopular=true
[junit4:junit4]   2> 246 T3411 oasc.SolrException.log SEVERE REQUEST FAILED: q=ac&spellcheck.count=2&qt=/suggest_tst&spellcheck.onlyMorePopular=true:java.lang.RuntimeException: REQUEST FAILED: xpath=//lst[@name='spellcheck']/lst[@name='suggestions']/lst[@name='ac']/int[@name='numFound'][.='2']
[junit4:junit4]   2> 		xml response was: <?xml version="1.0" encoding="UTF-8"?>
[junit4:junit4]   2> 	<response>
[junit4:junit4]   2> 	<lst name="responseHeader"><int name="status">0</int><int name="QTime">0</int></lst><lst name="spellcheck"><lst name="suggestions"/></lst>
[junit4:junit4]   2> 	</response>
[junit4:junit4]   2> 	
[junit4:junit4]   2> 		request was:q=ac&spellcheck.count=2&qt=/suggest_tst&spellcheck.onlyMorePopular=true
[junit4:junit4]   2> 		at org.apache.solr.SolrTestCaseJ4.assertQ(SolrTestCaseJ4.java:486)
[junit4:junit4]   2> 		at org.apache.solr.SolrTestCaseJ4.assertQ(SolrTestCaseJ4.java:460)
[junit4:junit4]   2> 		at org.apache.solr.spelling.suggest.SuggesterTest.testSuggestions(SuggesterTest.java:71)
[junit4:junit4]   2> 		at sun.reflect.NativeMethodAccessorImpl.invoke0(Native Method)
[junit4:junit4]   2> 		at sun.reflect.NativeMethodAccessorImpl.invoke(NativeMethodAccessorImpl.java:57)
[junit4:junit4]   2> 		at sun.reflect.DelegatingMethodAccessorImpl.invoke(DelegatingMethodAccessorImpl.java:43)
[junit4:junit4]   2> 		at java.lang.reflect.Method.invoke(Method.java:601)
[junit4:junit4]   2> 		at com.carrotsearch.randomizedtesting.RandomizedRunner.invoke(RandomizedRunner.java:1559)
[junit4:junit4]   2> 		at com.carrotsearch.randomizedtesting.RandomizedRunner.access$600(RandomizedRunner.java:79)
[junit4:junit4]   2> 		at com.carrotsearch.randomizedtesting.RandomizedRunner$6.evaluate(RandomizedRunner.java:737)
[junit4:junit4]   2> 		at com.carrotsearch.randomizedtesting.RandomizedRunner$7.evaluate(RandomizedRunner.java:773)
[junit4:junit4]   2> 		at com.carrotsearch.randomizedtesting.RandomizedRunner$8.evaluate(RandomizedRunner.java:787)
[junit4:junit4]   2> 		at com.carrotsearch.randomizedtesting.rules.SystemPropertiesRestoreRule$1.evaluate(SystemPropertiesRestoreRule.java:53)
[junit4:junit4]   2> 		at org.apache.lucene.util.TestRuleSetupTeardownChained$1.evaluate(TestRuleSetupTeardownChained.java:50)
[junit4:junit4]   2> 		at org.apache.lucene.util.TestRuleFieldCacheSanity$1.evaluate(TestRuleFieldCacheSanity.java:51)
[junit4:junit4]   2> 		at org.apache.lucene.util.AbstractBeforeAfterRule$1.evaluate(AbstractBeforeAfterRule.java:45)
[junit4:junit4]   2> 		at com.carrotsearch.randomizedtesting.rules.SystemPropertiesInvariantRule$1.evaluate(SystemPropertiesInvariantRule.java:55)
[junit4:junit4]   2> 		at org.apache.lucene.util.TestRuleThreadAndTestName$1.evaluate(TestRuleThreadAndTestName.java:48)
[junit4:junit4]   2> 		at org.apache.lucene.util.TestRuleIgnoreAfterMaxFailures$1.evaluate(TestRuleIgnoreAfterMaxFailures.java:70)
[junit4:junit4]   2> 		at org.apache.lucene.util.TestRuleMarkFailure$1.evaluate(TestRuleMarkFailure.java:48)
[junit4:junit4]   2> 		at com.carrotsearch.randomizedtesting.rules.StatementAdapter.evaluate(StatementAdapter.java:36)
[junit4:junit4]   2> 		at com.carrotsearch.randomizedtesting.ThreadLeakControl$StatementRunner.run(ThreadLeakControl.java:345)
[junit4:junit4]   2> 		at com.carrotsearch.randomizedtesting.ThreadLeakControl.forkTimeoutingTask(ThreadLeakControl.java:769)
[junit4:junit4]   2> 		at com.carrotsearch.randomizedtesting.ThreadLeakControl$3.evaluate(ThreadLeakControl.java:429)
[junit4:junit4]   2> 		at com.carrotsearch.randomizedtesting.RandomizedRunner.runSingleTest(RandomizedRunner.java:746)
[junit4:junit4]   2> 		at com.carrotsearch.randomizedtesting.RandomizedRunner$3.evaluate(RandomizedRunner.java:648)
[junit4:junit4]   2> 		at com.carrotsearch.randomizedtesting.RandomizedRunner$4.evaluate(RandomizedRunner.java:682)
[junit4:junit4]   2> 		at com.carrotsearch.randomizedtesting.RandomizedRunner$5.evaluate(RandomizedRunner.java:693)
[junit4:junit4]   2> 		at com.carrotsearch.randomizedtesting.rules.StatementAdapter.evaluate(StatementAdapter.java:36)
[junit4:junit4]   2> 		at com.carrotsearch.randomizedtesting.rules.SystemPropertiesRestoreRule$1.evaluate(SystemPropertiesRestoreRule.java:53)
[junit4:junit4]   2> 		at org.apache.lucene.util.AbstractBeforeAfterRule$1.evaluate(AbstractBeforeAfterRule.java:45)
[junit4:junit4]   2> 		at org.apache.lucene.util.TestRuleStoreClassName$1.evaluate(TestRuleStoreClassName.java:42)
[junit4:junit4]   2> 		at com.carrotsearch.randomizedtesting.rules.SystemPropertiesInvariantRule$1.evaluate(SystemPropertiesInvariantRule.java:55)
[junit4:junit4]   2> 		at com.carrotsearch.randomizedtesting.rules.NoShadowingOrOverridesOnMethodsRule$1.evaluate(NoShadowingOrOverridesOnMethodsRule.java:39)
[junit4:junit4]   2> 		at com.carrotsearch.randomizedtesting.rules.NoShadowingOrOverridesOnMethodsRule$1.evaluate(NoShadowingOrOverridesOnMethodsRule.java:39)
[junit4:junit4]   2> 		at org.apache.lucene.util.TestRuleAssertionsRequired$1.evaluate(TestRuleAssertionsRequired.java:40)
[junit4:junit4]   2> 		at org.apache.lucene.util.TestRuleMarkFailure$1.evaluate(TestRuleMarkFailure.java:48)
[junit4:junit4]   2> 		at org.apache.lucene.util.TestRuleIgnoreAfterMaxFailures$1.evaluate(TestRuleIgnoreAfterMaxFailures.java:70)
[junit4:junit4]   2> 		at org.apache.lucene.util.TestRuleIgnoreTestSuites$1.evaluate(TestRuleIgnoreTestSuites.java:55)
[junit4:junit4]   2> 		at com.carrotsearch.randomizedtesting.rules.StatementAdapter.evaluate(StatementAdapter.java:36)
[junit4:junit4]   2> 		at com.carrotsearch.randomizedtesting.ThreadLeakControl$StatementRunner.run(ThreadLeakControl.java:345)
[junit4:junit4]   2> 		at java.lang.Thread.run(Thread.java:722)
[junit4:junit4]   2> 	
[junit4:junit4]   2> 247 T3411 oas.SolrTestCaseJ4.tearDown ###Ending testSuggestions
[junit4:junit4]   2> NOTE: reproduce with: ant test  -Dtestcase=SuggesterTSTTest -Dtests.method=testSuggestions -Dtests.seed=52FBD939A8B3C48A -Dtests.slow=true -Dtests.locale=ar_YE -Dtests.timezone=America/Resolute -Dtests.file.encoding=ISO-8859-1
[junit4:junit4] ERROR   0.08s | SuggesterTSTTest.testSuggestions <<<
[junit4:junit4]    > Throwable #1: java.lang.RuntimeException: Exception during query
[junit4:junit4]    > 	at __randomizedtesting.SeedInfo.seed([52FBD939A8B3C48A:F427E0CC66879374]:0)
[junit4:junit4]    > 	at org.apache.solr.SolrTestCaseJ4.assertQ(SolrTestCaseJ4.java:493)
[junit4:junit4]    > 	at org.apache.solr.SolrTestCaseJ4.assertQ(SolrTestCaseJ4.java:460)
[junit4:junit4]    > 	at org.apache.solr.spelling.suggest.SuggesterTest.testSuggestions(SuggesterTest.java:71)
[junit4:junit4]    > 	at sun.reflect.NativeMethodAccessorImpl.invoke0(Native Method)
[junit4:junit4]    > 	at sun.reflect.NativeMethodAccessorImpl.invoke(NativeMethodAccessorImpl.java:57)
[junit4:junit4]    > 	at sun.reflect.DelegatingMethodAccessorImpl.invoke(DelegatingMethodAccessorImpl.java:43)
[junit4:junit4]    > 	at java.lang.reflect.Method.invoke(Method.java:601)
[junit4:junit4]    > 	at com.carrotsearch.randomizedtesting.RandomizedRunner.invoke(RandomizedRunner.java:1559)
[junit4:junit4]    > 	at com.carrotsearch.randomizedtesting.RandomizedRunner.access$600(RandomizedRunner.java:79)
[junit4:junit4]    > 	at com.carrotsearch.randomizedtesting.RandomizedRunner$6.evaluate(RandomizedRunner.java:737)
[junit4:junit4]    > 	at com.carrotsearch.randomizedtesting.RandomizedRunner$7.evaluate(RandomizedRunner.java:773)
[junit4:junit4]    > 	at com.carrotsearch.randomizedtesting.RandomizedRunner$8.evaluate(RandomizedRunner.java:787)
[junit4:junit4]    > 	at com.carrotsearch.randomizedtesting.rules.SystemPropertiesRestoreRule$1.evaluate(SystemPropertiesRestoreRule.java:53)
[junit4:junit4]    > 	at org.apache.lucene.util.TestRuleSetupTeardownChained$1.evaluate(TestRuleSetupTeardownChained.java:50)
[junit4:junit4]    > 	at org.apache.lucene.util.TestRuleFieldCacheSanity$1.evaluate(TestRuleFieldCacheSanity.java:51)
[junit4:junit4]    > 	at org.apache.lucene.util.AbstractBeforeAfterRule$1.evaluate(AbstractBeforeAfterRule.java:45)
[junit4:junit4]    > 	at com.carrotsearch.randomizedtesting.rules.SystemPropertiesInvariantRule$1.evaluate(SystemPropertiesInvariantRule.java:55)
[junit4:junit4]    > 	at org.apache.lucene.util.TestRuleThreadAndTestName$1.evaluate(TestRuleThreadAndTestName.java:48)
[junit4:junit4]    > 	at org.apache.lucene.util.TestRuleIgnoreAfterMaxFailures$1.evaluate(TestRuleIgnoreAfterMaxFailures.java:70)
[junit4:junit4]    > 	at org.apache.lucene.util.TestRuleMarkFailure$1.evaluate(TestRuleMarkFailure.java:48)
[junit4:junit4]    > 	at com.carrotsearch.randomizedtesting.rules.StatementAdapter.evaluate(StatementAdapter.java:36)
[junit4:junit4]    > 	at com.carrotsearch.randomizedtesting.ThreadLeakControl$StatementRunner.run(ThreadLeakControl.java:345)
[junit4:junit4]    > 	at com.carrotsearch.randomizedtesting.ThreadLeakControl.forkTimeoutingTask(ThreadLeakControl.java:769)
[junit4:junit4]    > 	at com.carrotsearch.randomizedtesting.ThreadLeakControl$3.evaluate(ThreadLeakControl.java:429)
[junit4:junit4]    > 	at com.carrotsearch.randomizedtesting.RandomizedRunner.runSingleTest(RandomizedRunner.java:746)
[junit4:junit4]    > 	at com.carrotsearch.randomizedtesting.RandomizedRunner$3.evaluate(RandomizedRunner.java:648)
[junit4:junit4]    > 	at com.carrotsearch.randomizedtesting.RandomizedRunner$4.evaluate(RandomizedRunner.java:682)
[junit4:junit4]    > 	at com.carrotsearch.randomizedtesting.RandomizedRunner$5.evaluate(RandomizedRunner.java:693)
[junit4:junit4]    > 	at com.carrotsearch.randomizedtesting.rules.StatementAdapter.evaluate(StatementAdapter.java:36)
[junit4:junit4]    > 	at com.carrotsearch.randomizedtesting.rules.SystemPropertiesRestoreRule$1.evaluate(SystemPropertiesRestoreRule.java:53)
[junit4:junit4]    > 	at org.apache.lucene.util.AbstractBeforeAfterRule$1.evaluate(AbstractBeforeAfterRule.java:45)
[junit4:junit4]    > 	at org.apache.lucene.util.TestRuleStoreClassName$1.evaluate(TestRuleStoreClassName.java:42)
[junit4:junit4]    > 	at com.carrotsearch.randomizedtesting.rules.SystemPropertiesInvariantRule$1.evaluate(SystemPropertiesInvariantRule.java:55)
[junit4:junit4]    > 	at com.carrotsearch.randomizedtesting.rules.NoShadowingOrOverridesOnMethodsRule$1.evaluate(NoShadowingOrOverridesOnMethodsRule.java:39)
[junit4:junit4]    > 	at com.carrotsearch.randomizedtesting.rules.NoShadowingOrOverridesOnMethodsRule$1.evaluate(NoShadowingOrOverridesOnMethodsRule.java:39)
[junit4:junit4]    > 	at org.apache.lucene.util.TestRuleAssertionsRequired$1.evaluate(TestRuleAssertionsRequired.java:40)
[junit4:junit4]    > 	at org.apache.lucene.util.TestRuleMarkFailure$1.evaluate(TestRuleMarkFailure.java:48)
[junit4:junit4]    > 	at org.apache.lucene.util.TestRuleIgnoreAfterMaxFailures$1.evaluate(TestRuleIgnoreAfterMaxFailures.java:70)
[junit4:junit4]    > 	at org.apache.lucene.util.TestRuleIgnoreTestSuites$1.evaluate(TestRuleIgnoreTestSuites.java:55)
[junit4:junit4]    > 	at com.carrotsearch.randomizedtesting.rules.StatementAdapter.evaluate(StatementAdapter.java:36)
[junit4:junit4]    > 	at com.carrotsearch.randomizedtesting.ThreadLeakControl$StatementRunner.run(ThreadLeakControl.java:345)
[junit4:junit4]    > 	at java.lang.Thread.run(Thread.java:722)
[junit4:junit4]    > Caused by: java.lang.RuntimeException: REQUEST FAILED: xpath=//lst[@name='spellcheck']/lst[@name='suggestions']/lst[@name='ac']/int[@name='numFound'][.='2']
[junit4:junit4]    > 	xml response was: <?xml version="1.0" encoding="UTF-8"?>
[junit4:junit4]    > <response>
[junit4:junit4]    > <lst name="responseHeader"><int name="status">0</int><int name="QTime">0</int></lst><lst name="spellcheck"><lst name="suggestions"/></lst>
[junit4:junit4]    > </response>
[junit4:junit4]    > 
[junit4:junit4]    > 	request was:q=ac&spellcheck.count=2&qt=/suggest_tst&spellcheck.onlyMorePopular=true
[junit4:junit4]    > 	at org.apache.solr.SolrTestCaseJ4.assertQ(SolrTestCaseJ4.java:486)
[junit4:junit4]    > 	... 41 more
[junit4:junit4]   2> 255 T3411 oas.SolrTestCaseJ4.setUp ###Starting testReload
[junit4:junit4]   2> 259 T3411 C271 UPDATE [collection1] webapp=null path=null params={} {add=[1]} 0 0
[junit4:junit4]   2> 266 T3411 C271 UPDATE [collection1] webapp=null path=null params={} {add=[2]} 0 1
[junit4:junit4]   2> 271 T3411 C271 UPDATE [collection1] webapp=null path=null params={} {add=[3]} 0 0
[junit4:junit4]   2> 276 T3411 C271 oasu.DirectUpdateHandler2.commit start commit{flags=0,_version_=0,optimize=false,openSearcher=true,waitSearcher=true,expungeDeletes=false,softCommit=false}
[junit4:junit4]   2> 298 T3411 C271 oasc.SolrDeletionPolicy.onCommit SolrDeletionPolicy.onCommit: commits:num=2
[junit4:junit4]   2> 		commit{dir=MockDirWrapper(org.apache.lucene.store.NIOFSDirectory@C:\Jenkins\workspace\Lucene-Solr-trunk-Windows\solr\build\solr-core\test\J0\solrtest-SuggesterTSTTest-1345628906698\index lockFactory=org.apache.lucene.store.NativeFSLockFactory@2ce26071),segFN=segments_2,generation=2,filenames=[_0_Asserting_0.tim, _0.fnm, _0_Asserting_0.tip, _0_Memory_0.ram, _0_nrm.cfs, _0_Direct_0.frq, _0_Asserting_0.prx, _0_Asserting_0.frq, _0_nrm.cfe, _0_SimpleText_0.pst, segments_2, _0_Direct_0.tip, _0.fdx, _0_Direct_0.prx, _0.si, _0_Direct_0.tim, _0.fdt]
[junit4:junit4]   2> 		commit{dir=MockDirWrapper(org.apache.lucene.store.NIOFSDirectory@C:\Jenkins\workspace\Lucene-Solr-trunk-Windows\solr\build\solr-core\test\J0\solrtest-SuggesterTSTTest-1345628906698\index lockFactory=org.apache.lucene.store.NativeFSLockFactory@2ce26071),segFN=segments_3,generation=3,filenames=[_1_nrm.cfs, _1_Asserting_0.frq, _1.fnm, _1_Direct_0.prx, _1_nrm.cfe, _1.fdx, _1_Asserting_0.tim, _1_Memory_0.ram, _1.fdt, _1_Asserting_0.prx, _1_Asserting_0.tip, _1.si, _1_Direct_0.tim, _1_Direct_0.tip, segments_3, _1_Direct_0.frq, _1_SimpleText_0.pst]
[junit4:junit4]   2> 299 T3411 C271 oasc.SolrDeletionPolicy.updateCommits newest commit = 3
[junit4:junit4]   2> 306 T3411 C271 oass.SolrIndexSearcher.<init> Opening Searcher@147f3925 main
[junit4:junit4]   2> 307 T3411 C271 oass.SolrIndexSearcher.getIndexDir WARNING WARNING: Directory impl does not support setting indexDir: org.apache.lucene.store.MockDirectoryWrapper
[junit4:junit4]   2> 307 T3412 oashc.SpellCheckComponent$SpellCheckerListener.buildSpellIndex Building spell index for spell checker: suggest
[junit4:junit4]   2> 307 T3411 C271 oasu.DirectUpdateHandler2.commit end_commit_flush
[junit4:junit4]   2> 307 T3412 oasss.Suggester.build build()
[junit4:junit4]   2> 308 T3412 oasss.Suggester.build Stored suggest data to: C:\Jenkins\workspace\Lucene-Solr-trunk-Windows\solr\build\solr-core\test\J0\.\solrtest-SuggesterTSTTest-1345628906698\suggest\jaspell.dat
[junit4:junit4]   2> 309 T3412 oashc.SpellCheckComponent$SpellCheckerListener.buildSpellIndex Building spell index for spell checker: suggest_tst
[junit4:junit4]   2> 309 T3412 oasss.Suggester.build build()
[junit4:junit4]   2> 314 T3412 oasss.Suggester.build Stored suggest data to: C:\Jenkins\workspace\Lucene-Solr-trunk-Windows\solr\build\solr-core\test\J0\.\solrtest-SuggesterTSTTest-1345628906698\suggest_tst\tst.dat
[junit4:junit4]   2> 314 T3412 oashc.SpellCheckComponent$SpellCheckerListener.buildSpellIndex Building spell index for spell checker: suggest_fst
[junit4:junit4]   2> 314 T3412 oasss.Suggester.build build()
[junit4:junit4]   2> 319 T3412 oasss.Suggester.build Stored suggest data to: C:\Jenkins\workspace\Lucene-Solr-trunk-Windows\solr\build\solr-core\test\J0\.\solrtest-SuggesterTSTTest-1345628906698\suggest_fst\fst.bin
[junit4:junit4]   2> 319 T3412 oashc.SpellCheckComponent$SpellCheckerListener.buildSpellIndex Building spell index for spell checker: suggest_wfst
[junit4:junit4]   2> 319 T3412 oasss.Suggester.build build()
[junit4:junit4]   2> 323 T3412 oasss.Suggester.build Stored suggest data to: C:\Jenkins\workspace\Lucene-Solr-trunk-Windows\solr\build\solr-core\test\J0\.\solrtest-SuggesterTSTTest-1345628906698\suggest_wfst\wfst.bin
[junit4:junit4]   2> 323 T3412 oasc.SolrCore.registerSearcher [collection1] Registered new searcher Searcher@147f3925 main{StandardDirectoryReader(segments_3:7 _1(5.0):C3)}
[junit4:junit4]   2> 324 T3411 C271 UPDATE [collection1] webapp=null path=null params={} {commit=} 0 48
[junit4:junit4]   2> 326 T3411 oas.SolrTestCaseJ4.deleteCore ###deleteCore
[junit4:junit4]   2> 326 T3411 oasc.CoreContainer.shutdown Shutting down CoreContainer instance=1020896195
[junit4:junit4]   2> 326 T3411 oasc.SolrCore.close [collection1]  CLOSING SolrCore org.apache.solr.core.SolrCore@7ba2d4f1
[junit4:junit4]   2> 327 T3411 oasc.SolrCore.closeSearcher [collection1] Closing main searcher on request.
[junit4:junit4]   2> 327 T3411 oasu.DirectUpdateHandler2.close closing DirectUpdateHandler2{commits=2,autocommits=0,soft autocommits=0,optimizes=0,rollbacks=0,expungeDeletes=0,docsPending=0,adds=0,deletesById=0,deletesByQuery=0,errors=0,cumulative_adds=6,cumulative_deletesById=0,cumulative_deletesByQuery=0,cumulative_errors=0}
[junit4:junit4]   2> 327 T3411 oasu.DefaultSolrCoreState.decref SolrCoreState ref count has reached 0 - closing IndexWriter
[junit4:junit4]   2> NOTE: per solr.test.leavedatadir, dataDir will not be removed: C:\Jenkins\workspace\Lucene-Solr-trunk-Windows\solr\build\solr-core\test\J0\.\solrtest-SuggesterTSTTest-1345628906698
[junit4:junit4]   2> 336 T3411 oas.SolrTestCaseJ4.initCore ####initCore
[junit4:junit4]   2> 336 T3411 oasc.SolrResourceLoader.<init> new SolrResourceLoader for directory: 'C:\Jenkins\workspace\Lucene-Solr-trunk-Windows\solr\build\solr-core\test-files\solr\collection1\'
[junit4:junit4]   2> 337 T3411 oasc.SolrResourceLoader.replaceClassLoader Adding 'file:/C:/Jenkins/workspace/Lucene-Solr-trunk-Windows/solr/build/solr-core/test-files/solr/collection1/lib/classes/' to classloader
[junit4:junit4]   2> 337 T3411 oasc.SolrResourceLoader.replaceClassLoader Adding 'file:/C:/Jenkins/workspace/Lucene-Solr-trunk-Windows/solr/build/solr-core/test-files/solr/collection1/lib/README' to classloader
[junit4:junit4]   2> 372 T3411 oasc.SolrConfig.<init> Using Lucene MatchVersion: LUCENE_50
[junit4:junit4]   2> 423 T3411 oasc.SolrConfig.<init> Loaded SolrConfig: solrconfig-spellchecker.xml
[junit4:junit4]   2> 424 T3411 oass.IndexSchema.readSchema Reading Solr Schema
[junit4:junit4]   2> 428 T3411 oass.IndexSchema.readSchema Schema name=test
[junit4:junit4]   2> 1011 T3411 oass.OpenExchangeRatesOrgProvider.init Initialized with rates=open-exchange-rates.json, refreshInterval=1440.
[junit4:junit4]   2> 1017 T3411 oass.IndexSchema.readSchema default search field in schema is text
[junit4:junit4]   2> 1021 T3411 oass.IndexSchema.readSchema unique key field: id
[junit4:junit4]   2> 1025 T3411 oass.FileExchangeRateProvider.reload Reloading exchange rates from file currency.xml
[junit4:junit4]   2> 1028 T3411 oass.FileExchangeRateProvider.reload Reloading exchange rates from file currency.xml
[junit4:junit4]   2> 1032 T3411 oass.OpenExchangeRatesOrgProvider.reload Reloading exchange rates from open-exchange-rates.json
[junit4:junit4]   2> 1032 T3411 oass.OpenExchangeRatesOrgProvider.reload Reloading exchange rates from open-exchange-rates.json
[junit4:junit4]   2> 1032 T3411 oasc.SolrResourceLoader.locateSolrHome JNDI not configured for solr (NoInitialContextEx)
[junit4:junit4]   2> 1032 T3411 oasc.SolrResourceLoader.locateSolrHome using system property solr.solr.home: C:\Jenkins\workspace\Lucene-Solr-trunk-Windows\solr\build\solr-core\test-files\solr
[junit4:junit4]   2> 1033 T3411 oasc.SolrResourceLoader.<init> new SolrResourceLoader for directory: 'C:\Jenkins\workspace\Lucene-Solr-trunk-Windows\solr\build\solr-core\test-files\solr\'
[junit4:junit4]   2> 1040 T3411 oasc.CoreContainer.<init> New CoreContainer 340079779
[junit4:junit4]   2> 1041 T3411 oasc.SolrCore.<init> [collection1] Opening new SolrCore at C:\Jenkins\workspace\Lucene-Solr-trunk-Windows\solr\build\solr-core\test-files\solr\collection1\, dataDir=C:\Jenkins\workspace\Lucene-Solr-trunk-Windows\solr\build\solr-core\test\J0\.\solrtest-SuggesterTSTTest-1345628906698\
[junit4:junit4]   2> 1041 T3411 oasc.SolrCore.<init> JMX monitoring not detected for core: collection1
[junit4:junit4]   2> 1041 T3411 oasc.SolrCore.getNewIndexDir WARNING New index directory detected: old=null new=C:\Jenkins\workspace\Lucene-Solr-trunk-Windows\solr\build\solr-core\test\J0\.\solrtest-SuggesterTSTTest-1345628906698\index/
[junit4:junit4]   2> 1043 T3411 oasc.RequestHandlers.initHandlersFromConfig created standard: solr.StandardRequestHandler
[junit4:junit4]   2> 1043 T3411 oasc.RequestHandlers.initHandlersFromConfig created /suggest: org.apache.solr.handler.component.SearchHandler
[junit4:junit4]   2> 1043 T3411 oasc.RequestHandlers.initHandlersFromConfig created /suggest_tst: org.apache.solr.handler.component.SearchHandler
[junit4:junit4]   2> 1044 T3411 oasc.RequestHandlers.initHandlersFromConfig created /suggest_fst: org.apache.solr.handler.component.SearchHandler
[junit4:junit4]   2> 1044 T3411 oasc.RequestHandlers.initHandlersFromConfig created /suggest_wfst: org.apache.solr.handler.component.SearchHandler
[junit4:junit4]   2> 1047 T3411 oasc.CachingDirectoryFactory.get return new directory for C:\Jenkins\workspace\Lucene-Solr-trunk-Windows\solr\build\solr-core\test\J0\.\solrtest-SuggesterTSTTest-1345628906698\index forceNew:false
[junit4:junit4]   2> 1050 T3411 oass.SolrIndexSearcher.<init> Opening Searcher@aa64704 main
[junit4:junit4]   2> 1050 T3411 oass.SolrIndexSearcher.getIndexDir WARNING WARNING: Directory impl does not support setting indexDir: org.apache.lucene.store.MockDirectoryWrapper
[junit4:junit4]   2> 1051 T3411 oasu.CommitTracker.<init> Hard AutoCommit: disabled
[junit4:junit4]   2> 1051 T3411 oasu.CommitTracker.<init> Soft AutoCommit: disabled
[junit4:junit4]   2> 1051 T3411 oashc.SpellCheckComponent.inform Initializing spell checkers
[junit4:junit4]   2> 1052 T3411 oasss.Suggester.init init: {name=suggest,classname=org.apache.solr.spelling.suggest.Suggester,lookupImpl=org.apache.solr.spelling.suggest.jaspell.JaspellLookup,field=suggest,storeDir=suggest,buildOnCommit=true,threshold=0.0}
[junit4:junit4]   2> 1052 T3411 oasssj.JaspellLookupFactory.create init: {name=suggest,classname=org.apache.solr.spelling.suggest.Suggester,lookupImpl=org.apache.solr.spelling.suggest.jaspell.JaspellLookup,field=suggest,storeDir=suggest,buildOnCommit=true,threshold=0.0}
[junit4:junit4]   2> 1053 T3411 oashc.SpellCheckComponent.inform Registering newSearcher listener for spellchecker: suggest
[junit4:junit4]   2> 1053 T3411 oashc.SpellCheckComponent.inform No queryConverter defined, using default converter
[junit4:junit4]   2> 1054 T3411 oashc.SpellCheckComponent.inform Initializing spell checkers
[junit4:junit4]   2> 1054 T3411 oasss.Suggester.init init: {name=suggest_tst,classname=org.apache.solr.spelling.suggest.Suggester,lookupImpl=org.apache.solr.spelling.suggest.tst.TSTLookup,field=suggest,storeDir=suggest_tst,buildOnCommit=true,threshold=0.0}
[junit4:junit4]   2> 1054 T3411 oashc.SpellCheckComponent.inform Registering newSearcher listener for spellchecker: suggest_tst
[junit4:junit4]   2> 1054 T3411 oashc.SpellCheckComponent.inform No queryConverter defined, using default converter
[junit4:junit4]   2> 1054 T3411 oashc.SpellCheckComponent.inform Initializing spell checkers
[junit4:junit4]   2> 1054 T3411 oasss.Suggester.init init: {name=suggest_fst,classname=org.apache.solr.spelling.suggest.Suggester,lookupImpl=org.apache.solr.spelling.suggest.fst.FSTLookup,field=suggest,storeDir=suggest_fst,buildOnCommit=true,weightBuckets=5,exactMatchFirst=true}
[junit4:junit4]   2> 1055 T3411 oashc.SpellCheckComponent.inform Registering newSearcher listener for spellchecker: suggest_fst
[junit4:junit4]   2> 1055 T3411 oashc.SpellCheckComponent.inform No queryConverter defined, using default converter
[junit4:junit4]   2> 1055 T3411 oashc.SpellCheckComponent.inform Initializing spell checkers
[junit4:junit4]   2> 1056 T3411 oasss.Suggester.init init: {name=suggest_wfst,classname=org.apache.solr.spelling.suggest.Suggester,lookupImpl=org.apache.solr.spelling.suggest.fst.WFSTLookupFactory,field=suggest,storeDir=suggest_wfst,buildOnCommit=true,exactMatchFirst=true}
[junit4:junit4]   2> 1056 T3411 oashc.SpellCheckComponent.inform Registering newSearcher listener for spellchecker: suggest_wfst
[junit4:junit4]   2> 1057 T3411 oashc.SpellCheckComponent.inform No queryConverter defined, using default converter
[junit4:junit4]   2> 1057 T3411 oashc.HttpShardHandlerFactory.getParameter Setting socketTimeout to: 0
[junit4:junit4]   2> 1057 T3411 oashc.HttpShardHandlerFactory.getParameter Setting urlScheme to: http://
[junit4:junit4]   2> 1057 T3411 oashc.HttpShardHandlerFactory.getParameter Setting connTimeout to: 0
[junit4:junit4]   2> 1058 T3411 oashc.HttpShardHandlerFactory.getParameter Setting maxConnectionsPerHost to: 20
[junit4:junit4]   2> 1058 T3411 oashc.HttpShardHandlerFactory.getParameter Setting corePoolSize to: 0
[junit4:junit4]   2> 1058 T3411 oashc.HttpShardHandlerFactory.getParameter Setting maximumPoolSize to: 2147483647
[junit4:junit4]   2> 1058 T3411 oashc.HttpShardHandlerFactory.getParameter Setting maxThreadIdleTime to: 5
[junit4:junit4]   2> 1058 T3411 oashc.HttpShardHandlerFactory.getParameter Setting sizeOfQueue to: -1
[junit4:junit4]   2> 1058 T3411 oashc.HttpShardHandlerFactory.getParameter Setting fairnessPolicy to: false
[junit4:junit4]   2> 1058 T3411 oascsi.HttpClientUtil.createClient Creating new http client, config:maxConnectionsPerHost=20&maxConnections=10000&socketTimeout=0&connTimeout=0&retry=false
[junit4:junit4]   2> 1062 T3413 oasc.SolrCore.registerSearcher [collection1] Registered new searcher Searcher@aa64704 main{StandardDirectoryReader(segments_3:7 _1(5.0):C3)}
[junit4:junit4]   2> 1062 T3411 oasc.CoreContainer.register registering core: collection1
[junit4:junit4]   2> 1063 T3411 oas.SolrTestCaseJ4.initCore ####initCore end
[junit4:junit4]   2> ASYNC  NEW_CORE C272 name=collection1 org.apache.solr.core.SolrCore@6dbdac50
[junit4:junit4]   2> 1064 T3411 C272 REQ [collection1] webapp=null path=null params={q=ac&spellcheck.count=2&qt=/suggest_tst&spellcheck.onlyMorePopular=true} status=0 QTime=1 
[junit4:junit4]   2> 1069 T3411 oas.SolrTestCaseJ4.tearDown ###Ending testReload
[junit4:junit4]   2> 1072 T3411 oas.SolrTestCaseJ4.setUp ###Starting testRebuild
[junit4:junit4]   2> 1078 T3411 C272 oasc.SolrDeletionPolicy.onInit SolrDeletionPolicy.onInit: commits:num=1
[junit4:junit4]   2> 		commit{dir=MockDirWrapper(org.apache.lucene.store.SimpleFSDirectory@C:\Jenkins\workspace\Lucene-Solr-trunk-Windows\solr\build\solr-core\test\J0\solrtest-SuggesterTSTTest-1345628906698\index lockFactory=org.apache.lucene.store.NativeFSLockFactory@729108f7),segFN=segments_3,generation=3,filenames=[_1_nrm.cfs, _1_Asserting_0.frq, _1.fnm, _1_Direct_0.prx, _1_nrm.cfe, _1.fdx, _1_Asserting_0.tim, _1_Memory_0.ram, _1.fdt, _1_Asserting_0.prx, _1_Asserting_0.tip, _1.si, _1_Direct_0.tim, _1_Direct_0.tip, segments_3, _1_SimpleText_0.pst, _1_Direct_0.frq]
[junit4:junit4]   2> 1079 T3411 C272 oasc.SolrDeletionPolicy.updateCommits newest commit = 3
[junit4:junit4]   2> 1080 T3411 C272 UPDATE [collection1] webapp=null path=null params={} {add=[1]} 0 4
[junit4:junit4]   2> 1111 T3411 C272 UPDATE [collection1] webapp=null path=null params={} {add=[2]} 0 0
[junit4:junit4]   2> 1116 T3411 C272 UPDATE [collection1] webapp=null path=null params={} {add=[3]} 0 1
[junit4:junit4]   2> 1122 T3411 C272 oasu.DirectUpdateHandler2.commit start commit{flags=0,_version_=0,optimize=false,openSearcher=true,waitSearcher=true,expungeDeletes=false,softCommit=false}
[junit4:junit4]   2> 1132 T3411 C272 oasc.SolrDeletionPolicy.onCommit SolrDeletionPolicy.onCommit: commits:num=2
[junit4:junit4]   2> 		commit{dir=MockDirWrapper(org.apache.lucene.store.SimpleFSDirectory@C:\Jenkins\workspace\Lucene-Solr-trunk-Windows\solr\build\solr-core\test\J0\solrtest-SuggesterTSTTest-1345628906698\index lockFactory=org.apache.lucene.store.NativeFSLockFactory@729108f7),segFN=segments_3,generation=3,filenames=[_1_nrm.cfs, _1_Asserting_0.frq, _1.fnm, _1_Direct_0.prx, _1_nrm.cfe, _1.fdx, _1_Asserting_0.tim, _1_Memory_0.ram, _1.fdt, _1_Asserting_0.prx, _1_Asserting_0.tip, _1.si, _1_Direct_0.tim, _1_Direct_0.tip, segments_3, _1_SimpleText_0.pst, _1_Direct_0.frq]
[junit4:junit4]   2> 		commit{dir=MockDirWrapper(org.apache.lucene.store.SimpleFSDirectory@C:\Jenkins\workspace\Lucene-Solr-trunk-Windows\solr\build\solr-core\test\J0\solrtest-SuggesterTSTTest-1345628906698\index lockFactory=org.apache.lucene.store.NativeFSLockFactory@729108f7),segFN=segments_4,generation=4,filenames=[_2_Direct_0.tip, _2.si, _2_Direct_0.tim, _2_SimpleText_0.pst, _1.fnm, _1_Asserting_0.tim, _2_nrm.cfe, _1_Memory_0.ram, _1_Asserting_0.tip, _2_Asserting_0.frq, _2_Asserting_0.prx, _2_Memory_0.ram, _1_Direct_0.tim, _2_nrm.cfs, _1_Direct_0.tip, _1_nrm.cfs, _1_Asserting_0.frq, _2.fdt, _1_Direct_0.prx, _2.fdx, _1_nrm.cfe, _2.fnm, _2_Direct_0.prx, _2_Asserting_0.tim, _1.fdx, _2_Asserting_0.tip, _1.fdt, _1_Asserting_0.prx, _1.si, _2_Direct_0.frq, segments_4, _1_Direct_0.frq, _1_SimpleText_0.pst]
[junit4:junit4]   2> 1133 T3411 C272 oasc.SolrDeletionPolicy.updateCommits newest commit = 4
[junit4:junit4]   2> 1138 T3411 C272 oass.SolrIndexSearcher.<init> Opening Searcher@41f63eb9 main
[junit4:junit4]   2> 1138 T3411 C272 oass.SolrIndexSearcher.getIndexDir WARNING WARNING: Directory impl does not support setting indexDir: org.apache.lucene.store.MockDirectoryWrapper
[junit4:junit4]   2> 1139 T3413 oashc.SpellCheckComponent$SpellCheckerListener.buildSpellIndex Building spell index for spell checker: suggest
[junit4:junit4]   2> 1138 T3411 C272 oasu.DirectUpdateHandler2.commit end_commit_flush
[junit4:junit4]   2> 1139 T3413 oasss.Suggester.build build()
[junit4:junit4]   2> 1141 T3413 oasss.Suggester.build Stored suggest data to: C:\Jenkins\workspace\Lucene-Solr-trunk-Windows\solr\build\solr-core\test\J0\.\solrtest-SuggesterTSTTest-1345628906698\suggest\jaspell.dat
[junit4:junit4]   2> 1141 T3413 oashc.SpellCheckComponent$SpellCheckerListener.buildSpellIndex Building spell index for spell checker: suggest_tst
[junit4:junit4]   2> 1141 T3413 oasss.Suggester.build build()
[junit4:junit4]   2> 1146 T3413 oasss.Suggester.build Stored suggest data to: C:\Jenkins\workspace\Lucene-Solr-trunk-Windows\solr\build\solr-core\test\J0\.\solrtest-SuggesterTSTTest-1345628906698\suggest_tst\tst.dat
[junit4:junit4]   2> 1146 T3413 oashc.SpellCheckComponent$SpellCheckerListener.buildSpellIndex Building spell index for spell checker: suggest_fst
[junit4:junit4]   2> 1146 T3413 oasss.Suggester.build build()
[junit4:junit4]   2> 1151 T3413 oasss.Suggester.build Stored suggest data to: C:\Jenkins\workspace\Lucene-Solr-trunk-Windows\solr\build\solr-core\test\J0\.\solrtest-SuggesterTSTTest-1345628906698\suggest_fst\fst.bin
[junit4:junit4]   2> 1151 T3413 oashc.SpellCheckComponent$SpellCheckerListener.buildSpellIndex Building spell index for spell checker: suggest_wfst
[junit4:junit4]   2> 1151 T3413 oasss.Suggester.build build()
[junit4:junit4]   2> 1155 T3413 oasss.Suggester.build Stored suggest data to: C:\Jenkins\workspace\Lucene-Solr-trunk-Windows\solr\build\solr-core\test\J0\.\solrtest-SuggesterTSTTest-1345628906698\suggest_wfst\wfst.bin
[junit4:junit4]   2> 1155 T3413 oasc.SolrCore.registerSearcher [collection1] Registered new searcher Searcher@41f63eb9 main{StandardDirectoryReader(segments_4:9 _1(5.0):C3 _2(5.0):C3)}
[junit4:junit4]   2> 1155 T3411 C272 UPDATE [collection1] webapp=null path=null params={} {commit=} 0 33
[junit4:junit4]   2> 1157 T3411 C272 REQ [collection1] webapp=null path=null params={q=ac&spellcheck.count=2&qt=/suggest_tst&spellcheck.onlyMorePopular=true} status=0 QTime=0 
[junit4:junit4]   2> 1163 T3411 C272 UPDATE [collection1] webapp=null path=null params={} {add=[4]} 0 2
[junit4:junit4]   2> 1168 T3411 C272 oasu.DirectUpdateHandler2.commit start commit{flags=0,_version_=0,optimize=false,openSearcher=true,waitSearcher=true,expungeDeletes=false,softCommit=false}
[junit4:junit4]   2> 1185 T3411 C272 oasc.SolrDeletionPolicy.onCommit SolrDeletionPolicy.onCommit: commits:num=2
[junit4:junit4]   2> 		commit{dir=MockDirWrapper(org.apache.lucene.store.SimpleFSDirectory@C:\Jenkins\workspace\Lucene-Solr-trunk-Windows\solr\build\solr-core\test\J0\solrtest-SuggesterTSTTest-1345628906698\index lockFactory=org.apache.lucene.store.NativeFSLockFactory@729108f7),segFN=segments_4,generation=4,filenames=[_2_Direct_0.tip, _2.si, _2_Direct_0.tim, _2_SimpleText_0.pst, _1.fnm, _1_Asserting_0.tim, _2_nrm.cfe, _1_Memory_0.ram, _1_Asserting_0.tip, _2_Asserting_0.frq, _2_Asserting_0.prx, _2_Memory_0.ram, _1_Direct_0.tim, _2_nrm.cfs, _1_Direct_0.tip, _1_nrm.cfs, _1_Asserting_0.frq, _2.fdt, _1_Direct_0.prx, _2.fdx, _1_nrm.cfe, _2.fnm, _2_Direct_0.prx, _2_Asserting_0.tim, _1.fdx, _2_Asserting_0.tip, _1.fdt, _1_Asserting_0.prx, _1.si, _2_Direct_0.frq, segments_4, _1_Direct_0.frq, _1_SimpleText_0.pst]
[junit4:junit4]   2> 		commit{dir=MockDirWrapper(org.apache.lucene.store.SimpleFSDirectory@C:\Jenkins\workspace\Lucene-Solr-trunk-Windows\solr\build\solr-core\test\J0\solrtest-SuggesterTSTTest-1345628906698\index lockFactory=org.apache.lucene.store.NativeFSLockFactory@729108f7),segFN=segments_5,generation=5,filenames=[_3_nrm.cfe, _2_Direct_0.tip, _2.si, _3_Direct_0.frq, _2_Direct_0.tim, _2_SimpleText_0.pst, _3.fdt, _3.fnm, _1.fnm, _1_Asserting_0.tim, _2_nrm.cfe, _1_Memory_0.ram, _3_Asserting_0.prx, _3_SimpleText_0.pst, _1_Asserting_0.tip, _2_Asserting_0.frq, _2_Asserting_0.prx, _3_Direct_0.prx, _2_Memory_0.ram, _1_Direct_0.tim, _3_Memory_0.ram, _2_nrm.cfs, _1_Direct_0.tip, _1_nrm.cfs, _3_Direct_0.tip, _1_Asserting_0.frq, _2.fdt, _1_Direct_0.prx, _2.fdx, _1_nrm.cfe, _2.fnm, _3_Asserting_0.frq, _3.fdx, _3_nrm.cfs, _2_Direct_0.prx, _2_Asserting_0.tim, _1.fdx, _2_Asserting_0.tip, _3_Asserting_0.tim, _1.fdt, _3_Asserting_0.tip, _1_Asserting_0.prx, _1.si, _3.si, _2_Direct_0.frq, segments_5, _3_Direct_0.tim, _1_Direct_0.frq, _1_SimpleText_0.pst]
[junit4:junit4]   2> 1186 T3411 C272 oasc.SolrDeletionPolicy.updateCommits newest commit = 5
[junit4:junit4]   2> 1192 T3411 C272 oass.SolrIndexSearcher.<init> Opening Searcher@39e78b2a main
[junit4:junit4]   2> 1192 T3411 C272 oass.SolrIndexSearcher.getIndexDir WARNING WARNING: Directory impl does not support setting indexDir: org.apache.lucene.store.MockDirectoryWrapper
[junit4:junit4]   2> 1193 T3413 oashc.SpellCheckComponent$SpellCheckerListener.buildSpellIndex Building spell index for spell checker: suggest
[junit4:junit4]   2> 1193 T3411 C272 oasu.DirectUpdateHandler2.commit end_commit_flush
[junit4:junit4]   2> 1193 T3413 oasss.Suggester.build build()
[junit4:junit4]   2> 1196 T3413 oasss.Suggester.build Stored suggest data to: C:\Jenkins\workspace\Lucene-Solr-trunk-Windows\solr\build\solr-core\test\J0\.\solrtest-SuggesterTSTTest-1345628906698\suggest\jaspell.dat
[junit4:junit4]   2> 1196 T3413 oashc.SpellCheckComponent$SpellCheckerListener.buildSpellIndex Building spell index for spell checker: suggest_tst
[junit4:junit4]   2> 1196 T3413 oasss.Suggester.build build()
[junit4:junit4]   2> 1200 T3413 oasss.Suggester.build Stored suggest data to: C:\Jenkins\workspace\Lucene-Solr-trunk-Windows\solr\build\solr-core\test\J0\.\solrtest-SuggesterTSTTest-1345628906698\suggest_tst\tst.dat
[junit4:junit4]   2> 1200 T3413 oashc.SpellCheckComponent$SpellCheckerListener.buildSpellIndex Building spell index for spell checker: suggest_fst
[junit4:junit4]   2> 1200 T3413 oasss.Suggester.build build()
[junit4:junit4]   2> 1206 T3413 oasss.Suggester.build Stored suggest data to: C:\Jenkins\workspace\Lucene-Solr-trunk-Windows\solr\build\solr-core\test\J0\.\solrtest-SuggesterTSTTest-1345628906698\suggest_fst\fst.bin
[junit4:junit4]   2> 1206 T3413 oashc.SpellCheckComponent$SpellCheckerListener.buildSpellIndex Building spell index for spell checker: suggest_wfst
[junit4:junit4]   2> 1206 T3413 oasss.Suggester.build build()
[junit4:junit4]   2> 1209 T3413 oasss.Suggester.build Stored suggest data to: C:\Jenkins\workspace\Lucene-Solr-trunk-Windows\solr\build\solr-core\test\J0\.\solrtest-SuggesterTSTTest-1345628906698\suggest_wfst\wfst.bin
[junit4:junit4]   2> 1209 T3413 oasc.SolrCore.registerSearcher [collection1] Registered new searcher Searcher@39e78b2a main{StandardDirectoryReader(segments_5:11 _1(5.0):C3 _2(5.0):C3 _3(5.0):C1)}
[junit4:junit4]   2> 1210 T3411 C272 UPDATE [collection1] webapp=null path=null params={} {commit=} 0 42
[junit4:junit4]   2> 1212 T3411 C272 REQ [collection1] webapp=null path=null params={q=ac&spellcheck.count=2&qt=/suggest_tst&spellcheck.onlyMorePopular=true} status=0 QTime=0 
[junit4:junit4]   2> 1213 T3411 oas.SolrTestCaseJ4.tearDown ###Ending testRebuild
[junit4:junit4]   2> 1217 T3411 oas.SolrTestCaseJ4.setUp ###Starting testAnalyzer
[junit4:junit4]   2> 1217 T3411 oasss.Suggester.init init: {lookupImpl=org.apache.solr.spelling.suggest.tst.TSTLookupFactory}
[junit4:junit4]   2> 1217 T3411 oas.SolrTestCaseJ4.tearDown ###Ending testAnalyzer
[junit4:junit4]   2> 1217 T3411 oas.SolrTestCaseJ4.deleteCore ###deleteCore
[junit4:junit4]   2> 1217 T3411 oasc.CoreContainer.shutdown Shutting down CoreContainer instance=340079779
[junit4:junit4]   2> 1217 T3411 oasc.SolrCore.close [collection1]  CLOSING SolrCore org.apache.solr.core.SolrCore@6dbdac50
[junit4:junit4]   2> 1217 T3411 oasc.SolrCore.closeSearcher [collection1] Closing main searcher on request.
[junit4:junit4]   2> 1218 T3411 oasu.DirectUpdateHandler2.close closing DirectUpdateHandler2{commits=2,autocommits=0,soft autocommits=0,optimizes=0,rollbacks=0,expungeDeletes=0,docsPending=0,adds=0,deletesById=0,deletesByQuery=0,errors=0,cumulative_adds=4,cumulative_deletesById=0,cumulative_deletesByQuery=0,cumulative_errors=0}
[junit4:junit4]   2> 1218 T3411 oasu.DefaultSolrCoreState.decref SolrCoreState ref count has reached 0 - closing IndexWriter
[junit4:junit4]   2> NOTE: test params are: codec=Lucene40: {timestamp=PostingsFormat(name=Memory doPackFST= false), range_facet_l=PostingsFormat(name=Memory doPackFST= false), id=PostingsFormat(name=SimpleText), range_facet_sl=PostingsFormat(name=SimpleText), range_facet_si=PostingsFormat(name=Memory doPackFST= false), text=PostingsFormat(name=Asserting), multiDefault=PostingsFormat(name=Memory doPackFST= false), suggest=PostingsFormat(name=Memory doPackFST= false), intDefault=PostingsFormat(name=Direct), spell=PostingsFormat(name=Direct)}, sim=DefaultSimilarity, locale=ar_YE, timezone=America/Resolute
[junit4:junit4]   2> NOTE: Windows 7 6.1 amd64/Oracle Corporation 1.7.0_06 (64-bit)/cpus=2,threads=1,free=460668344,total=536870912
[junit4:junit4]   2> NOTE: All tests run in this JVM: [DirectSolrConnectionTest, TestDistributedGrouping, OutputWriterTest, SpellCheckCollatorTest, TestWordDelimiterFilterFactory, TermsComponentTest, IndexReaderFactoryTest, DocumentAnalysisRequestHandlerTest, XsltUpdateRequestHandlerTest, HighlighterConfigTest, ScriptEngineTest, CacheHeaderTest, TestXIncludeConfig, TestMultiCoreConfBootstrap, BasicDistributedZk2Test, TestSolrXMLSerializer, MultiTermTest, CoreContainerCoreInitFailuresTest, TestPerFieldSimilarity, ClusterStateUpdateTest, TestQuerySenderNoQuery, TestQueryUtils, SpellingQueryConverterTest, TestArbitraryIndexDir, TestDistributedSearch, PeerSyncTest, TestReload, SOLR749Test, TestValueSourceCache, PreAnalyzedFieldTest, TestStressRecovery, TestQueryTypes, SolrPluginUtilsTest, TestWriterPerf, RequestHandlersTest, URLClassifyProcessorTest, DirectUpdateHandlerTest, LeaderElectionIntegrationTest, ClusterStateTest, DefaultValueUpdateProcessorTest, EchoParamsTest, TestRealTimeGet, QueryEqualityTest, TestOmitPositions, TestBinaryResponseWriter, TestRTGBase, LoggingHandlerTest, PathHierarchyTokenizerFactoryTest, XmlUpdateRequestHandlerTest, PingRequestHandlerTest, TestPHPSerializedResponseWriter, StatsComponentTest, ZkCLITest, SolrIndexConfigTest, TestCollationField, PrimUtilsTest, TestPseudoReturnFields, TermVectorComponentDistributedTest, ZkSolrClientTest, StatelessScriptUpdateProcessorFactoryTest, TestIndexingPerformance, TestJoin, TestRecovery, SortByFunctionTest, TestFastLRUCache, SampleTest, TestFunctionQuery, TestReplicationHandler, SpellPossibilityIteratorTest, ConvertedLegacyTest, TestSort, SimpleFacetsTest, TestRemoteStreaming, DebugComponentTest, NoCacheHeaderTest, PolyFieldTest, TestNumberUtils, TestFoldingMultitermQuery, TestSolrDeletionPolicy2, UUIDFieldTest, TestHashPartitioner, DateMathParserTest, TestStressLucene, SpellCheckComponentTest, DistributedTermsComponentTest, ShowFileRequestHandlerTest, UniqFieldsUpdateProcessorFactoryTest, StandardRequestHandlerTest, TestQuerySenderListener, TestLuceneMatchVersion, WordBreakSolrSpellCheckerTest, DateFieldTest, AutoCommitTest, PrimitiveFieldTypeTest, TestFaceting, CSVRequestHandlerTest, RequiredFieldsTest, CircularListTest, TestJmxIntegration, FastVectorHighlighterTest, JSONWriterTest, SystemInfoHandlerTest, SolrCmdDistributorTest, LukeRequestHandlerTest, TestCodecSupport, TimeZoneUtilsTest, TestSolrDeletionPolicy1, TestDefaultSimilarityFactory, MoreLikeThisHandlerTest, TestSolrJ, UpdateRequestProcessorFactoryTest, BasicDistributedZkTest, OverseerTest, RecoveryZkTest, FullSolrCloudDistribCmdsTest, LeaderElectionTest, DistributedSpellCheckComponentTest, ZkControllerTest, TestRandomFaceting, TestExtendedDismaxParser, SoftAutoCommitTest, BasicZkTest, SolrCoreTest, IndexBasedSpellCheckerTest, TestRangeQuery, TestCoreContainer, TestGroupingSearch, DirectSolrSpellCheckerTest, TestFiltering, FileBasedSpellCheckerTest, QueryElevationComponentTest, BasicFunctionalityTest, SignatureUpdateProcessorFactoryTest, HighlighterTest, TestIndexSearcher, CoreAdminHandlerTest, TestTrie, SolrRequestParserTest, TestCSVLoader, SpatialFilterTest, TestCSVResponseWriter, DocumentBuilderTest, MBeansHandlerTest, DistributedQueryElevationComponentTest, CurrencyFieldTest, DisMaxRequestHandlerTest, IndexSchemaTest, BinaryUpdateRequestHandlerTest, QueryParsingTest, DistanceFunctionTest, SolrInfoMBeanTest, MinimalSchemaTest, FieldAnalysisRequestHandlerTest, TermVectorComponentTest, SuggesterWFSTTest, JsonLoaderTest, TestSurroundQueryParser, DirectUpdateHandlerOptimizeTest, IndexSchemaRuntimeFieldTest, TestSolrQueryParser, TestReversedWildcardFilterFactory, ReturnFieldsTest, SearchHandlerTest, SuggesterFSTTest, CopyFieldTest, SuggesterTSTTest]
[junit4:junit4] Completed in 1.27s, 4 tests, 1 error <<< FAILURES!

[...truncated 179 lines...]
BUILD FAILED
C:\Jenkins\workspace\Lucene-Solr-trunk-Windows\build.xml:29: The following error occurred while executing this line:
C:\Jenkins\workspace\Lucene-Solr-trunk-Windows\solr\build.xml:144: The following error occurred while executing this line:
C:\Jenkins\workspace\Lucene-Solr-trunk-Windows\lucene\module-build.xml:62: The following error occurred while executing this line:
C:\Jenkins\workspace\Lucene-Solr-trunk-Windows\lucene\common-build.xml:1105: The following error occurred while executing this line:
C:\Jenkins\workspace\Lucene-Solr-trunk-Windows\lucene\common-build.xml:797: There were test failures: 227 suites, 916 tests, 1 error, 11 ignored (6 assumptions)

Total time: 34 minutes 11 seconds
Build step 'Invoke Ant' marked build as failure
Recording test results
Description set: Java: 64bit/jdk1.7.0_06 -XX:+UseG1GC
Email was triggered for: Failure
Sending email for trigger: Failure



Mime
View raw message