lucene-dev mailing list archives

Site index · List index
Message view « Date » · « Thread »
Top « Date » · « Thread »
From Policeman Jenkins Server <jenk...@sd-datasolutions.de>
Subject [JENKINS] Lucene-Solr-trunk-Linux (64bit/ibm-j9-jdk6) - Build # 408 - Still Failing!
Date Mon, 13 Aug 2012 07:21:36 GMT
Build: http://jenkins.sd-datasolutions.de/job/Lucene-Solr-trunk-Linux/408/
Java: 64bit/ibm-j9-jdk6 

4 tests failed.
FAILED:  junit.framework.TestSuite.org.apache.lucene.analysis.uima.UIMATypeAwareAnalyzerTest

Error Message:
1 thread leaked from SUITE scope at org.apache.lucene.analysis.uima.UIMATypeAwareAnalyzerTest:
    1) Thread[id=19, name=MemoryPoolMXBean notification dispatcher, state=RUNNABLE, group=TGRP-UIMATypeAwareAnalyzerTest]
        at com.ibm.lang.management.MemoryNotificationThread.processNotificationLoop(Native
Method)         at com.ibm.lang.management.MemoryNotificationThread.run(MemoryNotificationThread.java:56)

Stack Trace:
com.carrotsearch.randomizedtesting.ThreadLeakError: 1 thread leaked from SUITE scope at org.apache.lucene.analysis.uima.UIMATypeAwareAnalyzerTest:

   1) Thread[id=19, name=MemoryPoolMXBean notification dispatcher, state=RUNNABLE, group=TGRP-UIMATypeAwareAnalyzerTest]
        at com.ibm.lang.management.MemoryNotificationThread.processNotificationLoop(Native
Method)
        at com.ibm.lang.management.MemoryNotificationThread.run(MemoryNotificationThread.java:56)
	at __randomizedtesting.SeedInfo.seed([17622712DD5CC1D5]:0)


FAILED:  junit.framework.TestSuite.org.apache.lucene.analysis.uima.UIMATypeAwareAnalyzerTest

Error Message:
There are still zombie threads that couldn't be terminated:    1) Thread[id=19, name=MemoryPoolMXBean
notification dispatcher, state=RUNNABLE, group=TGRP-UIMATypeAwareAnalyzerTest]         at
com.ibm.lang.management.MemoryNotificationThread.processNotificationLoop(Native Method)  
      at com.ibm.lang.management.MemoryNotificationThread.run(MemoryNotificationThread.java:56)

Stack Trace:
com.carrotsearch.randomizedtesting.ThreadLeakError: There are still zombie threads that couldn't
be terminated:
   1) Thread[id=19, name=MemoryPoolMXBean notification dispatcher, state=RUNNABLE, group=TGRP-UIMATypeAwareAnalyzerTest]
        at com.ibm.lang.management.MemoryNotificationThread.processNotificationLoop(Native
Method)
        at com.ibm.lang.management.MemoryNotificationThread.run(MemoryNotificationThread.java:56)
	at __randomizedtesting.SeedInfo.seed([17622712DD5CC1D5]:0)


FAILED:  junit.framework.TestSuite.org.apache.lucene.analysis.uima.UIMABaseAnalyzerTest

Error Message:
1 thread leaked from SUITE scope at org.apache.lucene.analysis.uima.UIMABaseAnalyzerTest:
    1) Thread[id=19, name=MemoryPoolMXBean notification dispatcher, state=RUNNABLE, group=TGRP-UIMABaseAnalyzerTest]
        at com.ibm.lang.management.MemoryNotificationThread.processNotificationLoop(Native
Method)         at com.ibm.lang.management.MemoryNotificationThread.run(MemoryNotificationThread.java:56)

Stack Trace:
com.carrotsearch.randomizedtesting.ThreadLeakError: 1 thread leaked from SUITE scope at org.apache.lucene.analysis.uima.UIMABaseAnalyzerTest:

   1) Thread[id=19, name=MemoryPoolMXBean notification dispatcher, state=RUNNABLE, group=TGRP-UIMABaseAnalyzerTest]
        at com.ibm.lang.management.MemoryNotificationThread.processNotificationLoop(Native
Method)
        at com.ibm.lang.management.MemoryNotificationThread.run(MemoryNotificationThread.java:56)
	at __randomizedtesting.SeedInfo.seed([17622712DD5CC1D5]:0)


FAILED:  junit.framework.TestSuite.org.apache.lucene.analysis.uima.UIMABaseAnalyzerTest

Error Message:
There are still zombie threads that couldn't be terminated:    1) Thread[id=19, name=MemoryPoolMXBean
notification dispatcher, state=RUNNABLE, group=TGRP-UIMABaseAnalyzerTest]         at com.ibm.lang.management.MemoryNotificationThread.processNotificationLoop(Native
Method)         at com.ibm.lang.management.MemoryNotificationThread.run(MemoryNotificationThread.java:56)

Stack Trace:
com.carrotsearch.randomizedtesting.ThreadLeakError: There are still zombie threads that couldn't
be terminated:
   1) Thread[id=19, name=MemoryPoolMXBean notification dispatcher, state=RUNNABLE, group=TGRP-UIMABaseAnalyzerTest]
        at com.ibm.lang.management.MemoryNotificationThread.processNotificationLoop(Native
Method)
        at com.ibm.lang.management.MemoryNotificationThread.run(MemoryNotificationThread.java:56)
	at __randomizedtesting.SeedInfo.seed([17622712DD5CC1D5]:0)




Build Log:
[...truncated 4099 lines...]
[junit4:junit4] Suite: org.apache.lucene.analysis.uima.UIMATypeAwareAnalyzerTest
[junit4:junit4]   2> ?????? ??, ???? ??:??:?? ??????? WhitespaceTokenizer initialize
[junit4:junit4]   2> INFO: "Whitespace tokenizer successfully initialized"
[junit4:junit4]   2> ?????? ??, ???? ??:??:?? ??????? WhitespaceTokenizer typeSystemInit
[junit4:junit4]   2> INFO: "Whitespace tokenizer typesystem initialized"
[junit4:junit4]   2> ?????? ??, ???? ??:??:?? ??????? WhitespaceTokenizer process
[junit4:junit4]   2> INFO: "Whitespace tokenizer starts processing"
[junit4:junit4]   2> ?????? ??, ???? ??:??:?? ??????? WhitespaceTokenizer process
[junit4:junit4]   2> INFO: "Whitespace tokenizer finished processing"
[junit4:junit4]   2> Aug 13, 2012 7:21:09 AM com.carrotsearch.randomizedtesting.ThreadLeakControl
checkThreadLeaks
[junit4:junit4]   2> WARNING: Will linger awaiting termination of 1 leaked thread(s).
[junit4:junit4]   2> Aug 13, 2012 7:21:29 AM com.carrotsearch.randomizedtesting.ThreadLeakControl
checkThreadLeaks
[junit4:junit4]   2> SEVERE: 1 thread leaked from SUITE scope at org.apache.lucene.analysis.uima.UIMATypeAwareAnalyzerTest:

[junit4:junit4]   2>    1) Thread[id=19, name=MemoryPoolMXBean notification dispatcher,
state=RUNNABLE, group=TGRP-UIMATypeAwareAnalyzerTest]
[junit4:junit4]   2>         at com.ibm.lang.management.MemoryNotificationThread.processNotificationLoop(Native
Method)
[junit4:junit4]   2>         at com.ibm.lang.management.MemoryNotificationThread.run(MemoryNotificationThread.java:56)
[junit4:junit4]   2> Aug 13, 2012 7:21:29 AM com.carrotsearch.randomizedtesting.ThreadLeakControl
tryToInterruptAll
[junit4:junit4]   2> INFO: Starting to interrupt leaked threads:
[junit4:junit4]   2>    1) Thread[id=19, name=MemoryPoolMXBean notification dispatcher,
state=RUNNABLE, group=TGRP-UIMATypeAwareAnalyzerTest]
[junit4:junit4]   2> Aug 13, 2012 7:21:32 AM com.carrotsearch.randomizedtesting.ThreadLeakControl
tryToInterruptAll
[junit4:junit4]   2> SEVERE: There are still zombie threads that couldn't be terminated:
[junit4:junit4]   2>    1) Thread[id=19, name=MemoryPoolMXBean notification dispatcher,
state=RUNNABLE, group=TGRP-UIMATypeAwareAnalyzerTest]
[junit4:junit4]   2>         at com.ibm.lang.management.MemoryNotificationThread.processNotificationLoop(Native
Method)
[junit4:junit4]   2>         at com.ibm.lang.management.MemoryNotificationThread.run(MemoryNotificationThread.java:56)
[junit4:junit4]   2> NOTE: test params are: codec=Asserting, sim=DefaultSimilarity, locale=kn,
timezone=Asia/Calcutta
[junit4:junit4]   2> NOTE: Linux 3.2.0-29-generic amd64/IBM Corporation 1.6.0 (64-bit)/cpus=8,threads=2,free=1199360,total=161754112
[junit4:junit4]   2> NOTE: All tests run in this JVM: [UIMATypeAwareAnalyzerTest]
[junit4:junit4]   2> NOTE: reproduce with: ant test  -Dtestcase=UIMATypeAwareAnalyzerTest
-Dtests.seed=17622712DD5CC1D5 -Dtests.multiplier=3 -Dtests.slow=true -Dtests.locale=kn -Dtests.timezone=Asia/Calcutta
-Dtests.file.encoding=ISO-8859-1
[junit4:junit4] ERROR   0.00s J1 | UIMATypeAwareAnalyzerTest (suite) <<<
[junit4:junit4]    > Throwable #1: com.carrotsearch.randomizedtesting.ThreadLeakError:
1 thread leaked from SUITE scope at org.apache.lucene.analysis.uima.UIMATypeAwareAnalyzerTest:

[junit4:junit4]    >    1) Thread[id=19, name=MemoryPoolMXBean notification dispatcher,
state=RUNNABLE, group=TGRP-UIMATypeAwareAnalyzerTest]
[junit4:junit4]    >         at com.ibm.lang.management.MemoryNotificationThread.processNotificationLoop(Native
Method)
[junit4:junit4]    >         at com.ibm.lang.management.MemoryNotificationThread.run(MemoryNotificationThread.java:56)
[junit4:junit4]    > 	at __randomizedtesting.SeedInfo.seed([17622712DD5CC1D5]:0)
[junit4:junit4]    > Throwable #2: com.carrotsearch.randomizedtesting.ThreadLeakError:
There are still zombie threads that couldn't be terminated:
[junit4:junit4]    >    1) Thread[id=19, name=MemoryPoolMXBean notification dispatcher,
state=RUNNABLE, group=TGRP-UIMATypeAwareAnalyzerTest]
[junit4:junit4]    >         at com.ibm.lang.management.MemoryNotificationThread.processNotificationLoop(Native
Method)
[junit4:junit4]    >         at com.ibm.lang.management.MemoryNotificationThread.run(MemoryNotificationThread.java:56)
[junit4:junit4]    > 	at __randomizedtesting.SeedInfo.seed([17622712DD5CC1D5]:0)
[junit4:junit4] Completed on J1 in 28.19s, 2 tests, 2 errors <<< FAILURES!

[...truncated 1 lines...]
[junit4:junit4] Suite: org.apache.lucene.analysis.uima.UIMABaseAnalyzerTest
[junit4:junit4]   2> 13-08-2012 03:21:08 WhitespaceTokenizer initialize
[junit4:junit4]   2> INFO: "Whitespace tokenizer successfully initialized"
[junit4:junit4]   2> 13-08-2012 03:21:09 WhitespaceTokenizer typeSystemInit
[junit4:junit4]   2> INFO: "Whitespace tokenizer typesystem initialized"
[junit4:junit4]   2> 13-08-2012 03:21:09 WhitespaceTokenizer process
[junit4:junit4]   2> INFO: "Whitespace tokenizer starts processing"
[junit4:junit4]   2> 13-08-2012 03:21:09 WhitespaceTokenizer process
[junit4:junit4]   2> INFO: "Whitespace tokenizer finished processing"
[junit4:junit4]   2> 13-08-2012 03:21:09 WhitespaceTokenizer process
[junit4:junit4]   2> INFO: "Whitespace tokenizer starts processing"
[junit4:junit4]   2> 13-08-2012 03:21:09 WhitespaceTokenizer process
[junit4:junit4]   2> INFO: "Whitespace tokenizer finished processing"
[junit4:junit4]   2> 13-08-2012 03:21:09 WhitespaceTokenizer process
[junit4:junit4]   2> INFO: "Whitespace tokenizer starts processing"
[junit4:junit4]   2> 13-08-2012 03:21:09 WhitespaceTokenizer process
[junit4:junit4]   2> INFO: "Whitespace tokenizer finished processing"
[junit4:junit4]   2> 13-08-2012 03:21:09 WhitespaceTokenizer process
[junit4:junit4]   2> INFO: "Whitespace tokenizer starts processing"
[junit4:junit4]   2> 13-08-2012 03:21:09 WhitespaceTokenizer process
[junit4:junit4]   2> INFO: "Whitespace tokenizer finished processing"
[junit4:junit4]   2> 13-08-2012 03:21:12 WhitespaceTokenizer initialize
[junit4:junit4]   2> INFO: "Whitespace tokenizer successfully initialized"
[junit4:junit4]   2> 13-08-2012 03:21:12 WhitespaceTokenizer typeSystemInit
[junit4:junit4]   2> INFO: "Whitespace tokenizer typesystem initialized"
[junit4:junit4]   2> 13-08-2012 03:21:12 WhitespaceTokenizer process
[junit4:junit4]   2> INFO: "Whitespace tokenizer starts processing"
[junit4:junit4]   2> 13-08-2012 03:21:12 WhitespaceTokenizer process
[junit4:junit4]   2> INFO: "Whitespace tokenizer finished processing"
[junit4:junit4]   2> Aug 13, 2012 7:21:12 AM com.carrotsearch.randomizedtesting.ThreadLeakControl
checkThreadLeaks
[junit4:junit4]   2> WARNING: Will linger awaiting termination of 1 leaked thread(s).
[junit4:junit4]   2> Aug 13, 2012 7:21:32 AM com.carrotsearch.randomizedtesting.ThreadLeakControl
checkThreadLeaks
[junit4:junit4]   2> SEVERE: 1 thread leaked from SUITE scope at org.apache.lucene.analysis.uima.UIMABaseAnalyzerTest:

[junit4:junit4]   2>    1) Thread[id=19, name=MemoryPoolMXBean notification dispatcher,
state=RUNNABLE, group=TGRP-UIMABaseAnalyzerTest]
[junit4:junit4]   2>         at com.ibm.lang.management.MemoryNotificationThread.processNotificationLoop(Native
Method)
[junit4:junit4]   2>         at com.ibm.lang.management.MemoryNotificationThread.run(MemoryNotificationThread.java:56)
[junit4:junit4]   2> Aug 13, 2012 7:21:32 AM com.carrotsearch.randomizedtesting.ThreadLeakControl
tryToInterruptAll
[junit4:junit4]   2> INFO: Starting to interrupt leaked threads:
[junit4:junit4]   2>    1) Thread[id=19, name=MemoryPoolMXBean notification dispatcher,
state=RUNNABLE, group=TGRP-UIMABaseAnalyzerTest]
[junit4:junit4]   2> Aug 13, 2012 7:21:35 AM com.carrotsearch.randomizedtesting.ThreadLeakControl
tryToInterruptAll
[junit4:junit4]   2> SEVERE: There are still zombie threads that couldn't be terminated:
[junit4:junit4]   2>    1) Thread[id=19, name=MemoryPoolMXBean notification dispatcher,
state=RUNNABLE, group=TGRP-UIMABaseAnalyzerTest]
[junit4:junit4]   2>         at com.ibm.lang.management.MemoryNotificationThread.processNotificationLoop(Native
Method)
[junit4:junit4]   2>         at com.ibm.lang.management.MemoryNotificationThread.run(MemoryNotificationThread.java:56)
[junit4:junit4]   2> NOTE: test params are: codec=Lucene40: {dummy=PostingsFormat(name=NestedPulsing),
title=PostingsFormat(name=NestedPulsing), contents=Pulsing40(freqCutoff=3 minBlockSize=4 maxBlockSize=34)},
sim=RandomSimilarityProvider(queryNorm=false,coord=no): {}, locale=da, timezone=America/Indiana/Vevay
[junit4:junit4]   2> NOTE: Linux 3.2.0-29-generic amd64/IBM Corporation 1.6.0 (64-bit)/cpus=8,threads=2,free=53005280,total=350577664
[junit4:junit4]   2> NOTE: All tests run in this JVM: [UIMABaseAnalyzerTest]
[junit4:junit4]   2> NOTE: reproduce with: ant test  -Dtestcase=UIMABaseAnalyzerTest -Dtests.seed=17622712DD5CC1D5
-Dtests.multiplier=3 -Dtests.slow=true -Dtests.locale=da -Dtests.timezone=America/Indiana/Vevay
-Dtests.file.encoding=ISO-8859-1
[junit4:junit4] ERROR   0.00s J0 | UIMABaseAnalyzerTest (suite) <<<
[junit4:junit4]    > Throwable #1: com.carrotsearch.randomizedtesting.ThreadLeakError:
1 thread leaked from SUITE scope at org.apache.lucene.analysis.uima.UIMABaseAnalyzerTest:

[junit4:junit4]    >    1) Thread[id=19, name=MemoryPoolMXBean notification dispatcher,
state=RUNNABLE, group=TGRP-UIMABaseAnalyzerTest]
[junit4:junit4]    >         at com.ibm.lang.management.MemoryNotificationThread.processNotificationLoop(Native
Method)
[junit4:junit4]    >         at com.ibm.lang.management.MemoryNotificationThread.run(MemoryNotificationThread.java:56)
[junit4:junit4]    > 	at __randomizedtesting.SeedInfo.seed([17622712DD5CC1D5]:0)
[junit4:junit4]    > Throwable #2: com.carrotsearch.randomizedtesting.ThreadLeakError:
There are still zombie threads that couldn't be terminated:
[junit4:junit4]    >    1) Thread[id=19, name=MemoryPoolMXBean notification dispatcher,
state=RUNNABLE, group=TGRP-UIMABaseAnalyzerTest]
[junit4:junit4]    >         at com.ibm.lang.management.MemoryNotificationThread.processNotificationLoop(Native
Method)
[junit4:junit4]    >         at com.ibm.lang.management.MemoryNotificationThread.run(MemoryNotificationThread.java:56)
[junit4:junit4]    > 	at __randomizedtesting.SeedInfo.seed([17622712DD5CC1D5]:0)
[junit4:junit4] Completed on J0 in 30.60s, 3 tests, 2 errors <<< FAILURES!

[...truncated 11 lines...]
BUILD FAILED
/mnt/ssd/jenkins/workspace/Lucene-Solr-trunk-Linux/build.xml:29: The following error occurred
while executing this line:
/mnt/ssd/jenkins/workspace/Lucene-Solr-trunk-Linux/lucene/build.xml:480: The following error
occurred while executing this line:
/mnt/ssd/jenkins/workspace/Lucene-Solr-trunk-Linux/lucene/common-build.xml:1507: The following
error occurred while executing this line:
/mnt/ssd/jenkins/workspace/Lucene-Solr-trunk-Linux/lucene/analysis/build.xml:101: The following
error occurred while executing this line:
/mnt/ssd/jenkins/workspace/Lucene-Solr-trunk-Linux/lucene/analysis/build.xml:38: The following
error occurred while executing this line:
/mnt/ssd/jenkins/workspace/Lucene-Solr-trunk-Linux/lucene/module-build.xml:62: The following
error occurred while executing this line:
/mnt/ssd/jenkins/workspace/Lucene-Solr-trunk-Linux/lucene/common-build.xml:1105: The following
error occurred while executing this line:
/mnt/ssd/jenkins/workspace/Lucene-Solr-trunk-Linux/lucene/common-build.xml:797: There were
test failures: 4 suites, 9 tests, 4 suite-level errors

Total time: 11 minutes 28 seconds
Build step 'Invoke Ant' marked build as failure
Recording test results
Description set: 
Email was triggered for: Failure
Sending email for trigger: Failure



Mime
View raw message