lucene-dev mailing list archives

Site index · List index
Message view « Date » · « Thread »
Top « Date » · « Thread »
From Policeman Jenkins Server <jenk...@sd-datasolutions.de>
Subject [JENKINS] Lucene-Solr-4.x-Linux (64bit/jdk1.8.0-ea-b49) - Build # 91 - Failure!
Date Thu, 02 Aug 2012 00:20:16 GMT
Build: http://jenkins.sd-datasolutions.de/job/Lucene-Solr-4.x-Linux/91/
Java: 64bit/jdk1.8.0-ea-b49 -XX:+UseParallelGC

1 tests failed.
REGRESSION:  org.apache.solr.handler.component.DistributedQueryElevationComponentTest.testDistribSearch

Error Message:
.responseHeader.params.shards:[::1]:33332/solr|localhost:38161/solr,localhost:39667/solr,localhost:38308/solr|[::1]:33332/solr!=/elevate

Stack Trace:
junit.framework.AssertionFailedError: .responseHeader.params.shards:[::1]:33332/solr|localhost:38161/solr,localhost:39667/solr,localhost:38308/solr|[::1]:33332/solr!=/elevate
	at __randomizedtesting.SeedInfo.seed([FD27BCB165D28FAF:7CC132A9128DEF93]:0)
	at junit.framework.Assert.fail(Assert.java:50)
	at org.apache.solr.BaseDistributedSearchTestCase.compareResponses(BaseDistributedSearchTestCase.java:670)
	at org.apache.solr.BaseDistributedSearchTestCase.query(BaseDistributedSearchTestCase.java:392)
	at org.apache.solr.handler.component.DistributedQueryElevationComponentTest.doTest(DistributedQueryElevationComponentTest.java:81)
	at org.apache.solr.BaseDistributedSearchTestCase.testDistribSearch(BaseDistributedSearchTestCase.java:679)
	at sun.reflect.NativeMethodAccessorImpl.invoke0(Native Method)
	at sun.reflect.NativeMethodAccessorImpl.invoke(NativeMethodAccessorImpl.java:57)
	at sun.reflect.DelegatingMethodAccessorImpl.invoke(DelegatingMethodAccessorImpl.java:43)
	at java.lang.reflect.Method.invoke(Method.java:474)
	at com.carrotsearch.randomizedtesting.RandomizedRunner.invoke(RandomizedRunner.java:1995)
	at com.carrotsearch.randomizedtesting.RandomizedRunner.access$1100(RandomizedRunner.java:132)
	at com.carrotsearch.randomizedtesting.RandomizedRunner$6.evaluate(RandomizedRunner.java:818)
	at com.carrotsearch.randomizedtesting.RandomizedRunner$7.evaluate(RandomizedRunner.java:877)
	at com.carrotsearch.randomizedtesting.RandomizedRunner$8.evaluate(RandomizedRunner.java:891)
	at com.carrotsearch.randomizedtesting.rules.SystemPropertiesRestoreRule$1.evaluate(SystemPropertiesRestoreRule.java:53)
	at org.apache.lucene.util.TestRuleSetupTeardownChained$1.evaluate(TestRuleSetupTeardownChained.java:50)
	at org.apache.lucene.util.TestRuleFieldCacheSanity$1.evaluate(TestRuleFieldCacheSanity.java:32)
	at org.apache.lucene.util.AbstractBeforeAfterRule$1.evaluate(AbstractBeforeAfterRule.java:45)
	at com.carrotsearch.randomizedtesting.rules.SystemPropertiesInvariantRule$1.evaluate(SystemPropertiesInvariantRule.java:55)
	at org.apache.lucene.util.TestRuleReportUncaughtExceptions$1.evaluate(TestRuleReportUncaughtExceptions.java:68)
	at org.apache.lucene.util.TestRuleThreadAndTestName$1.evaluate(TestRuleThreadAndTestName.java:48)
	at org.apache.lucene.util.TestRuleIgnoreAfterMaxFailures$1.evaluate(TestRuleIgnoreAfterMaxFailures.java:70)
	at org.apache.lucene.util.TestRuleMarkFailure$1.evaluate(TestRuleMarkFailure.java:48)
	at com.carrotsearch.randomizedtesting.RandomizedRunner.runSingleTest(RandomizedRunner.java:825)
	at com.carrotsearch.randomizedtesting.RandomizedRunner.access$700(RandomizedRunner.java:132)
	at com.carrotsearch.randomizedtesting.RandomizedRunner$3$1.run(RandomizedRunner.java:671)
	at com.carrotsearch.randomizedtesting.RandomizedRunner$3.evaluate(RandomizedRunner.java:697)
	at com.carrotsearch.randomizedtesting.RandomizedRunner$4.evaluate(RandomizedRunner.java:736)
	at com.carrotsearch.randomizedtesting.RandomizedRunner$5.evaluate(RandomizedRunner.java:747)
	at com.carrotsearch.randomizedtesting.rules.SystemPropertiesRestoreRule$1.evaluate(SystemPropertiesRestoreRule.java:53)
	at org.apache.lucene.util.AbstractBeforeAfterRule$1.evaluate(AbstractBeforeAfterRule.java:45)
	at org.apache.lucene.util.TestRuleReportUncaughtExceptions$1.evaluate(TestRuleReportUncaughtExceptions.java:68)
	at org.apache.lucene.util.TestRuleStoreClassName$1.evaluate(TestRuleStoreClassName.java:38)
	at com.carrotsearch.randomizedtesting.rules.SystemPropertiesInvariantRule$1.evaluate(SystemPropertiesInvariantRule.java:55)
	at org.apache.lucene.util.TestRuleNoInstanceHooksOverrides$1.evaluate(TestRuleNoInstanceHooksOverrides.java:53)
	at org.apache.lucene.util.TestRuleNoStaticHooksShadowing$1.evaluate(TestRuleNoStaticHooksShadowing.java:52)
	at org.apache.lucene.util.TestRuleAssertionsRequired$1.evaluate(TestRuleAssertionsRequired.java:36)
	at org.apache.lucene.util.TestRuleMarkFailure$1.evaluate(TestRuleMarkFailure.java:48)
	at org.apache.lucene.util.TestRuleIgnoreAfterMaxFailures$1.evaluate(TestRuleIgnoreAfterMaxFailures.java:70)
	at org.apache.lucene.util.TestRuleIgnoreTestSuites$1.evaluate(TestRuleIgnoreTestSuites.java:55)
	at com.carrotsearch.randomizedtesting.RandomizedRunner.runSuite(RandomizedRunner.java:605)
	at com.carrotsearch.randomizedtesting.RandomizedRunner.access$400(RandomizedRunner.java:132)
	at com.carrotsearch.randomizedtesting.RandomizedRunner$2.run(RandomizedRunner.java:551)




Build Log:
[...truncated 7470 lines...]
[junit4:junit4] Suite: org.apache.solr.handler.component.DistributedQueryElevationComponentTest
[junit4:junit4] FAILURE 1.21s J1 | DistributedQueryElevationComponentTest.testDistribSearch
[junit4:junit4]    > Throwable #1: junit.framework.AssertionFailedError: .responseHeader.params.shards:[::1]:33332/solr|localhost:38161/solr,localhost:39667/solr,localhost:38308/solr|[::1]:33332/solr!=/elevate
[junit4:junit4]    > 	at __randomizedtesting.SeedInfo.seed([FD27BCB165D28FAF:7CC132A9128DEF93]:0)
[junit4:junit4]    > 	at junit.framework.Assert.fail(Assert.java:50)
[junit4:junit4]    > 	at org.apache.solr.BaseDistributedSearchTestCase.compareResponses(BaseDistributedSearchTestCase.java:670)
[junit4:junit4]    > 	at org.apache.solr.BaseDistributedSearchTestCase.query(BaseDistributedSearchTestCase.java:392)
[junit4:junit4]    > 	at org.apache.solr.handler.component.DistributedQueryElevationComponentTest.doTest(DistributedQueryElevationComponentTest.java:81)
[junit4:junit4]    > 	at org.apache.solr.BaseDistributedSearchTestCase.testDistribSearch(BaseDistributedSearchTestCase.java:679)
[junit4:junit4]    > 	at sun.reflect.NativeMethodAccessorImpl.invoke0(Native Method)
[junit4:junit4]    > 	at sun.reflect.NativeMethodAccessorImpl.invoke(NativeMethodAccessorImpl.java:57)
[junit4:junit4]    > 	at sun.reflect.DelegatingMethodAccessorImpl.invoke(DelegatingMethodAccessorImpl.java:43)
[junit4:junit4]    > 	at java.lang.reflect.Method.invoke(Method.java:474)
[junit4:junit4]    > 	at com.carrotsearch.randomizedtesting.RandomizedRunner.invoke(RandomizedRunner.java:1995)
[junit4:junit4]    > 	at com.carrotsearch.randomizedtesting.RandomizedRunner.access$1100(RandomizedRunner.java:132)
[junit4:junit4]    > 	at com.carrotsearch.randomizedtesting.RandomizedRunner$6.evaluate(RandomizedRunner.java:818)
[junit4:junit4]    > 	at com.carrotsearch.randomizedtesting.RandomizedRunner$7.evaluate(RandomizedRunner.java:877)
[junit4:junit4]    > 	at com.carrotsearch.randomizedtesting.RandomizedRunner$8.evaluate(RandomizedRunner.java:891)
[junit4:junit4]    > 	at com.carrotsearch.randomizedtesting.rules.SystemPropertiesRestoreRule$1.evaluate(SystemPropertiesRestoreRule.java:53)
[junit4:junit4]    > 	at org.apache.lucene.util.TestRuleSetupTeardownChained$1.evaluate(TestRuleSetupTeardownChained.java:50)
[junit4:junit4]    > 	at org.apache.lucene.util.TestRuleFieldCacheSanity$1.evaluate(TestRuleFieldCacheSanity.java:32)
[junit4:junit4]    > 	at org.apache.lucene.util.AbstractBeforeAfterRule$1.evaluate(AbstractBeforeAfterRule.java:45)
[junit4:junit4]    > 	at com.carrotsearch.randomizedtesting.rules.SystemPropertiesInvariantRule$1.evaluate(SystemPropertiesInvariantRule.java:55)
[junit4:junit4]    > 	at org.apache.lucene.util.TestRuleReportUncaughtExceptions$1.evaluate(TestRuleReportUncaughtExceptions.java:68)
[junit4:junit4]    > 	at org.apache.lucene.util.TestRuleThreadAndTestName$1.evaluate(TestRuleThreadAndTestName.java:48)
[junit4:junit4]    > 	at org.apache.lucene.util.TestRuleIgnoreAfterMaxFailures$1.evaluate(TestRuleIgnoreAfterMaxFailures.java:70)
[junit4:junit4]    > 	at org.apache.lucene.util.TestRuleMarkFailure$1.evaluate(TestRuleMarkFailure.java:48)
[junit4:junit4]    > 	at com.carrotsearch.randomizedtesting.RandomizedRunner.runSingleTest(RandomizedRunner.java:825)
[junit4:junit4]    > 	at com.carrotsearch.randomizedtesting.RandomizedRunner.access$700(RandomizedRunner.java:132)
[junit4:junit4]    > 	at com.carrotsearch.randomizedtesting.RandomizedRunner$3$1.run(RandomizedRunner.java:671)
[junit4:junit4]    > 	at com.carrotsearch.randomizedtesting.RandomizedRunner$3.evaluate(RandomizedRunner.java:697)
[junit4:junit4]    > 	at com.carrotsearch.randomizedtesting.RandomizedRunner$4.evaluate(RandomizedRunner.java:736)
[junit4:junit4]    > 	at com.carrotsearch.randomizedtesting.RandomizedRunner$5.evaluate(RandomizedRunner.java:747)
[junit4:junit4]    > 	at com.carrotsearch.randomizedtesting.rules.SystemPropertiesRestoreRule$1.evaluate(SystemPropertiesRestoreRule.java:53)
[junit4:junit4]    > 	at org.apache.lucene.util.AbstractBeforeAfterRule$1.evaluate(AbstractBeforeAfterRule.java:45)
[junit4:junit4]    > 	at org.apache.lucene.util.TestRuleReportUncaughtExceptions$1.evaluate(TestRuleReportUncaughtExceptions.java:68)
[junit4:junit4]    > 	at org.apache.lucene.util.TestRuleStoreClassName$1.evaluate(TestRuleStoreClassName.java:38)
[junit4:junit4]    > 	at com.carrotsearch.randomizedtesting.rules.SystemPropertiesInvariantRule$1.evaluate(SystemPropertiesInvariantRule.java:55)
[junit4:junit4]    > 	at org.apache.lucene.util.TestRuleNoInstanceHooksOverrides$1.evaluate(TestRuleNoInstanceHooksOverrides.java:53)
[junit4:junit4]    > 	at org.apache.lucene.util.TestRuleNoStaticHooksShadowing$1.evaluate(TestRuleNoStaticHooksShadowing.java:52)
[junit4:junit4]    > 	at org.apache.lucene.util.TestRuleAssertionsRequired$1.evaluate(TestRuleAssertionsRequired.java:36)
[junit4:junit4]    > 	at org.apache.lucene.util.TestRuleMarkFailure$1.evaluate(TestRuleMarkFailure.java:48)
[junit4:junit4]    > 	at org.apache.lucene.util.TestRuleIgnoreAfterMaxFailures$1.evaluate(TestRuleIgnoreAfterMaxFailures.java:70)
[junit4:junit4]    > 	at org.apache.lucene.util.TestRuleIgnoreTestSuites$1.evaluate(TestRuleIgnoreTestSuites.java:55)
[junit4:junit4]    > 	at com.carrotsearch.randomizedtesting.RandomizedRunner.runSuite(RandomizedRunner.java:605)
[junit4:junit4]    > 	at com.carrotsearch.randomizedtesting.RandomizedRunner.access$400(RandomizedRunner.java:132)
[junit4:junit4]    > 	at com.carrotsearch.randomizedtesting.RandomizedRunner$2.run(RandomizedRunner.java:551)
[junit4:junit4]    > 
[junit4:junit4]   2> 2 T2128 oas.SolrTestCaseJ4.setUp ###Starting testDistribSearch
[junit4:junit4]   2> 2 T2128 oejs.Server.doStart jetty-8.1.2.v20120308
[junit4:junit4]   2> 6 T2128 oejs.AbstractConnector.doStart Started SocketConnector@0.0.0.0:43800
[junit4:junit4]   2> 7 T2128 oasc.SolrResourceLoader.locateSolrHome JNDI not configured for solr (NoInitialContextEx)
[junit4:junit4]   2> 7 T2128 oasc.SolrResourceLoader.locateSolrHome using system property solr.solr.home: /mnt/ssd/jenkins/workspace/Lucene-Solr-4.x-Linux/checkout/solr/build/solr-core/test-files/solr
[junit4:junit4]   2> 7 T2128 oasc.SolrResourceLoader.<init> new SolrResourceLoader for deduced Solr Home: '/mnt/ssd/jenkins/workspace/Lucene-Solr-4.x-Linux/checkout/solr/build/solr-core/test-files/solr/'
[junit4:junit4]   2> 13 T2128 oass.SolrDispatchFilter.init SolrDispatchFilter.init()
[junit4:junit4]   2> 13 T2128 oasc.SolrResourceLoader.locateSolrHome JNDI not configured for solr (NoInitialContextEx)
[junit4:junit4]   2> 13 T2128 oasc.SolrResourceLoader.locateSolrHome using system property solr.solr.home: /mnt/ssd/jenkins/workspace/Lucene-Solr-4.x-Linux/checkout/solr/build/solr-core/test-files/solr
[junit4:junit4]   2> 13 T2128 oasc.CoreContainer$Initializer.initialize looking for solr.xml: /mnt/ssd/jenkins/workspace/Lucene-Solr-4.x-Linux/checkout/solr/build/solr-core/test-files/solr/solr.xml
[junit4:junit4]   2> 13 T2128 oasc.CoreContainer.<init> New CoreContainer 1908607963
[junit4:junit4]   2> 14 T2128 oasc.CoreContainer.load Loading CoreContainer using Solr Home: '/mnt/ssd/jenkins/workspace/Lucene-Solr-4.x-Linux/checkout/solr/build/solr-core/test-files/solr/'
[junit4:junit4]   2> 14 T2128 oasc.SolrResourceLoader.<init> new SolrResourceLoader for directory: '/mnt/ssd/jenkins/workspace/Lucene-Solr-4.x-Linux/checkout/solr/build/solr-core/test-files/solr/'
[junit4:junit4]   2> 21 T2128 oasc.CoreContainer.load Registering Log Listener
[junit4:junit4]   2> 31 T2128 oasc.CoreContainer.create Creating SolrCore 'collection1' using instanceDir: /mnt/ssd/jenkins/workspace/Lucene-Solr-4.x-Linux/checkout/solr/build/solr-core/test-files/solr/collection1
[junit4:junit4]   2> 31 T2128 oasc.SolrResourceLoader.<init> new SolrResourceLoader for directory: '/mnt/ssd/jenkins/workspace/Lucene-Solr-4.x-Linux/checkout/solr/build/solr-core/test-files/solr/collection1/'
[junit4:junit4]   2> 31 T2128 oasc.SolrResourceLoader.replaceClassLoader Adding 'file:/mnt/ssd/jenkins/workspace/Lucene-Solr-4.x-Linux/checkout/solr/build/solr-core/test-files/solr/collection1/lib/README' to classloader
[junit4:junit4]   2> 32 T2128 oasc.SolrResourceLoader.replaceClassLoader Adding 'file:/mnt/ssd/jenkins/workspace/Lucene-Solr-4.x-Linux/checkout/solr/build/solr-core/test-files/solr/collection1/lib/classes/' to classloader
[junit4:junit4]   2> 50 T2128 oasc.SolrConfig.<init> Using Lucene MatchVersion: LUCENE_40
[junit4:junit4]   2> 86 T2128 oasc.SolrConfig.<init> Loaded SolrConfig: solrconfig-elevate.xml
[junit4:junit4]   2> 87 T2128 oass.IndexSchema.readSchema Reading Solr Schema
[junit4:junit4]   2> 90 T2128 oass.IndexSchema.readSchema Schema name=example
[junit4:junit4]   2> 207 T2128 oass.IndexSchema.readSchema default search field in schema is text
[junit4:junit4]   2> 209 T2128 oass.IndexSchema.readSchema unique key field: id
[junit4:junit4]   2> 211 T2128 oasc.SolrCore.<init> [collection1] Opening new SolrCore at /mnt/ssd/jenkins/workspace/Lucene-Solr-4.x-Linux/checkout/solr/build/solr-core/test-files/solr/collection1/, dataDir=./org.apache.solr.handler.component.DistributedQueryElevationComponentTest-1343866611980/control/data/
[junit4:junit4]   2> 211 T2128 oasc.JmxMonitoredMap.<init> JMX monitoring is enabled. Adding Solr mbeans to JMX Server: com.sun.jmx.mbeanserver.JmxMBeanServer@56459b78
[junit4:junit4]   2> 212 T2128 oasc.SolrCore.getNewIndexDir WARNING New index directory detected: old=null new=./org.apache.solr.handler.component.DistributedQueryElevationComponentTest-1343866611980/control/data/index/
[junit4:junit4]   2> 217 T2128 oasc.SolrCore.initIndex WARNING [collection1] Solr index directory './org.apache.solr.handler.component.DistributedQueryElevationComponentTest-1343866611980/control/data/index' doesn't exist. Creating new index...
[junit4:junit4]   2> 218 T2128 oasc.SolrDeletionPolicy.onCommit SolrDeletionPolicy.onCommit: commits:num=1
[junit4:junit4]   2> 		commit{dir=MockDirWrapper(org.apache.lucene.store.RAMDirectory@644c6963 lockFactory=org.apache.lucene.store.SingleInstanceLockFactory@11c30f4f),segFN=segments_1,generation=1,filenames=[segments_1]
[junit4:junit4]   2> 218 T2128 oasc.SolrDeletionPolicy.updateCommits newest commit = 1
[junit4:junit4]   2> 221 T2128 oasc.RequestHandlers.initHandlersFromConfig created /update: solr.UpdateRequestHandler
[junit4:junit4]   2> 221 T2128 oasc.RequestHandlers.initHandlersFromConfig created /elevate: org.apache.solr.handler.component.SearchHandler
[junit4:junit4]   2> 222 T2128 oasc.RequestHandlers.initHandlersFromConfig created /dataElevate: org.apache.solr.handler.component.SearchHandler
[junit4:junit4]   2> 222 T2128 oashl.XMLLoader.init xsltCacheLifetimeSeconds=60
[junit4:junit4]   2> 222 T2128 oasc.RequestHandlers.initHandlersFromConfig WARNING no default request handler is registered (either '/select' or 'standard')
[junit4:junit4]   2> 225 T2128 oasc.SolrCore.initDeprecatedSupport WARNING solrconfig.xml uses deprecated <admin/gettableFiles>, Please update your config to use the ShowFileRequestHandler.
[junit4:junit4]   2> 232 T2128 oasc.SolrCore.initDeprecatedSupport WARNING adding ShowFileRequestHandler with hidden files: [SOLRCONFIG-TERMINDEX.XML, TRIVIAL.UPDATEPROCESSOR1.JS, SCHEMA-CHARFILTERS.XML, SCHEMA-REQUIRED-FIELDS.XML, SCHEMA-REPLICATION1.XML, OPEN-EXCHANGE-RATES.JSON, SCHEMA-TFIDF.XML, HYPHENATION.DTD, CURRENCY.XML, DA_COMPOUNDDICTIONARY.TXT, SCHEMA-PHRASESUGGEST.XML, SCHEMA-SPELLCHECKER.XML, COMPOUNDDICTIONARY.TXT, SCHEMA_CODEC.XML, SCHEMA-LMJELINEKMERCER.XML, SCHEMA-IB.XML, SCHEMA.XML, BAD-SCHEMA-DUP-FIELDTYPE.XML, BAD-MP-SOLRCONFIG.XML, SOLRCONFIG-LAZYWRITER.XML, KEEP-2.TXT, SOLRCONFIG-SOLCOREPROPERTIES.XML, SOLRCONFIG-REQHANDLER.INCL, STOPTYPES-1.TXT, SOLRCONFIG-BASIC-LUCENEVERSION31.XML, SOLRCONFIG-SPELLCHECKER.XML, STOPWORDS.TXT, SOLRCONFIG-SLAVE.XML, SOLRCONFIG-MASTER3.XML, MAPPING-ISOLATIN1ACCENT.TXT, SOLRCONFIG-ENABLEPLUGIN.XML, SOLRCONFIG-PROPINJECT-INDEXDEFAULT.XML, STOP-SNOWBALL.TXT, SOLRCONFIG-TRANSFORMERS.XML, BAD-SCHEMA-NOT-INDEXED-BUT-POS.XML, BAD-SCHEMA-NOT-INDEXED-BUT-NORMS.XML, SOLRCONFIG-FUNCTIONQUERY.XML, DA_UTF8.XML, SOLRCONFIG-UPDATE-PROCESSOR-CHAINS.XML, SOLRCONFIG-SLAVE1.XML, SOLRCONFIG-REPEATER.XML, STOPWORDSWRONGENCODING.TXT, SOLRCONFIG-HIGHLIGHT.XML, SOLRCONFIG-SPELLCHECKCOMPONENT.XML, SOLRCONFIG-DELPOLICY1.XML, STOPWITHBOM.TXT, SOLRCONFIG-PROPINJECT.XML, SOLRCONFIG_CODEC.XML, XSLT, SCHEMA-COLLATEFILTER.XML, WDFTYPES.TXT, SOLRCONFIG-MASTER2.XML, SCHEMA-FOLDING.XML, MISSLEADING.EXTENSION.UPDATEPROCESSOR.JS.TXT, BAD-SCHEMA-EXTERNAL-FILEFIELD.XML, SCHEMA-NOT-REQUIRED-UNIQUE-KEY.XML, SOLRCONFIG-SOLR-749.XML, SOLRCONFIG-MASTER.XML, CONDITIONAL.UPDATEPROCESSOR.JS, BAD-SOLRCONFIG-MISSING-SCRIPTFILE.XML, SCHEMA-DFR.XML, MISSING.FUNCTIONS.UPDATEPROCESSOR.JS, SCHEMA-COPYFIELD-TEST.XML, SOLRCONFIG-PHRASESUGGEST.XML, STOPTYPES-2.TXT, SOLRCONFIG-ALTDIRECTORY.XML, SCHEMA-LMDIRICHLET.XML, BAD-SCHEMA-DUP-DYNAMICFIELD.XML, THROW.ERROR.ON.ADD.UPDATEPROCESSOR.JS, OLD_SYNONYMS.TXT, SOLRCONFIG-CACHING.XML, STOP-1.TXT, TRIVIAL.UPDATEPROCESSOR0.JS, SCHEMA-MINIMAL.XML, SOLRCONFIG-SIMPLELOCK.XML, SCHEMASURROUND.XML, SOLRCONFIG-QUERYSENDER.XML, SCHEMA-COLLATE.XML, SOLRCONFIG-NOCACHE.XML, SCHEMA-STOP-KEEP.XML, BAD-SCHEMA-UNIQUEKEY-IS-COPYFIELD-DEST.XML, SOLRCONFIG-NATIVELOCK.XML, SOLRCONFIG-MERGEPOLICY.XML, SOLRCONFIG-SCRIPT-UPDATEPROCESSOR.XML, ELEVATE.XML, SCHEMA-REPLICATION2.XML, STOP-2.TXT, ADDFIELDS.UPDATEPROCESSOR.JS, SCHEMA-SIM.XML, SOLRCONFIG_PERF.XML, STEMDICT.TXT, SCHEMA11.XML, SCHEMA-NUMERIC.XML, SCHEMA-LUCENEMATCHVERSION.XML, SOLRCONFIG-TLOG.XML, SCHEMA-REVERSED.XML, HUNSPELL-TEST.DIC, SOLRCONFIG-XINCLUDE.XML, SCHEMA12.XML, SOLRCONFIG-MASTER1-KEEPONEBACKUP.XML, SOLRCONFIG-DELPOLICY2.XML, BAD-SCHEMA-ANALYZER-CLASS-AND-NESTED.XML, BAD-SCHEMA-SIM-GLOBAL-VS-FT-MISMATCH.XML, SCHEMA-BINARYFIELD.XML, HUNSPELL-TEST.AFF, BAD-SCHEMA-NOT-INDEXED-BUT-TF.XML, KEEP-1.TXT, BAD-SCHEMA-DUP-FIELD.XML, BAD-SCHEMA-OMIT-TF-BUT-NOT-POS.XML, SCHEMA-BM25.XML, SOLRCONFIG-BASIC.XML, BAD_SOLRCONFIG.XML, SOLRCONFIG-QUERYSENDER-NOQUERY.XML, BAD-SCHEMA-NONTEXT-ANALYZER.XML, FRENCHARTICLES.TXT, BAD-SCHEMA-CODEC-GLOBAL-VS-FT-MISMATCH.XML, SCHEMA15.XML, SCHEMA-TRIE.XML, BAD-SOLRCONFIG-INVALID-SCRIPTFILE.XML, SYNONYMS.TXT, SOLRCONFIG-MASTER1.XML, PROTWORDS.TXT, BAD-SCHEMA-UNIQUEKEY-MULTIVALUED.XML, BAD-SCHEMA-UNIQUEKEY-USES-DEFAULT.XML, SOLRCONFIG-ELEVATE.XML, BAD-SOLRCONFIG-BOGUS-SCRIPTENGINE-NAME.XML, PHRASESUGGEST.TXT]
[junit4:junit4]   2> 235 T2128 oass.SolrIndexSearcher.<init> Opening Searcher@20a8d8ee main
[junit4:junit4]   2> 235 T2128 oass.SolrIndexSearcher.getIndexDir WARNING WARNING: Directory impl does not support setting indexDir: org.apache.lucene.store.MockDirectoryWrapper
[junit4:junit4]   2> 235 T2128 oasu.CommitTracker.<init> Hard AutoCommit: disabled
[junit4:junit4]   2> 236 T2128 oasu.CommitTracker.<init> Soft AutoCommit: disabled
[junit4:junit4]   2> 237 T2128 oashc.QueryElevationComponent.inform Loading QueryElevation from: /mnt/ssd/jenkins/workspace/Lucene-Solr-4.x-Linux/checkout/solr/build/solr-core/test-files/solr/collection1/conf/elevate.xml
[junit4:junit4]   2> 243 T2128 oashc.QueryElevationComponent.inform Loading QueryElevation from: /mnt/ssd/jenkins/workspace/Lucene-Solr-4.x-Linux/checkout/solr/build/solr-core/test-files/solr/collection1/conf/elevate.xml
[junit4:junit4]   2> 248 T2128 oashc.HttpShardHandlerFactory.getParameter Setting socketTimeout to: 0
[junit4:junit4]   2> 249 T2128 oashc.HttpShardHandlerFactory.getParameter Setting urlScheme to: http://
[junit4:junit4]   2> 249 T2128 oashc.HttpShardHandlerFactory.getParameter Setting connTimeout to: 0
[junit4:junit4]   2> 249 T2128 oashc.HttpShardHandlerFactory.getParameter Setting maxConnectionsPerHost to: 20
[junit4:junit4]   2> 249 T2128 oashc.HttpShardHandlerFactory.getParameter Setting corePoolSize to: 0
[junit4:junit4]   2> 249 T2128 oashc.HttpShardHandlerFactory.getParameter Setting maximumPoolSize to: 2147483647
[junit4:junit4]   2> 250 T2128 oashc.HttpShardHandlerFactory.getParameter Setting maxThreadIdleTime to: 5
[junit4:junit4]   2> 250 T2128 oashc.HttpShardHandlerFactory.getParameter Setting sizeOfQueue to: -1
[junit4:junit4]   2> 250 T2128 oashc.HttpShardHandlerFactory.getParameter Setting fairnessPolicy to: false
[junit4:junit4]   2> 250 T2128 oascsi.HttpClientUtil.createClient Creating new http client, config:maxConnectionsPerHost=20&maxConnections=10000&socketTimeout=0&connTimeout=0&retry=false
[junit4:junit4]   2> 252 T2138 oasc.SolrCore.registerSearcher [collection1] Registered new searcher Searcher@20a8d8ee main{StandardDirectoryReader(segments_1:1)}
[junit4:junit4]   2> 252 T2128 oasc.CoreContainer.register registering core: collection1
[junit4:junit4]   2> 253 T2128 oass.SolrDispatchFilter.init user.dir=/mnt/ssd/jenkins/workspace/Lucene-Solr-4.x-Linux/checkout/solr/build/solr-core/test/J1
[junit4:junit4]   2> 253 T2128 oass.SolrDispatchFilter.init SolrDispatchFilter.init() done
[junit4:junit4]   2> 253 T2128 oascsi.HttpClientUtil.createClient Creating new http client, config:maxConnections=128&maxConnectionsPerHost=32&followRedirects=false
[junit4:junit4]   2> 255 T2128 oejs.Server.doStart jetty-8.1.2.v20120308
[junit4:junit4]   2> 256 T2128 oejs.AbstractConnector.doStart Started SocketConnector@0.0.0.0:38161
[junit4:junit4]   2> 257 T2128 oasc.SolrResourceLoader.locateSolrHome JNDI not configured for solr (NoInitialContextEx)
[junit4:junit4]   2> 257 T2128 oasc.SolrResourceLoader.locateSolrHome using system property solr.solr.home: /mnt/ssd/jenkins/workspace/Lucene-Solr-4.x-Linux/checkout/solr/build/solr-core/test-files/solr
[junit4:junit4]   2> 258 T2128 oasc.SolrResourceLoader.<init> new SolrResourceLoader for deduced Solr Home: '/mnt/ssd/jenkins/workspace/Lucene-Solr-4.x-Linux/checkout/solr/build/solr-core/test-files/solr/'
[junit4:junit4]   2> 264 T2128 oass.SolrDispatchFilter.init SolrDispatchFilter.init()
[junit4:junit4]   2> 265 T2128 oasc.SolrResourceLoader.locateSolrHome JNDI not configured for solr (NoInitialContextEx)
[junit4:junit4]   2> 265 T2128 oasc.SolrResourceLoader.locateSolrHome using system property solr.solr.home: /mnt/ssd/jenkins/workspace/Lucene-Solr-4.x-Linux/checkout/solr/build/solr-core/test-files/solr
[junit4:junit4]   2> 265 T2128 oasc.CoreContainer$Initializer.initialize looking for solr.xml: /mnt/ssd/jenkins/workspace/Lucene-Solr-4.x-Linux/checkout/solr/build/solr-core/test-files/solr/solr.xml
[junit4:junit4]   2> 266 T2128 oasc.CoreContainer.<init> New CoreContainer 542164306
[junit4:junit4]   2> 266 T2128 oasc.CoreContainer.load Loading CoreContainer using Solr Home: '/mnt/ssd/jenkins/workspace/Lucene-Solr-4.x-Linux/checkout/solr/build/solr-core/test-files/solr/'
[junit4:junit4]   2> 266 T2128 oasc.SolrResourceLoader.<init> new SolrResourceLoader for directory: '/mnt/ssd/jenkins/workspace/Lucene-Solr-4.x-Linux/checkout/solr/build/solr-core/test-files/solr/'
[junit4:junit4]   2> 274 T2128 oasc.CoreContainer.load Registering Log Listener
[junit4:junit4]   2> 282 T2128 oasc.CoreContainer.create Creating SolrCore 'collection1' using instanceDir: /mnt/ssd/jenkins/workspace/Lucene-Solr-4.x-Linux/checkout/solr/build/solr-core/test-files/solr/collection1
[junit4:junit4]   2> 282 T2128 oasc.SolrResourceLoader.<init> new SolrResourceLoader for directory: '/mnt/ssd/jenkins/workspace/Lucene-Solr-4.x-Linux/checkout/solr/build/solr-core/test-files/solr/collection1/'
[junit4:junit4]   2> 283 T2128 oasc.SolrResourceLoader.replaceClassLoader Adding 'file:/mnt/ssd/jenkins/workspace/Lucene-Solr-4.x-Linux/checkout/solr/build/solr-core/test-files/solr/collection1/lib/README' to classloader
[junit4:junit4]   2> 283 T2128 oasc.SolrResourceLoader.replaceClassLoader Adding 'file:/mnt/ssd/jenkins/workspace/Lucene-Solr-4.x-Linux/checkout/solr/build/solr-core/test-files/solr/collection1/lib/classes/' to classloader
[junit4:junit4]   2> 299 T2128 oasc.SolrConfig.<init> Using Lucene MatchVersion: LUCENE_40
[junit4:junit4]   2> 323 T2128 oasc.SolrConfig.<init> Loaded SolrConfig: solrconfig-elevate.xml
[junit4:junit4]   2> 323 T2128 oass.IndexSchema.readSchema Reading Solr Schema
[junit4:junit4]   2> 325 T2128 oass.IndexSchema.readSchema Schema name=example
[junit4:junit4]   2> 435 T2128 oass.IndexSchema.readSchema default search field in schema is text
[junit4:junit4]   2> 437 T2128 oass.IndexSchema.readSchema unique key field: id
[junit4:junit4]   2> 438 T2128 oasc.SolrCore.<init> [collection1] Opening new SolrCore at /mnt/ssd/jenkins/workspace/Lucene-Solr-4.x-Linux/checkout/solr/build/solr-core/test-files/solr/collection1/, dataDir=./org.apache.solr.handler.component.DistributedQueryElevationComponentTest-1343866611980/shard0/data/
[junit4:junit4]   2> 439 T2128 oasc.JmxMonitoredMap.<init> JMX monitoring is enabled. Adding Solr mbeans to JMX Server: com.sun.jmx.mbeanserver.JmxMBeanServer@56459b78
[junit4:junit4]   2> 439 T2128 oasc.SolrCore.getNewIndexDir WARNING New index directory detected: old=null new=./org.apache.solr.handler.component.DistributedQueryElevationComponentTest-1343866611980/shard0/data/index/
[junit4:junit4]   2> 439 T2128 oasc.SolrCore.initIndex WARNING [collection1] Solr index directory './org.apache.solr.handler.component.DistributedQueryElevationComponentTest-1343866611980/shard0/data/index' doesn't exist. Creating new index...
[junit4:junit4]   2> 440 T2128 oasc.SolrDeletionPolicy.onCommit SolrDeletionPolicy.onCommit: commits:num=1
[junit4:junit4]   2> 		commit{dir=MockDirWrapper(org.apache.lucene.store.RAMDirectory@ec53530 lockFactory=org.apache.lucene.store.SingleInstanceLockFactory@dc55158),segFN=segments_1,generation=1,filenames=[segments_1]
[junit4:junit4]   2> 440 T2128 oasc.SolrDeletionPolicy.updateCommits newest commit = 1
[junit4:junit4]   2> 441 T2128 oasc.RequestHandlers.initHandlersFromConfig created /update: solr.UpdateRequestHandler
[junit4:junit4]   2> 441 T2128 oasc.RequestHandlers.initHandlersFromConfig created /elevate: org.apache.solr.handler.component.SearchHandler
[junit4:junit4]   2> 442 T2128 oasc.RequestHandlers.initHandlersFromConfig created /dataElevate: org.apache.solr.handler.component.SearchHandler
[junit4:junit4]   2> 442 T2128 oashl.XMLLoader.init xsltCacheLifetimeSeconds=60
[junit4:junit4]   2> 442 T2128 oasc.RequestHandlers.initHandlersFromConfig WARNING no default request handler is registered (either '/select' or 'standard')
[junit4:junit4]   2> 443 T2128 oasc.SolrCore.initDeprecatedSupport WARNING solrconfig.xml uses deprecated <admin/gettableFiles>, Please update your config to use the ShowFileRequestHandler.
[junit4:junit4]   2> 443 T2128 oasc.SolrCore.initDeprecatedSupport WARNING adding ShowFileRequestHandler with hidden files: [SOLRCONFIG-TERMINDEX.XML, TRIVIAL.UPDATEPROCESSOR1.JS, SCHEMA-CHARFILTERS.XML, SCHEMA-REQUIRED-FIELDS.XML, SCHEMA-REPLICATION1.XML, OPEN-EXCHANGE-RATES.JSON, SCHEMA-TFIDF.XML, HYPHENATION.DTD, CURRENCY.XML, DA_COMPOUNDDICTIONARY.TXT, SCHEMA-PHRASESUGGEST.XML, SCHEMA-SPELLCHECKER.XML, COMPOUNDDICTIONARY.TXT, SCHEMA_CODEC.XML, SCHEMA-LMJELINEKMERCER.XML, SCHEMA-IB.XML, SCHEMA.XML, BAD-SCHEMA-DUP-FIELDTYPE.XML, BAD-MP-SOLRCONFIG.XML, SOLRCONFIG-LAZYWRITER.XML, KEEP-2.TXT, SOLRCONFIG-SOLCOREPROPERTIES.XML, SOLRCONFIG-REQHANDLER.INCL, STOPTYPES-1.TXT, SOLRCONFIG-BASIC-LUCENEVERSION31.XML, SOLRCONFIG-SPELLCHECKER.XML, STOPWORDS.TXT, SOLRCONFIG-SLAVE.XML, SOLRCONFIG-MASTER3.XML, MAPPING-ISOLATIN1ACCENT.TXT, SOLRCONFIG-ENABLEPLUGIN.XML, SOLRCONFIG-PROPINJECT-INDEXDEFAULT.XML, STOP-SNOWBALL.TXT, SOLRCONFIG-TRANSFORMERS.XML, BAD-SCHEMA-NOT-INDEXED-BUT-POS.XML, BAD-SCHEMA-NOT-INDEXED-BUT-NORMS.XML, SOLRCONFIG-FUNCTIONQUERY.XML, DA_UTF8.XML, SOLRCONFIG-UPDATE-PROCESSOR-CHAINS.XML, SOLRCONFIG-SLAVE1.XML, SOLRCONFIG-REPEATER.XML, STOPWORDSWRONGENCODING.TXT, SOLRCONFIG-HIGHLIGHT.XML, SOLRCONFIG-SPELLCHECKCOMPONENT.XML, SOLRCONFIG-DELPOLICY1.XML, STOPWITHBOM.TXT, SOLRCONFIG-PROPINJECT.XML, SOLRCONFIG_CODEC.XML, XSLT, SCHEMA-COLLATEFILTER.XML, WDFTYPES.TXT, SOLRCONFIG-MASTER2.XML, SCHEMA-FOLDING.XML, MISSLEADING.EXTENSION.UPDATEPROCESSOR.JS.TXT, BAD-SCHEMA-EXTERNAL-FILEFIELD.XML, SCHEMA-NOT-REQUIRED-UNIQUE-KEY.XML, SOLRCONFIG-SOLR-749.XML, SOLRCONFIG-MASTER.XML, CONDITIONAL.UPDATEPROCESSOR.JS, BAD-SOLRCONFIG-MISSING-SCRIPTFILE.XML, SCHEMA-DFR.XML, MISSING.FUNCTIONS.UPDATEPROCESSOR.JS, SCHEMA-COPYFIELD-TEST.XML, SOLRCONFIG-PHRASESUGGEST.XML, STOPTYPES-2.TXT, SOLRCONFIG-ALTDIRECTORY.XML, SCHEMA-LMDIRICHLET.XML, BAD-SCHEMA-DUP-DYNAMICFIELD.XML, THROW.ERROR.ON.ADD.UPDATEPROCESSOR.JS, OLD_SYNONYMS.TXT, SOLRCONFIG-CACHING.XML, STOP-1.TXT, TRIVIAL.UPDATEPROCESSOR0.JS, SCHEMA-MINIMAL.XML, SOLRCONFIG-SIMPLELOCK.XML, SCHEMASURROUND.XML, SOLRCONFIG-QUERYSENDER.XML, SCHEMA-COLLATE.XML, SOLRCONFIG-NOCACHE.XML, SCHEMA-STOP-KEEP.XML, BAD-SCHEMA-UNIQUEKEY-IS-COPYFIELD-DEST.XML, SOLRCONFIG-NATIVELOCK.XML, SOLRCONFIG-MERGEPOLICY.XML, SOLRCONFIG-SCRIPT-UPDATEPROCESSOR.XML, ELEVATE.XML, SCHEMA-REPLICATION2.XML, STOP-2.TXT, ADDFIELDS.UPDATEPROCESSOR.JS, SCHEMA-SIM.XML, SOLRCONFIG_PERF.XML, STEMDICT.TXT, SCHEMA11.XML, SCHEMA-NUMERIC.XML, SCHEMA-LUCENEMATCHVERSION.XML, SOLRCONFIG-TLOG.XML, SCHEMA-REVERSED.XML, HUNSPELL-TEST.DIC, SOLRCONFIG-XINCLUDE.XML, SCHEMA12.XML, SOLRCONFIG-MASTER1-KEEPONEBACKUP.XML, SOLRCONFIG-DELPOLICY2.XML, BAD-SCHEMA-ANALYZER-CLASS-AND-NESTED.XML, BAD-SCHEMA-SIM-GLOBAL-VS-FT-MISMATCH.XML, SCHEMA-BINARYFIELD.XML, HUNSPELL-TEST.AFF, BAD-SCHEMA-NOT-INDEXED-BUT-TF.XML, KEEP-1.TXT, BAD-SCHEMA-DUP-FIELD.XML, BAD-SCHEMA-OMIT-TF-BUT-NOT-POS.XML, SCHEMA-BM25.XML, SOLRCONFIG-BASIC.XML, BAD_SOLRCONFIG.XML, SOLRCONFIG-QUERYSENDER-NOQUERY.XML, BAD-SCHEMA-NONTEXT-ANALYZER.XML, FRENCHARTICLES.TXT, BAD-SCHEMA-CODEC-GLOBAL-VS-FT-MISMATCH.XML, SCHEMA15.XML, SCHEMA-TRIE.XML, BAD-SOLRCONFIG-INVALID-SCRIPTFILE.XML, SYNONYMS.TXT, SOLRCONFIG-MASTER1.XML, PROTWORDS.TXT, BAD-SCHEMA-UNIQUEKEY-MULTIVALUED.XML, BAD-SCHEMA-UNIQUEKEY-USES-DEFAULT.XML, SOLRCONFIG-ELEVATE.XML, BAD-SOLRCONFIG-BOGUS-SCRIPTENGINE-NAME.XML, PHRASESUGGEST.TXT]
[junit4:junit4]   2> 445 T2128 oass.SolrIndexSearcher.<init> Opening Searcher@69f938a8 main
[junit4:junit4]   2> 445 T2128 oass.SolrIndexSearcher.getIndexDir WARNING WARNING: Directory impl does not support setting indexDir: org.apache.lucene.store.MockDirectoryWrapper
[junit4:junit4]   2> 445 T2128 oasu.CommitTracker.<init> Hard AutoCommit: disabled
[junit4:junit4]   2> 445 T2128 oasu.CommitTracker.<init> Soft AutoCommit: disabled
[junit4:junit4]   2> 446 T2128 oashc.QueryElevationComponent.inform Loading QueryElevation from: /mnt/ssd/jenkins/workspace/Lucene-Solr-4.x-Linux/checkout/solr/build/solr-core/test-files/solr/collection1/conf/elevate.xml
[junit4:junit4]   2> 450 T2128 oashc.QueryElevationComponent.inform Loading QueryElevation from: /mnt/ssd/jenkins/workspace/Lucene-Solr-4.x-Linux/checkout/solr/build/solr-core/test-files/solr/collection1/conf/elevate.xml
[junit4:junit4]   2> 455 T2128 oashc.HttpShardHandlerFactory.getParameter Setting socketTimeout to: 0
[junit4:junit4]   2> 455 T2128 oashc.HttpShardHandlerFactory.getParameter Setting urlScheme to: http://
[junit4:junit4]   2> 455 T2128 oashc.HttpShardHandlerFactory.getParameter Setting connTimeout to: 0
[junit4:junit4]   2> 455 T2128 oashc.HttpShardHandlerFactory.getParameter Setting maxConnectionsPerHost to: 20
[junit4:junit4]   2> 456 T2128 oashc.HttpShardHandlerFactory.getParameter Setting corePoolSize to: 0
[junit4:junit4]   2> 456 T2128 oashc.HttpShardHandlerFactory.getParameter Setting maximumPoolSize to: 2147483647
[junit4:junit4]   2> 456 T2128 oashc.HttpShardHandlerFactory.getParameter Setting maxThreadIdleTime to: 5
[junit4:junit4]   2> 456 T2128 oashc.HttpShardHandlerFactory.getParameter Setting sizeOfQueue to: -1
[junit4:junit4]   2> 456 T2128 oashc.HttpShardHandlerFactory.getParameter Setting fairnessPolicy to: false
[junit4:junit4]   2> 456 T2128 oascsi.HttpClientUtil.createClient Creating new http client, config:maxConnectionsPerHost=20&maxConnections=10000&socketTimeout=0&connTimeout=0&retry=false
[junit4:junit4]   2> 458 T2148 oasc.SolrCore.registerSearcher [collection1] Registered new searcher Searcher@69f938a8 main{StandardDirectoryReader(segments_1:1)}
[junit4:junit4]   2> 458 T2128 oasc.CoreContainer.register registering core: collection1
[junit4:junit4]   2> 459 T2128 oass.SolrDispatchFilter.init user.dir=/mnt/ssd/jenkins/workspace/Lucene-Solr-4.x-Linux/checkout/solr/build/solr-core/test/J1
[junit4:junit4]   2> 459 T2128 oass.SolrDispatchFilter.init SolrDispatchFilter.init() done
[junit4:junit4]   2> 459 T2128 oascsi.HttpClientUtil.createClient Creating new http client, config:maxConnections=128&maxConnectionsPerHost=32&followRedirects=false
[junit4:junit4]   2> 461 T2128 oejs.Server.doStart jetty-8.1.2.v20120308
[junit4:junit4]   2> 462 T2128 oejs.AbstractConnector.doStart Started SocketConnector@0.0.0.0:39667
[junit4:junit4]   2> 463 T2128 oasc.SolrResourceLoader.locateSolrHome JNDI not configured for solr (NoInitialContextEx)
[junit4:junit4]   2> 463 T2128 oasc.SolrResourceLoader.locateSolrHome using system property solr.solr.home: /mnt/ssd/jenkins/workspace/Lucene-Solr-4.x-Linux/checkout/solr/build/solr-core/test-files/solr
[junit4:junit4]   2> 463 T2128 oasc.SolrResourceLoader.<init> new SolrResourceLoader for deduced Solr Home: '/mnt/ssd/jenkins/workspace/Lucene-Solr-4.x-Linux/checkout/solr/build/solr-core/test-files/solr/'
[junit4:junit4]   2> 469 T2128 oass.SolrDispatchFilter.init SolrDispatchFilter.init()
[junit4:junit4]   2> 469 T2128 oasc.SolrResourceLoader.locateSolrHome JNDI not configured for solr (NoInitialContextEx)
[junit4:junit4]   2> 469 T2128 oasc.SolrResourceLoader.locateSolrHome using system property solr.solr.home: /mnt/ssd/jenkins/workspace/Lucene-Solr-4.x-Linux/checkout/solr/build/solr-core/test-files/solr
[junit4:junit4]   2> 469 T2128 oasc.CoreContainer$Initializer.initialize looking for solr.xml: /mnt/ssd/jenkins/workspace/Lucene-Solr-4.x-Linux/checkout/solr/build/solr-core/test-files/solr/solr.xml
[junit4:junit4]   2> 470 T2128 oasc.CoreContainer.<init> New CoreContainer 914597961
[junit4:junit4]   2> 470 T2128 oasc.CoreContainer.load Loading CoreContainer using Solr Home: '/mnt/ssd/jenkins/workspace/Lucene-Solr-4.x-Linux/checkout/solr/build/solr-core/test-files/solr/'
[junit4:junit4]   2> 470 T2128 oasc.SolrResourceLoader.<init> new SolrResourceLoader for directory: '/mnt/ssd/jenkins/workspace/Lucene-Solr-4.x-Linux/checkout/solr/build/solr-core/test-files/solr/'
[junit4:junit4]   2> 477 T2128 oasc.CoreContainer.load Registering Log Listener
[junit4:junit4]   2> 485 T2128 oasc.CoreContainer.create Creating SolrCore 'collection1' using instanceDir: /mnt/ssd/jenkins/workspace/Lucene-Solr-4.x-Linux/checkout/solr/build/solr-core/test-files/solr/collection1
[junit4:junit4]   2> 486 T2128 oasc.SolrResourceLoader.<init> new SolrResourceLoader for directory: '/mnt/ssd/jenkins/workspace/Lucene-Solr-4.x-Linux/checkout/solr/build/solr-core/test-files/solr/collection1/'
[junit4:junit4]   2> 486 T2128 oasc.SolrResourceLoader.replaceClassLoader Adding 'file:/mnt/ssd/jenkins/workspace/Lucene-Solr-4.x-Linux/checkout/solr/build/solr-core/test-files/solr/collection1/lib/README' to classloader
[junit4:junit4]   2> 486 T2128 oasc.SolrResourceLoader.replaceClassLoader Adding 'file:/mnt/ssd/jenkins/workspace/Lucene-Solr-4.x-Linux/checkout/solr/build/solr-core/test-files/solr/collection1/lib/classes/' to classloader
[junit4:junit4]   2> 502 T2128 oasc.SolrConfig.<init> Using Lucene MatchVersion: LUCENE_40
[junit4:junit4]   2> 526 T2128 oasc.SolrConfig.<init> Loaded SolrConfig: solrconfig-elevate.xml
[junit4:junit4]   2> 526 T2128 oass.IndexSchema.readSchema Reading Solr Schema
[junit4:junit4]   2> 529 T2128 oass.IndexSchema.readSchema Schema name=example
[junit4:junit4]   2> 635 T2128 oass.IndexSchema.readSchema default search field in schema is text
[junit4:junit4]   2> 636 T2128 oass.IndexSchema.readSchema unique key field: id
[junit4:junit4]   2> 638 T2128 oasc.SolrCore.<init> [collection1] Opening new SolrCore at /mnt/ssd/jenkins/workspace/Lucene-Solr-4.x-Linux/checkout/solr/build/solr-core/test-files/solr/collection1/, dataDir=./org.apache.solr.handler.component.DistributedQueryElevationComponentTest-1343866611980/shard1/data/
[junit4:junit4]   2> 638 T2128 oasc.JmxMonitoredMap.<init> JMX monitoring is enabled. Adding Solr mbeans to JMX Server: com.sun.jmx.mbeanserver.JmxMBeanServer@56459b78
[junit4:junit4]   2> 639 T2128 oasc.SolrCore.getNewIndexDir WARNING New index directory detected: old=null new=./org.apache.solr.handler.component.DistributedQueryElevationComponentTest-1343866611980/shard1/data/index/
[junit4:junit4]   2> 639 T2128 oasc.SolrCore.initIndex WARNING [collection1] Solr index directory './org.apache.solr.handler.component.DistributedQueryElevationComponentTest-1343866611980/shard1/data/index' doesn't exist. Creating new index...
[junit4:junit4]   2> 640 T2128 oasc.SolrDeletionPolicy.onCommit SolrDeletionPolicy.onCommit: commits:num=1
[junit4:junit4]   2> 		commit{dir=MockDirWrapper(org.apache.lucene.store.RAMDirectory@3a7b058e lockFactory=org.apache.lucene.store.SingleInstanceLockFactory@7977a7fa),segFN=segments_1,generation=1,filenames=[segments_1]
[junit4:junit4]   2> 640 T2128 oasc.SolrDeletionPolicy.updateCommits newest commit = 1
[junit4:junit4]   2> 641 T2128 oasc.RequestHandlers.initHandlersFromConfig created /update: solr.UpdateRequestHandler
[junit4:junit4]   2> 641 T2128 oasc.RequestHandlers.initHandlersFromConfig created /elevate: org.apache.solr.handler.component.SearchHandler
[junit4:junit4]   2> 642 T2128 oasc.RequestHandlers.initHandlersFromConfig created /dataElevate: org.apache.solr.handler.component.SearchHandler
[junit4:junit4]   2> 642 T2128 oashl.XMLLoader.init xsltCacheLifetimeSeconds=60
[junit4:junit4]   2> 642 T2128 oasc.RequestHandlers.initHandlersFromConfig WARNING no default request handler is registered (either '/select' or 'standard')
[junit4:junit4]   2> 643 T2128 oasc.SolrCore.initDeprecatedSupport WARNING solrconfig.xml uses deprecated <admin/gettableFiles>, Please update your config to use the ShowFileRequestHandler.
[junit4:junit4]   2> 644 T2128 oasc.SolrCore.initDeprecatedSupport WARNING adding ShowFileRequestHandler with hidden files: [SOLRCONFIG-TERMINDEX.XML, TRIVIAL.UPDATEPROCESSOR1.JS, SCHEMA-CHARFILTERS.XML, SCHEMA-REQUIRED-FIELDS.XML, SCHEMA-REPLICATION1.XML, OPEN-EXCHANGE-RATES.JSON, SCHEMA-TFIDF.XML, HYPHENATION.DTD, CURRENCY.XML, DA_COMPOUNDDICTIONARY.TXT, SCHEMA-PHRASESUGGEST.XML, SCHEMA-SPELLCHECKER.XML, COMPOUNDDICTIONARY.TXT, SCHEMA_CODEC.XML, SCHEMA-LMJELINEKMERCER.XML, SCHEMA-IB.XML, SCHEMA.XML, BAD-SCHEMA-DUP-FIELDTYPE.XML, BAD-MP-SOLRCONFIG.XML, SOLRCONFIG-LAZYWRITER.XML, KEEP-2.TXT, SOLRCONFIG-SOLCOREPROPERTIES.XML, SOLRCONFIG-REQHANDLER.INCL, STOPTYPES-1.TXT, SOLRCONFIG-BASIC-LUCENEVERSION31.XML, SOLRCONFIG-SPELLCHECKER.XML, STOPWORDS.TXT, SOLRCONFIG-SLAVE.XML, SOLRCONFIG-MASTER3.XML, MAPPING-ISOLATIN1ACCENT.TXT, SOLRCONFIG-ENABLEPLUGIN.XML, SOLRCONFIG-PROPINJECT-INDEXDEFAULT.XML, STOP-SNOWBALL.TXT, SOLRCONFIG-TRANSFORMERS.XML, BAD-SCHEMA-NOT-INDEXED-BUT-POS.XML, BAD-SCHEMA-NOT-INDEXED-BUT-NORMS.XML, SOLRCONFIG-FUNCTIONQUERY.XML, DA_UTF8.XML, SOLRCONFIG-UPDATE-PROCESSOR-CHAINS.XML, SOLRCONFIG-SLAVE1.XML, SOLRCONFIG-REPEATER.XML, STOPWORDSWRONGENCODING.TXT, SOLRCONFIG-HIGHLIGHT.XML, SOLRCONFIG-SPELLCHECKCOMPONENT.XML, SOLRCONFIG-DELPOLICY1.XML, STOPWITHBOM.TXT, SOLRCONFIG-PROPINJECT.XML, SOLRCONFIG_CODEC.XML, XSLT, SCHEMA-COLLATEFILTER.XML, WDFTYPES.TXT, SOLRCONFIG-MASTER2.XML, SCHEMA-FOLDING.XML, MISSLEADING.EXTENSION.UPDATEPROCESSOR.JS.TXT, BAD-SCHEMA-EXTERNAL-FILEFIELD.XML, SCHEMA-NOT-REQUIRED-UNIQUE-KEY.XML, SOLRCONFIG-SOLR-749.XML, SOLRCONFIG-MASTER.XML, CONDITIONAL.UPDATEPROCESSOR.JS, BAD-SOLRCONFIG-MISSING-SCRIPTFILE.XML, SCHEMA-DFR.XML, MISSING.FUNCTIONS.UPDATEPROCESSOR.JS, SCHEMA-COPYFIELD-TEST.XML, SOLRCONFIG-PHRASESUGGEST.XML, STOPTYPES-2.TXT, SOLRCONFIG-ALTDIRECTORY.XML, SCHEMA-LMDIRICHLET.XML, BAD-SCHEMA-DUP-DYNAMICFIELD.XML, THROW.ERROR.ON.ADD.UPDATEPROCESSOR.JS, OLD_SYNONYMS.TXT, SOLRCONFIG-CACHING.XML, STOP-1.TXT, TRIVIAL.UPDATEPROCESSOR0.JS, SCHEMA-MINIMAL.XML, SOLRCONFIG-SIMPLELOCK.XML, SCHEMASURROUND.XML, SOLRCONFIG-QUERYSENDER.XML, SCHEMA-COLLATE.XML, SOLRCONFIG-NOCACHE.XML, SCHEMA-STOP-KEEP.XML, BAD-SCHEMA-UNIQUEKEY-IS-COPYFIELD-DEST.XML, SOLRCONFIG-NATIVELOCK.XML, SOLRCONFIG-MERGEPOLICY.XML, SOLRCONFIG-SCRIPT-UPDATEPROCESSOR.XML, ELEVATE.XML, SCHEMA-REPLICATION2.XML, STOP-2.TXT, ADDFIELDS.UPDATEPROCESSOR.JS, SCHEMA-SIM.XML, SOLRCONFIG_PERF.XML, STEMDICT.TXT, SCHEMA11.XML, SCHEMA-NUMERIC.XML, SCHEMA-LUCENEMATCHVERSION.XML, SOLRCONFIG-TLOG.XML, SCHEMA-REVERSED.XML, HUNSPELL-TEST.DIC, SOLRCONFIG-XINCLUDE.XML, SCHEMA12.XML, SOLRCONFIG-MASTER1-KEEPONEBACKUP.XML, SOLRCONFIG-DELPOLICY2.XML, BAD-SCHEMA-ANALYZER-CLASS-AND-NESTED.XML, BAD-SCHEMA-SIM-GLOBAL-VS-FT-MISMATCH.XML, SCHEMA-BINARYFIELD.XML, HUNSPELL-TEST.AFF, BAD-SCHEMA-NOT-INDEXED-BUT-TF.XML, KEEP-1.TXT, BAD-SCHEMA-DUP-FIELD.XML, BAD-SCHEMA-OMIT-TF-BUT-NOT-POS.XML, SCHEMA-BM25.XML, SOLRCONFIG-BASIC.XML, BAD_SOLRCONFIG.XML, SOLRCONFIG-QUERYSENDER-NOQUERY.XML, BAD-SCHEMA-NONTEXT-ANALYZER.XML, FRENCHARTICLES.TXT, BAD-SCHEMA-CODEC-GLOBAL-VS-FT-MISMATCH.XML, SCHEMA15.XML, SCHEMA-TRIE.XML, BAD-SOLRCONFIG-INVALID-SCRIPTFILE.XML, SYNONYMS.TXT, SOLRCONFIG-MASTER1.XML, PROTWORDS.TXT, BAD-SCHEMA-UNIQUEKEY-MULTIVALUED.XML, BAD-SCHEMA-UNIQUEKEY-USES-DEFAULT.XML, SOLRCONFIG-ELEVATE.XML, BAD-SOLRCONFIG-BOGUS-SCRIPTENGINE-NAME.XML, PHRASESUGGEST.TXT]
[junit4:junit4]   2> 645 T2128 oass.SolrIndexSearcher.<init> Opening Searcher@7b39e881 main
[junit4:junit4]   2> 645 T2128 oass.SolrIndexSearcher.getIndexDir WARNING WARNING: Directory impl does not support setting indexDir: org.apache.lucene.store.MockDirectoryWrapper
[junit4:junit4]   2> 645 T2128 oasu.CommitTracker.<init> Hard AutoCommit: disabled
[junit4:junit4]   2> 646 T2128 oasu.CommitTracker.<init> Soft AutoCommit: disabled
[junit4:junit4]   2> 646 T2128 oashc.QueryElevationComponent.inform Loading QueryElevation from: /mnt/ssd/jenkins/workspace/Lucene-Solr-4.x-Linux/checkout/solr/build/solr-core/test-files/solr/collection1/conf/elevate.xml
[junit4:junit4]   2> 651 T2128 oashc.QueryElevationComponent.inform Loading QueryElevation from: /mnt/ssd/jenkins/workspace/Lucene-Solr-4.x-Linux/checkout/solr/build/solr-core/test-files/solr/collection1/conf/elevate.xml
[junit4:junit4]   2> 656 T2128 oashc.HttpShardHandlerFactory.getParameter Setting socketTimeout to: 0
[junit4:junit4]   2> 656 T2128 oashc.HttpShardHandlerFactory.getParameter Setting urlScheme to: http://
[junit4:junit4]   2> 656 T2128 oashc.HttpShardHandlerFactory.getParameter Setting connTimeout to: 0
[junit4:junit4]   2> 656 T2128 oashc.HttpShardHandlerFactory.getParameter Setting maxConnectionsPerHost to: 20
[junit4:junit4]   2> 656 T2128 oashc.HttpShardHandlerFactory.getParameter Setting corePoolSize to: 0
[junit4:junit4]   2> 657 T2128 oashc.HttpShardHandlerFactory.getParameter Setting maximumPoolSize to: 2147483647
[junit4:junit4]   2> 657 T2128 oashc.HttpShardHandlerFactory.getParameter Setting maxThreadIdleTime to: 5
[junit4:junit4]   2> 657 T2128 oashc.HttpShardHandlerFactory.getParameter Setting sizeOfQueue to: -1
[junit4:junit4]   2> 657 T2128 oashc.HttpShardHandlerFactory.getParameter Setting fairnessPolicy to: false
[junit4:junit4]   2> 657 T2128 oascsi.HttpClientUtil.createClient Creating new http client, config:maxConnectionsPerHost=20&maxConnections=10000&socketTimeout=0&connTimeout=0&retry=false
[junit4:junit4]   2> 659 T2158 oasc.SolrCore.registerSearcher [collection1] Registered new searcher Searcher@7b39e881 main{StandardDirectoryReader(segments_1:1)}
[junit4:junit4]   2> 659 T2128 oasc.CoreContainer.register registering core: collection1
[junit4:junit4]   2> 660 T2128 oass.SolrDispatchFilter.init user.dir=/mnt/ssd/jenkins/workspace/Lucene-Solr-4.x-Linux/checkout/solr/build/solr-core/test/J1
[junit4:junit4]   2> 660 T2128 oass.SolrDispatchFilter.init SolrDispatchFilter.init() done
[junit4:junit4]   2> 660 T2128 oascsi.HttpClientUtil.createClient Creating new http client, config:maxConnections=128&maxConnectionsPerHost=32&followRedirects=false
[junit4:junit4]   2> 662 T2128 oejs.Server.doStart jetty-8.1.2.v20120308
[junit4:junit4]   2> 664 T2128 oejs.AbstractConnector.doStart Started SocketConnector@0.0.0.0:38308
[junit4:junit4]   2> 664 T2128 oasc.SolrResourceLoader.locateSolrHome JNDI not configured for solr (NoInitialContextEx)
[junit4:junit4]   2> 665 T2128 oasc.SolrResourceLoader.locateSolrHome using system property solr.solr.home: /mnt/ssd/jenkins/workspace/Lucene-Solr-4.x-Linux/checkout/solr/build/solr-core/test-files/solr
[junit4:junit4]   2> 665 T2128 oasc.SolrResourceLoader.<init> new SolrResourceLoader for deduced Solr Home: '/mnt/ssd/jenkins/workspace/Lucene-Solr-4.x-Linux/checkout/solr/build/solr-core/test-files/solr/'
[junit4:junit4]   2> 672 T2128 oass.SolrDispatchFilter.init SolrDispatchFilter.init()
[junit4:junit4]   2> 672 T2128 oasc.SolrResourceLoader.locateSolrHome JNDI not configured for solr (NoInitialContextEx)
[junit4:junit4]   2> 673 T2128 oasc.SolrResourceLoader.locateSolrHome using system property solr.solr.home: /mnt/ssd/jenkins/workspace/Lucene-Solr-4.x-Linux/checkout/solr/build/solr-core/test-files/solr
[junit4:junit4]   2> 673 T2128 oasc.CoreContainer$Initializer.initialize looking for solr.xml: /mnt/ssd/jenkins/workspace/Lucene-Solr-4.x-Linux/checkout/solr/build/solr-core/test-files/solr/solr.xml
[junit4:junit4]   2> 673 T2128 oasc.CoreContainer.<init> New CoreContainer 644605453
[junit4:junit4]   2> 673 T2128 oasc.CoreContainer.load Loading CoreContainer using Solr Home: '/mnt/ssd/jenkins/workspace/Lucene-Solr-4.x-Linux/checkout/solr/build/solr-core/test-files/solr/'
[junit4:junit4]   2> 673 T2128 oasc.SolrResourceLoader.<init> new SolrResourceLoader for directory: '/mnt/ssd/jenkins/workspace/Lucene-Solr-4.x-Linux/checkout/solr/build/solr-core/test-files/solr/'
[junit4:junit4]   2> 681 T2128 oasc.CoreContainer.load Registering Log Listener
[junit4:junit4]   2> 690 T2128 oasc.CoreContainer.create Creating SolrCore 'collection1' using instanceDir: /mnt/ssd/jenkins/workspace/Lucene-Solr-4.x-Linux/checkout/solr/build/solr-core/test-files/solr/collection1
[junit4:junit4]   2> 690 T2128 oasc.SolrResourceLoader.<init> new SolrResourceLoader for directory: '/mnt/ssd/jenkins/workspace/Lucene-Solr-4.x-Linux/checkout/solr/build/solr-core/test-files/solr/collection1/'
[junit4:junit4]   2> 690 T2128 oasc.SolrResourceLoader.replaceClassLoader Adding 'file:/mnt/ssd/jenkins/workspace/Lucene-Solr-4.x-Linux/checkout/solr/build/solr-core/test-files/solr/collection1/lib/README' to classloader
[junit4:junit4]   2> 690 T2128 oasc.SolrResourceLoader.replaceClassLoader Adding 'file:/mnt/ssd/jenkins/workspace/Lucene-Solr-4.x-Linux/checkout/solr/build/solr-core/test-files/solr/collection1/lib/classes/' to classloader
[junit4:junit4]   2> 705 T2128 oasc.SolrConfig.<init> Using Lucene MatchVersion: LUCENE_40
[junit4:junit4]   2> 727 T2128 oasc.SolrConfig.<init> Loaded SolrConfig: solrconfig-elevate.xml
[junit4:junit4]   2> 728 T2128 oass.IndexSchema.readSchema Reading Solr Schema
[junit4:junit4]   2> 730 T2128 oass.IndexSchema.readSchema Schema name=example
[junit4:junit4]   2> 835 T2128 oass.IndexSchema.readSchema default search field in schema is text
[junit4:junit4]   2> 839 T2128 oass.IndexSchema.readSchema unique key field: id
[junit4:junit4]   2> 841 T2128 oasc.SolrCore.<init> [collection1] Opening new SolrCore at /mnt/ssd/jenkins/workspace/Lucene-Solr-4.x-Linux/checkout/solr/build/solr-core/test-files/solr/collection1/, dataDir=./org.apache.solr.handler.component.DistributedQueryElevationComponentTest-1343866611980/shard2/data/
[junit4:junit4]   2> 841 T2128 oasc.JmxMonitoredMap.<init> JMX monitoring is enabled. Adding Solr mbeans to JMX Server: com.sun.jmx.mbeanserver.JmxMBeanServer@56459b78
[junit4:junit4]   2> 841 T2128 oasc.SolrCore.getNewIndexDir WARNING New index directory detected: old=null new=./org.apache.solr.handler.component.DistributedQueryElevationComponentTest-1343866611980/shard2/data/index/
[junit4:junit4]   2> 841 T2128 oasc.SolrCore.initIndex WARNING [collection1] Solr index directory './org.apache.solr.handler.component.DistributedQueryElevationComponentTest-1343866611980/shard2/data/index' doesn't exist. Creating new index...
[junit4:junit4]   2> 842 T2128 oasc.SolrDeletionPolicy.onCommit SolrDeletionPolicy.onCommit: commits:num=1
[junit4:junit4]   2> 		commit{dir=BaseDirectoryWrapper(org.apache.lucene.store.RAMDirectory@2e12ccc3 lockFactory=org.apache.lucene.store.SingleInstanceLockFactory@54412dd6),segFN=segments_1,generation=1,filenames=[segments_1]
[junit4:junit4]   2> 842 T2128 oasc.SolrDeletionPolicy.updateCommits newest commit = 1
[junit4:junit4]   2> 843 T2128 oasc.RequestHandlers.initHandlersFromConfig created /update: solr.UpdateRequestHandler
[junit4:junit4]   2> 844 T2128 oasc.RequestHandlers.initHandlersFromConfig created /elevate: org.apache.solr.handler.component.SearchHandler
[junit4:junit4]   2> 844 T2128 oasc.RequestHandlers.initHandlersFromConfig created /dataElevate: org.apache.solr.handler.component.SearchHandler
[junit4:junit4]   2> 844 T2128 oashl.XMLLoader.init xsltCacheLifetimeSeconds=60
[junit4:junit4]   2> 844 T2128 oasc.RequestHandlers.initHandlersFromConfig WARNING no default request handler is registered (either '/select' or 'standard')
[junit4:junit4]   2> 845 T2128 oasc.SolrCore.initDeprecatedSupport WARNING solrconfig.xml uses deprecated <admin/gettableFiles>, Please update your config to use the ShowFileRequestHandler.
[junit4:junit4]   2> 846 T2128 oasc.SolrCore.initDeprecatedSupport WARNING adding ShowFileRequestHandler with hidden files: [SOLRCONFIG-TERMINDEX.XML, TRIVIAL.UPDATEPROCESSOR1.JS, SCHEMA-CHARFILTERS.XML, SCHEMA-REQUIRED-FIELDS.XML, SCHEMA-REPLICATION1.XML, OPEN-EXCHANGE-RATES.JSON, SCHEMA-TFIDF.XML, HYPHENATION.DTD, CURRENCY.XML, DA_COMPOUNDDICTIONARY.TXT, SCHEMA-PHRASESUGGEST.XML, SCHEMA-SPELLCHECKER.XML, COMPOUNDDICTIONARY.TXT, SCHEMA_CODEC.XML, SCHEMA-LMJELINEKMERCER.XML, SCHEMA-IB.XML, SCHEMA.XML, BAD-SCHEMA-DUP-FIELDTYPE.XML, BAD-MP-SOLRCONFIG.XML, SOLRCONFIG-LAZYWRITER.XML, KEEP-2.TXT, SOLRCONFIG-SOLCOREPROPERTIES.XML, SOLRCONFIG-REQHANDLER.INCL, STOPTYPES-1.TXT, SOLRCONFIG-BASIC-LUCENEVERSION31.XML, SOLRCONFIG-SPELLCHECKER.XML, STOPWORDS.TXT, SOLRCONFIG-SLAVE.XML, SOLRCONFIG-MASTER3.XML, MAPPING-ISOLATIN1ACCENT.TXT, SOLRCONFIG-ENABLEPLUGIN.XML, SOLRCONFIG-PROPINJECT-INDEXDEFAULT.XML, STOP-SNOWBALL.TXT, SOLRCONFIG-TRANSFORMERS.XML, BAD-SCHEMA-NOT-INDEXED-BUT-POS.XML, BAD-SCHEMA-NOT-INDEXED-BUT-NORMS.XML, SOLRCONFIG-FUNCTIONQUERY.XML, DA_UTF8.XML, SOLRCONFIG-UPDATE-PROCESSOR-CHAINS.XML, SOLRCONFIG-SLAVE1.XML, SOLRCONFIG-REPEATER.XML, STOPWORDSWRONGENCODING.TXT, SOLRCONFIG-HIGHLIGHT.XML, SOLRCONFIG-SPELLCHECKCOMPONENT.XML, SOLRCONFIG-DELPOLICY1.XML, STOPWITHBOM.TXT, SOLRCONFIG-PROPINJECT.XML, SOLRCONFIG_CODEC.XML, XSLT, SCHEMA-COLLATEFILTER.XML, WDFTYPES.TXT, SOLRCONFIG-MASTER2.XML, SCHEMA-FOLDING.XML, MISSLEADING.EXTENSION.UPDATEPROCESSOR.JS.TXT, BAD-SCHEMA-EXTERNAL-FILEFIELD.XML, SCHEMA-NOT-REQUIRED-UNIQUE-KEY.XML, SOLRCONFIG-SOLR-749.XML, SOLRCONFIG-MASTER.XML, CONDITIONAL.UPDATEPROCESSOR.JS, BAD-SOLRCONFIG-MISSING-SCRIPTFILE.XML, SCHEMA-DFR.XML, MISSING.FUNCTIONS.UPDATEPROCESSOR.JS, SCHEMA-COPYFIELD-TEST.XML, SOLRCONFIG-PHRASESUGGEST.XML, STOPTYPES-2.TXT, SOLRCONFIG-ALTDIRECTORY.XML, SCHEMA-LMDIRICHLET.XML, BAD-SCHEMA-DUP-DYNAMICFIELD.XML, THROW.ERROR.ON.ADD.UPDATEPROCESSOR.JS, OLD_SYNONYMS.TXT, SOLRCONFIG-CACHING.XML, STOP-1.TXT, TRIVIAL.UPDATEPROCESSOR0.JS, SCHEMA-MINIMAL.XML, SOLRCONFIG-SIMPLELOCK.XML, SCHEMASURROUND.XML, SOLRCONFIG-QUERYSENDER.XML, SCHEMA-COLLATE.XML, SOLRCONFIG-NOCACHE.XML, SCHEMA-STOP-KEEP.XML, BAD-SCHEMA-UNIQUEKEY-IS-COPYFIELD-DEST.XML, SOLRCONFIG-NATIVELOCK.XML, SOLRCONFIG-MERGEPOLICY.XML, SOLRCONFIG-SCRIPT-UPDATEPROCESSOR.XML, ELEVATE.XML, SCHEMA-REPLICATION2.XML, STOP-2.TXT, ADDFIELDS.UPDATEPROCESSOR.JS, SCHEMA-SIM.XML, SOLRCONFIG_PERF.XML, STEMDICT.TXT, SCHEMA11.XML, SCHEMA-NUMERIC.XML, SCHEMA-LUCENEMATCHVERSION.XML, SOLRCONFIG-TLOG.XML, SCHEMA-REVERSED.XML, HUNSPELL-TEST.DIC, SOLRCONFIG-XINCLUDE.XML, SCHEMA12.XML, SOLRCONFIG-MASTER1-KEEPONEBACKUP.XML, SOLRCONFIG-DELPOLICY2.XML, BAD-SCHEMA-ANALYZER-CLASS-AND-NESTED.XML, BAD-SCHEMA-SIM-GLOBAL-VS-FT-MISMATCH.XML, SCHEMA-BINARYFIELD.XML, HUNSPELL-TEST.AFF, BAD-SCHEMA-NOT-INDEXED-BUT-TF.XML, KEEP-1.TXT, BAD-SCHEMA-DUP-FIELD.XML, BAD-SCHEMA-OMIT-TF-BUT-NOT-POS.XML, SCHEMA-BM25.XML, SOLRCONFIG-BASIC.XML, BAD_SOLRCONFIG.XML, SOLRCONFIG-QUERYSENDER-NOQUERY.XML, BAD-SCHEMA-NONTEXT-ANALYZER.XML, FRENCHARTICLES.TXT, BAD-SCHEMA-CODEC-GLOBAL-VS-FT-MISMATCH.XML, SCHEMA15.XML, SCHEMA-TRIE.XML, BAD-SOLRCONFIG-INVALID-SCRIPTFILE.XML, SYNONYMS.TXT, SOLRCONFIG-MASTER1.XML, PROTWORDS.TXT, BAD-SCHEMA-UNIQUEKEY-MULTIVALUED.XML, BAD-SCHEMA-UNIQUEKEY-USES-DEFAULT.XML, SOLRCONFIG-ELEVATE.XML, BAD-SOLRCONFIG-BOGUS-SCRIPTENGINE-NAME.XML, PHRASESUGGEST.TXT]
[junit4:junit4]   2> 847 T2128 oass.SolrIndexSearcher.<init> Opening Searcher@409e1a41 main
[junit4:junit4]   2> 847 T2128 oass.SolrIndexSearcher.getIndexDir WARNING WARNING: Directory impl does not support setting indexDir: org.apache.lucene.store.BaseDirectoryWrapper
[junit4:junit4]   2> 848 T2128 oasu.CommitTracker.<init> Hard AutoCommit: disabled
[junit4:junit4]   2> 848 T2128 oasu.CommitTracker.<init> Soft AutoCommit: disabled
[junit4:junit4]   2> 849 T2128 oashc.QueryElevationComponent.inform Loading QueryElevation from: /mnt/ssd/jenkins/workspace/Lucene-Solr-4.x-Linux/checkout/solr/build/solr-core/test-files/solr/collection1/conf/elevate.xml
[junit4:junit4]   2> 855 T2128 oashc.QueryElevationComponent.inform Loading QueryElevation from: /mnt/ssd/jenkins/workspace/Lucene-Solr-4.x-Linux/checkout/solr/build/solr-core/test-files/solr/collection1/conf/elevate.xml
[junit4:junit4]   2> 862 T2128 oashc.HttpShardHandlerFactory.getParameter Setting socketTimeout to: 0
[junit4:junit4]   2> 862 T2128 oashc.HttpShardHandlerFactory.getParameter Setting urlScheme to: http://
[junit4:junit4]   2> 862 T2128 oashc.HttpShardHandlerFactory.getParameter Setting connTimeout to: 0
[junit4:junit4]   2> 862 T2128 oashc.HttpShardHandlerFactory.getParameter Setting maxConnectionsPerHost to: 20
[junit4:junit4]   2> 863 T2128 oashc.HttpShardHandlerFactory.getParameter Setting corePoolSize to: 0
[junit4:junit4]   2> 863 T2128 oashc.HttpShardHandlerFactory.getParameter Setting maximumPoolSize to: 2147483647
[junit4:junit4]   2> 863 T2128 oashc.HttpShardHandlerFactory.getParameter Setting maxThreadIdleTime to: 5
[junit4:junit4]   2> 863 T2128 oashc.HttpShardHandlerFactory.getParameter Setting sizeOfQueue to: -1
[junit4:junit4]   2> 864 T2128 oashc.HttpShardHandlerFactory.getParameter Setting fairnessPolicy to: false
[junit4:junit4]   2> 864 T2128 oascsi.HttpClientUtil.createClient Creating new http client, config:maxConnectionsPerHost=20&maxConnections=10000&socketTimeout=0&connTimeout=0&retry=false
[junit4:junit4]   2> 867 T2168 oasc.SolrCore.registerSearcher [collection1] Registered new searcher Searcher@409e1a41 main{StandardDirectoryReader(segments_1:1)}
[junit4:junit4]   2> 867 T2128 oasc.CoreContainer.register registering core: collection1
[junit4:junit4]   2> 868 T2128 oass.SolrDispatchFilter.init user.dir=/mnt/ssd/jenkins/workspace/Lucene-Solr-4.x-Linux/checkout/solr/build/solr-core/test/J1
[junit4:junit4]   2> 868 T2128 oass.SolrDispatchFilter.init SolrDispatchFilter.init() done
[junit4:junit4]   2> 868 T2128 oascsi.HttpClientUtil.createClient Creating new http client, config:maxConnections=128&maxConnectionsPerHost=32&followRedirects=false
[junit4:junit4]   2> ASYNC  NEW_CORE C93 name=collection1 org.apache.solr.core.SolrCore@5c48ccd4
[junit4:junit4]   2> 875 T2131 C93 oasu.DirectUpdateHandler2.deleteAll [collection1] REMOVING ALL DOCUMENTS FROM INDEX
[junit4:junit4]   2> 876 T2131 C93 oasc.SolrDeletionPolicy.onInit SolrDeletionPolicy.onInit: commits:num=1
[junit4:junit4]   2> 		commit{dir=MockDirWrapper(org.apache.lucene.store.RAMDirectory@644c6963 lockFactory=org.apache.lucene.store.SingleInstanceLockFactory@11c30f4f),segFN=segments_1,generation=1,filenames=[segments_1]
[junit4:junit4]   2> 876 T2131 C93 oasc.SolrDeletionPolicy.updateCommits newest commit = 1
[junit4:junit4]   2> 876 T2131 C93 UPDATE [collection1] webapp=/solr path=/update params={version=2&wt=javabin} {deleteByQuery=*:*} 0 2
[junit4:junit4]   2> ASYNC  NEW_CORE C94 name=collection1 org.apache.solr.core.SolrCore@1124eb13
[junit4:junit4]   2> 882 T2141 C94 oasu.DirectUpdateHandler2.deleteAll [collection1] REMOVING ALL DOCUMENTS FROM INDEX
[junit4:junit4]   2> 883 T2141 C94 oasc.SolrDeletionPolicy.onInit SolrDeletionPolicy.onInit: commits:num=1
[junit4:junit4]   2> 		commit{dir=MockDirWrapper(org.apache.lucene.store.RAMDirectory@ec53530 lockFactory=org.apache.lucene.store.SingleInstanceLockFactory@dc55158),segFN=segments_1,generation=1,filenames=[segments_1]
[junit4:junit4]   2> 884 T2141 C94 oasc.SolrDeletionPolicy.updateCommits newest commit = 1
[junit4:junit4]   2> 884 T2141 C94 UPDATE [collection1] webapp=/solr path=/update params={version=2&wt=javabin} {deleteByQuery=*:*} 0 2
[junit4:junit4]   2> ASYNC  NEW_CORE C95 name=collection1 org.apache.solr.core.SolrCore@6e8a4fc4
[junit4:junit4]   2> 887 T2151 C95 oasu.DirectUpdateHandler2.deleteAll [collection1] REMOVING ALL DOCUMENTS FROM INDEX
[junit4:junit4]   2> 888 T2151 C95 oasc.SolrDeletionPolicy.onInit SolrDeletionPolicy.onInit: commits:num=1
[junit4:junit4]   2> 		commit{dir=MockDirWrapper(org.apache.lucene.store.RAMDirectory@3a7b058e lockFactory=org.apache.lucene.store.SingleInstanceLockFactory@7977a7fa),segFN=segments_1,generation=1,filenames=[segments_1]
[junit4:junit4]   2> 888 T2151 C95 oasc.SolrDeletionPolicy.updateCommits newest commit = 1
[junit4:junit4]   2> 889 T2151 C95 UPDATE [collection1] webapp=/solr path=/update params={version=2&wt=javabin} {deleteByQuery=*:*} 0 1
[junit4:junit4]   2> 889 T2115 oaz.ClientCnxn$SendThread.startConnect Opening socket connection to server localhost.localdomain/127.0.0.1:52593
[junit4:junit4]   2> 889 T2115 oaz.ClientCnxn$SendThread.run WARNING Session 0x138e4b052030010 for server null, unexpected error, closing socket connection and attempting reconnect java.net.ConnectException: Connection refused
[junit4:junit4]   2> 	at sun.nio.ch.SocketChannelImpl.checkConnect(Native Method)
[junit4:junit4]   2> 	at sun.nio.ch.SocketChannelImpl.finishConnect(SocketChannelImpl.java:692)
[junit4:junit4]   2> 	at org.apache.zookeeper.ClientCnxn$SendThread.run(ClientCnxn.java:1143)
[junit4:junit4]   2> 
[junit4:junit4]   2> ASYNC  NEW_CORE C96 name=collection1 org.apache.solr.core.SolrCore@6fa0ecae
[junit4:junit4]   2> 892 T2161 C96 oasu.DirectUpdateHandler2.deleteAll [collection1] REMOVING ALL DOCUMENTS FROM INDEX
[junit4:junit4]   2> 893 T2161 C96 oasc.SolrDeletionPolicy.onInit SolrDeletionPolicy.onInit: commits:num=1
[junit4:junit4]   2> 		commit{dir=BaseDirectoryWrapper(org.apache.lucene.store.RAMDirectory@2e12ccc3 lockFactory=org.apache.lucene.store.SingleInstanceLockFactory@54412dd6),segFN=segments_1,generation=1,filenames=[segments_1]
[junit4:junit4]   2> 893 T2161 C96 oasc.SolrDeletionPolicy.updateCommits newest commit = 1
[junit4:junit4]   2> 893 T2161 C96 UPDATE [collection1] webapp=/solr path=/update params={version=2&wt=javabin} {deleteByQuery=*:*} 0 1
[junit4:junit4]   2> 896 T2131 C93 UPDATE [collection1] webapp=/solr path=/update params={version=2&wt=javabin} {add=[1]} 0 1
[junit4:junit4]   2> 898 T2141 C94 UPDATE [collection1] webapp=/solr path=/update params={version=2&wt=javabin} {add=[1]} 0 0
[junit4:junit4]   2> 900 T2131 C93 UPDATE [collection1] webapp=/solr path=/update params={version=2&wt=javabin} {add=[2]} 0 0
[junit4:junit4]   2> 902 T2151 C95 UPDATE [collection1] webapp=/solr path=/update params={version=2&wt=javabin} {add=[2]} 0 1
[junit4:junit4]   2> 903 T2131 C93 UPDATE [collection1] webapp=/solr path=/update params={version=2&wt=javabin} {add=[3]} 0 0
[junit4:junit4]   2> 905 T2161 C96 UPDATE [collection1] webapp=/solr path=/update params={version=2&wt=javabin} {add=[3]} 0 0
[junit4:junit4]   2> 906 T2131 C93 UPDATE [collection1] webapp=/solr path=/update params={version=2&wt=javabin} {add=[4]} 0 0
[junit4:junit4]   2> 908 T2141 C94 UPDATE [collection1] webapp=/solr path=/update params={version=2&wt=javabin} {add=[4]} 0 0
[junit4:junit4]   2> 909 T2131 C93 UPDATE [collection1] webapp=/solr path=/update params={version=2&wt=javabin} {add=[5]} 0 0
[junit4:junit4]   2> 911 T2151 C95 UPDATE [collection1] webapp=/solr path=/update params={version=2&wt=javabin} {add=[5]} 0 0
[junit4:junit4]   2> 913 T2131 C93 UPDATE [collection1] webapp=/solr path=/update params={version=2&wt=javabin} {add=[6]} 0 0
[junit4:junit4]   2> 914 T2161 C96 UPDATE [collection1] webapp=/solr path=/update params={version=2&wt=javabin} {add=[6]} 0 0
[junit4:junit4]   2> 916 T2131 C93 UPDATE [collection1] webapp=/solr path=/update params={version=2&wt=javabin} {add=[7]} 0 0
[junit4:junit4]   2> 918 T2161 C96 UPDATE [collection1] webapp=/solr path=/update params={version=2&wt=javabin} {add=[7]} 0 1
[junit4:junit4]   2> 919 T2131 C93 oasu.DirectUpdateHandler2.commit start commit{flags=0,_version_=0,optimize=false,openSearcher=true,waitSearcher=true,expungeDeletes=false,softCommit=false}
[junit4:junit4]   2> 920 T2131 C93 oasc.SolrDeletionPolicy.onCommit SolrDeletionPolicy.onCommit: commits:num=2
[junit4:junit4]   2> 		commit{dir=MockDirWrapper(org.apache.lucene.store.RAMDirectory@644c6963 lockFactory=org.apache.lucene.store.SingleInstanceLockFactory@11c30f4f),segFN=segments_1,generation=1,filenames=[segments_1]
[junit4:junit4]   2> 		commit{dir=MockDirWrapper(org.apache.lucene.store.RAMDirectory@644c6963 lockFactory=org.apache.lucene.store.SingleInstanceLockFactory@11c30f4f),segFN=segments_2,generation=2,filenames=[segments_2, _0.tis, _0.prx, _0.tii, _0.nrm, _0.si, _0.fdx, _0.frq, _0.fdt, _0.fnm]
[junit4:junit4]   2> 921 T2131 C93 oasc.SolrDeletionPolicy.updateCommits newest commit = 2
[junit4:junit4]   2> 921 T2131 C93 oass.SolrIndexSearcher.<init> Opening Searcher@4b3a6efa main
[junit4:junit4]   2> 921 T2131 C93 oass.SolrIndexSearcher.getIndexDir WARNING WARNING: Directory impl does not support setting indexDir: org.apache.lucene.store.MockDirectoryWrapper
[junit4:junit4]   2> 922 T2131 C93 oasu.DirectUpdateHandler2.commit end_commit_flush
[junit4:junit4]   2> 922 T2138 oasc.SolrCore.registerSearcher [collection1] Registered new searcher Searcher@4b3a6efa main{StandardDirectoryReader(segments_2:4 _0(4.0.0.1):C7)}
[junit4:junit4]   2> 923 T2131 C93 UPDATE [collection1] webapp=/solr path=/update params={commit=true&version=2&softCommit=false&waitSearcher=true&wt=javabin} {commit=} 0 4
[junit4:junit4]   2> 924 T2141 C94 oasu.DirectUpdateHandler2.commit start commit{flags=0,_version_=0,optimize=false,openSearcher=true,waitSearcher=true,expungeDeletes=false,softCommit=false}
[junit4:junit4]   2> 925 T2141 C94 oasc.SolrDeletionPolicy.onCommit SolrDeletionPolicy.onCommit: commits:num=2
[junit4:junit4]   2> 		commit{dir=MockDirWrapper(org.apache.lucene.store.RAMDirectory@ec53530 lockFactory=org.apache.lucene.store.SingleInstanceLockFactory@dc55158),segFN=segments_1,generation=1,filenames=[segments_1]
[junit4:junit4]   2> 		commit{dir=MockDirWrapper(org.apache.lucene.store.RAMDirectory@ec53530 lockFactory=org.apache.lucene.store.SingleInstanceLockFactory@dc55158),segFN=segments_2,generation=2,filenames=[segments_2, _0.tis, _0.prx, _0.tii, _0.nrm, _0.si, _0.fdx, _0.frq, _0.fdt, _0.fnm]
[junit4:junit4]   2> 926 T2141 C94 oasc.SolrDeletionPolicy.updateCommits newest commit = 2
[junit4:junit4]   2> 926 T2141 C94 oass.SolrIndexSearcher.<init> Opening Searcher@15e14d67 main
[junit4:junit4]   2> 926 T2141 C94 oass.SolrIndexSearcher.getIndexDir WARNING WARNING: Directory impl does not support setting indexDir: org.apache.lucene.store.MockDirectoryWrapper
[junit4:junit4]   2> 927 T2141 C94 oasu.DirectUpdateHandler2.commit end_commit_flush
[junit4:junit4]   2> 927 T2148 oasc.SolrCore.registerSearcher [collection1] Registered new searcher Searcher@15e14d67 main{StandardDirectoryReader(segments_2:4 _0(4.0.0.1):C2)}
[junit4:junit4]   2> 927 T2141 C94 UPDATE [collection1] webapp=/solr path=/update params={commit=true&version=2&softCommit=false&waitSearcher=true&wt=javabin} {commit=} 0 3
[junit4:junit4]   2> 929 T2151 C95 oasu.DirectUpdateHandler2.commit start commit{flags=0,_version_=0,optimize=false,openSearcher=true,waitSearcher=true,expungeDeletes=false,softCommit=false}
[junit4:junit4]   2> 929 T2151 C95 oasc.SolrDeletionPolicy.onCommit SolrDeletionPolicy.onCommit: commits:num=2
[junit4:junit4]   2> 		commit{dir=MockDirWrapper(org.apache.lucene.store.RAMDirectory@3a7b058e lockFactory=org.apache.lucene.store.SingleInstanceLockFactory@7977a7fa),segFN=segments_1,generation=1,filenames=[segments_1]
[junit4:junit4]   2> 		commit{dir=MockDirWrapper(org.apache.lucene.store.RAMDirectory@3a7b058e lockFactory=org.apache.lucene.store.SingleInstanceLockFactory@7977a7fa),segFN=segments_2,generation=2,filenames=[segments_2, _0.tis, _0.prx, _0.tii, _0.nrm, _0.si, _0.fdx, _0.frq, _0.fdt, _0.fnm]
[junit4:junit4]   2> 930 T2151 C95 oasc.SolrDeletionPolicy.updateCommits newest commit = 2
[junit4:junit4]   2> 930 T2151 C95 oass.SolrIndexSearcher.<init> Opening Searcher@1ccce215 main
[junit4:junit4]   2> 930 T2151 C95 oass.SolrIndexSearcher.getIndexDir WARNING WARNING: Directory impl does not support setting indexDir: org.apache.lucene.store.MockDirectoryWrapper
[junit4:junit4]   2> 931 T2151 C95 oasu.DirectUpdateHandler2.commit end_commit_flush
[junit4:junit4]   2> 931 T2158 oasc.SolrCore.registerSearcher [collection1] Registered new searcher Searcher@1ccce215 main{StandardDirectoryReader(segments_2:4 _0(4.0.0.1):C2)}
[junit4:junit4]   2> 931 T2151 C95 UPDATE [collection1] webapp=/solr path=/update params={commit=true&version=2&softCommit=false&waitSearcher=true&wt=javabin} {commit=} 0 2
[junit4:junit4]   2> 933 T2161 C96 oasu.DirectUpdateHandler2.commit start commit{flags=0,_version_=0,optimize=false,openSearcher=true,waitSearcher=true,expungeDeletes=false,softCommit=false}
[junit4:junit4]   2> 934 T2161 C96 oasc.SolrDeletionPolicy.onCommit SolrDeletionPolicy.onCommit: commits:num=2
[junit4:junit4]   2> 		commit{dir=BaseDirectoryWrapper(org.apache.lucene.store.RAMDirectory@2e12ccc3 lockFactory=org.apache.lucene.store.SingleInstanceLockFactory@54412dd6),segFN=segments_1,generation=1,filenames=[segments_1]
[junit4:junit4]   2> 		commit{dir=BaseDirectoryWrapper(org.apache.lucene.store.RAMDirectory@2e12ccc3 lockFactory=org.apache.lucene.store.SingleInstanceLockFactory@54412dd6),segFN=segments_2,generation=2,filenames=[segments_2, _0.tis, _0.prx, _0.tii, _0.nrm, _0.si, _0.fdx, _0.frq, _0.fdt, _0.fnm]
[junit4:junit4]   2> 934 T2161 C96 oasc.SolrDeletionPolicy.updateCommits newest commit = 2
[junit4:junit4]   2> 935 T2161 C96 oass.SolrIndexSearcher.<init> Opening Searcher@3dbc3890 main
[junit4:junit4]   2> 935 T2161 C96 oass.SolrIndexSearcher.getIndexDir WARNING WARNING: Directory impl does not support setting indexDir: org.apache.lucene.store.BaseDirectoryWrapper
[junit4:junit4]   2> 936 T2161 C96 oasu.DirectUpdateHandler2.commit end_commit_flush
[junit4:junit4]   2> 936 T2168 oasc.SolrCore.registerSearcher [collection1] Registered new searcher Searcher@3dbc3890 main{StandardDirectoryReader(segments_2:4 _0(4.0.0.1):C3)}
[junit4:junit4]   2> 937 T2161 C96 UPDATE [collection1] webapp=/solr path=/update params={commit=true&version=2&softCommit=false&waitSearcher=true&wt=javabin} {commit=} 0 4
[junit4:junit4]   2> 940 T2131 C93 REQ [collection1] webapp=/solr path=/elevate params={fl=id,+score,+[elevated]&version=2&rows=500&wt=javabin&distrib=false&q=*:*&shards.qt=/elevate&sort=id+desc&qt=/elevate} hits=7 status=0 QTime=1 
[junit4:junit4]   2> 946 T2152 C95 REQ [collection1] webapp=/solr path=/elevate params={start=0&version=2&rows=500&distrib=false&fsv=true&shards.qt=/elevate&NOW=1343866612920&isShard=true&fl=id,score&wt=javabin&q=*:*&sort=id+desc&qt=/elevate&shard.url=localhost:39667/solr} hits=2 status=0 QTime=1 
[junit4:junit4]   2> 946 T2162 C96 REQ [collection1] webapp=/solr path=/elevate params={start=0&version=2&rows=500&distrib=false&fsv=true&shards.qt=/elevate&NOW=1343866612920&isShard=true&fl=id,score&wt=javabin&q=*:*&sort=id+desc&qt=/elevate&shard.url=localhost:38308/solr|[::1]:33332/solr} hits=3 status=0 QTime=1 
[junit4:junit4]   2> 954 T2142 C94 REQ [collection1] webapp=/solr path=/elevate params={start=0&version=2&rows=500&distrib=false&fsv=true&shards.qt=/elevate&NOW=1343866612920&isShard=true&fl=id,score&wt=javabin&q=*:*&sort=id+desc&qt=/elevate&shard.url=[::1]:33332/solr|localhost:38161/solr} hits=2 status=0 QTime=0 
[junit4:junit4]   2> 958 T2142 C94 REQ [collection1] webapp=/solr path=/elevate params={version=2&rows=500&distrib=false&shards.qt=/elevate&isShard=true&NOW=1343866612920&fl=id,+score,+[elevated]&wt=javabin&q=*:*&qt=/elevate&shard.url=[::1]:33332/solr|localhost:38161/solr&ids=1.0,4.0} status=0 QTime=1 
[junit4:junit4]   2> 958 T2152 C95 REQ [collection1] webapp=/solr path=/elevate params={version=2&rows=500&distrib=false&shards.qt=/elevate&isShard=true&NOW=1343866612920&fl=id,+score,+[elevated]&wt=javabin&q=*:*&qt=/elevate&shard.url=localhost:39667/solr&ids=2.0,5.0} status=0 QTime=1 
[junit4:junit4]   2> 958 T2162 C96 REQ [collection1] webapp=/solr path=/elevate params={version=2&rows=500&distrib=false&shards.qt=/elevate&isShard=true&NOW=1343866612920&fl=id,+score,+[elevated]&wt=javabin&q=*:*&qt=/elevate&shard.url=localhost:38308/solr|[::1]:33332/solr&ids=6.0,3.0,7.0} status=0 QTime=1 
[junit4:junit4]   2> 959 T2161 C96 REQ [collection1] webapp=/solr path=/elevate params={fl=id,+score,+[elevated]&version=2&rows=500&wt=javabin&q=*:*&shards.qt=/elevate&sort=id+desc&qt=/elevate&shards=[::1]:33332/solr|localhost:38161/solr,localhost:39667/solr,localhost:38308/solr|[::1]:33332/solr} status=0 QTime=17 
[junit4:junit4]   2> 963 T2128 oas.BaseDistributedSearchTestCase.compareResponses SEVERE Mismatched responses:
[junit4:junit4]   2> 	{responseHeader={status=0,QTime=17,params={fl=id, score, [elevated],version=2,rows=500,wt=javabin,q=*:*,shards.qt=/elevate,sort=id desc,qt=/elevate,shards=[::1]:33332/solr|localhost:38161/solr,localhost:39667/solr,localhost:38308/solr|[::1]:33332/solr}},response={numFound=7,start=0,maxScore=1.0,docs=[SolrDocument{id=7.0, [elevated]=false, score=1.0}, SolrDocument{id=6.0, [elevated]=false, score=1.0}, SolrDocument{id=5.0, [elevated]=false, score=1.0}, SolrDocument{id=4.0, [elevated]=false, score=1.0}, SolrDocument{id=3.0, [elevated]=false, score=1.0}, SolrDocument{id=2.0, [elevated]=false, score=1.0}, SolrDocument{id=1.0, [elevated]=false, score=1.0}]}}
[junit4:junit4]   2> 	{responseHeader={status=0,QTime=1,params={fl=id, score, [elevated],version=2,rows=500,wt=javabin,distrib=false,q=*:*,shards.qt=/elevate,sort=id desc,qt=/elevate}},response={numFound=7,start=0,maxScore=1.0,docs=[SolrDocument{id=7.0, score=1.0, [elevated]=false}, SolrDocument{id=6.0, score=1.0, [elevated]=false}, SolrDocument{id=5.0, score=1.0, [elevated]=false}, SolrDocument{id=4.0, score=1.0, [elevated]=false}, SolrDocument{id=3.0, score=1.0, [elevated]=false}, SolrDocument{id=2.0, score=1.0, [elevated]=false}, SolrDocument{id=1.0, score=1.0, [elevated]=false}]}}
[junit4:junit4]   2> 965 T2128 oasc.CoreContainer.shutdown Shutting down CoreContainer instance=1908607963
[junit4:junit4]   2> 965 T2128 oasc.SolrCore.close [collection1]  CLOSING SolrCore org.apache.solr.core.SolrCore@5c48ccd4
[junit4:junit4]   2> 966 T2128 oasc.SolrCore.closeSearcher [collection1] Closing main searcher on request.
[junit4:junit4]   2> 967 T2128 oasu.DirectUpdateHandler2.close closing DirectUpdateHandler2{commits=1,autocommits=0,soft autocommits=0,optimizes=0,rollbacks=0,expungeDeletes=0,docsPending=0,adds=0,deletesById=0,deletesByQuery=0,errors=0,cumulative_adds=7,cumulative_deletesById=0,cumulative_deletesByQuery=1,cumulative_errors=0}
[junit4:junit4]   2> 972 T2128 oejsh.ContextHandler.doStop stopped o.e.j.s.ServletContextHandler{/solr,null}
[junit4:junit4]   2> 1024 T2128 oasc.CoreContainer.shutdown Shutting down CoreContainer instance=542164306
[junit4:junit4]   2> 1024 T2128 oasc.SolrCore.close [collection1]  CLOSING SolrCore org.apache.solr.core.SolrCore@1124eb13
[junit4:junit4]   2> 1025 T2128 oasc.SolrCore.closeSearcher [collection1] Closing main searcher on request.
[junit4:junit4]   2> 1025 T2128 oasu.DirectUpdateHandler2.close closing DirectUpdateHandler2{commits=1,autocommits=0,soft autocommits=0,optimizes=0,rollbacks=0,expungeDeletes=0,docsPending=0,adds=0,deletesById=0,deletesByQuery=0,errors=0,cumulative_adds=2,cumulative_deletesById=0,cumulative_deletesByQuery=1,cumulative_errors=0}
[junit4:junit4]   2> 1029 T2128 oejsh.ContextHandler.doStop stopped o.e.j.s.ServletContextHandler{/solr,null}
[junit4:junit4]   2> 1080 T2128 oasc.CoreContainer.shutdown Shutting down CoreContainer instance=914597961
[junit4:junit4]   2> 1081 T2128 oasc.SolrCore.close [collection1]  CLOSING SolrCore org.apache.solr.core.SolrCore@6e8a4fc4
[junit4:junit4]   2> 1081 T2128 oasc.SolrCore.closeSearcher [collection1] Closing main searcher on request.
[junit4:junit4]   2> 1082 T2128 oasu.DirectUpdateHandler2.close closing DirectUpdateHandler2{commits=1,autocommits=0,soft autocommits=0,optimizes=0,rollbacks=0,expungeDeletes=0,docsPending=0,adds=0,deletesById=0,deletesByQuery=0,errors=0,cumulative_adds=2,cumulative_deletesById=0,cumulative_deletesByQuery=1,cumulative_errors=0}
[junit4:junit4]   2> 1085 T2128 oejsh.ContextHandler.doStop stopped o.e.j.s.ServletContextHandler{/solr,null}
[junit4:junit4]   2> 1137 T2128 oasc.CoreContainer.shutdown Shutting down CoreContainer instance=644605453
[junit4:junit4]   2> 1137 T2128 oasc.SolrCore.close [collection1]  CLOSING SolrCore org.apache.solr.core.SolrCore@6fa0ecae
[junit4:junit4]   2> 1138 T2128 oasc.SolrCore.closeSearcher [collection1] Closing main searcher on request.
[junit4:junit4]   2> 1138 T2128 oasu.DirectUpdateHandler2.close closing DirectUpdateHandler2{commits=1,autocommits=0,soft autocommits=0,optimizes=0,rollbacks=0,expungeDeletes=0,docsPending=0,adds=0,deletesById=0,deletesByQuery=0,errors=0,cumulative_adds=3,cumulative_deletesById=0,cumulative_deletesByQuery=1,cumulative_errors=0}
[junit4:junit4]   2> 1143 T2128 oejsh.ContextHandler.doStop stopped o.e.j.s.ServletContextHandler{/solr,null}
[junit4:junit4]   2> 1194 T2128 oas.SolrTestCaseJ4.tearDown ###Ending testDistribSearch
[junit4:junit4]   2> NOTE: reproduce with: ant test  -Dtestcase=DistributedQueryElevationComponentTest -Dtests.method=testDistribSearch -Dtests.seed=FD27BCB165D28FAF -Dtests.multiplier=3 -Dtests.slow=true -Dtests.locale=es_CL -Dtests.timezone=Europe/Sofia -Dtests.file.encoding=US-ASCII
[junit4:junit4]   2>
[junit4:junit4]    > (@AfterClass output)
[junit4:junit4]   2> 1211 T2128 oas.SolrTestCaseJ4.deleteCore ###deleteCore
[junit4:junit4]   2> NOTE: test params are: codec=Lucene3x, sim=RandomSimilarityProvider(queryNorm=true,coord=false): {}, locale=es_CL, timezone=Europe/Sofia
[junit4:junit4]   2> NOTE: Linux 3.2.0-27-generic amd64/Oracle Corporation 1.8.0-ea (64-bit)/cpus=8,threads=1,free=140489584,total=280625152
[junit4:junit4]   2> NOTE: All tests run in this JVM: [OverseerTest, TestHashPartitioner, BadIndexSchemaTest, TestStressReorder, TestStressLucene, UpdateParamsTest, CircularListTest, TestOmitPositions, DisMaxRequestHandlerTest, MultiTermTest, PrimitiveFieldTypeTest, TestPropInjectDefaults, LegacyHTMLStripCharFilterTest, TestFoldingMultitermQuery, TestFaceting, TestTrie, IndexSchemaTest, QueryEqualityTest, TestBinaryField, SuggesterTSTTest, TestPhraseSuggestions, SuggesterWFSTTest, TestCSVResponseWriter, DirectUpdateHandlerOptimizeTest, RequiredFieldsTest, TestPHPSerializedResponseWriter, TestCodecSupport, FileUtilsTest, TestSolrDeletionPolicy2, TestFunctionQuery, URLClassifyProcessorTest, TestArbitraryIndexDir, IndexBasedSpellCheckerTest, OutputWriterTest, TestReload, TestMergePolicyConfig, ZkControllerTest, TestRealTimeGet, TestUpdate, BasicZkTest, SyncSliceTest, DebugComponentTest, DocumentBuilderTest, UUIDFieldTest, HighlighterTest, TestFiltering, TestSolrCoreProperties, StatsComponentTest, FullSolrCloudTest, SampleTest, SolrIndexConfigTest, DistributedQueryElevationComponentTest]
[junit4:junit4]   2> 
[junit4:junit4] Completed on J1 in 1.22s, 1 test, 1 failure <<< FAILURES!

[...truncated 347 lines...]
BUILD FAILED
/mnt/ssd/jenkins/workspace/Lucene-Solr-4.x-Linux/checkout/build.xml:29: The following error occurred while executing this line:
/mnt/ssd/jenkins/workspace/Lucene-Solr-4.x-Linux/checkout/solr/build.xml:144: The following error occurred while executing this line:
/mnt/ssd/jenkins/workspace/Lucene-Solr-4.x-Linux/checkout/lucene/module-build.xml:62: The following error occurred while executing this line:
/mnt/ssd/jenkins/workspace/Lucene-Solr-4.x-Linux/checkout/lucene/common-build.xml:1095: The following error occurred while executing this line:
/mnt/ssd/jenkins/workspace/Lucene-Solr-4.x-Linux/checkout/lucene/common-build.xml:790: There were test failures: 224 suites, 903 tests, 1 failure, 6 ignored (1 assumption)

Total time: 19 minutes 17 seconds
Build step 'Execute shell' marked build as failure
Archiving artifacts
Recording test results
Email was triggered for: Failure
Sending email for trigger: Failure



Mime
View raw message