lucene-dev mailing list archives

Site index · List index
Message view « Date » · « Thread »
Top « Date » · « Thread »
From Policeman Jenkins Server <jenk...@sd-datasolutions.de>
Subject [JENKINS] Lucene-Solr-trunk-Linux (64bit/jdk1.8.0-ea-b49) - Build # 69 - Failure!
Date Wed, 01 Aug 2012 01:09:28 GMT
Build: http://jenkins.sd-datasolutions.de/job/Lucene-Solr-trunk-Linux/69/
Java: 64bit/jdk1.8.0-ea-b49 -XX:+UseG1GC

1 tests failed.
REGRESSION:  org.apache.solr.handler.component.DistributedQueryElevationComponentTest.testDistribSearch

Error Message:
.responseHeader.params.shards:localhost:35495/solr,localhost:33958/solr,localhost:44204/solr!=false

Stack Trace:
junit.framework.AssertionFailedError: .responseHeader.params.shards:localhost:35495/solr,localhost:33958/solr,localhost:44204/solr!=false
	at __randomizedtesting.SeedInfo.seed([5FFE58FE1E60FA4E:DE18D6E6693F9A72]:0)
	at junit.framework.Assert.fail(Assert.java:50)
	at org.apache.solr.BaseDistributedSearchTestCase.compareResponses(BaseDistributedSearchTestCase.java:670)
	at org.apache.solr.BaseDistributedSearchTestCase.query(BaseDistributedSearchTestCase.java:392)
	at org.apache.solr.handler.component.DistributedQueryElevationComponentTest.doTest(DistributedQueryElevationComponentTest.java:81)
	at org.apache.solr.BaseDistributedSearchTestCase.testDistribSearch(BaseDistributedSearchTestCase.java:679)
	at sun.reflect.NativeMethodAccessorImpl.invoke0(Native Method)
	at sun.reflect.NativeMethodAccessorImpl.invoke(NativeMethodAccessorImpl.java:57)
	at sun.reflect.DelegatingMethodAccessorImpl.invoke(DelegatingMethodAccessorImpl.java:43)
	at java.lang.reflect.Method.invoke(Method.java:474)
	at com.carrotsearch.randomizedtesting.RandomizedRunner.invoke(RandomizedRunner.java:1995)
	at com.carrotsearch.randomizedtesting.RandomizedRunner.access$1100(RandomizedRunner.java:132)
	at com.carrotsearch.randomizedtesting.RandomizedRunner$6.evaluate(RandomizedRunner.java:818)
	at com.carrotsearch.randomizedtesting.RandomizedRunner$7.evaluate(RandomizedRunner.java:877)
	at com.carrotsearch.randomizedtesting.RandomizedRunner$8.evaluate(RandomizedRunner.java:891)
	at com.carrotsearch.randomizedtesting.rules.SystemPropertiesRestoreRule$1.evaluate(SystemPropertiesRestoreRule.java:53)
	at org.apache.lucene.util.TestRuleSetupTeardownChained$1.evaluate(TestRuleSetupTeardownChained.java:50)
	at org.apache.lucene.util.TestRuleFieldCacheSanity$1.evaluate(TestRuleFieldCacheSanity.java:32)
	at org.apache.lucene.util.AbstractBeforeAfterRule$1.evaluate(AbstractBeforeAfterRule.java:45)
	at com.carrotsearch.randomizedtesting.rules.SystemPropertiesInvariantRule$1.evaluate(SystemPropertiesInvariantRule.java:55)
	at org.apache.lucene.util.TestRuleReportUncaughtExceptions$1.evaluate(TestRuleReportUncaughtExceptions.java:68)
	at org.apache.lucene.util.TestRuleThreadAndTestName$1.evaluate(TestRuleThreadAndTestName.java:48)
	at org.apache.lucene.util.TestRuleIgnoreAfterMaxFailures$1.evaluate(TestRuleIgnoreAfterMaxFailures.java:70)
	at org.apache.lucene.util.TestRuleMarkFailure$1.evaluate(TestRuleMarkFailure.java:48)
	at com.carrotsearch.randomizedtesting.RandomizedRunner.runSingleTest(RandomizedRunner.java:825)
	at com.carrotsearch.randomizedtesting.RandomizedRunner.access$700(RandomizedRunner.java:132)
	at com.carrotsearch.randomizedtesting.RandomizedRunner$3$1.run(RandomizedRunner.java:671)
	at com.carrotsearch.randomizedtesting.RandomizedRunner$3.evaluate(RandomizedRunner.java:697)
	at com.carrotsearch.randomizedtesting.RandomizedRunner$4.evaluate(RandomizedRunner.java:736)
	at com.carrotsearch.randomizedtesting.RandomizedRunner$5.evaluate(RandomizedRunner.java:747)
	at com.carrotsearch.randomizedtesting.rules.SystemPropertiesRestoreRule$1.evaluate(SystemPropertiesRestoreRule.java:53)
	at org.apache.lucene.util.AbstractBeforeAfterRule$1.evaluate(AbstractBeforeAfterRule.java:45)
	at org.apache.lucene.util.TestRuleReportUncaughtExceptions$1.evaluate(TestRuleReportUncaughtExceptions.java:68)
	at org.apache.lucene.util.TestRuleStoreClassName$1.evaluate(TestRuleStoreClassName.java:38)
	at com.carrotsearch.randomizedtesting.rules.SystemPropertiesInvariantRule$1.evaluate(SystemPropertiesInvariantRule.java:55)
	at org.apache.lucene.util.TestRuleNoInstanceHooksOverrides$1.evaluate(TestRuleNoInstanceHooksOverrides.java:53)
	at org.apache.lucene.util.TestRuleNoStaticHooksShadowing$1.evaluate(TestRuleNoStaticHooksShadowing.java:52)
	at org.apache.lucene.util.TestRuleAssertionsRequired$1.evaluate(TestRuleAssertionsRequired.java:36)
	at org.apache.lucene.util.TestRuleMarkFailure$1.evaluate(TestRuleMarkFailure.java:48)
	at org.apache.lucene.util.TestRuleIgnoreAfterMaxFailures$1.evaluate(TestRuleIgnoreAfterMaxFailures.java:70)
	at org.apache.lucene.util.TestRuleIgnoreTestSuites$1.evaluate(TestRuleIgnoreTestSuites.java:55)
	at com.carrotsearch.randomizedtesting.RandomizedRunner.runSuite(RandomizedRunner.java:605)
	at com.carrotsearch.randomizedtesting.RandomizedRunner.access$400(RandomizedRunner.java:132)
	at com.carrotsearch.randomizedtesting.RandomizedRunner$2.run(RandomizedRunner.java:551)




Build Log:
[...truncated 7536 lines...]
[junit4:junit4] Suite: org.apache.solr.handler.component.DistributedQueryElevationComponentTest
[junit4:junit4] FAILURE 1.40s J0 | DistributedQueryElevationComponentTest.testDistribSearch
[junit4:junit4]    > Throwable #1: junit.framework.AssertionFailedError: .responseHeader.params.shards:localhost:35495/solr,localhost:33958/solr,localhost:44204/solr!=false
[junit4:junit4]    > 	at __randomizedtesting.SeedInfo.seed([5FFE58FE1E60FA4E:DE18D6E6693F9A72]:0)
[junit4:junit4]    > 	at junit.framework.Assert.fail(Assert.java:50)
[junit4:junit4]    > 	at org.apache.solr.BaseDistributedSearchTestCase.compareResponses(BaseDistributedSearchTestCase.java:670)
[junit4:junit4]    > 	at org.apache.solr.BaseDistributedSearchTestCase.query(BaseDistributedSearchTestCase.java:392)
[junit4:junit4]    > 	at org.apache.solr.handler.component.DistributedQueryElevationComponentTest.doTest(DistributedQueryElevationComponentTest.java:81)
[junit4:junit4]    > 	at org.apache.solr.BaseDistributedSearchTestCase.testDistribSearch(BaseDistributedSearchTestCase.java:679)
[junit4:junit4]    > 	at sun.reflect.NativeMethodAccessorImpl.invoke0(Native Method)
[junit4:junit4]    > 	at sun.reflect.NativeMethodAccessorImpl.invoke(NativeMethodAccessorImpl.java:57)
[junit4:junit4]    > 	at sun.reflect.DelegatingMethodAccessorImpl.invoke(DelegatingMethodAccessorImpl.java:43)
[junit4:junit4]    > 	at java.lang.reflect.Method.invoke(Method.java:474)
[junit4:junit4]    > 	at com.carrotsearch.randomizedtesting.RandomizedRunner.invoke(RandomizedRunner.java:1995)
[junit4:junit4]    > 	at com.carrotsearch.randomizedtesting.RandomizedRunner.access$1100(RandomizedRunner.java:132)
[junit4:junit4]    > 	at com.carrotsearch.randomizedtesting.RandomizedRunner$6.evaluate(RandomizedRunner.java:818)
[junit4:junit4]    > 	at com.carrotsearch.randomizedtesting.RandomizedRunner$7.evaluate(RandomizedRunner.java:877)
[junit4:junit4]    > 	at com.carrotsearch.randomizedtesting.RandomizedRunner$8.evaluate(RandomizedRunner.java:891)
[junit4:junit4]    > 	at com.carrotsearch.randomizedtesting.rules.SystemPropertiesRestoreRule$1.evaluate(SystemPropertiesRestoreRule.java:53)
[junit4:junit4]    > 	at org.apache.lucene.util.TestRuleSetupTeardownChained$1.evaluate(TestRuleSetupTeardownChained.java:50)
[junit4:junit4]    > 	at org.apache.lucene.util.TestRuleFieldCacheSanity$1.evaluate(TestRuleFieldCacheSanity.java:32)
[junit4:junit4]    > 	at org.apache.lucene.util.AbstractBeforeAfterRule$1.evaluate(AbstractBeforeAfterRule.java:45)
[junit4:junit4]    > 	at com.carrotsearch.randomizedtesting.rules.SystemPropertiesInvariantRule$1.evaluate(SystemPropertiesInvariantRule.java:55)
[junit4:junit4]    > 	at org.apache.lucene.util.TestRuleReportUncaughtExceptions$1.evaluate(TestRuleReportUncaughtExceptions.java:68)
[junit4:junit4]    > 	at org.apache.lucene.util.TestRuleThreadAndTestName$1.evaluate(TestRuleThreadAndTestName.java:48)
[junit4:junit4]    > 	at org.apache.lucene.util.TestRuleIgnoreAfterMaxFailures$1.evaluate(TestRuleIgnoreAfterMaxFailures.java:70)
[junit4:junit4]    > 	at org.apache.lucene.util.TestRuleMarkFailure$1.evaluate(TestRuleMarkFailure.java:48)
[junit4:junit4]    > 	at com.carrotsearch.randomizedtesting.RandomizedRunner.runSingleTest(RandomizedRunner.java:825)
[junit4:junit4]    > 	at com.carrotsearch.randomizedtesting.RandomizedRunner.access$700(RandomizedRunner.java:132)
[junit4:junit4]    > 	at com.carrotsearch.randomizedtesting.RandomizedRunner$3$1.run(RandomizedRunner.java:671)
[junit4:junit4]    > 	at com.carrotsearch.randomizedtesting.RandomizedRunner$3.evaluate(RandomizedRunner.java:697)
[junit4:junit4]    > 	at com.carrotsearch.randomizedtesting.RandomizedRunner$4.evaluate(RandomizedRunner.java:736)
[junit4:junit4]    > 	at com.carrotsearch.randomizedtesting.RandomizedRunner$5.evaluate(RandomizedRunner.java:747)
[junit4:junit4]    > 	at com.carrotsearch.randomizedtesting.rules.SystemPropertiesRestoreRule$1.evaluate(SystemPropertiesRestoreRule.java:53)
[junit4:junit4]    > 	at org.apache.lucene.util.AbstractBeforeAfterRule$1.evaluate(AbstractBeforeAfterRule.java:45)
[junit4:junit4]    > 	at org.apache.lucene.util.TestRuleReportUncaughtExceptions$1.evaluate(TestRuleReportUncaughtExceptions.java:68)
[junit4:junit4]    > 	at org.apache.lucene.util.TestRuleStoreClassName$1.evaluate(TestRuleStoreClassName.java:38)
[junit4:junit4]    > 	at com.carrotsearch.randomizedtesting.rules.SystemPropertiesInvariantRule$1.evaluate(SystemPropertiesInvariantRule.java:55)
[junit4:junit4]    > 	at org.apache.lucene.util.TestRuleNoInstanceHooksOverrides$1.evaluate(TestRuleNoInstanceHooksOverrides.java:53)
[junit4:junit4]    > 	at org.apache.lucene.util.TestRuleNoStaticHooksShadowing$1.evaluate(TestRuleNoStaticHooksShadowing.java:52)
[junit4:junit4]    > 	at org.apache.lucene.util.TestRuleAssertionsRequired$1.evaluate(TestRuleAssertionsRequired.java:36)
[junit4:junit4]    > 	at org.apache.lucene.util.TestRuleMarkFailure$1.evaluate(TestRuleMarkFailure.java:48)
[junit4:junit4]    > 	at org.apache.lucene.util.TestRuleIgnoreAfterMaxFailures$1.evaluate(TestRuleIgnoreAfterMaxFailures.java:70)
[junit4:junit4]    > 	at org.apache.lucene.util.TestRuleIgnoreTestSuites$1.evaluate(TestRuleIgnoreTestSuites.java:55)
[junit4:junit4]    > 	at com.carrotsearch.randomizedtesting.RandomizedRunner.runSuite(RandomizedRunner.java:605)
[junit4:junit4]    > 	at com.carrotsearch.randomizedtesting.RandomizedRunner.access$400(RandomizedRunner.java:132)
[junit4:junit4]    > 	at com.carrotsearch.randomizedtesting.RandomizedRunner$2.run(RandomizedRunner.java:551)
[junit4:junit4]    > 
[junit4:junit4]   2> 1 T7038 oas.SolrTestCaseJ4.setUp ###Starting testDistribSearch
[junit4:junit4]   2> 2 T7038 oejs.Server.doStart jetty-8.1.2.v20120308
[junit4:junit4]   2> 4 T7038 oejs.AbstractConnector.doStart Started SocketConnector@0.0.0.0:43524
[junit4:junit4]   2> 5 T7038 oasc.SolrResourceLoader.locateSolrHome JNDI not configured for solr (NoInitialContextEx)
[junit4:junit4]   2> 5 T7038 oasc.SolrResourceLoader.locateSolrHome using system property solr.solr.home: /mnt/ssd/jenkins/workspace/Lucene-Solr-trunk-Linux/checkout/solr/build/solr-core/test-files/solr
[junit4:junit4]   2> 5 T7038 oasc.SolrResourceLoader.<init> new SolrResourceLoader for deduced Solr Home: '/mnt/ssd/jenkins/workspace/Lucene-Solr-trunk-Linux/checkout/solr/build/solr-core/test-files/solr/'
[junit4:junit4]   2> 13 T7038 oass.SolrDispatchFilter.init SolrDispatchFilter.init()
[junit4:junit4]   2> 13 T7038 oasc.SolrResourceLoader.locateSolrHome JNDI not configured for solr (NoInitialContextEx)
[junit4:junit4]   2> 13 T7038 oasc.SolrResourceLoader.locateSolrHome using system property solr.solr.home: /mnt/ssd/jenkins/workspace/Lucene-Solr-trunk-Linux/checkout/solr/build/solr-core/test-files/solr
[junit4:junit4]   2> 14 T7038 oasc.CoreContainer$Initializer.initialize looking for solr.xml: /mnt/ssd/jenkins/workspace/Lucene-Solr-trunk-Linux/checkout/solr/build/solr-core/test-files/solr/solr.xml
[junit4:junit4]   2> 14 T7038 oasc.CoreContainer.<init> New CoreContainer 1430475293
[junit4:junit4]   2> 14 T7038 oasc.CoreContainer.load Loading CoreContainer using Solr Home: '/mnt/ssd/jenkins/workspace/Lucene-Solr-trunk-Linux/checkout/solr/build/solr-core/test-files/solr/'
[junit4:junit4]   2> 14 T7038 oasc.SolrResourceLoader.<init> new SolrResourceLoader for directory: '/mnt/ssd/jenkins/workspace/Lucene-Solr-trunk-Linux/checkout/solr/build/solr-core/test-files/solr/'
[junit4:junit4]   2> 24 T7038 oasc.CoreContainer.load Registering Log Listener
[junit4:junit4]   2> 33 T7038 oasc.CoreContainer.create Creating SolrCore 'collection1' using instanceDir: /mnt/ssd/jenkins/workspace/Lucene-Solr-trunk-Linux/checkout/solr/build/solr-core/test-files/solr/collection1
[junit4:junit4]   2> 34 T7038 oasc.SolrResourceLoader.<init> new SolrResourceLoader for directory: '/mnt/ssd/jenkins/workspace/Lucene-Solr-trunk-Linux/checkout/solr/build/solr-core/test-files/solr/collection1/'
[junit4:junit4]   2> 34 T7038 oasc.SolrResourceLoader.replaceClassLoader Adding 'file:/mnt/ssd/jenkins/workspace/Lucene-Solr-trunk-Linux/checkout/solr/build/solr-core/test-files/solr/collection1/lib/README' to classloader
[junit4:junit4]   2> 34 T7038 oasc.SolrResourceLoader.replaceClassLoader Adding 'file:/mnt/ssd/jenkins/workspace/Lucene-Solr-trunk-Linux/checkout/solr/build/solr-core/test-files/solr/collection1/lib/classes/' to classloader
[junit4:junit4]   2> 53 T7038 oasc.SolrConfig.<init> Using Lucene MatchVersion: LUCENE_50
[junit4:junit4]   2> 80 T7038 oasc.SolrConfig.<init> Loaded SolrConfig: solrconfig-elevate.xml
[junit4:junit4]   2> 81 T7038 oass.IndexSchema.readSchema Reading Solr Schema
[junit4:junit4]   2> 83 T7038 oass.IndexSchema.readSchema Schema name=example
[junit4:junit4]   2> 192 T7038 oass.IndexSchema.readSchema default search field in schema is text
[junit4:junit4]   2> 193 T7038 oass.IndexSchema.readSchema unique key field: id
[junit4:junit4]   2> 195 T7038 oasc.SolrCore.<init> [collection1] Opening new SolrCore at /mnt/ssd/jenkins/workspace/Lucene-Solr-trunk-Linux/checkout/solr/build/solr-core/test-files/solr/collection1/, dataDir=./org.apache.solr.handler.component.DistributedQueryElevationComponentTest-1343783295361/control/data/
[junit4:junit4]   2> 196 T7038 oasc.JmxMonitoredMap.<init> JMX monitoring is enabled. Adding Solr mbeans to JMX Server: com.sun.jmx.mbeanserver.JmxMBeanServer@5065c5ab
[junit4:junit4]   2> 196 T7038 oasc.SolrCore.getNewIndexDir WARNING New index directory detected: old=null new=./org.apache.solr.handler.component.DistributedQueryElevationComponentTest-1343783295361/control/data/index/
[junit4:junit4]   2> 196 T7038 oasc.SolrCore.initIndex WARNING [collection1] Solr index directory './org.apache.solr.handler.component.DistributedQueryElevationComponentTest-1343783295361/control/data/index' doesn't exist. Creating new index...
[junit4:junit4]   2> 197 T7038 oasc.SolrDeletionPolicy.onCommit SolrDeletionPolicy.onCommit: commits:num=1
[junit4:junit4]   2> 		commit{dir=MockDirWrapper(org.apache.lucene.store.RAMDirectory@1250f642 lockFactory=org.apache.lucene.store.SingleInstanceLockFactory@13978eb5),segFN=segments_1,generation=1,filenames=[segments_1]
[junit4:junit4]   2> 198 T7038 oasc.SolrDeletionPolicy.updateCommits newest commit = 1
[junit4:junit4]   2> 199 T7038 oasc.RequestHandlers.initHandlersFromConfig created /update: solr.UpdateRequestHandler
[junit4:junit4]   2> 199 T7038 oasc.RequestHandlers.initHandlersFromConfig created /elevate: org.apache.solr.handler.component.SearchHandler
[junit4:junit4]   2> 199 T7038 oasc.RequestHandlers.initHandlersFromConfig created /dataElevate: org.apache.solr.handler.component.SearchHandler
[junit4:junit4]   2> 200 T7038 oashl.XMLLoader.init xsltCacheLifetimeSeconds=60
[junit4:junit4]   2> 200 T7038 oasc.RequestHandlers.initHandlersFromConfig WARNING no default request handler is registered (either '/select' or 'standard')
[junit4:junit4]   2> 201 T7038 oasc.SolrCore.initDeprecatedSupport WARNING solrconfig.xml uses deprecated <admin/gettableFiles>, Please update your config to use the ShowFileRequestHandler.
[junit4:junit4]   2> 202 T7038 oasc.SolrCore.initDeprecatedSupport WARNING adding ShowFileRequestHandler with hidden files: [SCHEMA12.XML, SOLRCONFIG-SCRIPT-UPDATEPROCESSOR.XML, OPEN-EXCHANGE-RATES.JSON, BAD-SCHEMA-UNIQUEKEY-IS-COPYFIELD-DEST.XML, SOLRCONFIG-MASTER.XML, SOLRCONFIG-SOLCOREPROPERTIES.XML, SCHEMA_CODEC.XML, SOLRCONFIG_CODEC.XML, BAD-SOLRCONFIG-BOGUS-SCRIPTENGINE-NAME.XML, MISSLEADING.EXTENSION.UPDATEPROCESSOR.JS.TXT, PHRASESUGGEST.TXT, SOLRCONFIG-XINCLUDE.XML, PROTWORDS.TXT, SCHEMA-BM25.XML, SCHEMA-TFIDF.XML, WDFTYPES.TXT, XSLT, COMPOUNDDICTIONARY.TXT, BAD-SCHEMA-ANALYZER-CLASS-AND-NESTED.XML, SOLRCONFIG-CACHING.XML, MAPPING-ISOLATIN1ACCENT.TXT, SOLRCONFIG-DELPOLICY1.XML, OLD_SYNONYMS.TXT, SOLRCONFIG-LAZYWRITER.XML, SCHEMA-NUMERIC.XML, SCHEMA-DFR.XML, SOLRCONFIG-PROPINJECT.XML, KEEP-1.TXT, BAD-MP-SOLRCONFIG.XML, SOLRCONFIG-REQHANDLER.INCL, SOLRCONFIG-QUERYSENDER-NOQUERY.XML, SOLRCONFIG-QUERYSENDER.XML, SOLRCONFIG-HIGHLIGHT.XML, BAD-SOLRCONFIG-INVALID-SCRIPTFILE.XML, SOLRCONFIG-NOCACHE.XML, SCHEMA11.XML, BAD-SCHEMA-CODEC-GLOBAL-VS-FT-MISMATCH.XML, SOLRCONFIG-NATIVELOCK.XML, SOLRCONFIG-TRANSFORMERS.XML, SOLRCONFIG-PHRASESUGGEST.XML, BAD-SCHEMA-EXTERNAL-FILEFIELD.XML, HUNSPELL-TEST.DIC, SOLRCONFIG-DELPOLICY2.XML, SOLRCONFIG-ENABLEPLUGIN.XML, SCHEMA-COPYFIELD-TEST.XML, SOLRCONFIG-ALTDIRECTORY.XML, SOLRCONFIG-FUNCTIONQUERY.XML, DA_UTF8.XML, SCHEMA-REPLICATION2.XML, SCHEMA-IB.XML, BAD_SOLRCONFIG.XML, SCHEMA-REQUIRED-FIELDS.XML, SCHEMA.XML, SOLRCONFIG-TLOG.XML, BAD-SCHEMA-UNIQUEKEY-MULTIVALUED.XML, SCHEMA-LMJELINEKMERCER.XML, SCHEMASURROUND.XML, SCHEMA-PHRASESUGGEST.XML, STOPWORDSWRONGENCODING.TXT, STOP-SNOWBALL.TXT, SOLRCONFIG-MERGEPOLICY.XML, SOLRCONFIG-MASTER1.XML, SOLRCONFIG-MASTER3.XML, SOLRCONFIG-SLAVE.XML, SOLRCONFIG-ELEVATE.XML, ADDFIELDS.UPDATEPROCESSOR.JS, STOPWORDS.TXT, BAD-SCHEMA-OMIT-TF-BUT-NOT-POS.XML, STOP-2.TXT, SCHEMA-BINARYFIELD.XML, SCHEMA-FOLDING.XML, HYPHENATION.DTD, TRIVIAL.UPDATEPROCESSOR1.JS, BAD-SCHEMA-NOT-INDEXED-BUT-NORMS.XML, BAD-SCHEMA-DUP-FIELDTYPE.XML, SCHEMA-REVERSED.XML, MISSING.FUNCTIONS.UPDATEPROCESSOR.JS, SOLRCONFIG-SIMPLELOCK.XML, SCHEMA-NOT-REQUIRED-UNIQUE-KEY.XML, SOLRCONFIG-REPEATER.XML, SYNONYMS.TXT, STOPWITHBOM.TXT, SOLRCONFIG-SOLR-749.XML, SCHEMA-SIM.XML, KEEP-2.TXT, BAD-SCHEMA-NOT-INDEXED-BUT-TF.XML, SCHEMA-TRIE.XML, SOLRCONFIG-SPELLCHECKER.XML, SCHEMA-SPELLCHECKER.XML, SCHEMA-LUCENEMATCHVERSION.XML, SOLRCONFIG_PERF.XML, CONDITIONAL.UPDATEPROCESSOR.JS, SOLRCONFIG-SLAVE1.XML, SCHEMA-REPLICATION1.XML, BAD-SCHEMA-SIM-GLOBAL-VS-FT-MISMATCH.XML, SOLRCONFIG-PROPINJECT-INDEXDEFAULT.XML, THROW.ERROR.ON.ADD.UPDATEPROCESSOR.JS, CURRENCY.XML, HUNSPELL-TEST.AFF, BAD-SCHEMA-NOT-INDEXED-BUT-POS.XML, SOLRCONFIG-BASIC.XML, SOLRCONFIG-TERMINDEX.XML, BAD-SCHEMA-DUP-FIELD.XML, SCHEMA-CHARFILTERS.XML, SOLRCONFIG-SPELLCHECKCOMPONENT.XML, SOLRCONFIG-MASTER2.XML, STOP-1.TXT, BAD-SCHEMA-NONTEXT-ANALYZER.XML, DA_COMPOUNDDICTIONARY.TXT, STOPTYPES-2.TXT, BAD-SCHEMA-DUP-DYNAMICFIELD.XML, BAD-SOLRCONFIG-MISSING-SCRIPTFILE.XML, SCHEMA-LMDIRICHLET.XML, FRENCHARTICLES.TXT, STOPTYPES-1.TXT, SCHEMA15.XML, SCHEMA-MINIMAL.XML, SCHEMA-STOP-KEEP.XML, BAD-SCHEMA-UNIQUEKEY-USES-DEFAULT.XML, STEMDICT.TXT, SCHEMA-COLLATE.XML, TRIVIAL.UPDATEPROCESSOR0.JS, ELEVATE.XML, SOLRCONFIG-UPDATE-PROCESSOR-CHAINS.XML, SOLRCONFIG-MASTER1-KEEPONEBACKUP.XML]
[junit4:junit4]   2> 203 T7038 oass.SolrIndexSearcher.<init> Opening Searcher@7b924f76 main
[junit4:junit4]   2> 203 T7038 oass.SolrIndexSearcher.getIndexDir WARNING WARNING: Directory impl does not support setting indexDir: org.apache.lucene.store.MockDirectoryWrapper
[junit4:junit4]   2> 204 T7038 oasu.CommitTracker.<init> Hard AutoCommit: disabled
[junit4:junit4]   2> 204 T7038 oasu.CommitTracker.<init> Soft AutoCommit: disabled
[junit4:junit4]   2> 204 T7038 oashc.QueryElevationComponent.inform Loading QueryElevation from: /mnt/ssd/jenkins/workspace/Lucene-Solr-trunk-Linux/checkout/solr/build/solr-core/test-files/solr/collection1/conf/elevate.xml
[junit4:junit4]   2> 210 T7038 oashc.QueryElevationComponent.inform Loading QueryElevation from: /mnt/ssd/jenkins/workspace/Lucene-Solr-trunk-Linux/checkout/solr/build/solr-core/test-files/solr/collection1/conf/elevate.xml
[junit4:junit4]   2> 215 T7038 oashc.HttpShardHandlerFactory.getParameter Setting socketTimeout to: 0
[junit4:junit4]   2> 216 T7038 oashc.HttpShardHandlerFactory.getParameter Setting urlScheme to: http://
[junit4:junit4]   2> 216 T7038 oashc.HttpShardHandlerFactory.getParameter Setting connTimeout to: 0
[junit4:junit4]   2> 216 T7038 oashc.HttpShardHandlerFactory.getParameter Setting maxConnectionsPerHost to: 20
[junit4:junit4]   2> 217 T7038 oashc.HttpShardHandlerFactory.getParameter Setting corePoolSize to: 0
[junit4:junit4]   2> 217 T7038 oashc.HttpShardHandlerFactory.getParameter Setting maximumPoolSize to: 2147483647
[junit4:junit4]   2> 217 T7038 oashc.HttpShardHandlerFactory.getParameter Setting maxThreadIdleTime to: 5
[junit4:junit4]   2> 217 T7038 oashc.HttpShardHandlerFactory.getParameter Setting sizeOfQueue to: -1
[junit4:junit4]   2> 218 T7038 oashc.HttpShardHandlerFactory.getParameter Setting fairnessPolicy to: false
[junit4:junit4]   2> 218 T7038 oascsi.HttpClientUtil.createClient Creating new http client, config:maxConnectionsPerHost=20&maxConnections=10000&socketTimeout=0&connTimeout=0&retry=false
[junit4:junit4]   2> 220 T7048 oasc.SolrCore.registerSearcher [collection1] Registered new searcher Searcher@7b924f76 main{StandardDirectoryReader(segments_1:1)}
[junit4:junit4]   2> 220 T7038 oasc.CoreContainer.register registering core: collection1
[junit4:junit4]   2> 221 T7038 oass.SolrDispatchFilter.init user.dir=/mnt/ssd/jenkins/workspace/Lucene-Solr-trunk-Linux/checkout/solr/build/solr-core/test/J0
[junit4:junit4]   2> 221 T7038 oass.SolrDispatchFilter.init SolrDispatchFilter.init() done
[junit4:junit4]   2> 221 T7038 oascsi.HttpClientUtil.createClient Creating new http client, config:maxConnections=128&maxConnectionsPerHost=32&followRedirects=false
[junit4:junit4]   2> 223 T7038 oejs.Server.doStart jetty-8.1.2.v20120308
[junit4:junit4]   2> 224 T7038 oejs.AbstractConnector.doStart Started SocketConnector@0.0.0.0:35495
[junit4:junit4]   2> 225 T7038 oasc.SolrResourceLoader.locateSolrHome JNDI not configured for solr (NoInitialContextEx)
[junit4:junit4]   2> 225 T7038 oasc.SolrResourceLoader.locateSolrHome using system property solr.solr.home: /mnt/ssd/jenkins/workspace/Lucene-Solr-trunk-Linux/checkout/solr/build/solr-core/test-files/solr
[junit4:junit4]   2> 226 T7038 oasc.SolrResourceLoader.<init> new SolrResourceLoader for deduced Solr Home: '/mnt/ssd/jenkins/workspace/Lucene-Solr-trunk-Linux/checkout/solr/build/solr-core/test-files/solr/'
[junit4:junit4]   2> 233 T7038 oass.SolrDispatchFilter.init SolrDispatchFilter.init()
[junit4:junit4]   2> 233 T7038 oasc.SolrResourceLoader.locateSolrHome JNDI not configured for solr (NoInitialContextEx)
[junit4:junit4]   2> 234 T7038 oasc.SolrResourceLoader.locateSolrHome using system property solr.solr.home: /mnt/ssd/jenkins/workspace/Lucene-Solr-trunk-Linux/checkout/solr/build/solr-core/test-files/solr
[junit4:junit4]   2> 234 T7038 oasc.CoreContainer$Initializer.initialize looking for solr.xml: /mnt/ssd/jenkins/workspace/Lucene-Solr-trunk-Linux/checkout/solr/build/solr-core/test-files/solr/solr.xml
[junit4:junit4]   2> 234 T7038 oasc.CoreContainer.<init> New CoreContainer 1296918623
[junit4:junit4]   2> 234 T7038 oasc.CoreContainer.load Loading CoreContainer using Solr Home: '/mnt/ssd/jenkins/workspace/Lucene-Solr-trunk-Linux/checkout/solr/build/solr-core/test-files/solr/'
[junit4:junit4]   2> 234 T7038 oasc.SolrResourceLoader.<init> new SolrResourceLoader for directory: '/mnt/ssd/jenkins/workspace/Lucene-Solr-trunk-Linux/checkout/solr/build/solr-core/test-files/solr/'
[junit4:junit4]   2> 246 T7038 oasc.CoreContainer.load Registering Log Listener
[junit4:junit4]   2> 259 T7038 oasc.CoreContainer.create Creating SolrCore 'collection1' using instanceDir: /mnt/ssd/jenkins/workspace/Lucene-Solr-trunk-Linux/checkout/solr/build/solr-core/test-files/solr/collection1
[junit4:junit4]   2> 260 T7038 oasc.SolrResourceLoader.<init> new SolrResourceLoader for directory: '/mnt/ssd/jenkins/workspace/Lucene-Solr-trunk-Linux/checkout/solr/build/solr-core/test-files/solr/collection1/'
[junit4:junit4]   2> 260 T7038 oasc.SolrResourceLoader.replaceClassLoader Adding 'file:/mnt/ssd/jenkins/workspace/Lucene-Solr-trunk-Linux/checkout/solr/build/solr-core/test-files/solr/collection1/lib/README' to classloader
[junit4:junit4]   2> 261 T7038 oasc.SolrResourceLoader.replaceClassLoader Adding 'file:/mnt/ssd/jenkins/workspace/Lucene-Solr-trunk-Linux/checkout/solr/build/solr-core/test-files/solr/collection1/lib/classes/' to classloader
[junit4:junit4]   2> 281 T7038 oasc.SolrConfig.<init> Using Lucene MatchVersion: LUCENE_50
[junit4:junit4]   2> 308 T7038 oasc.SolrConfig.<init> Loaded SolrConfig: solrconfig-elevate.xml
[junit4:junit4]   2> 309 T7038 oass.IndexSchema.readSchema Reading Solr Schema
[junit4:junit4]   2> 311 T7038 oass.IndexSchema.readSchema Schema name=example
[junit4:junit4]   2> 451 T7038 oass.IndexSchema.readSchema default search field in schema is text
[junit4:junit4]   2> 453 T7038 oass.IndexSchema.readSchema unique key field: id
[junit4:junit4]   2> 455 T7038 oasc.SolrCore.<init> [collection1] Opening new SolrCore at /mnt/ssd/jenkins/workspace/Lucene-Solr-trunk-Linux/checkout/solr/build/solr-core/test-files/solr/collection1/, dataDir=./org.apache.solr.handler.component.DistributedQueryElevationComponentTest-1343783295361/shard0/data/
[junit4:junit4]   2> 455 T7038 oasc.JmxMonitoredMap.<init> JMX monitoring is enabled. Adding Solr mbeans to JMX Server: com.sun.jmx.mbeanserver.JmxMBeanServer@5065c5ab
[junit4:junit4]   2> 455 T7038 oasc.SolrCore.getNewIndexDir WARNING New index directory detected: old=null new=./org.apache.solr.handler.component.DistributedQueryElevationComponentTest-1343783295361/shard0/data/index/
[junit4:junit4]   2> 456 T7038 oasc.SolrCore.initIndex WARNING [collection1] Solr index directory './org.apache.solr.handler.component.DistributedQueryElevationComponentTest-1343783295361/shard0/data/index' doesn't exist. Creating new index...
[junit4:junit4]   2> 457 T7038 oasc.SolrDeletionPolicy.onCommit SolrDeletionPolicy.onCommit: commits:num=1
[junit4:junit4]   2> 		commit{dir=MockDirWrapper(org.apache.lucene.store.RAMDirectory@621088f8 lockFactory=org.apache.lucene.store.SingleInstanceLockFactory@1ccf5364),segFN=segments_1,generation=1,filenames=[segments_1]
[junit4:junit4]   2> 457 T7038 oasc.SolrDeletionPolicy.updateCommits newest commit = 1
[junit4:junit4]   2> 458 T7038 oasc.RequestHandlers.initHandlersFromConfig created /update: solr.UpdateRequestHandler
[junit4:junit4]   2> 458 T7038 oasc.RequestHandlers.initHandlersFromConfig created /elevate: org.apache.solr.handler.component.SearchHandler
[junit4:junit4]   2> 459 T7038 oasc.RequestHandlers.initHandlersFromConfig created /dataElevate: org.apache.solr.handler.component.SearchHandler
[junit4:junit4]   2> 459 T7038 oashl.XMLLoader.init xsltCacheLifetimeSeconds=60
[junit4:junit4]   2> 459 T7038 oasc.RequestHandlers.initHandlersFromConfig WARNING no default request handler is registered (either '/select' or 'standard')
[junit4:junit4]   2> 460 T7038 oasc.SolrCore.initDeprecatedSupport WARNING solrconfig.xml uses deprecated <admin/gettableFiles>, Please update your config to use the ShowFileRequestHandler.
[junit4:junit4]   2> 461 T7038 oasc.SolrCore.initDeprecatedSupport WARNING adding ShowFileRequestHandler with hidden files: [SCHEMA12.XML, SOLRCONFIG-SCRIPT-UPDATEPROCESSOR.XML, OPEN-EXCHANGE-RATES.JSON, BAD-SCHEMA-UNIQUEKEY-IS-COPYFIELD-DEST.XML, SOLRCONFIG-MASTER.XML, SOLRCONFIG-SOLCOREPROPERTIES.XML, SCHEMA_CODEC.XML, SOLRCONFIG_CODEC.XML, BAD-SOLRCONFIG-BOGUS-SCRIPTENGINE-NAME.XML, MISSLEADING.EXTENSION.UPDATEPROCESSOR.JS.TXT, PHRASESUGGEST.TXT, SOLRCONFIG-XINCLUDE.XML, PROTWORDS.TXT, SCHEMA-BM25.XML, SCHEMA-TFIDF.XML, WDFTYPES.TXT, XSLT, COMPOUNDDICTIONARY.TXT, BAD-SCHEMA-ANALYZER-CLASS-AND-NESTED.XML, SOLRCONFIG-CACHING.XML, MAPPING-ISOLATIN1ACCENT.TXT, SOLRCONFIG-DELPOLICY1.XML, OLD_SYNONYMS.TXT, SOLRCONFIG-LAZYWRITER.XML, SCHEMA-NUMERIC.XML, SCHEMA-DFR.XML, SOLRCONFIG-PROPINJECT.XML, KEEP-1.TXT, BAD-MP-SOLRCONFIG.XML, SOLRCONFIG-REQHANDLER.INCL, SOLRCONFIG-QUERYSENDER-NOQUERY.XML, SOLRCONFIG-QUERYSENDER.XML, SOLRCONFIG-HIGHLIGHT.XML, BAD-SOLRCONFIG-INVALID-SCRIPTFILE.XML, SOLRCONFIG-NOCACHE.XML, SCHEMA11.XML, BAD-SCHEMA-CODEC-GLOBAL-VS-FT-MISMATCH.XML, SOLRCONFIG-NATIVELOCK.XML, SOLRCONFIG-TRANSFORMERS.XML, SOLRCONFIG-PHRASESUGGEST.XML, BAD-SCHEMA-EXTERNAL-FILEFIELD.XML, HUNSPELL-TEST.DIC, SOLRCONFIG-DELPOLICY2.XML, SOLRCONFIG-ENABLEPLUGIN.XML, SCHEMA-COPYFIELD-TEST.XML, SOLRCONFIG-ALTDIRECTORY.XML, SOLRCONFIG-FUNCTIONQUERY.XML, DA_UTF8.XML, SCHEMA-REPLICATION2.XML, SCHEMA-IB.XML, BAD_SOLRCONFIG.XML, SCHEMA-REQUIRED-FIELDS.XML, SCHEMA.XML, SOLRCONFIG-TLOG.XML, BAD-SCHEMA-UNIQUEKEY-MULTIVALUED.XML, SCHEMA-LMJELINEKMERCER.XML, SCHEMASURROUND.XML, SCHEMA-PHRASESUGGEST.XML, STOPWORDSWRONGENCODING.TXT, STOP-SNOWBALL.TXT, SOLRCONFIG-MERGEPOLICY.XML, SOLRCONFIG-MASTER1.XML, SOLRCONFIG-MASTER3.XML, SOLRCONFIG-SLAVE.XML, SOLRCONFIG-ELEVATE.XML, ADDFIELDS.UPDATEPROCESSOR.JS, STOPWORDS.TXT, BAD-SCHEMA-OMIT-TF-BUT-NOT-POS.XML, STOP-2.TXT, SCHEMA-BINARYFIELD.XML, SCHEMA-FOLDING.XML, HYPHENATION.DTD, TRIVIAL.UPDATEPROCESSOR1.JS, BAD-SCHEMA-NOT-INDEXED-BUT-NORMS.XML, BAD-SCHEMA-DUP-FIELDTYPE.XML, SCHEMA-REVERSED.XML, MISSING.FUNCTIONS.UPDATEPROCESSOR.JS, SOLRCONFIG-SIMPLELOCK.XML, SCHEMA-NOT-REQUIRED-UNIQUE-KEY.XML, SOLRCONFIG-REPEATER.XML, SYNONYMS.TXT, STOPWITHBOM.TXT, SOLRCONFIG-SOLR-749.XML, SCHEMA-SIM.XML, KEEP-2.TXT, BAD-SCHEMA-NOT-INDEXED-BUT-TF.XML, SCHEMA-TRIE.XML, SOLRCONFIG-SPELLCHECKER.XML, SCHEMA-SPELLCHECKER.XML, SCHEMA-LUCENEMATCHVERSION.XML, SOLRCONFIG_PERF.XML, CONDITIONAL.UPDATEPROCESSOR.JS, SOLRCONFIG-SLAVE1.XML, SCHEMA-REPLICATION1.XML, BAD-SCHEMA-SIM-GLOBAL-VS-FT-MISMATCH.XML, SOLRCONFIG-PROPINJECT-INDEXDEFAULT.XML, THROW.ERROR.ON.ADD.UPDATEPROCESSOR.JS, CURRENCY.XML, HUNSPELL-TEST.AFF, BAD-SCHEMA-NOT-INDEXED-BUT-POS.XML, SOLRCONFIG-BASIC.XML, SOLRCONFIG-TERMINDEX.XML, BAD-SCHEMA-DUP-FIELD.XML, SCHEMA-CHARFILTERS.XML, SOLRCONFIG-SPELLCHECKCOMPONENT.XML, SOLRCONFIG-MASTER2.XML, STOP-1.TXT, BAD-SCHEMA-NONTEXT-ANALYZER.XML, DA_COMPOUNDDICTIONARY.TXT, STOPTYPES-2.TXT, BAD-SCHEMA-DUP-DYNAMICFIELD.XML, BAD-SOLRCONFIG-MISSING-SCRIPTFILE.XML, SCHEMA-LMDIRICHLET.XML, FRENCHARTICLES.TXT, STOPTYPES-1.TXT, SCHEMA15.XML, SCHEMA-MINIMAL.XML, SCHEMA-STOP-KEEP.XML, BAD-SCHEMA-UNIQUEKEY-USES-DEFAULT.XML, STEMDICT.TXT, SCHEMA-COLLATE.XML, TRIVIAL.UPDATEPROCESSOR0.JS, ELEVATE.XML, SOLRCONFIG-UPDATE-PROCESSOR-CHAINS.XML, SOLRCONFIG-MASTER1-KEEPONEBACKUP.XML]
[junit4:junit4]   2> 462 T7038 oass.SolrIndexSearcher.<init> Opening Searcher@388c6af2 main
[junit4:junit4]   2> 463 T7038 oass.SolrIndexSearcher.getIndexDir WARNING WARNING: Directory impl does not support setting indexDir: org.apache.lucene.store.MockDirectoryWrapper
[junit4:junit4]   2> 463 T7038 oasu.CommitTracker.<init> Hard AutoCommit: disabled
[junit4:junit4]   2> 463 T7038 oasu.CommitTracker.<init> Soft AutoCommit: disabled
[junit4:junit4]   2> 464 T7038 oashc.QueryElevationComponent.inform Loading QueryElevation from: /mnt/ssd/jenkins/workspace/Lucene-Solr-trunk-Linux/checkout/solr/build/solr-core/test-files/solr/collection1/conf/elevate.xml
[junit4:junit4]   2> 469 T7038 oashc.QueryElevationComponent.inform Loading QueryElevation from: /mnt/ssd/jenkins/workspace/Lucene-Solr-trunk-Linux/checkout/solr/build/solr-core/test-files/solr/collection1/conf/elevate.xml
[junit4:junit4]   2> 475 T7038 oashc.HttpShardHandlerFactory.getParameter Setting socketTimeout to: 0
[junit4:junit4]   2> 475 T7038 oashc.HttpShardHandlerFactory.getParameter Setting urlScheme to: http://
[junit4:junit4]   2> 475 T7038 oashc.HttpShardHandlerFactory.getParameter Setting connTimeout to: 0
[junit4:junit4]   2> 476 T7038 oashc.HttpShardHandlerFactory.getParameter Setting maxConnectionsPerHost to: 20
[junit4:junit4]   2> 476 T7038 oashc.HttpShardHandlerFactory.getParameter Setting corePoolSize to: 0
[junit4:junit4]   2> 476 T7038 oashc.HttpShardHandlerFactory.getParameter Setting maximumPoolSize to: 2147483647
[junit4:junit4]   2> 476 T7038 oashc.HttpShardHandlerFactory.getParameter Setting maxThreadIdleTime to: 5
[junit4:junit4]   2> 477 T7038 oashc.HttpShardHandlerFactory.getParameter Setting sizeOfQueue to: -1
[junit4:junit4]   2> 477 T7038 oashc.HttpShardHandlerFactory.getParameter Setting fairnessPolicy to: false
[junit4:junit4]   2> 477 T7038 oascsi.HttpClientUtil.createClient Creating new http client, config:maxConnectionsPerHost=20&maxConnections=10000&socketTimeout=0&connTimeout=0&retry=false
[junit4:junit4]   2> 479 T7058 oasc.SolrCore.registerSearcher [collection1] Registered new searcher Searcher@388c6af2 main{StandardDirectoryReader(segments_1:1)}
[junit4:junit4]   2> 479 T7038 oasc.CoreContainer.register registering core: collection1
[junit4:junit4]   2> 479 T7038 oass.SolrDispatchFilter.init user.dir=/mnt/ssd/jenkins/workspace/Lucene-Solr-trunk-Linux/checkout/solr/build/solr-core/test/J0
[junit4:junit4]   2> 480 T7038 oass.SolrDispatchFilter.init SolrDispatchFilter.init() done
[junit4:junit4]   2> 480 T7038 oascsi.HttpClientUtil.createClient Creating new http client, config:maxConnections=128&maxConnectionsPerHost=32&followRedirects=false
[junit4:junit4]   2> 482 T7038 oejs.Server.doStart jetty-8.1.2.v20120308
[junit4:junit4]   2> 483 T7038 oejs.AbstractConnector.doStart Started SocketConnector@0.0.0.0:33958
[junit4:junit4]   2> 484 T7038 oasc.SolrResourceLoader.locateSolrHome JNDI not configured for solr (NoInitialContextEx)
[junit4:junit4]   2> 484 T7038 oasc.SolrResourceLoader.locateSolrHome using system property solr.solr.home: /mnt/ssd/jenkins/workspace/Lucene-Solr-trunk-Linux/checkout/solr/build/solr-core/test-files/solr
[junit4:junit4]   2> 484 T7038 oasc.SolrResourceLoader.<init> new SolrResourceLoader for deduced Solr Home: '/mnt/ssd/jenkins/workspace/Lucene-Solr-trunk-Linux/checkout/solr/build/solr-core/test-files/solr/'
[junit4:junit4]   2> 492 T7038 oass.SolrDispatchFilter.init SolrDispatchFilter.init()
[junit4:junit4]   2> 492 T7038 oasc.SolrResourceLoader.locateSolrHome JNDI not configured for solr (NoInitialContextEx)
[junit4:junit4]   2> 492 T7038 oasc.SolrResourceLoader.locateSolrHome using system property solr.solr.home: /mnt/ssd/jenkins/workspace/Lucene-Solr-trunk-Linux/checkout/solr/build/solr-core/test-files/solr
[junit4:junit4]   2> 493 T7038 oasc.CoreContainer$Initializer.initialize looking for solr.xml: /mnt/ssd/jenkins/workspace/Lucene-Solr-trunk-Linux/checkout/solr/build/solr-core/test-files/solr/solr.xml
[junit4:junit4]   2> 493 T7038 oasc.CoreContainer.<init> New CoreContainer 1790245948
[junit4:junit4]   2> 493 T7038 oasc.CoreContainer.load Loading CoreContainer using Solr Home: '/mnt/ssd/jenkins/workspace/Lucene-Solr-trunk-Linux/checkout/solr/build/solr-core/test-files/solr/'
[junit4:junit4]   2> 493 T7038 oasc.SolrResourceLoader.<init> new SolrResourceLoader for directory: '/mnt/ssd/jenkins/workspace/Lucene-Solr-trunk-Linux/checkout/solr/build/solr-core/test-files/solr/'
[junit4:junit4]   2> 503 T7038 oasc.CoreContainer.load Registering Log Listener
[junit4:junit4]   2> 514 T7038 oasc.CoreContainer.create Creating SolrCore 'collection1' using instanceDir: /mnt/ssd/jenkins/workspace/Lucene-Solr-trunk-Linux/checkout/solr/build/solr-core/test-files/solr/collection1
[junit4:junit4]   2> 514 T7038 oasc.SolrResourceLoader.<init> new SolrResourceLoader for directory: '/mnt/ssd/jenkins/workspace/Lucene-Solr-trunk-Linux/checkout/solr/build/solr-core/test-files/solr/collection1/'
[junit4:junit4]   2> 515 T7038 oasc.SolrResourceLoader.replaceClassLoader Adding 'file:/mnt/ssd/jenkins/workspace/Lucene-Solr-trunk-Linux/checkout/solr/build/solr-core/test-files/solr/collection1/lib/README' to classloader
[junit4:junit4]   2> 515 T7038 oasc.SolrResourceLoader.replaceClassLoader Adding 'file:/mnt/ssd/jenkins/workspace/Lucene-Solr-trunk-Linux/checkout/solr/build/solr-core/test-files/solr/collection1/lib/classes/' to classloader
[junit4:junit4]   2> 539 T7038 oasc.SolrConfig.<init> Using Lucene MatchVersion: LUCENE_50
[junit4:junit4]   2> 567 T7038 oasc.SolrConfig.<init> Loaded SolrConfig: solrconfig-elevate.xml
[junit4:junit4]   2> 567 T7038 oass.IndexSchema.readSchema Reading Solr Schema
[junit4:junit4]   2> 569 T7038 oass.IndexSchema.readSchema Schema name=example
[junit4:junit4]   2> 691 T7038 oass.IndexSchema.readSchema default search field in schema is text
[junit4:junit4]   2> 693 T7038 oass.IndexSchema.readSchema unique key field: id
[junit4:junit4]   2> 695 T7038 oasc.SolrCore.<init> [collection1] Opening new SolrCore at /mnt/ssd/jenkins/workspace/Lucene-Solr-trunk-Linux/checkout/solr/build/solr-core/test-files/solr/collection1/, dataDir=./org.apache.solr.handler.component.DistributedQueryElevationComponentTest-1343783295361/shard1/data/
[junit4:junit4]   2> 695 T7038 oasc.JmxMonitoredMap.<init> JMX monitoring is enabled. Adding Solr mbeans to JMX Server: com.sun.jmx.mbeanserver.JmxMBeanServer@5065c5ab
[junit4:junit4]   2> 696 T7038 oasc.SolrCore.getNewIndexDir WARNING New index directory detected: old=null new=./org.apache.solr.handler.component.DistributedQueryElevationComponentTest-1343783295361/shard1/data/index/
[junit4:junit4]   2> 696 T7038 oasc.SolrCore.initIndex WARNING [collection1] Solr index directory './org.apache.solr.handler.component.DistributedQueryElevationComponentTest-1343783295361/shard1/data/index' doesn't exist. Creating new index...
[junit4:junit4]   2> 697 T7038 oasc.SolrDeletionPolicy.onCommit SolrDeletionPolicy.onCommit: commits:num=1
[junit4:junit4]   2> 		commit{dir=MockDirWrapper(org.apache.lucene.store.RAMDirectory@f6afe18 lockFactory=org.apache.lucene.store.SingleInstanceLockFactory@2b61d255),segFN=segments_1,generation=1,filenames=[segments_1]
[junit4:junit4]   2> 697 T7038 oasc.SolrDeletionPolicy.updateCommits newest commit = 1
[junit4:junit4]   2> 698 T7038 oasc.RequestHandlers.initHandlersFromConfig created /update: solr.UpdateRequestHandler
[junit4:junit4]   2> 698 T7038 oasc.RequestHandlers.initHandlersFromConfig created /elevate: org.apache.solr.handler.component.SearchHandler
[junit4:junit4]   2> 699 T7038 oasc.RequestHandlers.initHandlersFromConfig created /dataElevate: org.apache.solr.handler.component.SearchHandler
[junit4:junit4]   2> 699 T7038 oashl.XMLLoader.init xsltCacheLifetimeSeconds=60
[junit4:junit4]   2> 699 T7038 oasc.RequestHandlers.initHandlersFromConfig WARNING no default request handler is registered (either '/select' or 'standard')
[junit4:junit4]   2> 700 T7038 oasc.SolrCore.initDeprecatedSupport WARNING solrconfig.xml uses deprecated <admin/gettableFiles>, Please update your config to use the ShowFileRequestHandler.
[junit4:junit4]   2> 701 T7038 oasc.SolrCore.initDeprecatedSupport WARNING adding ShowFileRequestHandler with hidden files: [SCHEMA12.XML, SOLRCONFIG-SCRIPT-UPDATEPROCESSOR.XML, OPEN-EXCHANGE-RATES.JSON, BAD-SCHEMA-UNIQUEKEY-IS-COPYFIELD-DEST.XML, SOLRCONFIG-MASTER.XML, SOLRCONFIG-SOLCOREPROPERTIES.XML, SCHEMA_CODEC.XML, SOLRCONFIG_CODEC.XML, BAD-SOLRCONFIG-BOGUS-SCRIPTENGINE-NAME.XML, MISSLEADING.EXTENSION.UPDATEPROCESSOR.JS.TXT, PHRASESUGGEST.TXT, SOLRCONFIG-XINCLUDE.XML, PROTWORDS.TXT, SCHEMA-BM25.XML, SCHEMA-TFIDF.XML, WDFTYPES.TXT, XSLT, COMPOUNDDICTIONARY.TXT, BAD-SCHEMA-ANALYZER-CLASS-AND-NESTED.XML, SOLRCONFIG-CACHING.XML, MAPPING-ISOLATIN1ACCENT.TXT, SOLRCONFIG-DELPOLICY1.XML, OLD_SYNONYMS.TXT, SOLRCONFIG-LAZYWRITER.XML, SCHEMA-NUMERIC.XML, SCHEMA-DFR.XML, SOLRCONFIG-PROPINJECT.XML, KEEP-1.TXT, BAD-MP-SOLRCONFIG.XML, SOLRCONFIG-REQHANDLER.INCL, SOLRCONFIG-QUERYSENDER-NOQUERY.XML, SOLRCONFIG-QUERYSENDER.XML, SOLRCONFIG-HIGHLIGHT.XML, BAD-SOLRCONFIG-INVALID-SCRIPTFILE.XML, SOLRCONFIG-NOCACHE.XML, SCHEMA11.XML, BAD-SCHEMA-CODEC-GLOBAL-VS-FT-MISMATCH.XML, SOLRCONFIG-NATIVELOCK.XML, SOLRCONFIG-TRANSFORMERS.XML, SOLRCONFIG-PHRASESUGGEST.XML, BAD-SCHEMA-EXTERNAL-FILEFIELD.XML, HUNSPELL-TEST.DIC, SOLRCONFIG-DELPOLICY2.XML, SOLRCONFIG-ENABLEPLUGIN.XML, SCHEMA-COPYFIELD-TEST.XML, SOLRCONFIG-ALTDIRECTORY.XML, SOLRCONFIG-FUNCTIONQUERY.XML, DA_UTF8.XML, SCHEMA-REPLICATION2.XML, SCHEMA-IB.XML, BAD_SOLRCONFIG.XML, SCHEMA-REQUIRED-FIELDS.XML, SCHEMA.XML, SOLRCONFIG-TLOG.XML, BAD-SCHEMA-UNIQUEKEY-MULTIVALUED.XML, SCHEMA-LMJELINEKMERCER.XML, SCHEMASURROUND.XML, SCHEMA-PHRASESUGGEST.XML, STOPWORDSWRONGENCODING.TXT, STOP-SNOWBALL.TXT, SOLRCONFIG-MERGEPOLICY.XML, SOLRCONFIG-MASTER1.XML, SOLRCONFIG-MASTER3.XML, SOLRCONFIG-SLAVE.XML, SOLRCONFIG-ELEVATE.XML, ADDFIELDS.UPDATEPROCESSOR.JS, STOPWORDS.TXT, BAD-SCHEMA-OMIT-TF-BUT-NOT-POS.XML, STOP-2.TXT, SCHEMA-BINARYFIELD.XML, SCHEMA-FOLDING.XML, HYPHENATION.DTD, TRIVIAL.UPDATEPROCESSOR1.JS, BAD-SCHEMA-NOT-INDEXED-BUT-NORMS.XML, BAD-SCHEMA-DUP-FIELDTYPE.XML, SCHEMA-REVERSED.XML, MISSING.FUNCTIONS.UPDATEPROCESSOR.JS, SOLRCONFIG-SIMPLELOCK.XML, SCHEMA-NOT-REQUIRED-UNIQUE-KEY.XML, SOLRCONFIG-REPEATER.XML, SYNONYMS.TXT, STOPWITHBOM.TXT, SOLRCONFIG-SOLR-749.XML, SCHEMA-SIM.XML, KEEP-2.TXT, BAD-SCHEMA-NOT-INDEXED-BUT-TF.XML, SCHEMA-TRIE.XML, SOLRCONFIG-SPELLCHECKER.XML, SCHEMA-SPELLCHECKER.XML, SCHEMA-LUCENEMATCHVERSION.XML, SOLRCONFIG_PERF.XML, CONDITIONAL.UPDATEPROCESSOR.JS, SOLRCONFIG-SLAVE1.XML, SCHEMA-REPLICATION1.XML, BAD-SCHEMA-SIM-GLOBAL-VS-FT-MISMATCH.XML, SOLRCONFIG-PROPINJECT-INDEXDEFAULT.XML, THROW.ERROR.ON.ADD.UPDATEPROCESSOR.JS, CURRENCY.XML, HUNSPELL-TEST.AFF, BAD-SCHEMA-NOT-INDEXED-BUT-POS.XML, SOLRCONFIG-BASIC.XML, SOLRCONFIG-TERMINDEX.XML, BAD-SCHEMA-DUP-FIELD.XML, SCHEMA-CHARFILTERS.XML, SOLRCONFIG-SPELLCHECKCOMPONENT.XML, SOLRCONFIG-MASTER2.XML, STOP-1.TXT, BAD-SCHEMA-NONTEXT-ANALYZER.XML, DA_COMPOUNDDICTIONARY.TXT, STOPTYPES-2.TXT, BAD-SCHEMA-DUP-DYNAMICFIELD.XML, BAD-SOLRCONFIG-MISSING-SCRIPTFILE.XML, SCHEMA-LMDIRICHLET.XML, FRENCHARTICLES.TXT, STOPTYPES-1.TXT, SCHEMA15.XML, SCHEMA-MINIMAL.XML, SCHEMA-STOP-KEEP.XML, BAD-SCHEMA-UNIQUEKEY-USES-DEFAULT.XML, STEMDICT.TXT, SCHEMA-COLLATE.XML, TRIVIAL.UPDATEPROCESSOR0.JS, ELEVATE.XML, SOLRCONFIG-UPDATE-PROCESSOR-CHAINS.XML, SOLRCONFIG-MASTER1-KEEPONEBACKUP.XML]
[junit4:junit4]   2> 702 T7038 oass.SolrIndexSearcher.<init> Opening Searcher@7d4931b0 main
[junit4:junit4]   2> 702 T7038 oass.SolrIndexSearcher.getIndexDir WARNING WARNING: Directory impl does not support setting indexDir: org.apache.lucene.store.MockDirectoryWrapper
[junit4:junit4]   2> 703 T7038 oasu.CommitTracker.<init> Hard AutoCommit: disabled
[junit4:junit4]   2> 703 T7038 oasu.CommitTracker.<init> Soft AutoCommit: disabled
[junit4:junit4]   2> 703 T7038 oashc.QueryElevationComponent.inform Loading QueryElevation from: /mnt/ssd/jenkins/workspace/Lucene-Solr-trunk-Linux/checkout/solr/build/solr-core/test-files/solr/collection1/conf/elevate.xml
[junit4:junit4]   2> 709 T7038 oashc.QueryElevationComponent.inform Loading QueryElevation from: /mnt/ssd/jenkins/workspace/Lucene-Solr-trunk-Linux/checkout/solr/build/solr-core/test-files/solr/collection1/conf/elevate.xml
[junit4:junit4]   2> 715 T7038 oashc.HttpShardHandlerFactory.getParameter Setting socketTimeout to: 0
[junit4:junit4]   2> 716 T7038 oashc.HttpShardHandlerFactory.getParameter Setting urlScheme to: http://
[junit4:junit4]   2> 716 T7038 oashc.HttpShardHandlerFactory.getParameter Setting connTimeout to: 0
[junit4:junit4]   2> 716 T7038 oashc.HttpShardHandlerFactory.getParameter Setting maxConnectionsPerHost to: 20
[junit4:junit4]   2> 717 T7038 oashc.HttpShardHandlerFactory.getParameter Setting corePoolSize to: 0
[junit4:junit4]   2> 717 T7038 oashc.HttpShardHandlerFactory.getParameter Setting maximumPoolSize to: 2147483647
[junit4:junit4]   2> 717 T7038 oashc.HttpShardHandlerFactory.getParameter Setting maxThreadIdleTime to: 5
[junit4:junit4]   2> 717 T7038 oashc.HttpShardHandlerFactory.getParameter Setting sizeOfQueue to: -1
[junit4:junit4]   2> 718 T7038 oashc.HttpShardHandlerFactory.getParameter Setting fairnessPolicy to: false
[junit4:junit4]   2> 718 T7038 oascsi.HttpClientUtil.createClient Creating new http client, config:maxConnectionsPerHost=20&maxConnections=10000&socketTimeout=0&connTimeout=0&retry=false
[junit4:junit4]   2> 720 T7068 oasc.SolrCore.registerSearcher [collection1] Registered new searcher Searcher@7d4931b0 main{StandardDirectoryReader(segments_1:1)}
[junit4:junit4]   2> 720 T7038 oasc.CoreContainer.register registering core: collection1
[junit4:junit4]   2> 720 T7038 oass.SolrDispatchFilter.init user.dir=/mnt/ssd/jenkins/workspace/Lucene-Solr-trunk-Linux/checkout/solr/build/solr-core/test/J0
[junit4:junit4]   2> 721 T7038 oass.SolrDispatchFilter.init SolrDispatchFilter.init() done
[junit4:junit4]   2> 721 T7038 oascsi.HttpClientUtil.createClient Creating new http client, config:maxConnections=128&maxConnectionsPerHost=32&followRedirects=false
[junit4:junit4]   2> 723 T7038 oejs.Server.doStart jetty-8.1.2.v20120308
[junit4:junit4]   2> 724 T7038 oejs.AbstractConnector.doStart Started SocketConnector@0.0.0.0:44204
[junit4:junit4]   2> 725 T7038 oasc.SolrResourceLoader.locateSolrHome JNDI not configured for solr (NoInitialContextEx)
[junit4:junit4]   2> 725 T7038 oasc.SolrResourceLoader.locateSolrHome using system property solr.solr.home: /mnt/ssd/jenkins/workspace/Lucene-Solr-trunk-Linux/checkout/solr/build/solr-core/test-files/solr
[junit4:junit4]   2> 725 T7038 oasc.SolrResourceLoader.<init> new SolrResourceLoader for deduced Solr Home: '/mnt/ssd/jenkins/workspace/Lucene-Solr-trunk-Linux/checkout/solr/build/solr-core/test-files/solr/'
[junit4:junit4]   2> 732 T7038 oass.SolrDispatchFilter.init SolrDispatchFilter.init()
[junit4:junit4]   2> 733 T7038 oasc.SolrResourceLoader.locateSolrHome JNDI not configured for solr (NoInitialContextEx)
[junit4:junit4]   2> 733 T7038 oasc.SolrResourceLoader.locateSolrHome using system property solr.solr.home: /mnt/ssd/jenkins/workspace/Lucene-Solr-trunk-Linux/checkout/solr/build/solr-core/test-files/solr
[junit4:junit4]   2> 733 T7038 oasc.CoreContainer$Initializer.initialize looking for solr.xml: /mnt/ssd/jenkins/workspace/Lucene-Solr-trunk-Linux/checkout/solr/build/solr-core/test-files/solr/solr.xml
[junit4:junit4]   2> 733 T7038 oasc.CoreContainer.<init> New CoreContainer 1944385452
[junit4:junit4]   2> 733 T7038 oasc.CoreContainer.load Loading CoreContainer using Solr Home: '/mnt/ssd/jenkins/workspace/Lucene-Solr-trunk-Linux/checkout/solr/build/solr-core/test-files/solr/'
[junit4:junit4]   2> 734 T7038 oasc.SolrResourceLoader.<init> new SolrResourceLoader for directory: '/mnt/ssd/jenkins/workspace/Lucene-Solr-trunk-Linux/checkout/solr/build/solr-core/test-files/solr/'
[junit4:junit4]   2> 745 T7038 oasc.CoreContainer.load Registering Log Listener
[junit4:junit4]   2> 760 T7038 oasc.CoreContainer.create Creating SolrCore 'collection1' using instanceDir: /mnt/ssd/jenkins/workspace/Lucene-Solr-trunk-Linux/checkout/solr/build/solr-core/test-files/solr/collection1
[junit4:junit4]   2> 761 T7038 oasc.SolrResourceLoader.<init> new SolrResourceLoader for directory: '/mnt/ssd/jenkins/workspace/Lucene-Solr-trunk-Linux/checkout/solr/build/solr-core/test-files/solr/collection1/'
[junit4:junit4]   2> 761 T7038 oasc.SolrResourceLoader.replaceClassLoader Adding 'file:/mnt/ssd/jenkins/workspace/Lucene-Solr-trunk-Linux/checkout/solr/build/solr-core/test-files/solr/collection1/lib/README' to classloader
[junit4:junit4]   2> 761 T7038 oasc.SolrResourceLoader.replaceClassLoader Adding 'file:/mnt/ssd/jenkins/workspace/Lucene-Solr-trunk-Linux/checkout/solr/build/solr-core/test-files/solr/collection1/lib/classes/' to classloader
[junit4:junit4]   2> 790 T7038 oasc.SolrConfig.<init> Using Lucene MatchVersion: LUCENE_50
[junit4:junit4]   2> 868 T7038 oasc.SolrConfig.<init> Loaded SolrConfig: solrconfig-elevate.xml
[junit4:junit4]   2> 869 T7038 oass.IndexSchema.readSchema Reading Solr Schema
[junit4:junit4]   2> 871 T7038 oass.IndexSchema.readSchema Schema name=example
[junit4:junit4]   2> 981 T7038 oass.IndexSchema.readSchema default search field in schema is text
[junit4:junit4]   2> 983 T7038 oass.IndexSchema.readSchema unique key field: id
[junit4:junit4]   2> 985 T7038 oasc.SolrCore.<init> [collection1] Opening new SolrCore at /mnt/ssd/jenkins/workspace/Lucene-Solr-trunk-Linux/checkout/solr/build/solr-core/test-files/solr/collection1/, dataDir=./org.apache.solr.handler.component.DistributedQueryElevationComponentTest-1343783295361/shard2/data/
[junit4:junit4]   2> 985 T7038 oasc.JmxMonitoredMap.<init> JMX monitoring is enabled. Adding Solr mbeans to JMX Server: com.sun.jmx.mbeanserver.JmxMBeanServer@5065c5ab
[junit4:junit4]   2> 985 T7038 oasc.SolrCore.getNewIndexDir WARNING New index directory detected: old=null new=./org.apache.solr.handler.component.DistributedQueryElevationComponentTest-1343783295361/shard2/data/index/
[junit4:junit4]   2> 986 T7038 oasc.SolrCore.initIndex WARNING [collection1] Solr index directory './org.apache.solr.handler.component.DistributedQueryElevationComponentTest-1343783295361/shard2/data/index' doesn't exist. Creating new index...
[junit4:junit4]   2> 987 T7038 oasc.SolrDeletionPolicy.onCommit SolrDeletionPolicy.onCommit: commits:num=1
[junit4:junit4]   2> 		commit{dir=MockDirWrapper(org.apache.lucene.store.RAMDirectory@6d596f3c lockFactory=org.apache.lucene.store.SingleInstanceLockFactory@7eef8143),segFN=segments_1,generation=1,filenames=[segments_1]
[junit4:junit4]   2> 987 T7038 oasc.SolrDeletionPolicy.updateCommits newest commit = 1
[junit4:junit4]   2> 988 T7038 oasc.RequestHandlers.initHandlersFromConfig created /update: solr.UpdateRequestHandler
[junit4:junit4]   2> 988 T7038 oasc.RequestHandlers.initHandlersFromConfig created /elevate: org.apache.solr.handler.component.SearchHandler
[junit4:junit4]   2> 988 T7038 oasc.RequestHandlers.initHandlersFromConfig created /dataElevate: org.apache.solr.handler.component.SearchHandler
[junit4:junit4]   2> 989 T7038 oashl.XMLLoader.init xsltCacheLifetimeSeconds=60
[junit4:junit4]   2> 989 T7038 oasc.RequestHandlers.initHandlersFromConfig WARNING no default request handler is registered (either '/select' or 'standard')
[junit4:junit4]   2> 990 T7038 oasc.SolrCore.initDeprecatedSupport WARNING solrconfig.xml uses deprecated <admin/gettableFiles>, Please update your config to use the ShowFileRequestHandler.
[junit4:junit4]   2> 991 T7038 oasc.SolrCore.initDeprecatedSupport WARNING adding ShowFileRequestHandler with hidden files: [SCHEMA12.XML, SOLRCONFIG-SCRIPT-UPDATEPROCESSOR.XML, OPEN-EXCHANGE-RATES.JSON, BAD-SCHEMA-UNIQUEKEY-IS-COPYFIELD-DEST.XML, SOLRCONFIG-MASTER.XML, SOLRCONFIG-SOLCOREPROPERTIES.XML, SCHEMA_CODEC.XML, SOLRCONFIG_CODEC.XML, BAD-SOLRCONFIG-BOGUS-SCRIPTENGINE-NAME.XML, MISSLEADING.EXTENSION.UPDATEPROCESSOR.JS.TXT, PHRASESUGGEST.TXT, SOLRCONFIG-XINCLUDE.XML, PROTWORDS.TXT, SCHEMA-BM25.XML, SCHEMA-TFIDF.XML, WDFTYPES.TXT, XSLT, COMPOUNDDICTIONARY.TXT, BAD-SCHEMA-ANALYZER-CLASS-AND-NESTED.XML, SOLRCONFIG-CACHING.XML, MAPPING-ISOLATIN1ACCENT.TXT, SOLRCONFIG-DELPOLICY1.XML, OLD_SYNONYMS.TXT, SOLRCONFIG-LAZYWRITER.XML, SCHEMA-NUMERIC.XML, SCHEMA-DFR.XML, SOLRCONFIG-PROPINJECT.XML, KEEP-1.TXT, BAD-MP-SOLRCONFIG.XML, SOLRCONFIG-REQHANDLER.INCL, SOLRCONFIG-QUERYSENDER-NOQUERY.XML, SOLRCONFIG-QUERYSENDER.XML, SOLRCONFIG-HIGHLIGHT.XML, BAD-SOLRCONFIG-INVALID-SCRIPTFILE.XML, SOLRCONFIG-NOCACHE.XML, SCHEMA11.XML, BAD-SCHEMA-CODEC-GLOBAL-VS-FT-MISMATCH.XML, SOLRCONFIG-NATIVELOCK.XML, SOLRCONFIG-TRANSFORMERS.XML, SOLRCONFIG-PHRASESUGGEST.XML, BAD-SCHEMA-EXTERNAL-FILEFIELD.XML, HUNSPELL-TEST.DIC, SOLRCONFIG-DELPOLICY2.XML, SOLRCONFIG-ENABLEPLUGIN.XML, SCHEMA-COPYFIELD-TEST.XML, SOLRCONFIG-ALTDIRECTORY.XML, SOLRCONFIG-FUNCTIONQUERY.XML, DA_UTF8.XML, SCHEMA-REPLICATION2.XML, SCHEMA-IB.XML, BAD_SOLRCONFIG.XML, SCHEMA-REQUIRED-FIELDS.XML, SCHEMA.XML, SOLRCONFIG-TLOG.XML, BAD-SCHEMA-UNIQUEKEY-MULTIVALUED.XML, SCHEMA-LMJELINEKMERCER.XML, SCHEMASURROUND.XML, SCHEMA-PHRASESUGGEST.XML, STOPWORDSWRONGENCODING.TXT, STOP-SNOWBALL.TXT, SOLRCONFIG-MERGEPOLICY.XML, SOLRCONFIG-MASTER1.XML, SOLRCONFIG-MASTER3.XML, SOLRCONFIG-SLAVE.XML, SOLRCONFIG-ELEVATE.XML, ADDFIELDS.UPDATEPROCESSOR.JS, STOPWORDS.TXT, BAD-SCHEMA-OMIT-TF-BUT-NOT-POS.XML, STOP-2.TXT, SCHEMA-BINARYFIELD.XML, SCHEMA-FOLDING.XML, HYPHENATION.DTD, TRIVIAL.UPDATEPROCESSOR1.JS, BAD-SCHEMA-NOT-INDEXED-BUT-NORMS.XML, BAD-SCHEMA-DUP-FIELDTYPE.XML, SCHEMA-REVERSED.XML, MISSING.FUNCTIONS.UPDATEPROCESSOR.JS, SOLRCONFIG-SIMPLELOCK.XML, SCHEMA-NOT-REQUIRED-UNIQUE-KEY.XML, SOLRCONFIG-REPEATER.XML, SYNONYMS.TXT, STOPWITHBOM.TXT, SOLRCONFIG-SOLR-749.XML, SCHEMA-SIM.XML, KEEP-2.TXT, BAD-SCHEMA-NOT-INDEXED-BUT-TF.XML, SCHEMA-TRIE.XML, SOLRCONFIG-SPELLCHECKER.XML, SCHEMA-SPELLCHECKER.XML, SCHEMA-LUCENEMATCHVERSION.XML, SOLRCONFIG_PERF.XML, CONDITIONAL.UPDATEPROCESSOR.JS, SOLRCONFIG-SLAVE1.XML, SCHEMA-REPLICATION1.XML, BAD-SCHEMA-SIM-GLOBAL-VS-FT-MISMATCH.XML, SOLRCONFIG-PROPINJECT-INDEXDEFAULT.XML, THROW.ERROR.ON.ADD.UPDATEPROCESSOR.JS, CURRENCY.XML, HUNSPELL-TEST.AFF, BAD-SCHEMA-NOT-INDEXED-BUT-POS.XML, SOLRCONFIG-BASIC.XML, SOLRCONFIG-TERMINDEX.XML, BAD-SCHEMA-DUP-FIELD.XML, SCHEMA-CHARFILTERS.XML, SOLRCONFIG-SPELLCHECKCOMPONENT.XML, SOLRCONFIG-MASTER2.XML, STOP-1.TXT, BAD-SCHEMA-NONTEXT-ANALYZER.XML, DA_COMPOUNDDICTIONARY.TXT, STOPTYPES-2.TXT, BAD-SCHEMA-DUP-DYNAMICFIELD.XML, BAD-SOLRCONFIG-MISSING-SCRIPTFILE.XML, SCHEMA-LMDIRICHLET.XML, FRENCHARTICLES.TXT, STOPTYPES-1.TXT, SCHEMA15.XML, SCHEMA-MINIMAL.XML, SCHEMA-STOP-KEEP.XML, BAD-SCHEMA-UNIQUEKEY-USES-DEFAULT.XML, STEMDICT.TXT, SCHEMA-COLLATE.XML, TRIVIAL.UPDATEPROCESSOR0.JS, ELEVATE.XML, SOLRCONFIG-UPDATE-PROCESSOR-CHAINS.XML, SOLRCONFIG-MASTER1-KEEPONEBACKUP.XML]
[junit4:junit4]   2> 992 T7038 oass.SolrIndexSearcher.<init> Opening Searcher@40912121 main
[junit4:junit4]   2> 992 T7038 oass.SolrIndexSearcher.getIndexDir WARNING WARNING: Directory impl does not support setting indexDir: org.apache.lucene.store.MockDirectoryWrapper
[junit4:junit4]   2> 993 T7038 oasu.CommitTracker.<init> Hard AutoCommit: disabled
[junit4:junit4]   2> 993 T7038 oasu.CommitTracker.<init> Soft AutoCommit: disabled
[junit4:junit4]   2> 993 T7038 oashc.QueryElevationComponent.inform Loading QueryElevation from: /mnt/ssd/jenkins/workspace/Lucene-Solr-trunk-Linux/checkout/solr/build/solr-core/test-files/solr/collection1/conf/elevate.xml
[junit4:junit4]   2> 999 T7038 oashc.QueryElevationComponent.inform Loading QueryElevation from: /mnt/ssd/jenkins/workspace/Lucene-Solr-trunk-Linux/checkout/solr/build/solr-core/test-files/solr/collection1/conf/elevate.xml
[junit4:junit4]   2> 1004 T7038 oashc.HttpShardHandlerFactory.getParameter Setting socketTimeout to: 0
[junit4:junit4]   2> 1005 T7038 oashc.HttpShardHandlerFactory.getParameter Setting urlScheme to: http://
[junit4:junit4]   2> 1005 T7038 oashc.HttpShardHandlerFactory.getParameter Setting connTimeout to: 0
[junit4:junit4]   2> 1005 T7038 oashc.HttpShardHandlerFactory.getParameter Setting maxConnectionsPerHost to: 20
[junit4:junit4]   2> 1005 T7038 oashc.HttpShardHandlerFactory.getParameter Setting corePoolSize to: 0
[junit4:junit4]   2> 1006 T7038 oashc.HttpShardHandlerFactory.getParameter Setting maximumPoolSize to: 2147483647
[junit4:junit4]   2> 1006 T7038 oashc.HttpShardHandlerFactory.getParameter Setting maxThreadIdleTime to: 5
[junit4:junit4]   2> 1006 T7038 oashc.HttpShardHandlerFactory.getParameter Setting sizeOfQueue to: -1
[junit4:junit4]   2> 1006 T7038 oashc.HttpShardHandlerFactory.getParameter Setting fairnessPolicy to: false
[junit4:junit4]   2> 1007 T7038 oascsi.HttpClientUtil.createClient Creating new http client, config:maxConnectionsPerHost=20&maxConnections=10000&socketTimeout=0&connTimeout=0&retry=false
[junit4:junit4]   2> 1009 T7078 oasc.SolrCore.registerSearcher [collection1] Registered new searcher Searcher@40912121 main{StandardDirectoryReader(segments_1:1)}
[junit4:junit4]   2> 1009 T7038 oasc.CoreContainer.register registering core: collection1
[junit4:junit4]   2> 1009 T7038 oass.SolrDispatchFilter.init user.dir=/mnt/ssd/jenkins/workspace/Lucene-Solr-trunk-Linux/checkout/solr/build/solr-core/test/J0
[junit4:junit4]   2> 1009 T7038 oass.SolrDispatchFilter.init SolrDispatchFilter.init() done
[junit4:junit4]   2> 1009 T7038 oascsi.HttpClientUtil.createClient Creating new http client, config:maxConnections=128&maxConnectionsPerHost=32&followRedirects=false
[junit4:junit4]   2> ASYNC  NEW_CORE C191 name=collection1 org.apache.solr.core.SolrCore@5bfe44b5
[junit4:junit4]   2> 1015 T7042 C191 oasu.DirectUpdateHandler2.deleteAll [collection1] REMOVING ALL DOCUMENTS FROM INDEX
[junit4:junit4]   2> 1017 T7042 C191 oasc.SolrDeletionPolicy.onInit SolrDeletionPolicy.onInit: commits:num=1
[junit4:junit4]   2> 		commit{dir=MockDirWrapper(org.apache.lucene.store.RAMDirectory@1250f642 lockFactory=org.apache.lucene.store.SingleInstanceLockFactory@13978eb5),segFN=segments_1,generation=1,filenames=[segments_1]
[junit4:junit4]   2> 1017 T7042 C191 oasc.SolrDeletionPolicy.updateCommits newest commit = 1
[junit4:junit4]   2> 1018 T7042 C191 UPDATE [collection1] webapp=/solr path=/update params={version=2&wt=javabin} {deleteByQuery=*:*} 0 3
[junit4:junit4]   2> ASYNC  NEW_CORE C192 name=collection1 org.apache.solr.core.SolrCore@31b4fff6
[junit4:junit4]   2> 1021 T7051 C192 oasu.DirectUpdateHandler2.deleteAll [collection1] REMOVING ALL DOCUMENTS FROM INDEX
[junit4:junit4]   2> 1022 T7051 C192 oasc.SolrDeletionPolicy.onInit SolrDeletionPolicy.onInit: commits:num=1
[junit4:junit4]   2> 		commit{dir=MockDirWrapper(org.apache.lucene.store.RAMDirectory@621088f8 lockFactory=org.apache.lucene.store.SingleInstanceLockFactory@1ccf5364),segFN=segments_1,generation=1,filenames=[segments_1]
[junit4:junit4]   2> 1022 T7051 C192 oasc.SolrDeletionPolicy.updateCommits newest commit = 1
[junit4:junit4]   2> 1023 T7051 C192 UPDATE [collection1] webapp=/solr path=/update params={version=2&wt=javabin} {deleteByQuery=*:*} 0 2
[junit4:junit4]   2> ASYNC  NEW_CORE C193 name=collection1 org.apache.solr.core.SolrCore@1501685e
[junit4:junit4]   2> 1027 T7061 C193 oasu.DirectUpdateHandler2.deleteAll [collection1] REMOVING ALL DOCUMENTS FROM INDEX
[junit4:junit4]   2> 1028 T7061 C193 oasc.SolrDeletionPolicy.onInit SolrDeletionPolicy.onInit: commits:num=1
[junit4:junit4]   2> 		commit{dir=MockDirWrapper(org.apache.lucene.store.RAMDirectory@f6afe18 lockFactory=org.apache.lucene.store.SingleInstanceLockFactory@2b61d255),segFN=segments_1,generation=1,filenames=[segments_1]
[junit4:junit4]   2> 1029 T7061 C193 oasc.SolrDeletionPolicy.updateCommits newest commit = 1
[junit4:junit4]   2> 1029 T7061 C193 UPDATE [collection1] webapp=/solr path=/update params={version=2&wt=javabin} {deleteByQuery=*:*} 0 2
[junit4:junit4]   2> ASYNC  NEW_CORE C194 name=collection1 org.apache.solr.core.SolrCore@2f81b809
[junit4:junit4]   2> 1033 T7071 C194 oasu.DirectUpdateHandler2.deleteAll [collection1] REMOVING ALL DOCUMENTS FROM INDEX
[junit4:junit4]   2> 1034 T7071 C194 oasc.SolrDeletionPolicy.onInit SolrDeletionPolicy.onInit: commits:num=1
[junit4:junit4]   2> 		commit{dir=MockDirWrapper(org.apache.lucene.store.RAMDirectory@6d596f3c lockFactory=org.apache.lucene.store.SingleInstanceLockFactory@7eef8143),segFN=segments_1,generation=1,filenames=[segments_1]
[junit4:junit4]   2> 1035 T7071 C194 oasc.SolrDeletionPolicy.updateCommits newest commit = 1
[junit4:junit4]   2> 1035 T7071 C194 UPDATE [collection1] webapp=/solr path=/update params={version=2&wt=javabin} {deleteByQuery=*:*} 0 2
[junit4:junit4]   2> 1038 T7042 C191 UPDATE [collection1] webapp=/solr path=/update params={version=2&wt=javabin} {add=[1]} 0 1
[junit4:junit4]   2> 1041 T7051 C192 UPDATE [collection1] webapp=/solr path=/update params={version=2&wt=javabin} {add=[1]} 0 1
[junit4:junit4]   2> 1043 T7042 C191 UPDATE [collection1] webapp=/solr path=/update params={version=2&wt=javabin} {add=[2]} 0 1
[junit4:junit4]   2> 1045 T7061 C193 UPDATE [collection1] webapp=/solr path=/update params={version=2&wt=javabin} {add=[2]} 0 1
[junit4:junit4]   2> 1047 T7042 C191 UPDATE [collection1] webapp=/solr path=/update params={version=2&wt=javabin} {add=[3]} 0 1
[junit4:junit4]   2> 1049 T7071 C194 UPDATE [collection1] webapp=/solr path=/update params={version=2&wt=javabin} {add=[3]} 0 1
[junit4:junit4]   2> 1050 T7042 C191 UPDATE [collection1] webapp=/solr path=/update params={version=2&wt=javabin} {add=[4]} 0 0
[junit4:junit4]   2> 1052 T7051 C192 UPDATE [collection1] webapp=/solr path=/update params={version=2&wt=javabin} {add=[4]} 0 0
[junit4:junit4]   2> 1054 T7042 C191 UPDATE [collection1] webapp=/solr path=/update params={version=2&wt=javabin} {add=[5]} 0 0
[junit4:junit4]   2> 1056 T7061 C193 UPDATE [collection1] webapp=/solr path=/update params={version=2&wt=javabin} {add=[5]} 0 0
[junit4:junit4]   2> 1058 T7042 C191 UPDATE [collection1] webapp=/solr path=/update params={version=2&wt=javabin} {add=[6]} 0 0
[junit4:junit4]   2> 1060 T7071 C194 UPDATE [collection1] webapp=/solr path=/update params={version=2&wt=javabin} {add=[6]} 0 0
[junit4:junit4]   2> 1062 T7042 C191 UPDATE [collection1] webapp=/solr path=/update params={version=2&wt=javabin} {add=[7]} 0 0
[junit4:junit4]   2> 1064 T7071 C194 UPDATE [collection1] webapp=/solr path=/update params={version=2&wt=javabin} {add=[7]} 0 0
[junit4:junit4]   2> 1067 T7042 C191 oasu.DirectUpdateHandler2.commit start commit{flags=0,_version_=0,optimize=false,openSearcher=true,waitSearcher=true,expungeDeletes=false,softCommit=false}
[junit4:junit4]   2> 1069 T7042 C191 oasc.SolrDeletionPolicy.onCommit SolrDeletionPolicy.onCommit: commits:num=2
[junit4:junit4]   2> 		commit{dir=MockDirWrapper(org.apache.lucene.store.RAMDirectory@1250f642 lockFactory=org.apache.lucene.store.SingleInstanceLockFactory@13978eb5),segFN=segments_1,generation=1,filenames=[segments_1]
[junit4:junit4]   2> 		commit{dir=MockDirWrapper(org.apache.lucene.store.RAMDirectory@1250f642 lockFactory=org.apache.lucene.store.SingleInstanceLockFactory@13978eb5),segFN=segments_2,generation=2,filenames=[_0.fld, _0.inf, _0_3.len, _0_2.len, segments_2, _0.pst, _0.si, _0_4.len]
[junit4:junit4]   2> 1070 T7042 C191 oasc.SolrDeletionPolicy.updateCommits newest commit = 2
[junit4:junit4]   2> 1071 T7042 C191 oass.SolrIndexSearcher.<init> Opening Searcher@1467a4d5 main
[junit4:junit4]   2> 1071 T7042 C191 oass.SolrIndexSearcher.getIndexDir WARNING WARNING: Directory impl does not support setting indexDir: org.apache.lucene.store.MockDirectoryWrapper
[junit4:junit4]   2> 1071 T7042 C191 oasu.DirectUpdateHandler2.commit end_commit_flush
[junit4:junit4]   2> 1072 T7048 oasc.SolrCore.registerSearcher [collection1] Registered new searcher Searcher@1467a4d5 main{StandardDirectoryReader(segments_2:4 _0(5.0):C7)}
[junit4:junit4]   2> 1072 T7042 C191 UPDATE [collection1] webapp=/solr path=/update params={wt=javabin&commit=true&waitSearcher=true&version=2&softCommit=false} {commit=} 0 5
[junit4:junit4]   2> 1074 T7051 C192 oasu.DirectUpdateHandler2.commit start commit{flags=0,_version_=0,optimize=false,openSearcher=true,waitSearcher=true,expungeDeletes=false,softCommit=false}
[junit4:junit4]   2> 1075 T7051 C192 oasc.SolrDeletionPolicy.onCommit SolrDeletionPolicy.onCommit: commits:num=2
[junit4:junit4]   2> 		commit{dir=MockDirWrapper(org.apache.lucene.store.RAMDirectory@621088f8 lockFactory=org.apache.lucene.store.SingleInstanceLockFactory@1ccf5364),segFN=segments_1,generation=1,filenames=[segments_1]
[junit4:junit4]   2> 		commit{dir=MockDirWrapper(org.apache.lucene.store.RAMDirectory@621088f8 lockFactory=org.apache.lucene.store.SingleInstanceLockFactory@1ccf5364),segFN=segments_2,generation=2,filenames=[_0.fld, _0.inf, _0_3.len, _0_2.len, segments_2, _0.pst, _0.si]
[junit4:junit4]   2> 1076 T7051 C192 oasc.SolrDeletionPolicy.updateCommits newest commit = 2
[junit4:junit4]   2> 1077 T7051 C192 oass.SolrIndexSearcher.<init> Opening Searcher@422a9e56 main
[junit4:junit4]   2> 1077 T7051 C192 oass.SolrIndexSearcher.getIndexDir WARNING WARNING: Directory impl does not support setting indexDir: org.apache.lucene.store.MockDirectoryWrapper
[junit4:junit4]   2> 1077 T7051 C192 oasu.DirectUpdateHandler2.commit end_commit_flush
[junit4:junit4]   2> 1078 T7058 oasc.SolrCore.registerSearcher [collection1] Registered new searcher Searcher@422a9e56 main{StandardDirectoryReader(segments_2:4 _0(5.0):C2)}
[junit4:junit4]   2> 1078 T7051 C192 UPDATE [collection1] webapp=/solr path=/update params={wt=javabin&commit=true&waitSearcher=true&version=2&softCommit=false} {commit=} 0 4
[junit4:junit4]   2> 1080 T7061 C193 oasu.DirectUpdateHandler2.commit start commit{flags=0,_version_=0,optimize=false,openSearcher=true,waitSearcher=true,expungeDeletes=false,softCommit=false}
[junit4:junit4]   2> 1081 T7061 C193 oasc.SolrDeletionPolicy.onCommit SolrDeletionPolicy.onCommit: commits:num=2
[junit4:junit4]   2> 		commit{dir=MockDirWrapper(org.apache.lucene.store.RAMDirectory@f6afe18 lockFactory=org.apache.lucene.store.SingleInstanceLockFactory@2b61d255),segFN=segments_1,generation=1,filenames=[segments_1]
[junit4:junit4]   2> 		commit{dir=MockDirWrapper(org.apache.lucene.store.RAMDirectory@f6afe18 lockFactory=org.apache.lucene.store.SingleInstanceLockFactory@2b61d255),segFN=segments_2,generation=2,filenames=[_0.fld, _0.inf, _0_3.len, _0_2.len, segments_2, _0.pst, _0.si]
[junit4:junit4]   2> 1082 T7061 C193 oasc.SolrDeletionPolicy.updateCommits newest commit = 2
[junit4:junit4]   2> 1082 T7061 C193 oass.SolrIndexSearcher.<init> Opening Searcher@31dd460b main
[junit4:junit4]   2> 1083 T7061 C193 oass.SolrIndexSearcher.getIndexDir WARNING WARNING: Directory impl does not support setting indexDir: org.apache.lucene.store.MockDirectoryWrapper
[junit4:junit4]   2> 1083 T7061 C193 oasu.DirectUpdateHandler2.commit end_commit_flush
[junit4:junit4]   2> 1083 T7068 oasc.SolrCore.registerSearcher [collection1] Registered new searcher Searcher@31dd460b main{StandardDirectoryReader(segments_2:4 _0(5.0):C2)}
[junit4:junit4]   2> 1083 T7061 C193 UPDATE [collection1] webapp=/solr path=/update params={wt=javabin&commit=true&waitSearcher=true&version=2&softCommit=false} {commit=} 0 3
[junit4:junit4]   2> 1085 T7071 C194 oasu.DirectUpdateHandler2.commit start commit{flags=0,_version_=0,optimize=false,openSearcher=true,waitSearcher=true,expungeDeletes=false,softCommit=false}
[junit4:junit4]   2> 1087 T7071 C194 oasc.SolrDeletionPolicy.onCommit SolrDeletionPolicy.onCommit: commits:num=2
[junit4:junit4]   2> 		commit{dir=MockDirWrapper(org.apache.lucene.store.RAMDirectory@6d596f3c lockFactory=org.apache.lucene.store.SingleInstanceLockFactory@7eef8143),segFN=segments_1,generation=1,filenames=[segments_1]
[junit4:junit4]   2> 		commit{dir=MockDirWrapper(org.apache.lucene.store.RAMDirectory@6d596f3c lockFactory=org.apache.lucene.store.SingleInstanceLockFactory@7eef8143),segFN=segments_2,generation=2,filenames=[_0.fld, _0.inf, _0_2.len, segments_2, _0.pst, _0.si]
[junit4:junit4]   2> 1087 T7071 C194 oasc.SolrDeletionPolicy.updateCommits newest commit = 2
[junit4:junit4]   2> 1088 T7071 C194 oass.SolrIndexSearcher.<init> Opening Searcher@7ac79dfa main
[junit4:junit4]   2> 1088 T7071 C194 oass.SolrIndexSearcher.getIndexDir WARNING WARNING: Directory impl does not support setting indexDir: org.apache.lucene.store.MockDirectoryWrapper
[junit4:junit4]   2> 1089 T7071 C194 oasu.DirectUpdateHandler2.commit end_commit_flush
[junit4:junit4]   2> 1089 T7078 oasc.SolrCore.registerSearcher [collection1] Registered new searcher Searcher@7ac79dfa main{StandardDirectoryReader(segments_2:4 _0(5.0):C3)}
[junit4:junit4]   2> 1089 T7071 C194 UPDATE [collection1] webapp=/solr path=/update params={wt=javabin&commit=true&waitSearcher=true&version=2&softCommit=false} {commit=} 0 4
[junit4:junit4]   2> 1092 T7042 C191 REQ [collection1] webapp=/solr path=/elevate params={qt=/elevate&fl=id,+score,+[elevated]&q=*:*&version=2&shards.qt=/elevate&sort=id+desc&wt=javabin&rows=500&distrib=false} hits=7 status=0 QTime=1 
[junit4:junit4]   2> 1101 T7062 C193 REQ [collection1] webapp=/solr path=/elevate params={shard.url=localhost:33958/solr&fl=id,score&version=2&shards.qt=/elevate&distrib=false&start=0&qt=/elevate&NOW=1343783296454&q=*:*&fsv=true&sort=id+desc&wt=javabin&rows=500&isShard=true} hits=2 status=0 QTime=0 
[junit4:junit4]   2> 1102 T7072 C194 REQ [collection1] webapp=/solr path=/elevate params={shard.url=localhost:44204/solr&fl=id,score&version=2&shards.qt=/elevate&distrib=false&start=0&qt=/elevate&NOW=1343783296454&q=*:*&fsv=true&sort=id+desc&wt=javabin&rows=500&isShard=true} hits=3 status=0 QTime=2 
[junit4:junit4]   2> 1102 T7052 C192 REQ [collection1] webapp=/solr path=/elevate params={shard.url=localhost:35495/solr&fl=id,score&version=2&shards.qt=/elevate&distrib=false&start=0&qt=/elevate&NOW=1343783296454&q=*:*&fsv=true&sort=id+desc&wt=javabin&rows=500&isShard=true} hits=2 status=0 QTime=1 
[junit4:junit4]   2> 1105 T7072 C194 REQ [collection1] webapp=/solr path=/elevate params={shard.url=localhost:44204/solr&fl=id,+score,+[elevated]&version=2&shards.qt=/elevate&distrib=false&qt=/elevate&NOW=1343783296454&q=*:*&ids=7.0,3.0,6.0&wt=javabin&rows=500&isShard=true} status=0 QTime=0 
[junit4:junit4]   2> 1105 T7052 C192 REQ [collection1] webapp=/solr path=/elevate params={shard.url=localhost:35495/solr&fl=id,+score,+[elevated]&version=2&shards.qt=/elevate&distrib=false&qt=/elevate&NOW=1343783296454&q=*:*&ids=4.0,1.0&wt=javabin&rows=500&isShard=true} status=0 QTime=0 
[junit4:junit4]   2> 1106 T7062 C193 REQ [collection1] webapp=/solr path=/elevate params={shard.url=localhost:33958/solr&fl=id,+score,+[elevated]&version=2&shards.qt=/elevate&distrib=false&qt=/elevate&NOW=1343783296454&q=*:*&ids=2.0,5.0&wt=javabin&rows=500&isShard=true} status=0 QTime=0 
[junit4:junit4]   2> 1107 T7071 C194 REQ [collection1] webapp=/solr path=/elevate params={qt=/elevate&fl=id,+score,+[elevated]&q=*:*&version=2&shards.qt=/elevate&sort=id+desc&wt=javabin&rows=500&shards=localhost:35495/solr,localhost:33958/solr,localhost:44204/solr} status=0 QTime=12 
[junit4:junit4]   2> 1108 T7038 oas.BaseDistributedSearchTestCase.compareResponses SEVERE Mismatched responses:
[junit4:junit4]   2> 	{responseHeader={status=0,QTime=12,params={qt=/elevate,fl=id, score, [elevated],q=*:*,version=2,shards.qt=/elevate,sort=id desc,wt=javabin,rows=500,shards=localhost:35495/solr,localhost:33958/solr,localhost:44204/solr}},response={numFound=7,start=0,maxScore=1.0,docs=[SolrDocument{id=7.0, [elevated]=false, score=1.0}, SolrDocument{id=6.0, [elevated]=false, score=1.0}, SolrDocument{id=5.0, [elevated]=false, score=1.0}, SolrDocument{id=4.0, [elevated]=false, score=1.0}, SolrDocument{id=3.0, [elevated]=false, score=1.0}, SolrDocument{id=2.0, [elevated]=false, score=1.0}, SolrDocument{id=1.0, [elevated]=false, score=1.0}]}}
[junit4:junit4]   2> 	{responseHeader={status=0,QTime=1,params={qt=/elevate,fl=id, score, [elevated],q=*:*,version=2,shards.qt=/elevate,sort=id desc,wt=javabin,rows=500,distrib=false}},response={numFound=7,start=0,maxScore=1.0,docs=[SolrDocument{id=7.0, score=1.0, [elevated]=false}, SolrDocument{id=6.0, score=1.0, [elevated]=false}, SolrDocument{id=5.0, score=1.0, [elevated]=false}, SolrDocument{id=4.0, score=1.0, [elevated]=false}, SolrDocument{id=3.0, score=1.0, [elevated]=false}, SolrDocument{id=2.0, score=1.0, [elevated]=false}, SolrDocument{id=1.0, score=1.0, [elevated]=false}]}}
[junit4:junit4]   2> 1109 T7038 oasc.CoreContainer.shutdown Shutting down CoreContainer instance=1430475293
[junit4:junit4]   2> 1110 T7038 oasc.SolrCore.close [collection1]  CLOSING SolrCore org.apache.solr.core.SolrCore@5bfe44b5
[junit4:junit4]   2> 1110 T7038 oasc.SolrCore.closeSearcher [collection1] Closing main searcher on request.
[junit4:junit4]   2> 1111 T7038 oasu.DirectUpdateHandler2.close closing DirectUpdateHandler2{commits=1,autocommits=0,soft autocommits=0,optimizes=0,rollbacks=0,expungeDeletes=0,docsPending=0,adds=0,deletesById=0,deletesByQuery=0,errors=0,cumulative_adds=7,cumulative_deletesById=0,cumulative_deletesByQuery=1,cumulative_errors=0}
[junit4:junit4]   2> 1114 T7038 oejsh.ContextHandler.doStop stopped o.e.j.s.ServletContextHandler{/solr,null}
[junit4:junit4]   2> 1166 T7038 oasc.CoreContainer.shutdown Shutting down CoreContainer instance=1296918623
[junit4:junit4]   2> 1167 T7038 oasc.SolrCore.close [collection1]  CLOSING SolrCore org.apache.solr.core.SolrCore@31b4fff6
[junit4:junit4]   2> 1168 T7038 oasc.SolrCore.closeSearcher [collection1] Closing main searcher on request.
[junit4:junit4]   2> 1168 T7038 oasu.DirectUpdateHandler2.close closing DirectUpdateHandler2{commits=1,autocommits=0,soft autocommits=0,optimizes=0,rollbacks=0,expungeDeletes=0,docsPending=0,adds=0,deletesById=0,deletesByQuery=0,errors=0,cumulative_adds=2,cumulative_deletesById=0,cumulative_deletesByQuery=1,cumulative_errors=0}
[junit4:junit4]   2> 1171 T7038 oejsh.ContextHandler.doStop stopped o.e.j.s.ServletContextHandler{/solr,null}
[junit4:junit4]   2> 1223 T7038 oasc.CoreContainer.shutdown Shutting down CoreContainer instance=1790245948
[junit4:junit4]   2> 1224 T7038 oasc.SolrCore.close [collection1]  CLOSING SolrCore org.apache.solr.core.SolrCore@1501685e
[junit4:junit4]   2> 1224 T7038 oasc.SolrCore.closeSearcher [collection1] Closing main searcher on request.
[junit4:junit4]   2> 1225 T7038 oasu.DirectUpdateHandler2.close closing DirectUpdateHandler2{commits=1,autocommits=0,soft autocommits=0,optimizes=0,rollbacks=0,expungeDeletes=0,docsPending=0,adds=0,deletesById=0,deletesByQuery=0,errors=0,cumulative_adds=2,cumulative_deletesById=0,cumulative_deletesByQuery=1,cumulative_errors=0}
[junit4:junit4]   2> 1227 T7038 oejsh.ContextHandler.doStop stopped o.e.j.s.ServletContextHandler{/solr,null}
[junit4:junit4]   2> 1280 T7038 oasc.CoreContainer.shutdown Shutting down CoreContainer instance=1944385452
[junit4:junit4]   2> 1281 T7038 oasc.SolrCore.close [collection1]  CLOSING SolrCore org.apache.solr.core.SolrCore@2f81b809
[junit4:junit4]   2> 1281 T7038 oasc.SolrCore.closeSearcher [collection1] Closing main searcher on request.
[junit4:junit4]   2> 1282 T7038 oasu.DirectUpdateHandler2.close closing DirectUpdateHandler2{commits=1,autocommits=0,soft autocommits=0,optimizes=0,rollbacks=0,expungeDeletes=0,docsPending=0,adds=0,deletesById=0,deletesByQuery=0,errors=0,cumulative_adds=3,cumulative_deletesById=0,cumulative_deletesByQuery=1,cumulative_errors=0}
[junit4:junit4]   2> 1285 T7038 oejsh.ContextHandler.doStop stopped o.e.j.s.ServletContextHandler{/solr,null}
[junit4:junit4]   2> 1343 T7038 oas.SolrTestCaseJ4.tearDown ###Ending testDistribSearch
[junit4:junit4]   2> NOTE: reproduce with: ant test  -Dtestcase=DistributedQueryElevationComponentTest -Dtests.method=testDistribSearch -Dtests.seed=5FFE58FE1E60FA4E -Dtests.multiplier=3 -Dtests.slow=true -Dtests.locale=hr -Dtests.timezone=Canada/Atlantic -Dtests.file.encoding=ISO-8859-1
[junit4:junit4]   2>
[junit4:junit4]    > (@AfterClass output)
[junit4:junit4]   2> 1399 T7038 oas.SolrTestCaseJ4.deleteCore ###deleteCore
[junit4:junit4]   2> NOTE: test params are: codec=SimpleText, sim=RandomSimilarityProvider(queryNorm=true,coord=true): {}, locale=hr, timezone=Canada/Atlantic
[junit4:junit4]   2> NOTE: Linux 3.2.0-27-generic amd64/Oracle Corporation 1.8.0-ea (64-bit)/cpus=8,threads=1,free=260875696,total=536870912
[junit4:junit4]   2> NOTE: All tests run in this JVM: [JSONWriterTest, DistributedSpellCheckComponentTest, MinimalSchemaTest, TestIndexSearcher, PathHierarchyTokenizerFactoryTest, TestJmxMonitoredMap, PreAnalyzedFieldTest, TermsComponentTest, FastVectorHighlighterTest, TestPseudoReturnFields, DefaultValueUpdateProcessorTest, TestSystemIdResolver, TestMultiCoreConfBootstrap, AnalysisAfterCoreReloadTest, SolrCmdDistributorTest, TestExtendedDismaxParser, PingRequestHandlerTest, UpdateRequestProcessorFactoryTest, SpellPossibilityIteratorTest, PeerSyncTest, TestDistributedSearch, TestCollationField, UniqFieldsUpdateProcessorFactoryTest, DOMUtilTest, TestReload, TestFastLRUCache, LeaderElectionIntegrationTest, FullSolrCloudDistribCmdsTest, TestCoreContainer, NumericFieldsTest, CopyFieldTest, CloudStateTest, DistributedTermsComponentTest, BinaryUpdateRequestHandlerTest, PluginInfoTest, TestIBSimilarityFactory, DateFieldTest, ResourceLoaderTest, DirectSolrSpellCheckerTest, SolrCoreCheckLockOnStartupTest, MBeansHandlerTest, TestSort, DirectSolrConnectionTest, TestLFUCache, BasicDistributedZkTest, TestStressReorder, NotRequiredUniqueKeyTest, TestValueSourceCache, TestIndexingPerformance, TestSearchPerf, TestUtils, TestSurroundQueryParser, IndexSchemaRuntimeFieldTest, RecoveryZkTest, TestRealTimeGet, TestRandomFaceting, SolrCoreTest, TestRangeQuery, LukeRequestHandlerTest, FileBasedSpellCheckerTest, ConvertedLegacyTest, QueryElevationComponentTest, SortByFunctionTest, BasicFunctionalityTest, SignatureUpdateProcessorFactoryTest, TestBinaryResponseWriter, TestJmxIntegration, CoreAdminHandlerTest, TestFunctionQuery, TestTrie, SolrRequestParserTest, TestRemoteStreaming, CacheHeaderTest, TestWordDelimiterFilterFactory, TestCSVLoader, PolyFieldTest, SpatialFilterTest, MoreLikeThisHandlerTest, DistributedQueryElevationComponentTest]
[junit4:junit4]   2> 
[junit4:junit4] Completed on J0 in 1.40s, 1 test, 1 failure <<< FAILURES!

[...truncated 226 lines...]
BUILD FAILED
/mnt/ssd/jenkins/workspace/Lucene-Solr-trunk-Linux/checkout/build.xml:29: The following error occurred while executing this line:
/mnt/ssd/jenkins/workspace/Lucene-Solr-trunk-Linux/checkout/solr/build.xml:144: The following error occurred while executing this line:
/mnt/ssd/jenkins/workspace/Lucene-Solr-trunk-Linux/checkout/lucene/module-build.xml:62: The following error occurred while executing this line:
/mnt/ssd/jenkins/workspace/Lucene-Solr-trunk-Linux/checkout/lucene/common-build.xml:1095: The following error occurred while executing this line:
/mnt/ssd/jenkins/workspace/Lucene-Solr-trunk-Linux/checkout/lucene/common-build.xml:790: There were test failures: 223 suites, 899 tests, 1 failure, 5 ignored

Total time: 21 minutes 47 seconds
Build step 'Execute shell' marked build as failure
Archiving artifacts
Recording test results
Email was triggered for: Failure
Sending email for trigger: Failure



Mime
View raw message