lucene-dev mailing list archives

Site index · List index
Message view « Date » · « Thread »
Top « Date » · « Thread »
From Policeman Jenkins Server <jenk...@sd-datasolutions.de>
Subject [JENKINS] Lucene-Solr-trunk-Linux (32bit/jdk1.8.0-ea-b49) - Build # 143 - Failure!
Date Fri, 03 Aug 2012 16:59:33 GMT
Build: http://jenkins.sd-datasolutions.de/job/Lucene-Solr-trunk-Linux/143/
Java: 32bit/jdk1.8.0-ea-b49 -server -XX:+UseSerialGC

2 tests failed.
REGRESSION:  org.apache.solr.cloud.ZkSolrClientTest.testWatchChildren

Error Message:
expected:<2> but was:<1>

Stack Trace:
java.lang.AssertionError: expected:<2> but was:<1>
	at __randomizedtesting.SeedInfo.seed([749D5A1AB7D5CE95:3CE33806F011742E]:0)
	at org.junit.Assert.fail(Assert.java:93)
	at org.junit.Assert.failNotEquals(Assert.java:647)
	at org.junit.Assert.assertEquals(Assert.java:128)
	at org.junit.Assert.assertEquals(Assert.java:472)
	at org.junit.Assert.assertEquals(Assert.java:456)
	at org.apache.solr.cloud.ZkSolrClientTest.testWatchChildren(ZkSolrClientTest.java:218)
	at sun.reflect.NativeMethodAccessorImpl.invoke0(Native Method)
	at sun.reflect.NativeMethodAccessorImpl.invoke(NativeMethodAccessorImpl.java:57)
	at sun.reflect.DelegatingMethodAccessorImpl.invoke(DelegatingMethodAccessorImpl.java:43)
	at java.lang.reflect.Method.invoke(Method.java:474)
	at com.carrotsearch.randomizedtesting.RandomizedRunner.invoke(RandomizedRunner.java:1995)
	at com.carrotsearch.randomizedtesting.RandomizedRunner.access$1100(RandomizedRunner.java:132)
	at com.carrotsearch.randomizedtesting.RandomizedRunner$6.evaluate(RandomizedRunner.java:818)
	at com.carrotsearch.randomizedtesting.RandomizedRunner$7.evaluate(RandomizedRunner.java:877)
	at com.carrotsearch.randomizedtesting.RandomizedRunner$8.evaluate(RandomizedRunner.java:891)
	at com.carrotsearch.randomizedtesting.rules.SystemPropertiesRestoreRule$1.evaluate(SystemPropertiesRestoreRule.java:53)
	at org.apache.lucene.util.TestRuleSetupTeardownChained$1.evaluate(TestRuleSetupTeardownChained.java:50)
	at org.apache.lucene.util.TestRuleFieldCacheSanity$1.evaluate(TestRuleFieldCacheSanity.java:32)
	at org.apache.lucene.util.AbstractBeforeAfterRule$1.evaluate(AbstractBeforeAfterRule.java:45)
	at com.carrotsearch.randomizedtesting.rules.SystemPropertiesInvariantRule$1.evaluate(SystemPropertiesInvariantRule.java:55)
	at org.apache.lucene.util.TestRuleReportUncaughtExceptions$1.evaluate(TestRuleReportUncaughtExceptions.java:68)
	at org.apache.lucene.util.TestRuleThreadAndTestName$1.evaluate(TestRuleThreadAndTestName.java:48)
	at org.apache.lucene.util.TestRuleIgnoreAfterMaxFailures$1.evaluate(TestRuleIgnoreAfterMaxFailures.java:70)
	at org.apache.lucene.util.TestRuleMarkFailure$1.evaluate(TestRuleMarkFailure.java:48)
	at com.carrotsearch.randomizedtesting.RandomizedRunner.runSingleTest(RandomizedRunner.java:825)
	at com.carrotsearch.randomizedtesting.RandomizedRunner.access$700(RandomizedRunner.java:132)
	at com.carrotsearch.randomizedtesting.RandomizedRunner$3$1.run(RandomizedRunner.java:671)
	at com.carrotsearch.randomizedtesting.RandomizedRunner$3.evaluate(RandomizedRunner.java:697)
	at com.carrotsearch.randomizedtesting.RandomizedRunner$4.evaluate(RandomizedRunner.java:736)
	at com.carrotsearch.randomizedtesting.RandomizedRunner$5.evaluate(RandomizedRunner.java:747)
	at com.carrotsearch.randomizedtesting.rules.SystemPropertiesRestoreRule$1.evaluate(SystemPropertiesRestoreRule.java:53)
	at org.apache.lucene.util.AbstractBeforeAfterRule$1.evaluate(AbstractBeforeAfterRule.java:45)
	at org.apache.lucene.util.TestRuleReportUncaughtExceptions$1.evaluate(TestRuleReportUncaughtExceptions.java:68)
	at org.apache.lucene.util.TestRuleStoreClassName$1.evaluate(TestRuleStoreClassName.java:38)
	at com.carrotsearch.randomizedtesting.rules.SystemPropertiesInvariantRule$1.evaluate(SystemPropertiesInvariantRule.java:55)
	at org.apache.lucene.util.TestRuleNoInstanceHooksOverrides$1.evaluate(TestRuleNoInstanceHooksOverrides.java:53)
	at org.apache.lucene.util.TestRuleNoStaticHooksShadowing$1.evaluate(TestRuleNoStaticHooksShadowing.java:52)
	at org.apache.lucene.util.TestRuleAssertionsRequired$1.evaluate(TestRuleAssertionsRequired.java:36)
	at org.apache.lucene.util.TestRuleMarkFailure$1.evaluate(TestRuleMarkFailure.java:48)
	at org.apache.lucene.util.TestRuleIgnoreAfterMaxFailures$1.evaluate(TestRuleIgnoreAfterMaxFailures.java:70)
	at org.apache.lucene.util.TestRuleIgnoreTestSuites$1.evaluate(TestRuleIgnoreTestSuites.java:55)
	at com.carrotsearch.randomizedtesting.RandomizedRunner.runSuite(RandomizedRunner.java:605)
	at com.carrotsearch.randomizedtesting.RandomizedRunner.access$400(RandomizedRunner.java:132)
	at com.carrotsearch.randomizedtesting.RandomizedRunner$2.run(RandomizedRunner.java:551)


REGRESSION:  org.apache.solr.handler.component.DistributedQueryElevationComponentTest.testDistribSearch

Error Message:
.responseHeader.params.shards.qt:/elevate!=false

Stack Trace:
junit.framework.AssertionFailedError: .responseHeader.params.shards.qt:/elevate!=false
	at __randomizedtesting.SeedInfo.seed([749D5A1AB7D5CE95:F57BD402C08AAEA9]:0)
	at junit.framework.Assert.fail(Assert.java:50)
	at org.apache.solr.BaseDistributedSearchTestCase.compareResponses(BaseDistributedSearchTestCase.java:670)
	at org.apache.solr.BaseDistributedSearchTestCase.query(BaseDistributedSearchTestCase.java:392)
	at org.apache.solr.handler.component.DistributedQueryElevationComponentTest.doTest(DistributedQueryElevationComponentTest.java:81)
	at org.apache.solr.BaseDistributedSearchTestCase.testDistribSearch(BaseDistributedSearchTestCase.java:679)
	at sun.reflect.NativeMethodAccessorImpl.invoke0(Native Method)
	at sun.reflect.NativeMethodAccessorImpl.invoke(NativeMethodAccessorImpl.java:57)
	at sun.reflect.DelegatingMethodAccessorImpl.invoke(DelegatingMethodAccessorImpl.java:43)
	at java.lang.reflect.Method.invoke(Method.java:474)
	at com.carrotsearch.randomizedtesting.RandomizedRunner.invoke(RandomizedRunner.java:1995)
	at com.carrotsearch.randomizedtesting.RandomizedRunner.access$1100(RandomizedRunner.java:132)
	at com.carrotsearch.randomizedtesting.RandomizedRunner$6.evaluate(RandomizedRunner.java:818)
	at com.carrotsearch.randomizedtesting.RandomizedRunner$7.evaluate(RandomizedRunner.java:877)
	at com.carrotsearch.randomizedtesting.RandomizedRunner$8.evaluate(RandomizedRunner.java:891)
	at com.carrotsearch.randomizedtesting.rules.SystemPropertiesRestoreRule$1.evaluate(SystemPropertiesRestoreRule.java:53)
	at org.apache.lucene.util.TestRuleSetupTeardownChained$1.evaluate(TestRuleSetupTeardownChained.java:50)
	at org.apache.lucene.util.TestRuleFieldCacheSanity$1.evaluate(TestRuleFieldCacheSanity.java:32)
	at org.apache.lucene.util.AbstractBeforeAfterRule$1.evaluate(AbstractBeforeAfterRule.java:45)
	at com.carrotsearch.randomizedtesting.rules.SystemPropertiesInvariantRule$1.evaluate(SystemPropertiesInvariantRule.java:55)
	at org.apache.lucene.util.TestRuleReportUncaughtExceptions$1.evaluate(TestRuleReportUncaughtExceptions.java:68)
	at org.apache.lucene.util.TestRuleThreadAndTestName$1.evaluate(TestRuleThreadAndTestName.java:48)
	at org.apache.lucene.util.TestRuleIgnoreAfterMaxFailures$1.evaluate(TestRuleIgnoreAfterMaxFailures.java:70)
	at org.apache.lucene.util.TestRuleMarkFailure$1.evaluate(TestRuleMarkFailure.java:48)
	at com.carrotsearch.randomizedtesting.RandomizedRunner.runSingleTest(RandomizedRunner.java:825)
	at com.carrotsearch.randomizedtesting.RandomizedRunner.access$700(RandomizedRunner.java:132)
	at com.carrotsearch.randomizedtesting.RandomizedRunner$3$1.run(RandomizedRunner.java:671)
	at com.carrotsearch.randomizedtesting.RandomizedRunner$3.evaluate(RandomizedRunner.java:697)
	at com.carrotsearch.randomizedtesting.RandomizedRunner$4.evaluate(RandomizedRunner.java:736)
	at com.carrotsearch.randomizedtesting.RandomizedRunner$5.evaluate(RandomizedRunner.java:747)
	at com.carrotsearch.randomizedtesting.rules.SystemPropertiesRestoreRule$1.evaluate(SystemPropertiesRestoreRule.java:53)
	at org.apache.lucene.util.AbstractBeforeAfterRule$1.evaluate(AbstractBeforeAfterRule.java:45)
	at org.apache.lucene.util.TestRuleReportUncaughtExceptions$1.evaluate(TestRuleReportUncaughtExceptions.java:68)
	at org.apache.lucene.util.TestRuleStoreClassName$1.evaluate(TestRuleStoreClassName.java:38)
	at com.carrotsearch.randomizedtesting.rules.SystemPropertiesInvariantRule$1.evaluate(SystemPropertiesInvariantRule.java:55)
	at org.apache.lucene.util.TestRuleNoInstanceHooksOverrides$1.evaluate(TestRuleNoInstanceHooksOverrides.java:53)
	at org.apache.lucene.util.TestRuleNoStaticHooksShadowing$1.evaluate(TestRuleNoStaticHooksShadowing.java:52)
	at org.apache.lucene.util.TestRuleAssertionsRequired$1.evaluate(TestRuleAssertionsRequired.java:36)
	at org.apache.lucene.util.TestRuleMarkFailure$1.evaluate(TestRuleMarkFailure.java:48)
	at org.apache.lucene.util.TestRuleIgnoreAfterMaxFailures$1.evaluate(TestRuleIgnoreAfterMaxFailures.java:70)
	at org.apache.lucene.util.TestRuleIgnoreTestSuites$1.evaluate(TestRuleIgnoreTestSuites.java:55)
	at com.carrotsearch.randomizedtesting.RandomizedRunner.runSuite(RandomizedRunner.java:605)
	at com.carrotsearch.randomizedtesting.RandomizedRunner.access$400(RandomizedRunner.java:132)
	at com.carrotsearch.randomizedtesting.RandomizedRunner$2.run(RandomizedRunner.java:551)




Build Log:
[...truncated 7360 lines...]
[junit4:junit4] Suite: org.apache.solr.handler.component.DistributedQueryElevationComponentTest
[junit4:junit4] FAILURE 2.22s J1 | DistributedQueryElevationComponentTest.testDistribSearch
[junit4:junit4]    > Throwable #1: junit.framework.AssertionFailedError: .responseHeader.params.shards.qt:/elevate!=false
[junit4:junit4]    > 	at __randomizedtesting.SeedInfo.seed([749D5A1AB7D5CE95:F57BD402C08AAEA9]:0)
[junit4:junit4]    > 	at junit.framework.Assert.fail(Assert.java:50)
[junit4:junit4]    > 	at org.apache.solr.BaseDistributedSearchTestCase.compareResponses(BaseDistributedSearchTestCase.java:670)
[junit4:junit4]    > 	at org.apache.solr.BaseDistributedSearchTestCase.query(BaseDistributedSearchTestCase.java:392)
[junit4:junit4]    > 	at org.apache.solr.handler.component.DistributedQueryElevationComponentTest.doTest(DistributedQueryElevationComponentTest.java:81)
[junit4:junit4]    > 	at org.apache.solr.BaseDistributedSearchTestCase.testDistribSearch(BaseDistributedSearchTestCase.java:679)
[junit4:junit4]    > 	at sun.reflect.NativeMethodAccessorImpl.invoke0(Native Method)
[junit4:junit4]    > 	at sun.reflect.NativeMethodAccessorImpl.invoke(NativeMethodAccessorImpl.java:57)
[junit4:junit4]    > 	at sun.reflect.DelegatingMethodAccessorImpl.invoke(DelegatingMethodAccessorImpl.java:43)
[junit4:junit4]    > 	at java.lang.reflect.Method.invoke(Method.java:474)
[junit4:junit4]    > 	at com.carrotsearch.randomizedtesting.RandomizedRunner.invoke(RandomizedRunner.java:1995)
[junit4:junit4]    > 	at com.carrotsearch.randomizedtesting.RandomizedRunner.access$1100(RandomizedRunner.java:132)
[junit4:junit4]    > 	at com.carrotsearch.randomizedtesting.RandomizedRunner$6.evaluate(RandomizedRunner.java:818)
[junit4:junit4]    > 	at com.carrotsearch.randomizedtesting.RandomizedRunner$7.evaluate(RandomizedRunner.java:877)
[junit4:junit4]    > 	at com.carrotsearch.randomizedtesting.RandomizedRunner$8.evaluate(RandomizedRunner.java:891)
[junit4:junit4]    > 	at com.carrotsearch.randomizedtesting.rules.SystemPropertiesRestoreRule$1.evaluate(SystemPropertiesRestoreRule.java:53)
[junit4:junit4]    > 	at org.apache.lucene.util.TestRuleSetupTeardownChained$1.evaluate(TestRuleSetupTeardownChained.java:50)
[junit4:junit4]    > 	at org.apache.lucene.util.TestRuleFieldCacheSanity$1.evaluate(TestRuleFieldCacheSanity.java:32)
[junit4:junit4]    > 	at org.apache.lucene.util.AbstractBeforeAfterRule$1.evaluate(AbstractBeforeAfterRule.java:45)
[junit4:junit4]    > 	at com.carrotsearch.randomizedtesting.rules.SystemPropertiesInvariantRule$1.evaluate(SystemPropertiesInvariantRule.java:55)
[junit4:junit4]    > 	at org.apache.lucene.util.TestRuleReportUncaughtExceptions$1.evaluate(TestRuleReportUncaughtExceptions.java:68)
[junit4:junit4]    > 	at org.apache.lucene.util.TestRuleThreadAndTestName$1.evaluate(TestRuleThreadAndTestName.java:48)
[junit4:junit4]    > 	at org.apache.lucene.util.TestRuleIgnoreAfterMaxFailures$1.evaluate(TestRuleIgnoreAfterMaxFailures.java:70)
[junit4:junit4]    > 	at org.apache.lucene.util.TestRuleMarkFailure$1.evaluate(TestRuleMarkFailure.java:48)
[junit4:junit4]    > 	at com.carrotsearch.randomizedtesting.RandomizedRunner.runSingleTest(RandomizedRunner.java:825)
[junit4:junit4]    > 	at com.carrotsearch.randomizedtesting.RandomizedRunner.access$700(RandomizedRunner.java:132)
[junit4:junit4]    > 	at com.carrotsearch.randomizedtesting.RandomizedRunner$3$1.run(RandomizedRunner.java:671)
[junit4:junit4]    > 	at com.carrotsearch.randomizedtesting.RandomizedRunner$3.evaluate(RandomizedRunner.java:697)
[junit4:junit4]    > 	at com.carrotsearch.randomizedtesting.RandomizedRunner$4.evaluate(RandomizedRunner.java:736)
[junit4:junit4]    > 	at com.carrotsearch.randomizedtesting.RandomizedRunner$5.evaluate(RandomizedRunner.java:747)
[junit4:junit4]    > 	at com.carrotsearch.randomizedtesting.rules.SystemPropertiesRestoreRule$1.evaluate(SystemPropertiesRestoreRule.java:53)
[junit4:junit4]    > 	at org.apache.lucene.util.AbstractBeforeAfterRule$1.evaluate(AbstractBeforeAfterRule.java:45)
[junit4:junit4]    > 	at org.apache.lucene.util.TestRuleReportUncaughtExceptions$1.evaluate(TestRuleReportUncaughtExceptions.java:68)
[junit4:junit4]    > 	at org.apache.lucene.util.TestRuleStoreClassName$1.evaluate(TestRuleStoreClassName.java:38)
[junit4:junit4]    > 	at com.carrotsearch.randomizedtesting.rules.SystemPropertiesInvariantRule$1.evaluate(SystemPropertiesInvariantRule.java:55)
[junit4:junit4]    > 	at org.apache.lucene.util.TestRuleNoInstanceHooksOverrides$1.evaluate(TestRuleNoInstanceHooksOverrides.java:53)
[junit4:junit4]    > 	at org.apache.lucene.util.TestRuleNoStaticHooksShadowing$1.evaluate(TestRuleNoStaticHooksShadowing.java:52)
[junit4:junit4]    > 	at org.apache.lucene.util.TestRuleAssertionsRequired$1.evaluate(TestRuleAssertionsRequired.java:36)
[junit4:junit4]    > 	at org.apache.lucene.util.TestRuleMarkFailure$1.evaluate(TestRuleMarkFailure.java:48)
[junit4:junit4]    > 	at org.apache.lucene.util.TestRuleIgnoreAfterMaxFailures$1.evaluate(TestRuleIgnoreAfterMaxFailures.java:70)
[junit4:junit4]    > 	at org.apache.lucene.util.TestRuleIgnoreTestSuites$1.evaluate(TestRuleIgnoreTestSuites.java:55)
[junit4:junit4]    > 	at com.carrotsearch.randomizedtesting.RandomizedRunner.runSuite(RandomizedRunner.java:605)
[junit4:junit4]    > 	at com.carrotsearch.randomizedtesting.RandomizedRunner.access$400(RandomizedRunner.java:132)
[junit4:junit4]    > 	at com.carrotsearch.randomizedtesting.RandomizedRunner$2.run(RandomizedRunner.java:551)
[junit4:junit4]    > 
[junit4:junit4]   2> 1 T452 oas.SolrTestCaseJ4.setUp ###Starting testDistribSearch
[junit4:junit4]   2> 61 T452 oejs.Server.doStart jetty-8.1.2.v20120308
[junit4:junit4]   2> 131 T452 oejs.AbstractConnector.doStart Started SocketConnector@0.0.0.0:44732
[junit4:junit4]   2> 141 T452 oasc.SolrResourceLoader.locateSolrHome JNDI not configured for solr (NoInitialContextEx)
[junit4:junit4]   2> 142 T452 oasc.SolrResourceLoader.locateSolrHome using system property solr.solr.home: /mnt/ssd/jenkins/workspace/Lucene-Solr-trunk-Linux/checkout/solr/build/solr-core/test-files/solr
[junit4:junit4]   2> 142 T452 oasc.SolrResourceLoader.<init> new SolrResourceLoader for deduced Solr Home: '/mnt/ssd/jenkins/workspace/Lucene-Solr-trunk-Linux/checkout/solr/build/solr-core/test-files/solr/'
[junit4:junit4]   2> 156 T452 oass.SolrDispatchFilter.init SolrDispatchFilter.init()
[junit4:junit4]   2> 156 T452 oasc.SolrResourceLoader.locateSolrHome JNDI not configured for solr (NoInitialContextEx)
[junit4:junit4]   2> 157 T452 oasc.SolrResourceLoader.locateSolrHome using system property solr.solr.home: /mnt/ssd/jenkins/workspace/Lucene-Solr-trunk-Linux/checkout/solr/build/solr-core/test-files/solr
[junit4:junit4]   2> 159 T452 oasc.CoreContainer$Initializer.initialize looking for solr.xml: /mnt/ssd/jenkins/workspace/Lucene-Solr-trunk-Linux/checkout/solr/build/solr-core/test-files/solr/solr.xml
[junit4:junit4]   2> 159 T452 oasc.CoreContainer.<init> New CoreContainer 18661566
[junit4:junit4]   2> 159 T452 oasc.CoreContainer.load Loading CoreContainer using Solr Home: '/mnt/ssd/jenkins/workspace/Lucene-Solr-trunk-Linux/checkout/solr/build/solr-core/test-files/solr/'
[junit4:junit4]   2> 160 T452 oasc.SolrResourceLoader.<init> new SolrResourceLoader for directory: '/mnt/ssd/jenkins/workspace/Lucene-Solr-trunk-Linux/checkout/solr/build/solr-core/test-files/solr/'
[junit4:junit4]   2> 191 T452 oasc.CoreContainer.load Registering Log Listener
[junit4:junit4]   2> 223 T452 oasc.CoreContainer.create Creating SolrCore 'collection1' using instanceDir: /mnt/ssd/jenkins/workspace/Lucene-Solr-trunk-Linux/checkout/solr/build/solr-core/test-files/solr/collection1
[junit4:junit4]   2> 224 T452 oasc.SolrResourceLoader.<init> new SolrResourceLoader for directory: '/mnt/ssd/jenkins/workspace/Lucene-Solr-trunk-Linux/checkout/solr/build/solr-core/test-files/solr/collection1/'
[junit4:junit4]   2> 224 T452 oasc.SolrResourceLoader.replaceClassLoader Adding 'file:/mnt/ssd/jenkins/workspace/Lucene-Solr-trunk-Linux/checkout/solr/build/solr-core/test-files/solr/collection1/lib/README' to classloader
[junit4:junit4]   2> 225 T452 oasc.SolrResourceLoader.replaceClassLoader Adding 'file:/mnt/ssd/jenkins/workspace/Lucene-Solr-trunk-Linux/checkout/solr/build/solr-core/test-files/solr/collection1/lib/classes/' to classloader
[junit4:junit4]   2> 268 T452 oasc.SolrConfig.<init> Using Lucene MatchVersion: LUCENE_50
[junit4:junit4]   2> 313 T452 oasc.SolrConfig.<init> Loaded SolrConfig: solrconfig-elevate.xml
[junit4:junit4]   2> 314 T452 oass.IndexSchema.readSchema Reading Solr Schema
[junit4:junit4]   2> 333 T452 oass.IndexSchema.readSchema Schema name=example
[junit4:junit4]   2> 494 T452 oass.IndexSchema.readSchema default search field in schema is text
[junit4:junit4]   2> 495 T452 oass.IndexSchema.readSchema unique key field: id
[junit4:junit4]   2> 498 T452 oasc.SolrCore.<init> [collection1] Opening new SolrCore at /mnt/ssd/jenkins/workspace/Lucene-Solr-trunk-Linux/checkout/solr/build/solr-core/test-files/solr/collection1/, dataDir=./org.apache.solr.handler.component.DistributedQueryElevationComponentTest-1344012881316/control/data/
[junit4:junit4]   2> 498 T452 oasc.JmxMonitoredMap.<init> JMX monitoring is enabled. Adding Solr mbeans to JMX Server: com.sun.jmx.mbeanserver.JmxMBeanServer@1f91667
[junit4:junit4]   2> 498 T452 oasc.SolrCore.getNewIndexDir WARNING New index directory detected: old=null new=./org.apache.solr.handler.component.DistributedQueryElevationComponentTest-1344012881316/control/data/index/
[junit4:junit4]   2> 499 T452 oasc.SolrCore.initIndex WARNING [collection1] Solr index directory './org.apache.solr.handler.component.DistributedQueryElevationComponentTest-1344012881316/control/data/index' doesn't exist. Creating new index...
[junit4:junit4]   2> 500 T452 oasc.SolrDeletionPolicy.onCommit SolrDeletionPolicy.onCommit: commits:num=1
[junit4:junit4]   2> 		commit{dir=BaseDirectoryWrapper(org.apache.lucene.store.RAMDirectory@18751cb lockFactory=org.apache.lucene.store.SingleInstanceLockFactory@10b1fa1),segFN=segments_1,generation=1,filenames=[segments_1]
[junit4:junit4]   2> 500 T452 oasc.SolrDeletionPolicy.updateCommits newest commit = 1
[junit4:junit4]   2> 501 T452 oasc.RequestHandlers.initHandlersFromConfig created /update: solr.UpdateRequestHandler
[junit4:junit4]   2> 501 T452 oasc.RequestHandlers.initHandlersFromConfig created /elevate: org.apache.solr.handler.component.SearchHandler
[junit4:junit4]   2> 501 T452 oasc.RequestHandlers.initHandlersFromConfig created /dataElevate: org.apache.solr.handler.component.SearchHandler
[junit4:junit4]   2> 502 T452 oashl.XMLLoader.init xsltCacheLifetimeSeconds=60
[junit4:junit4]   2> 502 T452 oasc.RequestHandlers.initHandlersFromConfig WARNING no default request handler is registered (either '/select' or 'standard')
[junit4:junit4]   2> 506 T452 oasc.SolrCore.initDeprecatedSupport WARNING solrconfig.xml uses deprecated <admin/gettableFiles>, Please update your config to use the ShowFileRequestHandler.
[junit4:junit4]   2> 507 T452 oasc.SolrCore.initDeprecatedSupport WARNING adding ShowFileRequestHandler with hidden files: [SOLRCONFIG-ELEVATE.XML, SCHEMA-SPELLCHECKER.XML, TRIVIAL.UPDATEPROCESSOR1.JS, BAD-SCHEMA-NOT-INDEXED-BUT-POS.XML, SOLRCONFIG-UPDATE-PROCESSOR-CHAINS.XML, SOLRCONFIG-DELPOLICY2.XML, SCHEMA-CHARFILTERS.XML, THROW.ERROR.ON.ADD.UPDATEPROCESSOR.JS, SOLRCONFIG_PERF.XML, SOLRCONFIG-SCRIPT-UPDATEPROCESSOR.XML, BAD-SCHEMA-OMIT-TF-BUT-NOT-POS.XML, OLD_SYNONYMS.TXT, BAD-SOLRCONFIG-INVALID-SCRIPTFILE.XML, STOPWORDSWRONGENCODING.TXT, SOLRCONFIG-SPELLCHECKER.XML, SCHEMA.XML, SOLRCONFIG-REQHANDLER.INCL, SCHEMA-STOP-KEEP.XML, TRIVIAL.UPDATEPROCESSOR0.JS, COMPOUNDDICTIONARY.TXT, MISSLEADING.EXTENSION.UPDATEPROCESSOR.JS.TXT, HUNSPELL-TEST.AFF, SCHEMA-BM25.XML, SCHEMA-LMDIRICHLET.XML, SOLRCONFIG-REPEATER.XML, SCHEMA12.XML, KEEP-1.TXT, PROTWORDS.TXT, MAPPING-ISOLATIN1ACCENT.TXT, SOLRCONFIG-FUNCTIONQUERY.XML, BAD-MP-SOLRCONFIG.XML, SCHEMA-PHRASESUGGEST.XML, SOLRCONFIG-NOCACHE.XML, SYNONYMS.TXT, SOLRCONFIG-ALTDIRECTORY.XML, SCHEMA-COLLATE.XML, STEMDICT.TXT, BAD-SCHEMA-DUP-DYNAMICFIELD.XML, SOLRCONFIG-SOLCOREPROPERTIES.XML, SOLRCONFIG-TRANSFORMERS.XML, ADDFIELDS.UPDATEPROCESSOR.JS, SOLRCONFIG-ENABLEPLUGIN.XML, XSLT, WDFTYPES.TXT, BAD-SCHEMA-NOT-INDEXED-BUT-NORMS.XML, SCHEMA-BINARYFIELD.XML, STOP-2.TXT, CONDITIONAL.UPDATEPROCESSOR.JS, HUNSPELL-TEST.DIC, DA_UTF8.XML, BAD-SOLRCONFIG-MISSING-SCRIPTFILE.XML, SOLRCONFIG-NATIVELOCK.XML, SOLRCONFIG-BASIC.XML, SOLRCONFIG-QUERYSENDER-NOQUERY.XML, OPEN-EXCHANGE-RATES.JSON, BAD-SCHEMA-NONTEXT-ANALYZER.XML, STOPWITHBOM.TXT, SCHEMA-FOLDING.XML, SOLRCONFIG-TLOG.XML, DA_COMPOUNDDICTIONARY.TXT, SCHEMA11.XML, SOLRCONFIG_CODEC.XML, SOLRCONFIG-CACHING.XML, FRENCHARTICLES.TXT, HYPHENATION.DTD, SCHEMA-REPLICATION1.XML, SCHEMA-COPYFIELD-TEST.XML, SOLRCONFIG-MASTER3.XML, SCHEMA-REVERSED.XML, SCHEMASURROUND.XML, SOLRCONFIG-MASTER1-KEEPONEBACKUP.XML, BAD-SCHEMA-NOT-INDEXED-BUT-TF.XML, SOLRCONFIG-MERGEPOLICY.XML, SOLRCONFIG-SLAVE.XML, CURRENCY.XML, SCHEMA-DFR.XML, BAD-SCHEMA-SIM-GLOBAL-VS-FT-MISMATCH.XML, SCHEMA-NOT-REQUIRED-UNIQUE-KEY.XML, ELEVATE.XML, SCHEMA-MINIMAL.XML, SCHEMA-IB.XML, SOLRCONFIG-MASTER1.XML, SCHEMA-NUMERIC.XML, BAD-SCHEMA-DUP-FIELD.XML, STOPWORDS.TXT, STOP-SNOWBALL.TXT, SOLRCONFIG-MASTER.XML, SOLRCONFIG-QUERYSENDER.XML, BAD-SCHEMA-UNIQUEKEY-USES-DEFAULT.XML, BAD_SOLRCONFIG.XML, SOLRCONFIG-TERMINDEX.XML, BAD-SCHEMA-EXTERNAL-FILEFIELD.XML, SCHEMA15.XML, STOP-1.TXT, SOLRCONFIG-HIGHLIGHT.XML, SCHEMA_CODEC.XML, BAD-SCHEMA-DUP-FIELDTYPE.XML, BAD-SOLRCONFIG-BOGUS-SCRIPTENGINE-NAME.XML, SOLRCONFIG-PHRASESUGGEST.XML, STOPTYPES-2.TXT, SCHEMA-REPLICATION2.XML, SOLRCONFIG-PROPINJECT-INDEXDEFAULT.XML, SOLRCONFIG-MASTER2.XML, SOLRCONFIG-SPELLCHECKCOMPONENT.XML, BAD-SCHEMA-ANALYZER-CLASS-AND-NESTED.XML, STOPTYPES-1.TXT, SCHEMA-TRIE.XML, MISSING.FUNCTIONS.UPDATEPROCESSOR.JS, SCHEMA-LUCENEMATCHVERSION.XML, SOLRCONFIG-SIMPLELOCK.XML, SOLRCONFIG-XINCLUDE.XML, BAD-SCHEMA-UNIQUEKEY-IS-COPYFIELD-DEST.XML, SOLRCONFIG-DELPOLICY1.XML, SOLRCONFIG-SLAVE1.XML, BAD-SCHEMA-UNIQUEKEY-MULTIVALUED.XML, SCHEMA-REQUIRED-FIELDS.XML, SOLRCONFIG-LAZYWRITER.XML, BAD-SCHEMA-CODEC-GLOBAL-VS-FT-MISMATCH.XML, SOLRCONFIG-PROPINJECT.XML, KEEP-2.TXT, SOLRCONFIG-SOLR-749.XML, PHRASESUGGEST.TXT, SCHEMA-LMJELINEKMERCER.XML, SCHEMA-SIM.XML, SCHEMA-TFIDF.XML]
[junit4:junit4]   2> 509 T452 oass.SolrIndexSearcher.<init> Opening Searcher@cdb366 main
[junit4:junit4]   2> 509 T452 oass.SolrIndexSearcher.getIndexDir WARNING WARNING: Directory impl does not support setting indexDir: org.apache.lucene.store.BaseDirectoryWrapper
[junit4:junit4]   2> 510 T452 oasu.CommitTracker.<init> Hard AutoCommit: disabled
[junit4:junit4]   2> 510 T452 oasu.CommitTracker.<init> Soft AutoCommit: disabled
[junit4:junit4]   2> 510 T452 oashc.QueryElevationComponent.inform Loading QueryElevation from: /mnt/ssd/jenkins/workspace/Lucene-Solr-trunk-Linux/checkout/solr/build/solr-core/test-files/solr/collection1/conf/elevate.xml
[junit4:junit4]   2> 515 T452 oashc.QueryElevationComponent.inform Loading QueryElevation from: /mnt/ssd/jenkins/workspace/Lucene-Solr-trunk-Linux/checkout/solr/build/solr-core/test-files/solr/collection1/conf/elevate.xml
[junit4:junit4]   2> 520 T452 oashc.HttpShardHandlerFactory.getParameter Setting socketTimeout to: 0
[junit4:junit4]   2> 521 T452 oashc.HttpShardHandlerFactory.getParameter Setting urlScheme to: http://
[junit4:junit4]   2> 521 T452 oashc.HttpShardHandlerFactory.getParameter Setting connTimeout to: 0
[junit4:junit4]   2> 521 T452 oashc.HttpShardHandlerFactory.getParameter Setting maxConnectionsPerHost to: 20
[junit4:junit4]   2> 521 T452 oashc.HttpShardHandlerFactory.getParameter Setting corePoolSize to: 0
[junit4:junit4]   2> 521 T452 oashc.HttpShardHandlerFactory.getParameter Setting maximumPoolSize to: 2147483647
[junit4:junit4]   2> 522 T452 oashc.HttpShardHandlerFactory.getParameter Setting maxThreadIdleTime to: 5
[junit4:junit4]   2> 522 T452 oashc.HttpShardHandlerFactory.getParameter Setting sizeOfQueue to: -1
[junit4:junit4]   2> 522 T452 oashc.HttpShardHandlerFactory.getParameter Setting fairnessPolicy to: false
[junit4:junit4]   2> 522 T452 oascsi.HttpClientUtil.createClient Creating new http client, config:maxConnectionsPerHost=20&maxConnections=10000&socketTimeout=0&connTimeout=0&retry=false
[junit4:junit4]   2> 524 T463 oasc.SolrCore.registerSearcher [collection1] Registered new searcher Searcher@cdb366 main{StandardDirectoryReader(segments_1:1)}
[junit4:junit4]   2> 525 T452 oasc.CoreContainer.register registering core: collection1
[junit4:junit4]   2> 525 T452 oass.SolrDispatchFilter.init user.dir=/mnt/ssd/jenkins/workspace/Lucene-Solr-trunk-Linux/checkout/solr/build/solr-core/test/J1
[junit4:junit4]   2> 525 T452 oass.SolrDispatchFilter.init SolrDispatchFilter.init() done
[junit4:junit4]   2> 531 T452 oascsi.HttpClientUtil.createClient Creating new http client, config:maxConnections=128&maxConnectionsPerHost=32&followRedirects=false
[junit4:junit4]   2> 535 T452 oejs.Server.doStart jetty-8.1.2.v20120308
[junit4:junit4]   2> 548 T452 oejs.AbstractConnector.doStart Started SocketConnector@0.0.0.0:44470
[junit4:junit4]   2> 548 T452 oasc.SolrResourceLoader.locateSolrHome JNDI not configured for solr (NoInitialContextEx)
[junit4:junit4]   2> 548 T452 oasc.SolrResourceLoader.locateSolrHome using system property solr.solr.home: /mnt/ssd/jenkins/workspace/Lucene-Solr-trunk-Linux/checkout/solr/build/solr-core/test-files/solr
[junit4:junit4]   2> 549 T452 oasc.SolrResourceLoader.<init> new SolrResourceLoader for deduced Solr Home: '/mnt/ssd/jenkins/workspace/Lucene-Solr-trunk-Linux/checkout/solr/build/solr-core/test-files/solr/'
[junit4:junit4]   2> 554 T452 oass.SolrDispatchFilter.init SolrDispatchFilter.init()
[junit4:junit4]   2> 555 T452 oasc.SolrResourceLoader.locateSolrHome JNDI not configured for solr (NoInitialContextEx)
[junit4:junit4]   2> 555 T452 oasc.SolrResourceLoader.locateSolrHome using system property solr.solr.home: /mnt/ssd/jenkins/workspace/Lucene-Solr-trunk-Linux/checkout/solr/build/solr-core/test-files/solr
[junit4:junit4]   2> 555 T452 oasc.CoreContainer$Initializer.initialize looking for solr.xml: /mnt/ssd/jenkins/workspace/Lucene-Solr-trunk-Linux/checkout/solr/build/solr-core/test-files/solr/solr.xml
[junit4:junit4]   2> 555 T452 oasc.CoreContainer.<init> New CoreContainer 16689392
[junit4:junit4]   2> 555 T452 oasc.CoreContainer.load Loading CoreContainer using Solr Home: '/mnt/ssd/jenkins/workspace/Lucene-Solr-trunk-Linux/checkout/solr/build/solr-core/test-files/solr/'
[junit4:junit4]   2> 555 T452 oasc.SolrResourceLoader.<init> new SolrResourceLoader for directory: '/mnt/ssd/jenkins/workspace/Lucene-Solr-trunk-Linux/checkout/solr/build/solr-core/test-files/solr/'
[junit4:junit4]   2> 569 T452 oasc.CoreContainer.load Registering Log Listener
[junit4:junit4]   2> 579 T452 oasc.CoreContainer.create Creating SolrCore 'collection1' using instanceDir: /mnt/ssd/jenkins/workspace/Lucene-Solr-trunk-Linux/checkout/solr/build/solr-core/test-files/solr/collection1
[junit4:junit4]   2> 579 T452 oasc.SolrResourceLoader.<init> new SolrResourceLoader for directory: '/mnt/ssd/jenkins/workspace/Lucene-Solr-trunk-Linux/checkout/solr/build/solr-core/test-files/solr/collection1/'
[junit4:junit4]   2> 580 T452 oasc.SolrResourceLoader.replaceClassLoader Adding 'file:/mnt/ssd/jenkins/workspace/Lucene-Solr-trunk-Linux/checkout/solr/build/solr-core/test-files/solr/collection1/lib/README' to classloader
[junit4:junit4]   2> 580 T452 oasc.SolrResourceLoader.replaceClassLoader Adding 'file:/mnt/ssd/jenkins/workspace/Lucene-Solr-trunk-Linux/checkout/solr/build/solr-core/test-files/solr/collection1/lib/classes/' to classloader
[junit4:junit4]   2> 601 T452 oasc.SolrConfig.<init> Using Lucene MatchVersion: LUCENE_50
[junit4:junit4]   2> 644 T452 oasc.SolrConfig.<init> Loaded SolrConfig: solrconfig-elevate.xml
[junit4:junit4]   2> 644 T452 oass.IndexSchema.readSchema Reading Solr Schema
[junit4:junit4]   2> 647 T452 oass.IndexSchema.readSchema Schema name=example
[junit4:junit4]   2> 832 T452 oass.IndexSchema.readSchema default search field in schema is text
[junit4:junit4]   2> 834 T452 oass.IndexSchema.readSchema unique key field: id
[junit4:junit4]   2> 842 T452 oasc.SolrCore.<init> [collection1] Opening new SolrCore at /mnt/ssd/jenkins/workspace/Lucene-Solr-trunk-Linux/checkout/solr/build/solr-core/test-files/solr/collection1/, dataDir=./org.apache.solr.handler.component.DistributedQueryElevationComponentTest-1344012881316/shard0/data/
[junit4:junit4]   2> 842 T452 oasc.JmxMonitoredMap.<init> JMX monitoring is enabled. Adding Solr mbeans to JMX Server: com.sun.jmx.mbeanserver.JmxMBeanServer@1f91667
[junit4:junit4]   2> 847 T452 oasc.SolrCore.getNewIndexDir WARNING New index directory detected: old=null new=./org.apache.solr.handler.component.DistributedQueryElevationComponentTest-1344012881316/shard0/data/index/
[junit4:junit4]   2> 847 T452 oasc.SolrCore.initIndex WARNING [collection1] Solr index directory './org.apache.solr.handler.component.DistributedQueryElevationComponentTest-1344012881316/shard0/data/index' doesn't exist. Creating new index...
[junit4:junit4]   2> 852 T452 oasc.SolrDeletionPolicy.onCommit SolrDeletionPolicy.onCommit: commits:num=1
[junit4:junit4]   2> 		commit{dir=MockDirWrapper(org.apache.lucene.store.RAMDirectory@13c4c4b lockFactory=org.apache.lucene.store.SingleInstanceLockFactory@153ef7e),segFN=segments_1,generation=1,filenames=[segments_1]
[junit4:junit4]   2> 852 T452 oasc.SolrDeletionPolicy.updateCommits newest commit = 1
[junit4:junit4]   2> 853 T452 oasc.RequestHandlers.initHandlersFromConfig created /update: solr.UpdateRequestHandler
[junit4:junit4]   2> 854 T452 oasc.RequestHandlers.initHandlersFromConfig created /elevate: org.apache.solr.handler.component.SearchHandler
[junit4:junit4]   2> 854 T452 oasc.RequestHandlers.initHandlersFromConfig created /dataElevate: org.apache.solr.handler.component.SearchHandler
[junit4:junit4]   2> 855 T452 oashl.XMLLoader.init xsltCacheLifetimeSeconds=60
[junit4:junit4]   2> 855 T452 oasc.RequestHandlers.initHandlersFromConfig WARNING no default request handler is registered (either '/select' or 'standard')
[junit4:junit4]   2> 856 T452 oasc.SolrCore.initDeprecatedSupport WARNING solrconfig.xml uses deprecated <admin/gettableFiles>, Please update your config to use the ShowFileRequestHandler.
[junit4:junit4]   2> 857 T452 oasc.SolrCore.initDeprecatedSupport WARNING adding ShowFileRequestHandler with hidden files: [SOLRCONFIG-ELEVATE.XML, SCHEMA-SPELLCHECKER.XML, TRIVIAL.UPDATEPROCESSOR1.JS, BAD-SCHEMA-NOT-INDEXED-BUT-POS.XML, SOLRCONFIG-UPDATE-PROCESSOR-CHAINS.XML, SOLRCONFIG-DELPOLICY2.XML, SCHEMA-CHARFILTERS.XML, THROW.ERROR.ON.ADD.UPDATEPROCESSOR.JS, SOLRCONFIG_PERF.XML, SOLRCONFIG-SCRIPT-UPDATEPROCESSOR.XML, BAD-SCHEMA-OMIT-TF-BUT-NOT-POS.XML, OLD_SYNONYMS.TXT, BAD-SOLRCONFIG-INVALID-SCRIPTFILE.XML, STOPWORDSWRONGENCODING.TXT, SOLRCONFIG-SPELLCHECKER.XML, SCHEMA.XML, SOLRCONFIG-REQHANDLER.INCL, SCHEMA-STOP-KEEP.XML, TRIVIAL.UPDATEPROCESSOR0.JS, COMPOUNDDICTIONARY.TXT, MISSLEADING.EXTENSION.UPDATEPROCESSOR.JS.TXT, HUNSPELL-TEST.AFF, SCHEMA-BM25.XML, SCHEMA-LMDIRICHLET.XML, SOLRCONFIG-REPEATER.XML, SCHEMA12.XML, KEEP-1.TXT, PROTWORDS.TXT, MAPPING-ISOLATIN1ACCENT.TXT, SOLRCONFIG-FUNCTIONQUERY.XML, BAD-MP-SOLRCONFIG.XML, SCHEMA-PHRASESUGGEST.XML, SOLRCONFIG-NOCACHE.XML, SYNONYMS.TXT, SOLRCONFIG-ALTDIRECTORY.XML, SCHEMA-COLLATE.XML, STEMDICT.TXT, BAD-SCHEMA-DUP-DYNAMICFIELD.XML, SOLRCONFIG-SOLCOREPROPERTIES.XML, SOLRCONFIG-TRANSFORMERS.XML, ADDFIELDS.UPDATEPROCESSOR.JS, SOLRCONFIG-ENABLEPLUGIN.XML, XSLT, WDFTYPES.TXT, BAD-SCHEMA-NOT-INDEXED-BUT-NORMS.XML, SCHEMA-BINARYFIELD.XML, STOP-2.TXT, CONDITIONAL.UPDATEPROCESSOR.JS, HUNSPELL-TEST.DIC, DA_UTF8.XML, BAD-SOLRCONFIG-MISSING-SCRIPTFILE.XML, SOLRCONFIG-NATIVELOCK.XML, SOLRCONFIG-BASIC.XML, SOLRCONFIG-QUERYSENDER-NOQUERY.XML, OPEN-EXCHANGE-RATES.JSON, BAD-SCHEMA-NONTEXT-ANALYZER.XML, STOPWITHBOM.TXT, SCHEMA-FOLDING.XML, SOLRCONFIG-TLOG.XML, DA_COMPOUNDDICTIONARY.TXT, SCHEMA11.XML, SOLRCONFIG_CODEC.XML, SOLRCONFIG-CACHING.XML, FRENCHARTICLES.TXT, HYPHENATION.DTD, SCHEMA-REPLICATION1.XML, SCHEMA-COPYFIELD-TEST.XML, SOLRCONFIG-MASTER3.XML, SCHEMA-REVERSED.XML, SCHEMASURROUND.XML, SOLRCONFIG-MASTER1-KEEPONEBACKUP.XML, BAD-SCHEMA-NOT-INDEXED-BUT-TF.XML, SOLRCONFIG-MERGEPOLICY.XML, SOLRCONFIG-SLAVE.XML, CURRENCY.XML, SCHEMA-DFR.XML, BAD-SCHEMA-SIM-GLOBAL-VS-FT-MISMATCH.XML, SCHEMA-NOT-REQUIRED-UNIQUE-KEY.XML, ELEVATE.XML, SCHEMA-MINIMAL.XML, SCHEMA-IB.XML, SOLRCONFIG-MASTER1.XML, SCHEMA-NUMERIC.XML, BAD-SCHEMA-DUP-FIELD.XML, STOPWORDS.TXT, STOP-SNOWBALL.TXT, SOLRCONFIG-MASTER.XML, SOLRCONFIG-QUERYSENDER.XML, BAD-SCHEMA-UNIQUEKEY-USES-DEFAULT.XML, BAD_SOLRCONFIG.XML, SOLRCONFIG-TERMINDEX.XML, BAD-SCHEMA-EXTERNAL-FILEFIELD.XML, SCHEMA15.XML, STOP-1.TXT, SOLRCONFIG-HIGHLIGHT.XML, SCHEMA_CODEC.XML, BAD-SCHEMA-DUP-FIELDTYPE.XML, BAD-SOLRCONFIG-BOGUS-SCRIPTENGINE-NAME.XML, SOLRCONFIG-PHRASESUGGEST.XML, STOPTYPES-2.TXT, SCHEMA-REPLICATION2.XML, SOLRCONFIG-PROPINJECT-INDEXDEFAULT.XML, SOLRCONFIG-MASTER2.XML, SOLRCONFIG-SPELLCHECKCOMPONENT.XML, BAD-SCHEMA-ANALYZER-CLASS-AND-NESTED.XML, STOPTYPES-1.TXT, SCHEMA-TRIE.XML, MISSING.FUNCTIONS.UPDATEPROCESSOR.JS, SCHEMA-LUCENEMATCHVERSION.XML, SOLRCONFIG-SIMPLELOCK.XML, SOLRCONFIG-XINCLUDE.XML, BAD-SCHEMA-UNIQUEKEY-IS-COPYFIELD-DEST.XML, SOLRCONFIG-DELPOLICY1.XML, SOLRCONFIG-SLAVE1.XML, BAD-SCHEMA-UNIQUEKEY-MULTIVALUED.XML, SCHEMA-REQUIRED-FIELDS.XML, SOLRCONFIG-LAZYWRITER.XML, BAD-SCHEMA-CODEC-GLOBAL-VS-FT-MISMATCH.XML, SOLRCONFIG-PROPINJECT.XML, KEEP-2.TXT, SOLRCONFIG-SOLR-749.XML, PHRASESUGGEST.TXT, SCHEMA-LMJELINEKMERCER.XML, SCHEMA-SIM.XML, SCHEMA-TFIDF.XML]
[junit4:junit4]   2> 860 T452 oass.SolrIndexSearcher.<init> Opening Searcher@a701d6 main
[junit4:junit4]   2> 860 T452 oass.SolrIndexSearcher.getIndexDir WARNING WARNING: Directory impl does not support setting indexDir: org.apache.lucene.store.MockDirectoryWrapper
[junit4:junit4]   2> 863 T452 oasu.CommitTracker.<init> Hard AutoCommit: disabled
[junit4:junit4]   2> 863 T452 oasu.CommitTracker.<init> Soft AutoCommit: disabled
[junit4:junit4]   2> 864 T452 oashc.QueryElevationComponent.inform Loading QueryElevation from: /mnt/ssd/jenkins/workspace/Lucene-Solr-trunk-Linux/checkout/solr/build/solr-core/test-files/solr/collection1/conf/elevate.xml
[junit4:junit4]   2> 874 T452 oashc.QueryElevationComponent.inform Loading QueryElevation from: /mnt/ssd/jenkins/workspace/Lucene-Solr-trunk-Linux/checkout/solr/build/solr-core/test-files/solr/collection1/conf/elevate.xml
[junit4:junit4]   2> 890 T452 oashc.HttpShardHandlerFactory.getParameter Setting socketTimeout to: 0
[junit4:junit4]   2> 890 T452 oashc.HttpShardHandlerFactory.getParameter Setting urlScheme to: http://
[junit4:junit4]   2> 891 T452 oashc.HttpShardHandlerFactory.getParameter Setting connTimeout to: 0
[junit4:junit4]   2> 891 T452 oashc.HttpShardHandlerFactory.getParameter Setting maxConnectionsPerHost to: 20
[junit4:junit4]   2> 891 T452 oashc.HttpShardHandlerFactory.getParameter Setting corePoolSize to: 0
[junit4:junit4]   2> 892 T452 oashc.HttpShardHandlerFactory.getParameter Setting maximumPoolSize to: 2147483647
[junit4:junit4]   2> 892 T452 oashc.HttpShardHandlerFactory.getParameter Setting maxThreadIdleTime to: 5
[junit4:junit4]   2> 892 T452 oashc.HttpShardHandlerFactory.getParameter Setting sizeOfQueue to: -1
[junit4:junit4]   2> 892 T452 oashc.HttpShardHandlerFactory.getParameter Setting fairnessPolicy to: false
[junit4:junit4]   2> 893 T452 oascsi.HttpClientUtil.createClient Creating new http client, config:maxConnectionsPerHost=20&maxConnections=10000&socketTimeout=0&connTimeout=0&retry=false
[junit4:junit4]   2> 896 T473 oasc.SolrCore.registerSearcher [collection1] Registered new searcher Searcher@a701d6 main{StandardDirectoryReader(segments_1:1)}
[junit4:junit4]   2> 902 T452 oasc.CoreContainer.register registering core: collection1
[junit4:junit4]   2> 902 T452 oass.SolrDispatchFilter.init user.dir=/mnt/ssd/jenkins/workspace/Lucene-Solr-trunk-Linux/checkout/solr/build/solr-core/test/J1
[junit4:junit4]   2> 902 T452 oass.SolrDispatchFilter.init SolrDispatchFilter.init() done
[junit4:junit4]   2> 903 T452 oascsi.HttpClientUtil.createClient Creating new http client, config:maxConnections=128&maxConnectionsPerHost=32&followRedirects=false
[junit4:junit4]   2> 906 T452 oejs.Server.doStart jetty-8.1.2.v20120308
[junit4:junit4]   2> 936 T452 oejs.AbstractConnector.doStart Started SocketConnector@0.0.0.0:44724
[junit4:junit4]   2> 937 T452 oasc.SolrResourceLoader.locateSolrHome JNDI not configured for solr (NoInitialContextEx)
[junit4:junit4]   2> 937 T452 oasc.SolrResourceLoader.locateSolrHome using system property solr.solr.home: /mnt/ssd/jenkins/workspace/Lucene-Solr-trunk-Linux/checkout/solr/build/solr-core/test-files/solr
[junit4:junit4]   2> 937 T452 oasc.SolrResourceLoader.<init> new SolrResourceLoader for deduced Solr Home: '/mnt/ssd/jenkins/workspace/Lucene-Solr-trunk-Linux/checkout/solr/build/solr-core/test-files/solr/'
[junit4:junit4]   2> 945 T452 oass.SolrDispatchFilter.init SolrDispatchFilter.init()
[junit4:junit4]   2> 946 T452 oasc.SolrResourceLoader.locateSolrHome JNDI not configured for solr (NoInitialContextEx)
[junit4:junit4]   2> 946 T452 oasc.SolrResourceLoader.locateSolrHome using system property solr.solr.home: /mnt/ssd/jenkins/workspace/Lucene-Solr-trunk-Linux/checkout/solr/build/solr-core/test-files/solr
[junit4:junit4]   2> 946 T452 oasc.CoreContainer$Initializer.initialize looking for solr.xml: /mnt/ssd/jenkins/workspace/Lucene-Solr-trunk-Linux/checkout/solr/build/solr-core/test-files/solr/solr.xml
[junit4:junit4]   2> 946 T452 oasc.CoreContainer.<init> New CoreContainer 28647330
[junit4:junit4]   2> 947 T452 oasc.CoreContainer.load Loading CoreContainer using Solr Home: '/mnt/ssd/jenkins/workspace/Lucene-Solr-trunk-Linux/checkout/solr/build/solr-core/test-files/solr/'
[junit4:junit4]   2> 952 T452 oasc.SolrResourceLoader.<init> new SolrResourceLoader for directory: '/mnt/ssd/jenkins/workspace/Lucene-Solr-trunk-Linux/checkout/solr/build/solr-core/test-files/solr/'
[junit4:junit4]   2> 972 T452 oasc.CoreContainer.load Registering Log Listener
[junit4:junit4]   2> 981 T452 oasc.CoreContainer.create Creating SolrCore 'collection1' using instanceDir: /mnt/ssd/jenkins/workspace/Lucene-Solr-trunk-Linux/checkout/solr/build/solr-core/test-files/solr/collection1
[junit4:junit4]   2> 981 T452 oasc.SolrResourceLoader.<init> new SolrResourceLoader for directory: '/mnt/ssd/jenkins/workspace/Lucene-Solr-trunk-Linux/checkout/solr/build/solr-core/test-files/solr/collection1/'
[junit4:junit4]   2> 981 T452 oasc.SolrResourceLoader.replaceClassLoader Adding 'file:/mnt/ssd/jenkins/workspace/Lucene-Solr-trunk-Linux/checkout/solr/build/solr-core/test-files/solr/collection1/lib/README' to classloader
[junit4:junit4]   2> 982 T452 oasc.SolrResourceLoader.replaceClassLoader Adding 'file:/mnt/ssd/jenkins/workspace/Lucene-Solr-trunk-Linux/checkout/solr/build/solr-core/test-files/solr/collection1/lib/classes/' to classloader
[junit4:junit4]   2> 1011 T452 oasc.SolrConfig.<init> Using Lucene MatchVersion: LUCENE_50
[junit4:junit4]   2> 1061 T452 oasc.SolrConfig.<init> Loaded SolrConfig: solrconfig-elevate.xml
[junit4:junit4]   2> 1061 T452 oass.IndexSchema.readSchema Reading Solr Schema
[junit4:junit4]   2> 1065 T452 oass.IndexSchema.readSchema Schema name=example
[junit4:junit4]   2> 1199 T452 oass.IndexSchema.readSchema default search field in schema is text
[junit4:junit4]   2> 1201 T452 oass.IndexSchema.readSchema unique key field: id
[junit4:junit4]   2> 1203 T452 oasc.SolrCore.<init> [collection1] Opening new SolrCore at /mnt/ssd/jenkins/workspace/Lucene-Solr-trunk-Linux/checkout/solr/build/solr-core/test-files/solr/collection1/, dataDir=./org.apache.solr.handler.component.DistributedQueryElevationComponentTest-1344012881316/shard1/data/
[junit4:junit4]   2> 1204 T452 oasc.JmxMonitoredMap.<init> JMX monitoring is enabled. Adding Solr mbeans to JMX Server: com.sun.jmx.mbeanserver.JmxMBeanServer@1f91667
[junit4:junit4]   2> 1204 T452 oasc.SolrCore.getNewIndexDir WARNING New index directory detected: old=null new=./org.apache.solr.handler.component.DistributedQueryElevationComponentTest-1344012881316/shard1/data/index/
[junit4:junit4]   2> 1205 T452 oasc.SolrCore.initIndex WARNING [collection1] Solr index directory './org.apache.solr.handler.component.DistributedQueryElevationComponentTest-1344012881316/shard1/data/index' doesn't exist. Creating new index...
[junit4:junit4]   2> 1207 T452 oasc.SolrDeletionPolicy.onCommit SolrDeletionPolicy.onCommit: commits:num=1
[junit4:junit4]   2> 		commit{dir=MockDirWrapper(org.apache.lucene.store.RAMDirectory@98f4d4 lockFactory=org.apache.lucene.store.SingleInstanceLockFactory@1558433),segFN=segments_1,generation=1,filenames=[segments_1]
[junit4:junit4]   2> 1208 T452 oasc.SolrDeletionPolicy.updateCommits newest commit = 1
[junit4:junit4]   2> 1209 T452 oasc.RequestHandlers.initHandlersFromConfig created /update: solr.UpdateRequestHandler
[junit4:junit4]   2> 1210 T452 oasc.RequestHandlers.initHandlersFromConfig created /elevate: org.apache.solr.handler.component.SearchHandler
[junit4:junit4]   2> 1210 T452 oasc.RequestHandlers.initHandlersFromConfig created /dataElevate: org.apache.solr.handler.component.SearchHandler
[junit4:junit4]   2> 1211 T452 oashl.XMLLoader.init xsltCacheLifetimeSeconds=60
[junit4:junit4]   2> 1211 T452 oasc.RequestHandlers.initHandlersFromConfig WARNING no default request handler is registered (either '/select' or 'standard')
[junit4:junit4]   2> 1212 T452 oasc.SolrCore.initDeprecatedSupport WARNING solrconfig.xml uses deprecated <admin/gettableFiles>, Please update your config to use the ShowFileRequestHandler.
[junit4:junit4]   2> 1213 T452 oasc.SolrCore.initDeprecatedSupport WARNING adding ShowFileRequestHandler with hidden files: [SOLRCONFIG-ELEVATE.XML, SCHEMA-SPELLCHECKER.XML, TRIVIAL.UPDATEPROCESSOR1.JS, BAD-SCHEMA-NOT-INDEXED-BUT-POS.XML, SOLRCONFIG-UPDATE-PROCESSOR-CHAINS.XML, SOLRCONFIG-DELPOLICY2.XML, SCHEMA-CHARFILTERS.XML, THROW.ERROR.ON.ADD.UPDATEPROCESSOR.JS, SOLRCONFIG_PERF.XML, SOLRCONFIG-SCRIPT-UPDATEPROCESSOR.XML, BAD-SCHEMA-OMIT-TF-BUT-NOT-POS.XML, OLD_SYNONYMS.TXT, BAD-SOLRCONFIG-INVALID-SCRIPTFILE.XML, STOPWORDSWRONGENCODING.TXT, SOLRCONFIG-SPELLCHECKER.XML, SCHEMA.XML, SOLRCONFIG-REQHANDLER.INCL, SCHEMA-STOP-KEEP.XML, TRIVIAL.UPDATEPROCESSOR0.JS, COMPOUNDDICTIONARY.TXT, MISSLEADING.EXTENSION.UPDATEPROCESSOR.JS.TXT, HUNSPELL-TEST.AFF, SCHEMA-BM25.XML, SCHEMA-LMDIRICHLET.XML, SOLRCONFIG-REPEATER.XML, SCHEMA12.XML, KEEP-1.TXT, PROTWORDS.TXT, MAPPING-ISOLATIN1ACCENT.TXT, SOLRCONFIG-FUNCTIONQUERY.XML, BAD-MP-SOLRCONFIG.XML, SCHEMA-PHRASESUGGEST.XML, SOLRCONFIG-NOCACHE.XML, SYNONYMS.TXT, SOLRCONFIG-ALTDIRECTORY.XML, SCHEMA-COLLATE.XML, STEMDICT.TXT, BAD-SCHEMA-DUP-DYNAMICFIELD.XML, SOLRCONFIG-SOLCOREPROPERTIES.XML, SOLRCONFIG-TRANSFORMERS.XML, ADDFIELDS.UPDATEPROCESSOR.JS, SOLRCONFIG-ENABLEPLUGIN.XML, XSLT, WDFTYPES.TXT, BAD-SCHEMA-NOT-INDEXED-BUT-NORMS.XML, SCHEMA-BINARYFIELD.XML, STOP-2.TXT, CONDITIONAL.UPDATEPROCESSOR.JS, HUNSPELL-TEST.DIC, DA_UTF8.XML, BAD-SOLRCONFIG-MISSING-SCRIPTFILE.XML, SOLRCONFIG-NATIVELOCK.XML, SOLRCONFIG-BASIC.XML, SOLRCONFIG-QUERYSENDER-NOQUERY.XML, OPEN-EXCHANGE-RATES.JSON, BAD-SCHEMA-NONTEXT-ANALYZER.XML, STOPWITHBOM.TXT, SCHEMA-FOLDING.XML, SOLRCONFIG-TLOG.XML, DA_COMPOUNDDICTIONARY.TXT, SCHEMA11.XML, SOLRCONFIG_CODEC.XML, SOLRCONFIG-CACHING.XML, FRENCHARTICLES.TXT, HYPHENATION.DTD, SCHEMA-REPLICATION1.XML, SCHEMA-COPYFIELD-TEST.XML, SOLRCONFIG-MASTER3.XML, SCHEMA-REVERSED.XML, SCHEMASURROUND.XML, SOLRCONFIG-MASTER1-KEEPONEBACKUP.XML, BAD-SCHEMA-NOT-INDEXED-BUT-TF.XML, SOLRCONFIG-MERGEPOLICY.XML, SOLRCONFIG-SLAVE.XML, CURRENCY.XML, SCHEMA-DFR.XML, BAD-SCHEMA-SIM-GLOBAL-VS-FT-MISMATCH.XML, SCHEMA-NOT-REQUIRED-UNIQUE-KEY.XML, ELEVATE.XML, SCHEMA-MINIMAL.XML, SCHEMA-IB.XML, SOLRCONFIG-MASTER1.XML, SCHEMA-NUMERIC.XML, BAD-SCHEMA-DUP-FIELD.XML, STOPWORDS.TXT, STOP-SNOWBALL.TXT, SOLRCONFIG-MASTER.XML, SOLRCONFIG-QUERYSENDER.XML, BAD-SCHEMA-UNIQUEKEY-USES-DEFAULT.XML, BAD_SOLRCONFIG.XML, SOLRCONFIG-TERMINDEX.XML, BAD-SCHEMA-EXTERNAL-FILEFIELD.XML, SCHEMA15.XML, STOP-1.TXT, SOLRCONFIG-HIGHLIGHT.XML, SCHEMA_CODEC.XML, BAD-SCHEMA-DUP-FIELDTYPE.XML, BAD-SOLRCONFIG-BOGUS-SCRIPTENGINE-NAME.XML, SOLRCONFIG-PHRASESUGGEST.XML, STOPTYPES-2.TXT, SCHEMA-REPLICATION2.XML, SOLRCONFIG-PROPINJECT-INDEXDEFAULT.XML, SOLRCONFIG-MASTER2.XML, SOLRCONFIG-SPELLCHECKCOMPONENT.XML, BAD-SCHEMA-ANALYZER-CLASS-AND-NESTED.XML, STOPTYPES-1.TXT, SCHEMA-TRIE.XML, MISSING.FUNCTIONS.UPDATEPROCESSOR.JS, SCHEMA-LUCENEMATCHVERSION.XML, SOLRCONFIG-SIMPLELOCK.XML, SOLRCONFIG-XINCLUDE.XML, BAD-SCHEMA-UNIQUEKEY-IS-COPYFIELD-DEST.XML, SOLRCONFIG-DELPOLICY1.XML, SOLRCONFIG-SLAVE1.XML, BAD-SCHEMA-UNIQUEKEY-MULTIVALUED.XML, SCHEMA-REQUIRED-FIELDS.XML, SOLRCONFIG-LAZYWRITER.XML, BAD-SCHEMA-CODEC-GLOBAL-VS-FT-MISMATCH.XML, SOLRCONFIG-PROPINJECT.XML, KEEP-2.TXT, SOLRCONFIG-SOLR-749.XML, PHRASESUGGEST.TXT, SCHEMA-LMJELINEKMERCER.XML, SCHEMA-SIM.XML, SCHEMA-TFIDF.XML]
[junit4:junit4]   2> 1216 T452 oass.SolrIndexSearcher.<init> Opening Searcher@1587354 main
[junit4:junit4]   2> 1216 T452 oass.SolrIndexSearcher.getIndexDir WARNING WARNING: Directory impl does not support setting indexDir: org.apache.lucene.store.MockDirectoryWrapper
[junit4:junit4]   2> 1217 T452 oasu.CommitTracker.<init> Hard AutoCommit: disabled
[junit4:junit4]   2> 1217 T452 oasu.CommitTracker.<init> Soft AutoCommit: disabled
[junit4:junit4]   2> 1217 T452 oashc.QueryElevationComponent.inform Loading QueryElevation from: /mnt/ssd/jenkins/workspace/Lucene-Solr-trunk-Linux/checkout/solr/build/solr-core/test-files/solr/collection1/conf/elevate.xml
[junit4:junit4]   2> 1225 T452 oashc.QueryElevationComponent.inform Loading QueryElevation from: /mnt/ssd/jenkins/workspace/Lucene-Solr-trunk-Linux/checkout/solr/build/solr-core/test-files/solr/collection1/conf/elevate.xml
[junit4:junit4]   2> 1238 T452 oashc.HttpShardHandlerFactory.getParameter Setting socketTimeout to: 0
[junit4:junit4]   2> 1240 T452 oashc.HttpShardHandlerFactory.getParameter Setting urlScheme to: http://
[junit4:junit4]   2> 1240 T452 oashc.HttpShardHandlerFactory.getParameter Setting connTimeout to: 0
[junit4:junit4]   2> 1240 T452 oashc.HttpShardHandlerFactory.getParameter Setting maxConnectionsPerHost to: 20
[junit4:junit4]   2> 1241 T452 oashc.HttpShardHandlerFactory.getParameter Setting corePoolSize to: 0
[junit4:junit4]   2> 1241 T452 oashc.HttpShardHandlerFactory.getParameter Setting maximumPoolSize to: 2147483647
[junit4:junit4]   2> 1241 T452 oashc.HttpShardHandlerFactory.getParameter Setting maxThreadIdleTime to: 5
[junit4:junit4]   2> 1241 T452 oashc.HttpShardHandlerFactory.getParameter Setting sizeOfQueue to: -1
[junit4:junit4]   2> 1242 T452 oashc.HttpShardHandlerFactory.getParameter Setting fairnessPolicy to: false
[junit4:junit4]   2> 1242 T452 oascsi.HttpClientUtil.createClient Creating new http client, config:maxConnectionsPerHost=20&maxConnections=10000&socketTimeout=0&connTimeout=0&retry=false
[junit4:junit4]   2> 1246 T483 oasc.SolrCore.registerSearcher [collection1] Registered new searcher Searcher@1587354 main{StandardDirectoryReader(segments_1:1)}
[junit4:junit4]   2> 1247 T452 oasc.CoreContainer.register registering core: collection1
[junit4:junit4]   2> 1248 T452 oass.SolrDispatchFilter.init user.dir=/mnt/ssd/jenkins/workspace/Lucene-Solr-trunk-Linux/checkout/solr/build/solr-core/test/J1
[junit4:junit4]   2> 1248 T452 oass.SolrDispatchFilter.init SolrDispatchFilter.init() done
[junit4:junit4]   2> 1248 T452 oascsi.HttpClientUtil.createClient Creating new http client, config:maxConnections=128&maxConnectionsPerHost=32&followRedirects=false
[junit4:junit4]   2> 1251 T452 oejs.Server.doStart jetty-8.1.2.v20120308
[junit4:junit4]   2> 1253 T452 oejs.AbstractConnector.doStart Started SocketConnector@0.0.0.0:47594
[junit4:junit4]   2> 1254 T452 oasc.SolrResourceLoader.locateSolrHome JNDI not configured for solr (NoInitialContextEx)
[junit4:junit4]   2> 1254 T452 oasc.SolrResourceLoader.locateSolrHome using system property solr.solr.home: /mnt/ssd/jenkins/workspace/Lucene-Solr-trunk-Linux/checkout/solr/build/solr-core/test-files/solr
[junit4:junit4]   2> 1254 T452 oasc.SolrResourceLoader.<init> new SolrResourceLoader for deduced Solr Home: '/mnt/ssd/jenkins/workspace/Lucene-Solr-trunk-Linux/checkout/solr/build/solr-core/test-files/solr/'
[junit4:junit4]   2> 1263 T452 oass.SolrDispatchFilter.init SolrDispatchFilter.init()
[junit4:junit4]   2> 1264 T452 oasc.SolrResourceLoader.locateSolrHome JNDI not configured for solr (NoInitialContextEx)
[junit4:junit4]   2> 1264 T452 oasc.SolrResourceLoader.locateSolrHome using system property solr.solr.home: /mnt/ssd/jenkins/workspace/Lucene-Solr-trunk-Linux/checkout/solr/build/solr-core/test-files/solr
[junit4:junit4]   2> 1264 T452 oasc.CoreContainer$Initializer.initialize looking for solr.xml: /mnt/ssd/jenkins/workspace/Lucene-Solr-trunk-Linux/checkout/solr/build/solr-core/test-files/solr/solr.xml
[junit4:junit4]   2> 1265 T452 oasc.CoreContainer.<init> New CoreContainer 14372547
[junit4:junit4]   2> 1265 T452 oasc.CoreContainer.load Loading CoreContainer using Solr Home: '/mnt/ssd/jenkins/workspace/Lucene-Solr-trunk-Linux/checkout/solr/build/solr-core/test-files/solr/'
[junit4:junit4]   2> 1265 T452 oasc.SolrResourceLoader.<init> new SolrResourceLoader for directory: '/mnt/ssd/jenkins/workspace/Lucene-Solr-trunk-Linux/checkout/solr/build/solr-core/test-files/solr/'
[junit4:junit4]   2> 1277 T452 oasc.CoreContainer.load Registering Log Listener
[junit4:junit4]   2> 1297 T452 oasc.CoreContainer.create Creating SolrCore 'collection1' using instanceDir: /mnt/ssd/jenkins/workspace/Lucene-Solr-trunk-Linux/checkout/solr/build/solr-core/test-files/solr/collection1
[junit4:junit4]   2> 1297 T452 oasc.SolrResourceLoader.<init> new SolrResourceLoader for directory: '/mnt/ssd/jenkins/workspace/Lucene-Solr-trunk-Linux/checkout/solr/build/solr-core/test-files/solr/collection1/'
[junit4:junit4]   2> 1297 T452 oasc.SolrResourceLoader.replaceClassLoader Adding 'file:/mnt/ssd/jenkins/workspace/Lucene-Solr-trunk-Linux/checkout/solr/build/solr-core/test-files/solr/collection1/lib/README' to classloader
[junit4:junit4]   2> 1298 T452 oasc.SolrResourceLoader.replaceClassLoader Adding 'file:/mnt/ssd/jenkins/workspace/Lucene-Solr-trunk-Linux/checkout/solr/build/solr-core/test-files/solr/collection1/lib/classes/' to classloader
[junit4:junit4]   2> 1316 T452 oasc.SolrConfig.<init> Using Lucene MatchVersion: LUCENE_50
[junit4:junit4]   2> 1351 T452 oasc.SolrConfig.<init> Loaded SolrConfig: solrconfig-elevate.xml
[junit4:junit4]   2> 1352 T452 oass.IndexSchema.readSchema Reading Solr Schema
[junit4:junit4]   2> 1354 T452 oass.IndexSchema.readSchema Schema name=example
[junit4:junit4]   2> 1523 T452 oass.IndexSchema.readSchema default search field in schema is text
[junit4:junit4]   2> 1525 T452 oass.IndexSchema.readSchema unique key field: id
[junit4:junit4]   2> 1527 T452 oasc.SolrCore.<init> [collection1] Opening new SolrCore at /mnt/ssd/jenkins/workspace/Lucene-Solr-trunk-Linux/checkout/solr/build/solr-core/test-files/solr/collection1/, dataDir=./org.apache.solr.handler.component.DistributedQueryElevationComponentTest-1344012881316/shard2/data/
[junit4:junit4]   2> 1527 T452 oasc.JmxMonitoredMap.<init> JMX monitoring is enabled. Adding Solr mbeans to JMX Server: com.sun.jmx.mbeanserver.JmxMBeanServer@1f91667
[junit4:junit4]   2> 1528 T452 oasc.SolrCore.getNewIndexDir WARNING New index directory detected: old=null new=./org.apache.solr.handler.component.DistributedQueryElevationComponentTest-1344012881316/shard2/data/index/
[junit4:junit4]   2> 1528 T452 oasc.SolrCore.initIndex WARNING [collection1] Solr index directory './org.apache.solr.handler.component.DistributedQueryElevationComponentTest-1344012881316/shard2/data/index' doesn't exist. Creating new index...
[junit4:junit4]   2> 1530 T452 oasc.SolrDeletionPolicy.onCommit SolrDeletionPolicy.onCommit: commits:num=1
[junit4:junit4]   2> 		commit{dir=MockDirWrapper(org.apache.lucene.store.RAMDirectory@1050700 lockFactory=org.apache.lucene.store.SingleInstanceLockFactory@72b93e),segFN=segments_1,generation=1,filenames=[segments_1]
[junit4:junit4]   2> 1530 T452 oasc.SolrDeletionPolicy.updateCommits newest commit = 1
[junit4:junit4]   2> 1531 T452 oasc.RequestHandlers.initHandlersFromConfig created /update: solr.UpdateRequestHandler
[junit4:junit4]   2> 1531 T452 oasc.RequestHandlers.initHandlersFromConfig created /elevate: org.apache.solr.handler.component.SearchHandler
[junit4:junit4]   2> 1532 T452 oasc.RequestHandlers.initHandlersFromConfig created /dataElevate: org.apache.solr.handler.component.SearchHandler
[junit4:junit4]   2> 1532 T452 oashl.XMLLoader.init xsltCacheLifetimeSeconds=60
[junit4:junit4]   2> 1533 T452 oasc.RequestHandlers.initHandlersFromConfig WARNING no default request handler is registered (either '/select' or 'standard')
[junit4:junit4]   2> 1534 T452 oasc.SolrCore.initDeprecatedSupport WARNING solrconfig.xml uses deprecated <admin/gettableFiles>, Please update your config to use the ShowFileRequestHandler.
[junit4:junit4]   2> 1535 T452 oasc.SolrCore.initDeprecatedSupport WARNING adding ShowFileRequestHandler with hidden files: [SOLRCONFIG-ELEVATE.XML, SCHEMA-SPELLCHECKER.XML, TRIVIAL.UPDATEPROCESSOR1.JS, BAD-SCHEMA-NOT-INDEXED-BUT-POS.XML, SOLRCONFIG-UPDATE-PROCESSOR-CHAINS.XML, SOLRCONFIG-DELPOLICY2.XML, SCHEMA-CHARFILTERS.XML, THROW.ERROR.ON.ADD.UPDATEPROCESSOR.JS, SOLRCONFIG_PERF.XML, SOLRCONFIG-SCRIPT-UPDATEPROCESSOR.XML, BAD-SCHEMA-OMIT-TF-BUT-NOT-POS.XML, OLD_SYNONYMS.TXT, BAD-SOLRCONFIG-INVALID-SCRIPTFILE.XML, STOPWORDSWRONGENCODING.TXT, SOLRCONFIG-SPELLCHECKER.XML, SCHEMA.XML, SOLRCONFIG-REQHANDLER.INCL, SCHEMA-STOP-KEEP.XML, TRIVIAL.UPDATEPROCESSOR0.JS, COMPOUNDDICTIONARY.TXT, MISSLEADING.EXTENSION.UPDATEPROCESSOR.JS.TXT, HUNSPELL-TEST.AFF, SCHEMA-BM25.XML, SCHEMA-LMDIRICHLET.XML, SOLRCONFIG-REPEATER.XML, SCHEMA12.XML, KEEP-1.TXT, PROTWORDS.TXT, MAPPING-ISOLATIN1ACCENT.TXT, SOLRCONFIG-FUNCTIONQUERY.XML, BAD-MP-SOLRCONFIG.XML, SCHEMA-PHRASESUGGEST.XML, SOLRCONFIG-NOCACHE.XML, SYNONYMS.TXT, SOLRCONFIG-ALTDIRECTORY.XML, SCHEMA-COLLATE.XML, STEMDICT.TXT, BAD-SCHEMA-DUP-DYNAMICFIELD.XML, SOLRCONFIG-SOLCOREPROPERTIES.XML, SOLRCONFIG-TRANSFORMERS.XML, ADDFIELDS.UPDATEPROCESSOR.JS, SOLRCONFIG-ENABLEPLUGIN.XML, XSLT, WDFTYPES.TXT, BAD-SCHEMA-NOT-INDEXED-BUT-NORMS.XML, SCHEMA-BINARYFIELD.XML, STOP-2.TXT, CONDITIONAL.UPDATEPROCESSOR.JS, HUNSPELL-TEST.DIC, DA_UTF8.XML, BAD-SOLRCONFIG-MISSING-SCRIPTFILE.XML, SOLRCONFIG-NATIVELOCK.XML, SOLRCONFIG-BASIC.XML, SOLRCONFIG-QUERYSENDER-NOQUERY.XML, OPEN-EXCHANGE-RATES.JSON, BAD-SCHEMA-NONTEXT-ANALYZER.XML, STOPWITHBOM.TXT, SCHEMA-FOLDING.XML, SOLRCONFIG-TLOG.XML, DA_COMPOUNDDICTIONARY.TXT, SCHEMA11.XML, SOLRCONFIG_CODEC.XML, SOLRCONFIG-CACHING.XML, FRENCHARTICLES.TXT, HYPHENATION.DTD, SCHEMA-REPLICATION1.XML, SCHEMA-COPYFIELD-TEST.XML, SOLRCONFIG-MASTER3.XML, SCHEMA-REVERSED.XML, SCHEMASURROUND.XML, SOLRCONFIG-MASTER1-KEEPONEBACKUP.XML, BAD-SCHEMA-NOT-INDEXED-BUT-TF.XML, SOLRCONFIG-MERGEPOLICY.XML, SOLRCONFIG-SLAVE.XML, CURRENCY.XML, SCHEMA-DFR.XML, BAD-SCHEMA-SIM-GLOBAL-VS-FT-MISMATCH.XML, SCHEMA-NOT-REQUIRED-UNIQUE-KEY.XML, ELEVATE.XML, SCHEMA-MINIMAL.XML, SCHEMA-IB.XML, SOLRCONFIG-MASTER1.XML, SCHEMA-NUMERIC.XML, BAD-SCHEMA-DUP-FIELD.XML, STOPWORDS.TXT, STOP-SNOWBALL.TXT, SOLRCONFIG-MASTER.XML, SOLRCONFIG-QUERYSENDER.XML, BAD-SCHEMA-UNIQUEKEY-USES-DEFAULT.XML, BAD_SOLRCONFIG.XML, SOLRCONFIG-TERMINDEX.XML, BAD-SCHEMA-EXTERNAL-FILEFIELD.XML, SCHEMA15.XML, STOP-1.TXT, SOLRCONFIG-HIGHLIGHT.XML, SCHEMA_CODEC.XML, BAD-SCHEMA-DUP-FIELDTYPE.XML, BAD-SOLRCONFIG-BOGUS-SCRIPTENGINE-NAME.XML, SOLRCONFIG-PHRASESUGGEST.XML, STOPTYPES-2.TXT, SCHEMA-REPLICATION2.XML, SOLRCONFIG-PROPINJECT-INDEXDEFAULT.XML, SOLRCONFIG-MASTER2.XML, SOLRCONFIG-SPELLCHECKCOMPONENT.XML, BAD-SCHEMA-ANALYZER-CLASS-AND-NESTED.XML, STOPTYPES-1.TXT, SCHEMA-TRIE.XML, MISSING.FUNCTIONS.UPDATEPROCESSOR.JS, SCHEMA-LUCENEMATCHVERSION.XML, SOLRCONFIG-SIMPLELOCK.XML, SOLRCONFIG-XINCLUDE.XML, BAD-SCHEMA-UNIQUEKEY-IS-COPYFIELD-DEST.XML, SOLRCONFIG-DELPOLICY1.XML, SOLRCONFIG-SLAVE1.XML, BAD-SCHEMA-UNIQUEKEY-MULTIVALUED.XML, SCHEMA-REQUIRED-FIELDS.XML, SOLRCONFIG-LAZYWRITER.XML, BAD-SCHEMA-CODEC-GLOBAL-VS-FT-MISMATCH.XML, SOLRCONFIG-PROPINJECT.XML, KEEP-2.TXT, SOLRCONFIG-SOLR-749.XML, PHRASESUGGEST.TXT, SCHEMA-LMJELINEKMERCER.XML, SCHEMA-SIM.XML, SCHEMA-TFIDF.XML]
[junit4:junit4]   2> 1543 T452 oass.SolrIndexSearcher.<init> Opening Searcher@ff235d main
[junit4:junit4]   2> 1543 T452 oass.SolrIndexSearcher.getIndexDir WARNING WARNING: Directory impl does not support setting indexDir: org.apache.lucene.store.MockDirectoryWrapper
[junit4:junit4]   2> 1544 T452 oasu.CommitTracker.<init> Hard AutoCommit: disabled
[junit4:junit4]   2> 1544 T452 oasu.CommitTracker.<init> Soft AutoCommit: disabled
[junit4:junit4]   2> 1545 T452 oashc.QueryElevationComponent.inform Loading QueryElevation from: /mnt/ssd/jenkins/workspace/Lucene-Solr-trunk-Linux/checkout/solr/build/solr-core/test-files/solr/collection1/conf/elevate.xml
[junit4:junit4]   2> 1552 T452 oashc.QueryElevationComponent.inform Loading QueryElevation from: /mnt/ssd/jenkins/workspace/Lucene-Solr-trunk-Linux/checkout/solr/build/solr-core/test-files/solr/collection1/conf/elevate.xml
[junit4:junit4]   2> 1560 T452 oashc.HttpShardHandlerFactory.getParameter Setting socketTimeout to: 0
[junit4:junit4]   2> 1561 T452 oashc.HttpShardHandlerFactory.getParameter Setting urlScheme to: http://
[junit4:junit4]   2> 1561 T452 oashc.HttpShardHandlerFactory.getParameter Setting connTimeout to: 0
[junit4:junit4]   2> 1561 T452 oashc.HttpShardHandlerFactory.getParameter Setting maxConnectionsPerHost to: 20
[junit4:junit4]   2> 1561 T452 oashc.HttpShardHandlerFactory.getParameter Setting corePoolSize to: 0
[junit4:junit4]   2> 1562 T452 oashc.HttpShardHandlerFactory.getParameter Setting maximumPoolSize to: 2147483647
[junit4:junit4]   2> 1562 T452 oashc.HttpShardHandlerFactory.getParameter Setting maxThreadIdleTime to: 5
[junit4:junit4]   2> 1562 T452 oashc.HttpShardHandlerFactory.getParameter Setting sizeOfQueue to: -1
[junit4:junit4]   2> 1563 T452 oashc.HttpShardHandlerFactory.getParameter Setting fairnessPolicy to: false
[junit4:junit4]   2> 1563 T452 oascsi.HttpClientUtil.createClient Creating new http client, config:maxConnectionsPerHost=20&maxConnections=10000&socketTimeout=0&connTimeout=0&retry=false
[junit4:junit4]   2> 1566 T493 oasc.SolrCore.registerSearcher [collection1] Registered new searcher Searcher@ff235d main{StandardDirectoryReader(segments_1:1)}
[junit4:junit4]   2> 1566 T452 oasc.CoreContainer.register registering core: collection1
[junit4:junit4]   2> 1567 T452 oass.SolrDispatchFilter.init user.dir=/mnt/ssd/jenkins/workspace/Lucene-Solr-trunk-Linux/checkout/solr/build/solr-core/test/J1
[junit4:junit4]   2> 1567 T452 oass.SolrDispatchFilter.init SolrDispatchFilter.init() done
[junit4:junit4]   2> 1568 T452 oascsi.HttpClientUtil.createClient Creating new http client, config:maxConnections=128&maxConnectionsPerHost=32&followRedirects=false
[junit4:junit4]   2> ASYNC  NEW_CORE C26 name=collection1 org.apache.solr.core.SolrCore@c3cfeb
[junit4:junit4]   2> 1704 T456 C26 oasu.DirectUpdateHandler2.deleteAll [collection1] REMOVING ALL DOCUMENTS FROM INDEX
[junit4:junit4]   2> 1705 T456 C26 oasc.SolrDeletionPolicy.onInit SolrDeletionPolicy.onInit: commits:num=1
[junit4:junit4]   2> 		commit{dir=BaseDirectoryWrapper(org.apache.lucene.store.RAMDirectory@18751cb lockFactory=org.apache.lucene.store.SingleInstanceLockFactory@10b1fa1),segFN=segments_1,generation=1,filenames=[segments_1]
[junit4:junit4]   2> 1705 T456 C26 oasc.SolrDeletionPolicy.updateCommits newest commit = 1
[junit4:junit4]   2> 1705 T456 C26 UPDATE [collection1] webapp=/solr path=/update params={version=2&wt=javabin} {deleteByQuery=*:*} 0 6
[junit4:junit4]   2> ASYNC  NEW_CORE C27 name=collection1 org.apache.solr.core.SolrCore@17633b3
[junit4:junit4]   2> 1724 T466 C27 oasu.DirectUpdateHandler2.deleteAll [collection1] REMOVING ALL DOCUMENTS FROM INDEX
[junit4:junit4]   2> 1725 T466 C27 oasc.SolrDeletionPolicy.onInit SolrDeletionPolicy.onInit: commits:num=1
[junit4:junit4]   2> 		commit{dir=MockDirWrapper(org.apache.lucene.store.RAMDirectory@13c4c4b lockFactory=org.apache.lucene.store.SingleInstanceLockFactory@153ef7e),segFN=segments_1,generation=1,filenames=[segments_1]
[junit4:junit4]   2> 1725 T466 C27 oasc.SolrDeletionPolicy.updateCommits newest commit = 1
[junit4:junit4]   2> 1725 T466 C27 UPDATE [collection1] webapp=/solr path=/update params={version=2&wt=javabin} {deleteByQuery=*:*} 0 2
[junit4:junit4]   2> ASYNC  NEW_CORE C28 name=collection1 org.apache.solr.core.SolrCore@535b73
[junit4:junit4]   2> 1730 T476 C28 oasu.DirectUpdateHandler2.deleteAll [collection1] REMOVING ALL DOCUMENTS FROM INDEX
[junit4:junit4]   2> 1731 T476 C28 oasc.SolrDeletionPolicy.onInit SolrDeletionPolicy.onInit: commits:num=1
[junit4:junit4]   2> 		commit{dir=MockDirWrapper(org.apache.lucene.store.RAMDirectory@98f4d4 lockFactory=org.apache.lucene.store.SingleInstanceLockFactory@1558433),segFN=segments_1,generation=1,filenames=[segments_1]
[junit4:junit4]   2> 1731 T476 C28 oasc.SolrDeletionPolicy.updateCommits newest commit = 1
[junit4:junit4]   2> 1731 T476 C28 UPDATE [collection1] webapp=/solr path=/update params={version=2&wt=javabin} {deleteByQuery=*:*} 0 2
[junit4:junit4]   2> ASYNC  NEW_CORE C29 name=collection1 org.apache.solr.core.SolrCore@ed344e
[junit4:junit4]   2> 1736 T486 C29 oasu.DirectUpdateHandler2.deleteAll [collection1] REMOVING ALL DOCUMENTS FROM INDEX
[junit4:junit4]   2> 1737 T486 C29 oasc.SolrDeletionPolicy.onInit SolrDeletionPolicy.onInit: commits:num=1
[junit4:junit4]   2> 		commit{dir=MockDirWrapper(org.apache.lucene.store.RAMDirectory@1050700 lockFactory=org.apache.lucene.store.SingleInstanceLockFactory@72b93e),segFN=segments_1,generation=1,filenames=[segments_1]
[junit4:junit4]   2> 1738 T486 C29 oasc.SolrDeletionPolicy.updateCommits newest commit = 1
[junit4:junit4]   2> 1738 T486 C29 UPDATE [collection1] webapp=/solr path=/update params={version=2&wt=javabin} {deleteByQuery=*:*} 0 2
[junit4:junit4]   2> 1742 T456 C26 UPDATE [collection1] webapp=/solr path=/update params={version=2&wt=javabin} {add=[1]} 0 1
[junit4:junit4]   2> 1745 T466 C27 UPDATE [collection1] webapp=/solr path=/update params={version=2&wt=javabin} {add=[1]} 0 1
[junit4:junit4]   2> 1747 T456 C26 UPDATE [collection1] webapp=/solr path=/update params={version=2&wt=javabin} {add=[2]} 0 0
[junit4:junit4]   2> 1756 T476 C28 UPDATE [collection1] webapp=/solr path=/update params={version=2&wt=javabin} {add=[2]} 0 6
[junit4:junit4]   2> 1759 T456 C26 UPDATE [collection1] webapp=/solr path=/update params={version=2&wt=javabin} {add=[3]} 0 0
[junit4:junit4]   2> 1764 T486 C29 UPDATE [collection1] webapp=/solr path=/update params={version=2&wt=javabin} {add=[3]} 0 3
[junit4:junit4]   2> 1767 T456 C26 UPDATE [collection1] webapp=/solr path=/update params={version=2&wt=javabin} {add=[4]} 0 1
[junit4:junit4]   2> 1770 T466 C27 UPDATE [collection1] webapp=/solr path=/update params={version=2&wt=javabin} {add=[4]} 0 0
[junit4:junit4]   2> 1773 T456 C26 UPDATE [collection1] webapp=/solr path=/update params={version=2&wt=javabin} {add=[5]} 0 1
[junit4:junit4]   2> 1776 T476 C28 UPDATE [collection1] webapp=/solr path=/update params={version=2&wt=javabin} {add=[5]} 0 1
[junit4:junit4]   2> 1778 T456 C26 UPDATE [collection1] webapp=/solr path=/update params={version=2&wt=javabin} {add=[6]} 0 0
[junit4:junit4]   2> 1781 T486 C29 UPDATE [collection1] webapp=/solr path=/update params={version=2&wt=javabin} {add=[6]} 0 0
[junit4:junit4]   2> 1783 T456 C26 UPDATE [collection1] webapp=/solr path=/update params={version=2&wt=javabin} {add=[7]} 0 0
[junit4:junit4]   2> 1792 T486 C29 UPDATE [collection1] webapp=/solr path=/update params={version=2&wt=javabin} {add=[7]} 0 0
[junit4:junit4]   2> 1801 T456 C26 oasu.DirectUpdateHandler2.commit start commit{flags=0,_version_=0,optimize=false,openSearcher=true,waitSearcher=true,expungeDeletes=false,softCommit=false}
[junit4:junit4]   2> 1803 T456 C26 oasc.SolrDeletionPolicy.onCommit SolrDeletionPolicy.onCommit: commits:num=2
[junit4:junit4]   2> 		commit{dir=BaseDirectoryWrapper(org.apache.lucene.store.RAMDirectory@18751cb lockFactory=org.apache.lucene.store.SingleInstanceLockFactory@10b1fa1),segFN=segments_1,generation=1,filenames=[segments_1]
[junit4:junit4]   2> 		commit{dir=BaseDirectoryWrapper(org.apache.lucene.store.RAMDirectory@18751cb lockFactory=org.apache.lucene.store.SingleInstanceLockFactory@10b1fa1),segFN=segments_2,generation=2,filenames=[_0_nrm.cfs, segments_2, _0_MockVariableIntBlock_0.frq, _0.fnm, _0_MockVariableIntBlock_0.pos, _0_MockVariableIntBlock_0.tib, _0_MockVariableIntBlock_0.doc, _0_SimpleText_0.pst, _0.fdt, _0.si, _0_nrm.cfe, _0_MockVariableIntBlock_0.pyl, _0_MockVariableIntBlock_0.skp, _0_MockVariableIntBlock_0.tii, _0.fdx]
[junit4:junit4]   2> 1803 T456 C26 oasc.SolrDeletionPolicy.updateCommits newest commit = 2
[junit4:junit4]   2> 1804 T456 C26 oass.SolrIndexSearcher.<init> Opening Searcher@1a83509 main
[junit4:junit4]   2> 1804 T456 C26 oass.SolrIndexSearcher.getIndexDir WARNING WARNING: Directory impl does not support setting indexDir: org.apache.lucene.store.BaseDirectoryWrapper
[junit4:junit4]   2> 1806 T456 C26 oasu.DirectUpdateHandler2.commit end_commit_flush
[junit4:junit4]   2> 1806 T463 oasc.SolrCore.registerSearcher [collection1] Registered new searcher Searcher@1a83509 main{StandardDirectoryReader(segments_2:4 _0(5.0):C7)}
[junit4:junit4]   2> 1806 T456 C26 UPDATE [collection1] webapp=/solr path=/update params={wt=javabin&version=2&softCommit=false&commit=true&waitSearcher=true} {commit=} 0 5
[junit4:junit4]   2> 1809 T466 C27 oasu.DirectUpdateHandler2.commit start commit{flags=0,_version_=0,optimize=false,openSearcher=true,waitSearcher=true,expungeDeletes=false,softCommit=false}
[junit4:junit4]   2> 1812 T466 C27 oasc.SolrDeletionPolicy.onCommit SolrDeletionPolicy.onCommit: commits:num=2
[junit4:junit4]   2> 		commit{dir=MockDirWrapper(org.apache.lucene.store.RAMDirectory@13c4c4b lockFactory=org.apache.lucene.store.SingleInstanceLockFactory@153ef7e),segFN=segments_1,generation=1,filenames=[segments_1]
[junit4:junit4]   2> 		commit{dir=MockDirWrapper(org.apache.lucene.store.RAMDirectory@13c4c4b lockFactory=org.apache.lucene.store.SingleInstanceLockFactory@153ef7e),segFN=segments_2,generation=2,filenames=[_0_nrm.cfs, segments_2, _0_MockVariableIntBlock_0.frq, _0.fnm, _0_MockVariableIntBlock_0.pos, _0_MockVariableIntBlock_0.tib, _0_MockVariableIntBlock_0.doc, _0_SimpleText_0.pst, _0.fdt, _0.si, _0_nrm.cfe, _0_MockVariableIntBlock_0.pyl, _0_MockVariableIntBlock_0.skp, _0_MockVariableIntBlock_0.tii, _0.fdx]
[junit4:junit4]   2> 1813 T466 C27 oasc.SolrDeletionPolicy.updateCommits newest commit = 2
[junit4:junit4]   2> 1815 T466 C27 oass.SolrIndexSearcher.<init> Opening Searcher@1793be8 main
[junit4:junit4]   2> 1815 T466 C27 oass.SolrIndexSearcher.getIndexDir WARNING WARNING: Directory impl does not support setting indexDir: org.apache.lucene.store.MockDirectoryWrapper
[junit4:junit4]   2> 1815 T466 C27 oasu.DirectUpdateHandler2.commit end_commit_flush
[junit4:junit4]   2> 1816 T473 oasc.SolrCore.registerSearcher [collection1] Registered new searcher Searcher@1793be8 main{StandardDirectoryReader(segments_2:4 _0(5.0):C2)}
[junit4:junit4]   2> 1816 T466 C27 UPDATE [collection1] webapp=/solr path=/update params={wt=javabin&version=2&softCommit=false&commit=true&waitSearcher=true} {commit=} 0 7
[junit4:junit4]   2> 1819 T476 C28 oasu.DirectUpdateHandler2.commit start commit{flags=0,_version_=0,optimize=false,openSearcher=true,waitSearcher=true,expungeDeletes=false,softCommit=false}
[junit4:junit4]   2> 1820 T476 C28 oasc.SolrDeletionPolicy.onCommit SolrDeletionPolicy.onCommit: commits:num=2
[junit4:junit4]   2> 		commit{dir=MockDirWrapper(org.apache.lucene.store.RAMDirectory@98f4d4 lockFactory=org.apache.lucene.store.SingleInstanceLockFactory@1558433),segFN=segments_1,generation=1,filenames=[segments_1]
[junit4:junit4]   2> 		commit{dir=MockDirWrapper(org.apache.lucene.store.RAMDirectory@98f4d4 lockFactory=org.apache.lucene.store.SingleInstanceLockFactory@1558433),segFN=segments_2,generation=2,filenames=[_0_nrm.cfs, segments_2, _0_MockVariableIntBlock_0.frq, _0.fnm, _0_MockVariableIntBlock_0.pos, _0_MockVariableIntBlock_0.tib, _0_MockVariableIntBlock_0.doc, _0_SimpleText_0.pst, _0.fdt, _0.si, _0_nrm.cfe, _0_MockVariableIntBlock_0.pyl, _0_MockVariableIntBlock_0.skp, _0_MockVariableIntBlock_0.tii, _0.fdx]
[junit4:junit4]   2> 1821 T476 C28 oasc.SolrDeletionPolicy.updateCommits newest commit = 2
[junit4:junit4]   2> 1822 T476 C28 oass.SolrIndexSearcher.<init> Opening Searcher@119dad8 main
[junit4:junit4]   2> 1822 T476 C28 oass.SolrIndexSearcher.getIndexDir WARNING WARNING: Directory impl does not support setting indexDir: org.apache.lucene.store.MockDirectoryWrapper
[junit4:junit4]   2> 1823 T476 C28 oasu.DirectUpdateHandler2.commit end_commit_flush
[junit4:junit4]   2> 1823 T483 oasc.SolrCore.registerSearcher [collection1] Registered new searcher Searcher@119dad8 main{StandardDirectoryReader(segments_2:4 _0(5.0):C2)}
[junit4:junit4]   2> 1823 T476 C28 UPDATE [collection1] webapp=/solr path=/update params={wt=javabin&version=2&softCommit=false&commit=true&waitSearcher=true} {commit=} 0 4
[junit4:junit4]   2> 1826 T486 C29 oasu.DirectUpdateHandler2.commit start commit{flags=0,_version_=0,optimize=false,openSearcher=true,waitSearcher=true,expungeDeletes=false,softCommit=false}
[junit4:junit4]   2> 1827 T486 C29 oasc.SolrDeletionPolicy.onCommit SolrDeletionPolicy.onCommit: commits:num=2
[junit4:junit4]   2> 		commit{dir=MockDirWrapper(org.apache.lucene.store.RAMDirectory@1050700 lockFactory=org.apache.lucene.store.SingleInstanceLockFactory@72b93e),segFN=segments_1,generation=1,filenames=[segments_1]
[junit4:junit4]   2> 		commit{dir=MockDirWrapper(org.apache.lucene.store.RAMDirectory@1050700 lockFactory=org.apache.lucene.store.SingleInstanceLockFactory@72b93e),segFN=segments_2,generation=2,filenames=[_0_nrm.cfs, segments_2, _0_MockVariableIntBlock_0.frq, _0.fnm, _0_MockVariableIntBlock_0.pos, _0_MockVariableIntBlock_0.tib, _0_MockVariableIntBlock_0.doc, _0_SimpleText_0.pst, _0.fdt, _0.si, _0_nrm.cfe, _0_MockVariableIntBlock_0.pyl, _0_MockVariableIntBlock_0.skp, _0_MockVariableIntBlock_0.tii, _0.fdx]
[junit4:junit4]   2> 1827 T486 C29 oasc.SolrDeletionPolicy.updateCommits newest commit = 2
[junit4:junit4]   2> 1828 T486 C29 oass.SolrIndexSearcher.<init> Opening Searcher@57286c main
[junit4:junit4]   2> 1828 T486 C29 oass.SolrIndexSearcher.getIndexDir WARNING WARNING: Directory impl does not support setting indexDir: org.apache.lucene.store.MockDirectoryWrapper
[junit4:junit4]   2> 1828 T486 C29 oasu.DirectUpdateHandler2.commit end_commit_flush
[junit4:junit4]   2> 1829 T493 oasc.SolrCore.registerSearcher [collection1] Registered new searcher Searcher@57286c main{StandardDirectoryReader(segments_2:4 _0(5.0):C3)}
[junit4:junit4]   2> 1829 T486 C29 UPDATE [collection1] webapp=/solr path=/update params={wt=javabin&version=2&softCommit=false&commit=true&waitSearcher=true} {commit=} 0 3
[junit4:junit4]   2> 1877 T456 C26 REQ [collection1] webapp=/solr path=/elevate params={version=2&fl=id,+score,+[elevated]&sort=id+desc&q=*:*&rows=500&wt=javabin&qt=/elevate&shards.qt=/elevate&distrib=false} hits=7 status=0 QTime=28 
[junit4:junit4]   2> 1898 T467 C27 REQ [collection1] webapp=/solr path=/elevate params={version=2&start=0&wt=javabin&distrib=false&fl=id,score&NOW=1344012883197&sort=id+desc&fsv=true&q=*:*&shard.url=localhost:44470/solr&rows=500&qt=/elevate&isShard=true&shards.qt=/elevate} hits=2 status=0 QTime=1 
[junit4:junit4]   2> 1911 T477 C28 REQ [collection1] webapp=/solr path=/elevate params={version=2&start=0&wt=javabin&distrib=false&fl=id,score&NOW=1344012883197&sort=id+desc&fsv=true&q=*:*&shard.url=localhost:44724/solr|[::1]:33332/solr&rows=500&qt=/elevate&isShard=true&shards.qt=/elevate} hits=2 status=0 QTime=4 
[junit4:junit4]   2> 1911 T487 C29 REQ [collection1] webapp=/solr path=/elevate params={version=2&start=0&wt=javabin&distrib=false&fl=id,score&NOW=1344012883197&sort=id+desc&fsv=true&q=*:*&shard.url=[::1]:33332/solr|localhost:47594/solr&rows=500&qt=/elevate&isShard=true&shards.qt=/elevate} hits=3 status=0 QTime=2 
[junit4:junit4]   2> 1925 T467 C27 REQ [collection1] webapp=/solr path=/elevate params={version=2&ids=4.0,1.0&wt=javabin&distrib=false&fl=id,+score,+[elevated]&NOW=1344012883197&q=*:*&shard.url=localhost:44470/solr&rows=500&qt=/elevate&isShard=true&shards.qt=/elevate} status=0 QTime=0 
[junit4:junit4]   2> 1926 T487 C29 REQ [collection1] webapp=/solr path=/elevate params={version=2&ids=3.0,7.0,6.0&wt=javabin&distrib=false&fl=id,+score,+[elevated]&NOW=1344012883197&q=*:*&shard.url=[::1]:33332/solr|localhost:47594/solr&rows=500&qt=/elevate&isShard=true&shards.qt=/elevate} status=0 QTime=1 
[junit4:junit4]   2> 1927 T477 C28 REQ [collection1] webapp=/solr path=/elevate params={version=2&ids=2.0,5.0&wt=javabin&distrib=false&fl=id,+score,+[elevated]&NOW=1344012883197&q=*:*&shard.url=localhost:44724/solr|[::1]:33332/solr&rows=500&qt=/elevate&isShard=true&shards.qt=/elevate} status=0 QTime=2 
[junit4:junit4]   2> 1927 T476 C28 REQ [collection1] webapp=/solr path=/elevate params={version=2&fl=id,+score,+[elevated]&sort=id+desc&q=*:*&rows=500&wt=javabin&qt=/elevate&shards=localhost:44470/solr,localhost:44724/solr|[::1]:33332/solr,[::1]:33332/solr|localhost:47594/solr&shards.qt=/elevate} status=0 QTime=45 
[junit4:junit4]   2> 1929 T452 oas.BaseDistributedSearchTestCase.compareResponses SEVERE Mismatched responses:
[junit4:junit4]   2> 	{responseHeader={status=0,QTime=45,params={version=2,fl=id, score, [elevated],sort=id desc,q=*:*,rows=500,wt=javabin,qt=/elevate,shards=localhost:44470/solr,localhost:44724/solr|[::1]:33332/solr,[::1]:33332/solr|localhost:47594/solr,shards.qt=/elevate}},response={numFound=7,start=0,maxScore=1.0,docs=[SolrDocument{id=7.0, [elevated]=false, score=1.0}, SolrDocument{id=6.0, [elevated]=false, score=1.0}, SolrDocument{id=5.0, [elevated]=false, score=1.0}, SolrDocument{id=4.0, [elevated]=false, score=1.0}, SolrDocument{id=3.0, [elevated]=false, score=1.0}, SolrDocument{id=2.0, [elevated]=false, score=1.0}, SolrDocument{id=1.0, [elevated]=false, score=1.0}]}}
[junit4:junit4]   2> 	{responseHeader={status=0,QTime=28,params={version=2,fl=id, score, [elevated],sort=id desc,q=*:*,rows=500,wt=javabin,qt=/elevate,shards.qt=/elevate,distrib=false}},response={numFound=7,start=0,maxScore=1.0,docs=[SolrDocument{id=7.0, score=1.0, [elevated]=false}, SolrDocument{id=6.0, score=1.0, [elevated]=false}, SolrDocument{id=5.0, score=1.0, [elevated]=false}, SolrDocument{id=4.0, score=1.0, [elevated]=false}, SolrDocument{id=3.0, score=1.0, [elevated]=false}, SolrDocument{id=2.0, score=1.0, [elevated]=false}, SolrDocument{id=1.0, score=1.0, [elevated]=false}]}}
[junit4:junit4]   2> 1930 T452 oasc.CoreContainer.shutdown Shutting down CoreContainer instance=18661566
[junit4:junit4]   2> 1931 T452 oasc.SolrCore.close [collection1]  CLOSING SolrCore org.apache.solr.core.SolrCore@c3cfeb
[junit4:junit4]   2> 1933 T452 oasc.SolrCore.closeSearcher [collection1] Closing main searcher on request.
[junit4:junit4]   2> 1933 T452 oasu.DirectUpdateHandler2.close closing DirectUpdateHandler2{commits=1,autocommits=0,soft autocommits=0,optimizes=0,rollbacks=0,expungeDeletes=0,docsPending=0,adds=0,deletesById=0,deletesByQuery=0,errors=0,cumulative_adds=7,cumulative_deletesById=0,cumulative_deletesByQuery=1,cumulative_errors=0}
[junit4:junit4]   2> 1939 T452 oejsh.ContextHandler.doStop stopped o.e.j.s.ServletContextHandler{/solr,null}
[junit4:junit4]   2> 1994 T452 oasc.CoreContainer.shutdown Shutting down CoreContainer instance=16689392
[junit4:junit4]   2> 1994 T452 oasc.SolrCore.close [collection1]  CLOSING SolrCore org.apache.solr.core.SolrCore@17633b3
[junit4:junit4]   2> 1996 T452 oasc.SolrCore.closeSearcher [collection1] Closing main searcher on request.
[junit4:junit4]   2> 1997 T452 oasu.DirectUpdateHandler2.close closing DirectUpdateHandler2{commits=1,autocommits=0,soft autocommits=0,optimizes=0,rollbacks=0,expungeDeletes=0,docsPending=0,adds=0,deletesById=0,deletesByQuery=0,errors=0,cumulative_adds=2,cumulative_deletesById=0,cumulative_deletesByQuery=1,cumulative_errors=0}
[junit4:junit4]   2> 2000 T452 oejsh.ContextHandler.doStop stopped o.e.j.s.ServletContextHandler{/solr,null}
[junit4:junit4]   2> 2054 T452 oasc.CoreContainer.shutdown Shutting down CoreContainer instance=28647330
[junit4:junit4]   2> 2054 T452 oasc.SolrCore.close [collection1]  CLOSING SolrCore org.apache.solr.core.SolrCore@535b73
[junit4:junit4]   2> 2055 T452 oasc.SolrCore.closeSearcher [collection1] Closing main searcher on request.
[junit4:junit4]   2> 2055 T452 oasu.DirectUpdateHandler2.close closing DirectUpdateHandler2{commits=1,autocommits=0,soft autocommits=0,optimizes=0,rollbacks=0,expungeDeletes=0,docsPending=0,adds=0,deletesById=0,deletesByQuery=0,errors=0,cumulative_adds=2,cumulative_deletesById=0,cumulative_deletesByQuery=1,cumulative_errors=0}
[junit4:junit4]   2> 2058 T452 oejsh.ContextHandler.doStop stopped o.e.j.s.ServletContextHandler{/solr,null}
[junit4:junit4]   2> 2112 T452 oasc.CoreContainer.shutdown Shutting down CoreContainer instance=14372547
[junit4:junit4]   2> 2112 T452 oasc.SolrCore.close [collection1]  CLOSING SolrCore org.apache.solr.core.SolrCore@ed344e
[junit4:junit4]   2> 2113 T452 oasc.SolrCore.closeSearcher [collection1] Closing main searcher on request.
[junit4:junit4]   2> 2113 T452 oasu.DirectUpdateHandler2.close closing DirectUpdateHandler2{commits=1,autocommits=0,soft autocommits=0,optimizes=0,rollbacks=0,expungeDeletes=0,docsPending=0,adds=0,deletesById=0,deletesByQuery=0,errors=0,cumulative_adds=3,cumulative_deletesById=0,cumulative_deletesByQuery=1,cumulative_errors=0}
[junit4:junit4]   2> 2116 T452 oejsh.ContextHandler.doStop stopped o.e.j.s.ServletContextHandler{/solr,null}
[junit4:junit4]   2> 2168 T452 oas.SolrTestCaseJ4.tearDown ###Ending testDistribSearch
[junit4:junit4]   2> NOTE: reproduce with: ant test  -Dtestcase=DistributedQueryElevationComponentTest -Dtests.method=testDistribSearch -Dtests.seed=749D5A1AB7D5CE95 -Dtests.multiplier=3 -Dtests.slow=true -Dtests.locale=sv_SE -Dtests.timezone=Iran -Dtests.file.encoding=US-ASCII
[junit4:junit4]   2>
[junit4:junit4]    > (@AfterClass output)
[junit4:junit4]   2> 2220 T452 oas.SolrTestCaseJ4.deleteCore ###deleteCore
[junit4:junit4]   2> NOTE: test params are: codec=Lucene40: {field_t=PostingsFormat(name=SimpleText), text=MockVariableIntBlock(baseBlockSize=79), plow_t=MockVariableIntBlock(baseBlockSize=79), id=PostingsFormat(name=SimpleText), int_i=MockVariableIntBlock(baseBlockSize=79)}, sim=RandomSimilarityProvider(queryNorm=true,coord=true): {}, locale=sv_SE, timezone=Iran
[junit4:junit4]   2> NOTE: Linux 3.2.0-27-generic i386/Oracle Corporation 1.8.0-ea (32-bit)/cpus=8,threads=1,free=16786256,total=65142784
[junit4:junit4]   2> NOTE: All tests run in this JVM: [ConvertedLegacyTest, TestCharFilters, TestDFRSimilarityFactory, QueryEqualityTest, UUIDFieldTest, TestCSVResponseWriter, TestFaceting, OutputWriterTest, FileUtilsTest, TestFiltering, TestSolrDeletionPolicy1, TestHashPartitioner, JsonLoaderTest, TestSolrJ, SpellCheckCollatorTest, URLClassifyProcessorTest, LegacyHTMLStripCharFilterTest, TestGroupingSearch, TestCSVLoader, DirectUpdateHandlerOptimizeTest, QueryParsingTest, UpdateParamsTest, TestDocumentBuilder, DebugComponentTest, TestStressVersions, BasicZkTest, TestQuerySenderListener, TestPluginEnable, SampleTest, TestFunctionQuery, TestReversedWildcardFilterFactory, TestDocSet, QueryElevationComponentTest, LeaderElectionTest, TestJoin, DistributedQueryElevationComponentTest]
[junit4:junit4]   2> 
[junit4:junit4] Completed on J1 in 2.23s, 1 test, 1 failure <<< FAILURES!

[...truncated 108 lines...]
[junit4:junit4] Suite: org.apache.solr.cloud.ZkSolrClientTest
[junit4:junit4] FAILURE 9.37s J1 | ZkSolrClientTest.testWatchChildren
[junit4:junit4]    > Throwable #1: java.lang.AssertionError: expected:<2> but was:<1>
[junit4:junit4]    > 	at __randomizedtesting.SeedInfo.seed([749D5A1AB7D5CE95:3CE33806F011742E]:0)
[junit4:junit4]    > 	at org.junit.Assert.fail(Assert.java:93)
[junit4:junit4]    > 	at org.junit.Assert.failNotEquals(Assert.java:647)
[junit4:junit4]    > 	at org.junit.Assert.assertEquals(Assert.java:128)
[junit4:junit4]    > 	at org.junit.Assert.assertEquals(Assert.java:472)
[junit4:junit4]    > 	at org.junit.Assert.assertEquals(Assert.java:456)
[junit4:junit4]    > 	at org.apache.solr.cloud.ZkSolrClientTest.testWatchChildren(ZkSolrClientTest.java:218)
[junit4:junit4]    > 	at sun.reflect.NativeMethodAccessorImpl.invoke0(Native Method)
[junit4:junit4]    > 	at sun.reflect.NativeMethodAccessorImpl.invoke(NativeMethodAccessorImpl.java:57)
[junit4:junit4]    > 	at sun.reflect.DelegatingMethodAccessorImpl.invoke(DelegatingMethodAccessorImpl.java:43)
[junit4:junit4]    > 	at java.lang.reflect.Method.invoke(Method.java:474)
[junit4:junit4]    > 	at com.carrotsearch.randomizedtesting.RandomizedRunner.invoke(RandomizedRunner.java:1995)
[junit4:junit4]    > 	at com.carrotsearch.randomizedtesting.RandomizedRunner.access$1100(RandomizedRunner.java:132)
[junit4:junit4]    > 	at com.carrotsearch.randomizedtesting.RandomizedRunner$6.evaluate(RandomizedRunner.java:818)
[junit4:junit4]    > 	at com.carrotsearch.randomizedtesting.RandomizedRunner$7.evaluate(RandomizedRunner.java:877)
[junit4:junit4]    > 	at com.carrotsearch.randomizedtesting.RandomizedRunner$8.evaluate(RandomizedRunner.java:891)
[junit4:junit4]    > 	at com.carrotsearch.randomizedtesting.rules.SystemPropertiesRestoreRule$1.evaluate(SystemPropertiesRestoreRule.java:53)
[junit4:junit4]    > 	at org.apache.lucene.util.TestRuleSetupTeardownChained$1.evaluate(TestRuleSetupTeardownChained.java:50)
[junit4:junit4]    > 	at org.apache.lucene.util.TestRuleFieldCacheSanity$1.evaluate(TestRuleFieldCacheSanity.java:32)
[junit4:junit4]    > 	at org.apache.lucene.util.AbstractBeforeAfterRule$1.evaluate(AbstractBeforeAfterRule.java:45)
[junit4:junit4]    > 	at com.carrotsearch.randomizedtesting.rules.SystemPropertiesInvariantRule$1.evaluate(SystemPropertiesInvariantRule.java:55)
[junit4:junit4]    > 	at org.apache.lucene.util.TestRuleReportUncaughtExceptions$1.evaluate(TestRuleReportUncaughtExceptions.java:68)
[junit4:junit4]    > 	at org.apache.lucene.util.TestRuleThreadAndTestName$1.evaluate(TestRuleThreadAndTestName.java:48)
[junit4:junit4]    > 	at org.apache.lucene.util.TestRuleIgnoreAfterMaxFailures$1.evaluate(TestRuleIgnoreAfterMaxFailures.java:70)
[junit4:junit4]    > 	at org.apache.lucene.util.TestRuleMarkFailure$1.evaluate(TestRuleMarkFailure.java:48)
[junit4:junit4]    > 	at com.carrotsearch.randomizedtesting.RandomizedRunner.runSingleTest(RandomizedRunner.java:825)
[junit4:junit4]    > 	at com.carrotsearch.randomizedtesting.RandomizedRunner.access$700(RandomizedRunner.java:132)
[junit4:junit4]    > 	at com.carrotsearch.randomizedtesting.RandomizedRunner$3$1.run(RandomizedRunner.java:671)
[junit4:junit4]    > 	at com.carrotsearch.randomizedtesting.RandomizedRunner$3.evaluate(RandomizedRunner.java:697)
[junit4:junit4]    > 	at com.carrotsearch.randomizedtesting.RandomizedRunner$4.evaluate(RandomizedRunner.java:736)
[junit4:junit4]    > 	at com.carrotsearch.randomizedtesting.RandomizedRunner$5.evaluate(RandomizedRunner.java:747)
[junit4:junit4]    > 	at com.carrotsearch.randomizedtesting.rules.SystemPropertiesRestoreRule$1.evaluate(SystemPropertiesRestoreRule.java:53)
[junit4:junit4]    > 	at org.apache.lucene.util.AbstractBeforeAfterRule$1.evaluate(AbstractBeforeAfterRule.java:45)
[junit4:junit4]    > 	at org.apache.lucene.util.TestRuleReportUncaughtExceptions$1.evaluate(TestRuleReportUncaughtExceptions.java:68)
[junit4:junit4]    > 	at org.apache.lucene.util.TestRuleStoreClassName$1.evaluate(TestRuleStoreClassName.java:38)
[junit4:junit4]    > 	at com.carrotsearch.randomizedtesting.rules.SystemPropertiesInvariantRule$1.evaluate(SystemPropertiesInvariantRule.java:55)
[junit4:junit4]    > 	at org.apache.lucene.util.TestRuleNoInstanceHooksOverrides$1.evaluate(TestRuleNoInstanceHooksOverrides.java:53)
[junit4:junit4]    > 	at org.apache.lucene.util.TestRuleNoStaticHooksShadowing$1.evaluate(TestRuleNoStaticHooksShadowing.java:52)
[junit4:junit4]    > 	at org.apache.lucene.util.TestRuleAssertionsRequired$1.evaluate(TestRuleAssertionsRequired.java:36)
[junit4:junit4]    > 	at org.apache.lucene.util.TestRuleMarkFailure$1.evaluate(TestRuleMarkFailure.java:48)
[junit4:junit4]    > 	at org.apache.lucene.util.TestRuleIgnoreAfterMaxFailures$1.evaluate(TestRuleIgnoreAfterMaxFailures.java:70)
[junit4:junit4]    > 	at org.apache.lucene.util.TestRuleIgnoreTestSuites$1.evaluate(TestRuleIgnoreTestSuites.java:55)
[junit4:junit4]    > 	at com.carrotsearch.randomizedtesting.RandomizedRunner.runSuite(RandomizedRunner.java:605)
[junit4:junit4]    > 	at com.carrotsearch.randomizedtesting.RandomizedRunner.access$400(RandomizedRunner.java:132)
[junit4:junit4]    > 	at com.carrotsearch.randomizedtesting.RandomizedRunner$2.run(RandomizedRunner.java:551)
[junit4:junit4]    > 
[junit4:junit4]   2> 18559 T1743 oasu.AbstractSolrTestCase.setUp ####SETUP_START testWatchChildren
[junit4:junit4]   2> 18560 T1743 oasu.AbstractSolrTestCase.setUp ####SETUP_END testWatchChildren
[junit4:junit4]   2> 18560 T1743 oasc.ZkTestServer.run STARTING ZK TEST SERVER
[junit4:junit4]   2> 18561 T1776 oazs.ZooKeeperServer.setTickTime tickTime set to 3000
[junit4:junit4]   2> 18561 T1776 oazs.NIOServerCnxn$Factory.<init> binding to port 0.0.0.0/0.0.0.0:0
[junit4:junit4]   2> 18561 T1776 oazsp.FileTxnSnapLog.save Snapshotting: 0
[junit4:junit4]   2> 18649 T735 oaz.ClientCnxn$SendThread.startConnect Opening socket connection to server localhost.localdomain/127.0.0.1:42267
[junit4:junit4]   2> 18649 T735 oaz.ClientCnxn$SendThread.run WARNING Session 0x138ed6964390010 for server null, unexpected error, closing socket connection and attempting reconnect java.net.ConnectException: Connection refused
[junit4:junit4]   2> 	at sun.nio.ch.SocketChannelImpl.checkConnect(Native Method)
[junit4:junit4]   2> 	at sun.nio.ch.SocketChannelImpl.finishConnect(SocketChannelImpl.java:692)
[junit4:junit4]   2> 	at org.apache.zookeeper.ClientCnxn$SendThread.run(ClientCnxn.java:1143)
[junit4:junit4]   2> 
[junit4:junit4]   2> 19061 T1743 oaz.ZooKeeper.<init> Initiating client connection, connectString=127.0.0.1:57018 sessionTimeout=10000 watcher=org.apache.solr.common.cloud.ConnectionManager@1b7c377
[junit4:junit4]   2> 19061 T1781 oaz.ClientCnxn$SendThread.startConnect Opening socket connection to server /127.0.0.1:57018
[junit4:junit4]   2> 19062 T1781 oaz.ClientCnxn$SendThread.primeConnection Socket connection established to localhost.localdomain/127.0.0.1:57018, initiating session
[junit4:junit4]   2> 19062 T1777 oazs.NIOServerCnxn$Factory.run Accepted socket connection from /127.0.0.1:51320
[junit4:junit4]   2> 19062 T1777 oazs.NIOServerCnxn.readConnectRequest Client attempting to establish new session at /127.0.0.1:51320
[junit4:junit4]   2> 19062 T1779 oazsp.FileTxnLog.append Creating new log file: log.1
[junit4:junit4]   2> 19063 T1779 oazs.NIOServerCnxn.finishSessionInit Established session 0x138ed6bcd2f0000 with negotiated timeout 10000 for client /127.0.0.1:51320
[junit4:junit4]   2> 19064 T1781 oaz.ClientCnxn$SendThread.readConnectResult Session establishment complete on server localhost.localdomain/127.0.0.1:57018, sessionid = 0x138ed6bcd2f0000, negotiated timeout = 10000
[junit4:junit4]   2> 19064 T1782 oascc.ConnectionManager.process Watcher org.apache.solr.common.cloud.ConnectionManager@1b7c377 name:ZooKeeperConnection Watcher:127.0.0.1:57018 got event WatchedEvent state:SyncConnected type:None path:null path:null type:None
[junit4:junit4]   2> 19064 T1743 oascc.SolrZkClient.makePath makePath: /solr
[junit4:junit4]   2> 19065 T1780 oazs.PrepRequestProcessor.pRequest Processed session termination for sessionid: 0x138ed6bcd2f0000
[junit4:junit4]   2> 19066 T1777 oazs.NIOServerCnxn.closeSock Closed socket connection for client /127.0.0.1:51320 which had sessionid 0x138ed6bcd2f0000
[junit4:junit4]   2> 19066 T1743 oaz.ZooKeeper.close Session: 0x138ed6bcd2f0000 closed
[junit4:junit4]   2> 19067 T1743 oaz.ZooKeeper.<init> Initiating client connection, connectString=127.0.0.1:57018/solr sessionTimeout=10000 watcher=org.apache.solr.common.cloud.ConnectionManager@1f481a4
[junit4:junit4]   2> 19067 T1783 oaz.ClientCnxn$SendThread.startConnect Opening socket connection to server /127.0.0.1:57018
[junit4:junit4]   2> 19066 T1782 oaz.ClientCnxn$EventThread.run EventThread shut down
[junit4:junit4]   2> 19068 T1783 oaz.ClientCnxn$SendThread.primeConnection Socket connection established to localhost.localdomain/127.0.0.1:57018, initiating session
[junit4:junit4]   2> 19068 T1777 oazs.NIOServerCnxn$Factory.run Accepted socket connection from /127.0.0.1:51321
[junit4:junit4]   2> 19068 T1777 oazs.NIOServerCnxn.readConnectRequest Client attempting to establish new session at /127.0.0.1:51321
[junit4:junit4]   2> 19068 T1779 oazs.NIOServerCnxn.finishSessionInit Established session 0x138ed6bcd2f0001 with negotiated timeout 10000 for client /127.0.0.1:51321
[junit4:junit4]   2> 19068 T1783 oaz.ClientCnxn$SendThread.readConnectResult Session establishment complete on server localhost.localdomain/127.0.0.1:57018, sessionid = 0x138ed6bcd2f0001, negotiated timeout = 10000
[junit4:junit4]   2> 19069 T1784 oascc.ConnectionManager.process Watcher org.apache.solr.common.cloud.ConnectionManager@1f481a4 name:ZooKeeperConnection Watcher:127.0.0.1:57018/solr got event WatchedEvent state:SyncConnected type:None path:null path:null type:None
[junit4:junit4]   2> 19069 T1743 oascc.SolrZkClient.makePath makePath: /collections
[junit4:junit4]   2> 19070 T1743 oascc.SolrZkClient.makePath makePath: /collections/collection99/shards
[junit4:junit4]   2> 19075 T1743 oascc.SolrZkClient.makePath makePath: collections/collection99/config=collection1
[junit4:junit4]   2> 19076 T1743 oascc.SolrZkClient.makePath makePath: collections/collection99/config=collection3
[junit4:junit4]   2> 19077 T1743 oascc.SolrZkClient.makePath makePath: /collections/collection97/shards
[junit4:junit4]   2> 19140 T1771 oazs.SessionTrackerImpl.run SessionTrackerImpl exited loop!
[junit4:junit4]   2> 20494 T735 oaz.ClientCnxn$SendThread.startConnect Opening socket connection to server localhost.localdomain/127.0.0.1:42267
[junit4:junit4]   2> 20494 T735 oaz.ClientCnxn$SendThread.run WARNING Session 0x138ed6964390010 for server null, unexpected error, closing socket connection and attempting reconnect java.net.ConnectException: Connection refused
[junit4:junit4]   2> 	at sun.nio.ch.SocketChannelImpl.checkConnect(Native Method)
[junit4:junit4]   2> 	at sun.nio.ch.SocketChannelImpl.finishConnect(SocketChannelImpl.java:692)
[junit4:junit4]   2> 	at org.apache.zookeeper.ClientCnxn$SendThread.run(ClientCnxn.java:1143)
[junit4:junit4]   2> 
[junit4:junit4]   2> 22291 T735 oaz.ClientCnxn$SendThread.startConnect Opening socket connection to server localhost.localdomain/127.0.0.1:42267
[junit4:junit4]   2> 22291 T735 oaz.ClientCnxn$SendThread.run WARNING Session 0x138ed6964390010 for server null, unexpected error, closing socket connection and attempting reconnect java.net.ConnectException: Connection refused
[junit4:junit4]   2> 	at sun.nio.ch.SocketChannelImpl.checkConnect(Native Method)
[junit4:junit4]   2> 	at sun.nio.ch.SocketChannelImpl.finishConnect(SocketChannelImpl.java:692)
[junit4:junit4]   2> 	at org.apache.zookeeper.ClientCnxn$SendThread.run(ClientCnxn.java:1143)
[junit4:junit4]   2> 
[junit4:junit4]   2> 24262 T735 oaz.ClientCnxn$SendThread.startConnect Opening socket connection to server localhost.localdomain/127.0.0.1:42267
[junit4:junit4]   2> 24262 T735 oaz.ClientCnxn$SendThread.run WARNING Session 0x138ed6964390010 for server null, unexpected error, closing socket connection and attempting reconnect java.net.ConnectException: Connection refused
[junit4:junit4]   2> 	at sun.nio.ch.SocketChannelImpl.checkConnect(Native Method)
[junit4:junit4]   2> 	at sun.nio.ch.SocketChannelImpl.finishConnect(SocketChannelImpl.java:692)
[junit4:junit4]   2> 	at org.apache.zookeeper.ClientCnxn$SendThread.run(ClientCnxn.java:1143)
[junit4:junit4]   2> 
[junit4:junit4]   2> 25744 T735 oaz.ClientCnxn$SendThread.startConnect Opening socket connection to server localhost.localdomain/127.0.0.1:42267
[junit4:junit4]   2> 25744 T735 oaz.ClientCnxn$SendThread.run WARNING Session 0x138ed6964390010 for server null, unexpected error, closing socket connection and attempting reconnect java.net.ConnectException: Connection refused
[junit4:junit4]   2> 	at sun.nio.ch.SocketChannelImpl.checkConnect(Native Method)
[junit4:junit4]   2> 	at sun.nio.ch.SocketChannelImpl.finishConnect(SocketChannelImpl.java:692)
[junit4:junit4]   2> 	at org.apache.zookeeper.ClientCnxn$SendThread.run(ClientCnxn.java:1143)
[junit4:junit4]   2> 
[junit4:junit4]   2> 27610 T735 oaz.ClientCnxn$SendThread.startConnect Opening socket connection to server localhost.localdomain/127.0.0.1:42267
[junit4:junit4]   2> 27610 T735 oaz.ClientCnxn$SendThread.run WARNING Session 0x138ed6964390010 for server null, unexpected error, closing socket connection and attempting reconnect java.net.ConnectException: Connection refused
[junit4:junit4]   2> 	at sun.nio.ch.SocketChannelImpl.checkConnect(Native Method)
[junit4:junit4]   2> 	at sun.nio.ch.SocketChannelImpl.finishConnect(SocketChannelImpl.java:692)
[junit4:junit4]   2> 	at org.apache.zookeeper.ClientCnxn$SendThread.run(ClientCnxn.java:1143)
[junit4:junit4]   2> 
[junit4:junit4]   2> 27779 T1780 oazs.PrepRequestProcessor.pRequest Processed session termination for sessionid: 0x138ed6bcd2f0001
[junit4:junit4]   2> 27796 T1784 oaz.ClientCnxn$EventThread.run EventThread shut down
[junit4:junit4]   2> 27797 T1777 oazs.NIOServerCnxn.closeSock Closed socket connection for client /127.0.0.1:51321 which had sessionid 0x138ed6bcd2f0001
[junit4:junit4]   2> 27796 T1743 oaz.ZooKeeper.close Session: 0x138ed6bcd2f0001 closed
[junit4:junit4]   2> 27797 T1780 oazs.PrepRequestProcessor.run PrepRequestProcessor exited loop!
[junit4:junit4]   2> 27797 T1779 oazs.SyncRequestProcessor.run SyncRequestProcessor exited!
[junit4:junit4]   2> 27797 T1743 oazs.FinalRequestProcessor.shutdown shutdown of request processor complete
[junit4:junit4]   2> 27799 T1777 oazs.NIOServerCnxn$Factory.run NIOServerCnxn factory exited run method
[junit4:junit4]   2> 27799 T1743 oazs.FinalRequestProcessor.shutdown shutdown of request processor complete
[junit4:junit4]   2> 27800 T1743 oasu.AbstractSolrTestCase.tearDown ####TEARDOWN_START testWatchChildren
[junit4:junit4]   2> NOTE: reproduce with: ant test  -Dtestcase=ZkSolrClientTest -Dtests.method=testWatchChildren -Dtests.seed=749D5A1AB7D5CE95 -Dtests.multiplier=3 -Dtests.slow=true -Dtests.locale=lv_LV -Dtests.timezone=Indian/Reunion -Dtests.file.encoding=US-ASCII
[junit4:junit4]   2>
[junit4:junit4]    > (@AfterClass output)
[junit4:junit4]   2> 28139 T1778 oazs.SessionTrackerImpl.run SessionTrackerImpl exited loop!
[junit4:junit4]   2> 29474 T735 oaz.ClientCnxn$SendThread.startConnect Opening socket connection to server localhost.localdomain/127.0.0.1:42267
[junit4:junit4]   2> 29474 T735 oaz.ClientCnxn$SendThread.run WARNING Session 0x138ed6964390010 for server null, unexpected error, closing socket connection and attempting reconnect java.net.ConnectException: Connection refused
[junit4:junit4]   2> 	at sun.nio.ch.SocketChannelImpl.checkConnect(Native Method)
[junit4:junit4]   2> 	at sun.nio.ch.SocketChannelImpl.finishConnect(SocketChannelImpl.java:692)
[junit4:junit4]   2> 	at org.apache.zookeeper.ClientCnxn$SendThread.run(ClientCnxn.java:1143)
[junit4:junit4]   2> 
[junit4:junit4]   2> NOTE: test params are: codec=Lucene40: {}, sim=DefaultSimilarity, locale=lv_LV, timezone=Indian/Reunion
[junit4:junit4]   2> NOTE: Linux 3.2.0-27-generic i386/Oracle Corporation 1.8.0-ea (32-bit)/cpus=8,threads=1,free=65514688,total=121085952
[junit4:junit4]   2> NOTE: All tests run in this JVM: [ConvertedLegacyTest, TestCharFilters, TestDFRSimilarityFactory, QueryEqualityTest, UUIDFieldTest, TestCSVResponseWriter, TestFaceting, OutputWriterTest, FileUtilsTest, TestFiltering, TestSolrDeletionPolicy1, TestHashPartitioner, JsonLoaderTest, TestSolrJ, SpellCheckCollatorTest, URLClassifyProcessorTest, LegacyHTMLStripCharFilterTest, TestGroupingSearch, TestCSVLoader, DirectUpdateHandlerOptimizeTest, QueryParsingTest, UpdateParamsTest, TestDocumentBuilder, DebugComponentTest, TestStressVersions, BasicZkTest, TestQuerySenderListener, TestPluginEnable, SampleTest, TestFunctionQuery, TestReversedWildcardFilterFactory, TestDocSet, QueryElevationComponentTest, LeaderElectionTest, TestJoin, DistributedQueryElevationComponentTest, SolrPluginUtilsTest, SoftAutoCommitTest, RequiredFieldsTest, SimpleFacetsTest, StatelessScriptUpdateProcessorFactoryTest, TestRemoteStreaming, BadIndexSchemaTest, BasicFunctionalityTest, EchoParamsTest, PrimUtilsTest, FullSolrCloudTest, TestLRUCache, TestSolrQueryParser, IndexReaderFactoryTest, TestBM25SimilarityFactory, TestTrie, TestPHPSerializedResponseWriter, FieldMutatingUpdateProcessorTest, OverseerTest, TestReplicationHandler, TestRealTimeGet, ZkControllerTest, TestDistributedSearch, ZkSolrClientTest]
[junit4:junit4]   2> 
[junit4:junit4] Completed on J1 in 14.93s, 4 tests, 1 failure <<< FAILURES!

[...truncated 290 lines...]
BUILD FAILED
/mnt/ssd/jenkins/workspace/Lucene-Solr-trunk-Linux/checkout/build.xml:29: The following error occurred while executing this line:
/mnt/ssd/jenkins/workspace/Lucene-Solr-trunk-Linux/checkout/solr/build.xml:144: The following error occurred while executing this line:
/mnt/ssd/jenkins/workspace/Lucene-Solr-trunk-Linux/checkout/lucene/module-build.xml:62: The following error occurred while executing this line:
/mnt/ssd/jenkins/workspace/Lucene-Solr-trunk-Linux/checkout/lucene/common-build.xml:1095: The following error occurred while executing this line:
/mnt/ssd/jenkins/workspace/Lucene-Solr-trunk-Linux/checkout/lucene/common-build.xml:790: There were test failures: 223 suites, 899 tests, 2 failures, 5 ignored

Total time: 19 minutes 55 seconds
Build step 'Execute shell' marked build as failure
Archiving artifacts
Recording test results
Email was triggered for: Failure
Sending email for trigger: Failure



Mime
View raw message