lucene-dev mailing list archives

Site index · List index
Message view « Date » · « Thread »
Top « Date » · « Thread »
From buil...@flonkings.com
Subject Build failed in Jenkins: Lucene-trunk-Linux-Java7-64-test-only #3527
Date Sun, 26 Aug 2012 09:37:39 GMT
See <builds.flonkings.com/job/Lucene-trunk-Linux-Java7-64-test-only/3527/changes>

Changes:

[uschindler] Fix more test to not fail when rarely() selects a maximum segment size

------------------------------------------
[...truncated 974 lines...]
[junit4:junit4] 
[junit4:junit4] Suite: org.apache.lucene.search.TestComplexExplanationsOfNonMatches
[junit4:junit4] Completed on J7 in 0.37s, 22 tests
[junit4:junit4] 
[junit4:junit4] Suite: org.apache.lucene.index.TestPerSegmentDeletes
[junit4:junit4] Completed on J2 in 0.25s, 1 test
[junit4:junit4] 
[junit4:junit4] Suite: org.apache.lucene.index.TestIndexWriterConfig
[junit4:junit4]   2> NOTE: reproduce with: ant test  -Dtestcase=TestIndexWriterConfig -Dtests.method=testLiveChangeToCFS
-Dtests.seed=308EF24A26E68207 -Dtests.slow=true -Dtests.locale=es_PE -Dtests.timezone=Africa/Gaborone
-Dtests.file.encoding=UTF-8
[junit4:junit4] FAILURE 0.09s J6 | TestIndexWriterConfig.testLiveChangeToCFS <<<
[junit4:junit4]    > Throwable #1: java.lang.AssertionError
[junit4:junit4]    > 	at __randomizedtesting.SeedInfo.seed([308EF24A26E68207:B90C0968E9FED504]:0)
[junit4:junit4]    > 	at org.junit.Assert.fail(Assert.java:92)
[junit4:junit4]    > 	at org.junit.Assert.assertTrue(Assert.java:43)
[junit4:junit4]    > 	at org.junit.Assert.assertFalse(Assert.java:68)
[junit4:junit4]    > 	at org.junit.Assert.assertFalse(Assert.java:79)
[junit4:junit4]    > 	at org.apache.lucene.index.TestIndexWriterConfig.testLiveChangeToCFS(TestIndexWriterConfig.java:351)
[junit4:junit4]    > 	at sun.reflect.NativeMethodAccessorImpl.invoke0(Native Method)
[junit4:junit4]    > 	at sun.reflect.NativeMethodAccessorImpl.invoke(NativeMethodAccessorImpl.java:57)
[junit4:junit4]    > 	at sun.reflect.DelegatingMethodAccessorImpl.invoke(DelegatingMethodAccessorImpl.java:43)
[junit4:junit4]    > 	at java.lang.reflect.Method.invoke(Method.java:601)
[junit4:junit4]    > 	at com.carrotsearch.randomizedtesting.RandomizedRunner.invoke(RandomizedRunner.java:1559)
[junit4:junit4]    > 	at com.carrotsearch.randomizedtesting.RandomizedRunner.access$600(RandomizedRunner.java:79)
[junit4:junit4]    > 	at com.carrotsearch.randomizedtesting.RandomizedRunner$6.evaluate(RandomizedRunner.java:737)
[junit4:junit4]    > 	at com.carrotsearch.randomizedtesting.RandomizedRunner$7.evaluate(RandomizedRunner.java:773)
[junit4:junit4]    > 	at com.carrotsearch.randomizedtesting.RandomizedRunner$8.evaluate(RandomizedRunner.java:787)
[junit4:junit4]    > 	at org.apache.lucene.util.TestRuleSetupTeardownChained$1.evaluate(TestRuleSetupTeardownChained.java:50)
[junit4:junit4]    > 	at org.apache.lucene.util.TestRuleFieldCacheSanity$1.evaluate(TestRuleFieldCacheSanity.java:51)
[junit4:junit4]    > 	at org.apache.lucene.util.AbstractBeforeAfterRule$1.evaluate(AbstractBeforeAfterRule.java:45)
[junit4:junit4]    > 	at com.carrotsearch.randomizedtesting.rules.SystemPropertiesInvariantRule$1.evaluate(SystemPropertiesInvariantRule.java:55)
[junit4:junit4]    > 	at org.apache.lucene.util.TestRuleThreadAndTestName$1.evaluate(TestRuleThreadAndTestName.java:48)
[junit4:junit4]    > 	at org.apache.lucene.util.TestRuleIgnoreAfterMaxFailures$1.evaluate(TestRuleIgnoreAfterMaxFailures.java:70)
[junit4:junit4]    > 	at org.apache.lucene.util.TestRuleMarkFailure$1.evaluate(TestRuleMarkFailure.java:48)
[junit4:junit4]    > 	at com.carrotsearch.randomizedtesting.rules.StatementAdapter.evaluate(StatementAdapter.java:36)
[junit4:junit4]    > 	at com.carrotsearch.randomizedtesting.ThreadLeakControl$StatementRunner.run(ThreadLeakControl.java:345)
[junit4:junit4]    > 	at com.carrotsearch.randomizedtesting.ThreadLeakControl.forkTimeoutingTask(ThreadLeakControl.java:769)
[junit4:junit4]    > 	at com.carrotsearch.randomizedtesting.ThreadLeakControl$3.evaluate(ThreadLeakControl.java:429)
[junit4:junit4]    > 	at com.carrotsearch.randomizedtesting.RandomizedRunner.runSingleTest(RandomizedRunner.java:746)
[junit4:junit4]    > 	at com.carrotsearch.randomizedtesting.RandomizedRunner$3.evaluate(RandomizedRunner.java:648)
[junit4:junit4]    > 	at com.carrotsearch.randomizedtesting.RandomizedRunner$4.evaluate(RandomizedRunner.java:682)
[junit4:junit4]    > 	at com.carrotsearch.randomizedtesting.RandomizedRunner$5.evaluate(RandomizedRunner.java:693)
[junit4:junit4]    > 	at org.apache.lucene.util.AbstractBeforeAfterRule$1.evaluate(AbstractBeforeAfterRule.java:45)
[junit4:junit4]    > 	at org.apache.lucene.util.TestRuleStoreClassName$1.evaluate(TestRuleStoreClassName.java:42)
[junit4:junit4]    > 	at com.carrotsearch.randomizedtesting.rules.SystemPropertiesInvariantRule$1.evaluate(SystemPropertiesInvariantRule.java:55)
[junit4:junit4]    > 	at com.carrotsearch.randomizedtesting.rules.NoShadowingOrOverridesOnMethodsRule$1.evaluate(NoShadowingOrOverridesOnMethodsRule.java:39)
[junit4:junit4]    > 	at com.carrotsearch.randomizedtesting.rules.NoShadowingOrOverridesOnMethodsRule$1.evaluate(NoShadowingOrOverridesOnMethodsRule.java:39)
[junit4:junit4]    > 	at org.apache.lucene.util.TestRuleAssertionsRequired$1.evaluate(TestRuleAssertionsRequired.java:40)
[junit4:junit4]    > 	at org.apache.lucene.util.TestRuleMarkFailure$1.evaluate(TestRuleMarkFailure.java:48)
[junit4:junit4]    > 	at org.apache.lucene.util.TestRuleIgnoreAfterMaxFailures$1.evaluate(TestRuleIgnoreAfterMaxFailures.java:70)
[junit4:junit4]    > 	at org.apache.lucene.util.TestRuleIgnoreTestSuites$1.evaluate(TestRuleIgnoreTestSuites.java:55)
[junit4:junit4]    > 	at com.carrotsearch.randomizedtesting.rules.StatementAdapter.evaluate(StatementAdapter.java:36)
[junit4:junit4]    > 	at com.carrotsearch.randomizedtesting.ThreadLeakControl$StatementRunner.run(ThreadLeakControl.java:345)
[junit4:junit4]    > 	at java.lang.Thread.run(Thread.java:722)
[junit4:junit4]   2> NOTE: test params are: codec=Appending, sim=RandomSimilarityProvider(queryNorm=false,coord=no):
{}, locale=es_PE, timezone=Africa/Gaborone
[junit4:junit4]   2> NOTE: Linux 3.2.0-26-generic amd64/Oracle Corporation 1.7.0_05 (64-bit)/cpus=8,threads=1,free=61654544,total=221315072
[junit4:junit4]   2> NOTE: All tests run in this JVM: [TestStressAdvance, TestForceMergeForever,
TestRamUsageEstimatorOnWildAnimals, TestLookaheadTokenFilter, TestTransactions, TestDocCount,
TestSpanSearchEquivalence, TestPulsingReuse, TestParallelReaderEmptyIndex, TestDoc, TestVersion,
TestNamedSPILoader, TestRegexpRandom, TestLevenshteinAutomata, Nested, TestHugeRamFile, TestIndexWriterOnDiskFull,
TestMultiTermQueryRewrites, TestReaderClosed, TestDirectoryReaderReopen, TestGraphTokenizers,
TestIndexWriter, TestSloppyPhraseQuery, TestTieredMergePolicy, TestNumericUtils, TestPrefixInBooleanQuery,
TestWindowsMMap, TestIndexInput, TestTermsEnum2, TestPrefixRandom, TestUnicodeUtil, TestMultiLevelSkipList,
InBeforeClass, InAfterClass, InTestMethod, NonStringProperties, TestAutomatonQuery, TestIndexWriterConfig]
[junit4:junit4] Completed on J6 in 0.24s, 9 tests, 1 failure <<< FAILURES!
[junit4:junit4] 
[junit4:junit4] Suite: org.apache.lucene.index.TestBinaryTerms
[junit4:junit4] Completed on J4 in 0.47s, 1 test
[junit4:junit4] 
[junit4:junit4] Suite: org.apache.lucene.util.junitcompat.TestBeforeAfterOverrides
[junit4:junit4] Completed on J3 in 0.13s, 2 tests
[junit4:junit4] 
[junit4:junit4] Suite: org.apache.lucene.util.TestSetOnce
[junit4:junit4] Completed on J7 in 0.24s, 4 tests
[junit4:junit4] 
[junit4:junit4] Suite: org.apache.lucene.search.TestFilteredSearch
[junit4:junit4] Completed on J2 in 0.13s, 1 test
[junit4:junit4] 
[junit4:junit4] Suite: org.apache.lucene.search.TestTopDocsCollector
[junit4:junit4] Completed on J5 in 0.40s, 8 tests
[junit4:junit4] 
[junit4:junit4] Suite: org.apache.lucene.util.junitcompat.TestSetupTeardownChaining
[junit4:junit4] Completed on J3 in 0.16s, 2 tests
[junit4:junit4] 
[junit4:junit4] Suite: org.apache.lucene.search.TestDocIdSet
[junit4:junit4] Completed on J7 in 0.14s, 3 tests
[junit4:junit4] 
[junit4:junit4] Suite: org.apache.lucene.search.TestTermScorer
[junit4:junit4] Completed on J2 in 0.19s, 3 tests
[junit4:junit4] 
[junit4:junit4] Suite: org.apache.lucene.util.junitcompat.TestSameRandomnessLocalePassedOrNot
[junit4:junit4] Completed on J5 in 0.21s, 1 test
[junit4:junit4] 
[junit4:junit4] Suite: org.apache.lucene.search.TestDocValuesScoring
[junit4:junit4] Completed on J4 in 0.46s, 1 test
[junit4:junit4] 
[junit4:junit4] Suite: org.apache.lucene.index.TestNoDeletionPolicy
[junit4:junit4] Completed on J6 in 0.29s, 4 tests
[junit4:junit4] 
[junit4:junit4] Suite: org.apache.lucene.search.TestSubScorerFreqs
[junit4:junit4] Completed on J3 in 0.12s, 3 tests
[junit4:junit4] 
[junit4:junit4] Suite: org.apache.lucene.index.TestFilterAtomicReader
[junit4:junit4] Completed on J2 in 0.13s, 2 tests
[junit4:junit4] 
[junit4:junit4] Suite: org.apache.lucene.search.TestPhrasePrefixQuery
[junit4:junit4] Completed on J5 in 0.12s, 1 test
[junit4:junit4] 
[junit4:junit4] Suite: org.apache.lucene.util.TestRecyclingByteBlockAllocator
[junit4:junit4] Completed on J4 in 0.19s, 3 tests
[junit4:junit4] 
[junit4:junit4] Suite: org.apache.lucene.document.TestDateTools
[junit4:junit4] Completed on J3 in 0.10s, 5 tests
[junit4:junit4] 
[junit4:junit4] Suite: org.apache.lucene.util.TestSortedVIntList
[junit4:junit4] Completed on J7 in 0.30s, 19 tests
[junit4:junit4] 
[junit4:junit4] Suite: org.apache.lucene.util.junitcompat.TestJUnitRuleOrder
[junit4:junit4] Completed on J2 in 0.09s, 1 test
[junit4:junit4] 
[junit4:junit4] Suite: org.apache.lucene.index.TestPrefixCodedTerms
[junit4:junit4] Completed on J0 in 4.76s, 6 tests
[junit4:junit4] 
[junit4:junit4] Suite: org.apache.lucene.TestSearch
[junit4:junit4] Completed on J5 in 0.20s, 1 test
[junit4:junit4] 
[junit4:junit4] Suite: org.apache.lucene.index.TestParallelTermEnum
[junit4:junit4] Completed on J4 in 0.16s, 1 test
[junit4:junit4] 
[junit4:junit4] Suite: org.apache.lucene.search.TestExplanations
[junit4:junit4] Completed on J3 in 0.16s, 1 test
[junit4:junit4] 
[junit4:junit4] Suite: org.apache.lucene.search.TestFieldCacheTermsFilter
[junit4:junit4] Completed on J7 in 0.07s, 1 test
[junit4:junit4] 
[junit4:junit4] Suite: org.apache.lucene.search.TestMatchAllDocsQuery
[junit4:junit4] Completed on J2 in 0.17s, 2 tests
[junit4:junit4] 
[junit4:junit4] Suite: org.apache.lucene.search.TestNot
[junit4:junit4] Completed on J0 in 0.08s, 1 test
[junit4:junit4] 
[junit4:junit4] Suite: org.apache.lucene.search.TestSimilarityProvider
[junit4:junit4] Completed on J5 in 0.11s, 1 test
[junit4:junit4] 
[junit4:junit4] Suite: org.apache.lucene.search.TestDateSort
[junit4:junit4] Completed on J3 in 0.12s, 1 test
[junit4:junit4] 
[junit4:junit4] Suite: org.apache.lucene.util.TestAttributeSource
[junit4:junit4] Completed on J4 in 0.08s, 5 tests
[junit4:junit4] 
[junit4:junit4] Suite: org.apache.lucene.index.TestIndexWriterOnJRECrash
[junit4:junit4] IGNOR/A 0.08s J7 | TestIndexWriterOnJRECrash.testNRTThreads
[junit4:junit4]    > Assumption #1: 'nightly' test group is disabled (@Nightly)
[junit4:junit4] Completed on J7 in 0.14s, 1 test, 1 skipped
[junit4:junit4] 
[junit4:junit4] Suite: org.apache.lucene.search.TestCachingCollector
[junit4:junit4] Completed on J2 in 0.10s, 5 tests
[junit4:junit4] 
[junit4:junit4] Suite: org.apache.lucene.document.TestBinaryDocument
[junit4:junit4] Completed on J0 in 0.12s, 2 tests
[junit4:junit4] 
[junit4:junit4] Suite: org.apache.lucene.search.TestPositionIncrement
[junit4:junit4] Completed on J6 in 0.79s, 2 tests
[junit4:junit4] 
[junit4:junit4] Suite: org.apache.lucene.search.TestTopScoreDocCollector
[junit4:junit4] Completed on J5 in 0.09s, 1 test
[junit4:junit4] 
[junit4:junit4] Suite: org.apache.lucene.search.spans.TestSpanFirstQuery
[junit4:junit4] Completed on J3 in 0.05s, 1 test
[junit4:junit4] 
[junit4:junit4] Suite: org.apache.lucene.store.TestLock
[junit4:junit4] Completed on J4 in 0.08s, 1 test
[junit4:junit4] 
[junit4:junit4] Suite: org.apache.lucene.util.TestIntsRef
[junit4:junit4] Completed on J7 in 0.06s, 2 tests
[junit4:junit4] 
[junit4:junit4] Suite: org.apache.lucene.util.TestPriorityQueue
[junit4:junit4] Completed on J2 in 0.19s, 4 tests
[junit4:junit4] 
[junit4:junit4] Suite: org.apache.lucene.index.Test2BTerms
[junit4:junit4] Completed on J6 in 0.09s, 1 test, 1 skipped
[junit4:junit4] 
[junit4:junit4] Suite: org.apache.lucene.search.TestNGramPhraseQuery
[junit4:junit4] Completed on J5 in 0.08s, 1 test
[junit4:junit4] 
[junit4:junit4] Suite: org.apache.lucene.index.TestNoMergePolicy
[junit4:junit4] Completed on J0 in 0.12s, 4 tests
[junit4:junit4] 
[junit4:junit4] Suite: org.apache.lucene.analysis.TestMockCharFilter
[junit4:junit4] Completed on J3 in 0.07s, 1 test
[junit4:junit4] 
[junit4:junit4] Suite: org.apache.lucene.codecs.intblock.TestIntBlockCodec
[junit4:junit4] Completed on J4 in 0.09s, 2 tests
[junit4:junit4] 
[junit4:junit4] Suite: org.apache.lucene.search.TestPositiveScoresOnlyCollector
[junit4:junit4] Completed on J7 in 0.08s, 1 test
[junit4:junit4] 
[junit4:junit4] Suite: org.apache.lucene.store.TestByteArrayDataInput
[junit4:junit4] Completed on J2 in 0.06s, 1 test
[junit4:junit4] 
[junit4:junit4] Suite: org.apache.lucene.codecs.pulsing.Test10KPulsings
[junit4:junit4] IGNOR/A 0.04s J6 | Test10KPulsings.test10kNotPulsed
[junit4:junit4]    > Assumption #1: 'nightly' test group is disabled (@Nightly)
[junit4:junit4] IGNOR/A 0.01s J6 | Test10KPulsings.test10kPulsed
[junit4:junit4]    > Assumption #1: 'nightly' test group is disabled (@Nightly)
[junit4:junit4] Completed on J6 in 0.10s, 2 tests, 2 skipped
[junit4:junit4] 
[junit4:junit4] Suite: org.apache.lucene.util.TestBitUtil
[junit4:junit4] Completed on J5 in 0.07s, 2 tests
[junit4:junit4] 
[junit4:junit4] Suite: org.apache.lucene.index.TestNewestSegment
[junit4:junit4] Completed on J0 in 0.11s, 1 test
[junit4:junit4] 
[junit4:junit4] Suite: org.apache.lucene.TestAssertions
[junit4:junit4] Completed on J3 in 0.04s, 1 test
[junit4:junit4] 
[junit4:junit4] Suite: org.apache.lucene.analysis.tokenattributes.TestSimpleAttributeImpl
[junit4:junit4] Completed on J4 in 0.09s, 1 test
[junit4:junit4] 
[junit4:junit4] Suite: org.apache.lucene.util.TestIOUtils
[junit4:junit4] Completed on J7 in 0.04s, 1 test
[junit4:junit4] 
[junit4:junit4] Suite: org.apache.lucene.TestWorstCaseTestBehavior
[junit4:junit4] Completed on J2 in 0.07s, 6 tests, 6 skipped
[junit4:junit4] 
[junit4:junit4] Suite: org.apache.lucene.index.TestTwoPhaseCommitTool
[junit4:junit4] Completed on J6 in 0.11s, 4 tests
[junit4:junit4] 
[junit4:junit4] Suite: org.apache.lucene.store.TestMockDirectoryWrapper
[junit4:junit4] Completed on J5 in 0.08s, 2 tests
[junit4:junit4] 
[junit4:junit4] Suite: org.apache.lucene.util.junitcompat.TestLeaveFilesIfTestFails
[junit4:junit4] Completed on J0 in 0.06s, 1 test
[junit4:junit4] 
[junit4:junit4] Suite: org.apache.lucene.index.TestSegmentReader
[junit4:junit4] Completed on J1 in 44.13s, 6 tests
[junit4:junit4] 
[junit4:junit4] JVM J0:     1.28 ..   173.32 =   172.04s
[junit4:junit4] JVM J1:     1.28 ..   203.66 =   202.38s
[junit4:junit4] JVM J2:     1.28 ..   172.98 =   171.70s
[junit4:junit4] JVM J3:     1.29 ..   172.85 =   171.56s
[junit4:junit4] JVM J4:     1.30 ..   173.14 =   171.84s
[junit4:junit4] JVM J5:     1.29 ..   173.06 =   171.77s
[junit4:junit4] JVM J6:     1.49 ..   173.03 =   171.54s
[junit4:junit4] JVM J7:     1.49 ..   172.96 =   171.48s
[junit4:junit4] Execution time total: 3 minutes 23 seconds
[junit4:junit4] Tests summary: 312 suites, 1776 tests, 1 failure, 18 ignored (10 assumptions)

BUILD FAILED
<builds.flonkings.com/job/Lucene-trunk-Linux-Java7-64-test-only/ws/checkout/lucene/build.xml>:49:
The following error occurred while executing this line:
<builds.flonkings.com/job/Lucene-trunk-Linux-Java7-64-test-only/ws/checkout/lucene/common-build.xml>:1106:
The following error occurred while executing this line:
<builds.flonkings.com/job/Lucene-trunk-Linux-Java7-64-test-only/ws/checkout/lucene/common-build.xml>:798:
There were test failures: 312 suites, 1776 tests, 1 failure, 18 ignored (10 assumptions)

Total time: 3 minutes 58 seconds
Build step 'Invoke Ant' marked build as failure
Archiving artifacts
Recording test results

---------------------------------------------------------------------
To unsubscribe, e-mail: dev-unsubscribe@lucene.apache.org
For additional commands, e-mail: dev-help@lucene.apache.org


Mime
View raw message