lucene-dev mailing list archives

Site index · List index
Message view « Date » · « Thread »
Top « Date » · « Thread »
From Policeman Jenkins Server <jenk...@sd-datasolutions.de>
Subject [JENKINS] Lucene-Solr-trunk-Linux (32bit/jdk1.8.0-ea-b49) - Build # 78 - Failure!
Date Wed, 01 Aug 2012 08:46:40 GMT
Build: http://jenkins.sd-datasolutions.de/job/Lucene-Solr-trunk-Linux/78/
Java: 32bit/jdk1.8.0-ea-b49 -client -XX:+UseParallelGC

1 tests failed.
REGRESSION:  org.apache.solr.handler.component.DistributedQueryElevationComponentTest.testDistribSearch

Error Message:
.responseHeader.params.size()==9,9skipped=5,4

Stack Trace:
junit.framework.AssertionFailedError: .responseHeader.params.size()==9,9skipped=5,4
	at __randomizedtesting.SeedInfo.seed([2848A833E22CAC91:A9AE262B9573CCAD]:0)
	at junit.framework.Assert.fail(Assert.java:50)
	at org.apache.solr.BaseDistributedSearchTestCase.compareResponses(BaseDistributedSearchTestCase.java:670)
	at org.apache.solr.BaseDistributedSearchTestCase.query(BaseDistributedSearchTestCase.java:392)
	at org.apache.solr.handler.component.DistributedQueryElevationComponentTest.doTest(DistributedQueryElevationComponentTest.java:81)
	at org.apache.solr.BaseDistributedSearchTestCase.testDistribSearch(BaseDistributedSearchTestCase.java:679)
	at sun.reflect.NativeMethodAccessorImpl.invoke0(Native Method)
	at sun.reflect.NativeMethodAccessorImpl.invoke(NativeMethodAccessorImpl.java:57)
	at sun.reflect.DelegatingMethodAccessorImpl.invoke(DelegatingMethodAccessorImpl.java:43)
	at java.lang.reflect.Method.invoke(Method.java:474)
	at com.carrotsearch.randomizedtesting.RandomizedRunner.invoke(RandomizedRunner.java:1995)
	at com.carrotsearch.randomizedtesting.RandomizedRunner.access$1100(RandomizedRunner.java:132)
	at com.carrotsearch.randomizedtesting.RandomizedRunner$6.evaluate(RandomizedRunner.java:818)
	at com.carrotsearch.randomizedtesting.RandomizedRunner$7.evaluate(RandomizedRunner.java:877)
	at com.carrotsearch.randomizedtesting.RandomizedRunner$8.evaluate(RandomizedRunner.java:891)
	at com.carrotsearch.randomizedtesting.rules.SystemPropertiesRestoreRule$1.evaluate(SystemPropertiesRestoreRule.java:53)
	at org.apache.lucene.util.TestRuleSetupTeardownChained$1.evaluate(TestRuleSetupTeardownChained.java:50)
	at org.apache.lucene.util.TestRuleFieldCacheSanity$1.evaluate(TestRuleFieldCacheSanity.java:32)
	at org.apache.lucene.util.AbstractBeforeAfterRule$1.evaluate(AbstractBeforeAfterRule.java:45)
	at com.carrotsearch.randomizedtesting.rules.SystemPropertiesInvariantRule$1.evaluate(SystemPropertiesInvariantRule.java:55)
	at org.apache.lucene.util.TestRuleReportUncaughtExceptions$1.evaluate(TestRuleReportUncaughtExceptions.java:68)
	at org.apache.lucene.util.TestRuleThreadAndTestName$1.evaluate(TestRuleThreadAndTestName.java:48)
	at org.apache.lucene.util.TestRuleIgnoreAfterMaxFailures$1.evaluate(TestRuleIgnoreAfterMaxFailures.java:70)
	at org.apache.lucene.util.TestRuleMarkFailure$1.evaluate(TestRuleMarkFailure.java:48)
	at com.carrotsearch.randomizedtesting.RandomizedRunner.runSingleTest(RandomizedRunner.java:825)
	at com.carrotsearch.randomizedtesting.RandomizedRunner.access$700(RandomizedRunner.java:132)
	at com.carrotsearch.randomizedtesting.RandomizedRunner$3$1.run(RandomizedRunner.java:671)
	at com.carrotsearch.randomizedtesting.RandomizedRunner$3.evaluate(RandomizedRunner.java:697)
	at com.carrotsearch.randomizedtesting.RandomizedRunner$4.evaluate(RandomizedRunner.java:736)
	at com.carrotsearch.randomizedtesting.RandomizedRunner$5.evaluate(RandomizedRunner.java:747)
	at com.carrotsearch.randomizedtesting.rules.SystemPropertiesRestoreRule$1.evaluate(SystemPropertiesRestoreRule.java:53)
	at org.apache.lucene.util.AbstractBeforeAfterRule$1.evaluate(AbstractBeforeAfterRule.java:45)
	at org.apache.lucene.util.TestRuleReportUncaughtExceptions$1.evaluate(TestRuleReportUncaughtExceptions.java:68)
	at org.apache.lucene.util.TestRuleStoreClassName$1.evaluate(TestRuleStoreClassName.java:38)
	at com.carrotsearch.randomizedtesting.rules.SystemPropertiesInvariantRule$1.evaluate(SystemPropertiesInvariantRule.java:55)
	at org.apache.lucene.util.TestRuleNoInstanceHooksOverrides$1.evaluate(TestRuleNoInstanceHooksOverrides.java:53)
	at org.apache.lucene.util.TestRuleNoStaticHooksShadowing$1.evaluate(TestRuleNoStaticHooksShadowing.java:52)
	at org.apache.lucene.util.TestRuleAssertionsRequired$1.evaluate(TestRuleAssertionsRequired.java:36)
	at org.apache.lucene.util.TestRuleMarkFailure$1.evaluate(TestRuleMarkFailure.java:48)
	at org.apache.lucene.util.TestRuleIgnoreAfterMaxFailures$1.evaluate(TestRuleIgnoreAfterMaxFailures.java:70)
	at org.apache.lucene.util.TestRuleIgnoreTestSuites$1.evaluate(TestRuleIgnoreTestSuites.java:55)
	at com.carrotsearch.randomizedtesting.RandomizedRunner.runSuite(RandomizedRunner.java:605)
	at com.carrotsearch.randomizedtesting.RandomizedRunner.access$400(RandomizedRunner.java:132)
	at com.carrotsearch.randomizedtesting.RandomizedRunner$2.run(RandomizedRunner.java:551)




Build Log:
[...truncated 7376 lines...]
[junit4:junit4] Suite: org.apache.solr.handler.component.DistributedQueryElevationComponentTest
[junit4:junit4] FAILURE 1.51s J1 | DistributedQueryElevationComponentTest.testDistribSearch
[junit4:junit4]    > Throwable #1: junit.framework.AssertionFailedError: .responseHeader.params.size()==9,9skipped=5,4
[junit4:junit4]    > 	at __randomizedtesting.SeedInfo.seed([2848A833E22CAC91:A9AE262B9573CCAD]:0)
[junit4:junit4]    > 	at junit.framework.Assert.fail(Assert.java:50)
[junit4:junit4]    > 	at org.apache.solr.BaseDistributedSearchTestCase.compareResponses(BaseDistributedSearchTestCase.java:670)
[junit4:junit4]    > 	at org.apache.solr.BaseDistributedSearchTestCase.query(BaseDistributedSearchTestCase.java:392)
[junit4:junit4]    > 	at org.apache.solr.handler.component.DistributedQueryElevationComponentTest.doTest(DistributedQueryElevationComponentTest.java:81)
[junit4:junit4]    > 	at org.apache.solr.BaseDistributedSearchTestCase.testDistribSearch(BaseDistributedSearchTestCase.java:679)
[junit4:junit4]    > 	at sun.reflect.NativeMethodAccessorImpl.invoke0(Native Method)
[junit4:junit4]    > 	at sun.reflect.NativeMethodAccessorImpl.invoke(NativeMethodAccessorImpl.java:57)
[junit4:junit4]    > 	at sun.reflect.DelegatingMethodAccessorImpl.invoke(DelegatingMethodAccessorImpl.java:43)
[junit4:junit4]    > 	at java.lang.reflect.Method.invoke(Method.java:474)
[junit4:junit4]    > 	at com.carrotsearch.randomizedtesting.RandomizedRunner.invoke(RandomizedRunner.java:1995)
[junit4:junit4]    > 	at com.carrotsearch.randomizedtesting.RandomizedRunner.access$1100(RandomizedRunner.java:132)
[junit4:junit4]    > 	at com.carrotsearch.randomizedtesting.RandomizedRunner$6.evaluate(RandomizedRunner.java:818)
[junit4:junit4]    > 	at com.carrotsearch.randomizedtesting.RandomizedRunner$7.evaluate(RandomizedRunner.java:877)
[junit4:junit4]    > 	at com.carrotsearch.randomizedtesting.RandomizedRunner$8.evaluate(RandomizedRunner.java:891)
[junit4:junit4]    > 	at com.carrotsearch.randomizedtesting.rules.SystemPropertiesRestoreRule$1.evaluate(SystemPropertiesRestoreRule.java:53)
[junit4:junit4]    > 	at org.apache.lucene.util.TestRuleSetupTeardownChained$1.evaluate(TestRuleSetupTeardownChained.java:50)
[junit4:junit4]    > 	at org.apache.lucene.util.TestRuleFieldCacheSanity$1.evaluate(TestRuleFieldCacheSanity.java:32)
[junit4:junit4]    > 	at org.apache.lucene.util.AbstractBeforeAfterRule$1.evaluate(AbstractBeforeAfterRule.java:45)
[junit4:junit4]    > 	at com.carrotsearch.randomizedtesting.rules.SystemPropertiesInvariantRule$1.evaluate(SystemPropertiesInvariantRule.java:55)
[junit4:junit4]    > 	at org.apache.lucene.util.TestRuleReportUncaughtExceptions$1.evaluate(TestRuleReportUncaughtExceptions.java:68)
[junit4:junit4]    > 	at org.apache.lucene.util.TestRuleThreadAndTestName$1.evaluate(TestRuleThreadAndTestName.java:48)
[junit4:junit4]    > 	at org.apache.lucene.util.TestRuleIgnoreAfterMaxFailures$1.evaluate(TestRuleIgnoreAfterMaxFailures.java:70)
[junit4:junit4]    > 	at org.apache.lucene.util.TestRuleMarkFailure$1.evaluate(TestRuleMarkFailure.java:48)
[junit4:junit4]    > 	at com.carrotsearch.randomizedtesting.RandomizedRunner.runSingleTest(RandomizedRunner.java:825)
[junit4:junit4]    > 	at com.carrotsearch.randomizedtesting.RandomizedRunner.access$700(RandomizedRunner.java:132)
[junit4:junit4]    > 	at com.carrotsearch.randomizedtesting.RandomizedRunner$3$1.run(RandomizedRunner.java:671)
[junit4:junit4]    > 	at com.carrotsearch.randomizedtesting.RandomizedRunner$3.evaluate(RandomizedRunner.java:697)
[junit4:junit4]    > 	at com.carrotsearch.randomizedtesting.RandomizedRunner$4.evaluate(RandomizedRunner.java:736)
[junit4:junit4]    > 	at com.carrotsearch.randomizedtesting.RandomizedRunner$5.evaluate(RandomizedRunner.java:747)
[junit4:junit4]    > 	at com.carrotsearch.randomizedtesting.rules.SystemPropertiesRestoreRule$1.evaluate(SystemPropertiesRestoreRule.java:53)
[junit4:junit4]    > 	at org.apache.lucene.util.AbstractBeforeAfterRule$1.evaluate(AbstractBeforeAfterRule.java:45)
[junit4:junit4]    > 	at org.apache.lucene.util.TestRuleReportUncaughtExceptions$1.evaluate(TestRuleReportUncaughtExceptions.java:68)
[junit4:junit4]    > 	at org.apache.lucene.util.TestRuleStoreClassName$1.evaluate(TestRuleStoreClassName.java:38)
[junit4:junit4]    > 	at com.carrotsearch.randomizedtesting.rules.SystemPropertiesInvariantRule$1.evaluate(SystemPropertiesInvariantRule.java:55)
[junit4:junit4]    > 	at org.apache.lucene.util.TestRuleNoInstanceHooksOverrides$1.evaluate(TestRuleNoInstanceHooksOverrides.java:53)
[junit4:junit4]    > 	at org.apache.lucene.util.TestRuleNoStaticHooksShadowing$1.evaluate(TestRuleNoStaticHooksShadowing.java:52)
[junit4:junit4]    > 	at org.apache.lucene.util.TestRuleAssertionsRequired$1.evaluate(TestRuleAssertionsRequired.java:36)
[junit4:junit4]    > 	at org.apache.lucene.util.TestRuleMarkFailure$1.evaluate(TestRuleMarkFailure.java:48)
[junit4:junit4]    > 	at org.apache.lucene.util.TestRuleIgnoreAfterMaxFailures$1.evaluate(TestRuleIgnoreAfterMaxFailures.java:70)
[junit4:junit4]    > 	at org.apache.lucene.util.TestRuleIgnoreTestSuites$1.evaluate(TestRuleIgnoreTestSuites.java:55)
[junit4:junit4]    > 	at com.carrotsearch.randomizedtesting.RandomizedRunner.runSuite(RandomizedRunner.java:605)
[junit4:junit4]    > 	at com.carrotsearch.randomizedtesting.RandomizedRunner.access$400(RandomizedRunner.java:132)
[junit4:junit4]    > 	at com.carrotsearch.randomizedtesting.RandomizedRunner$2.run(RandomizedRunner.java:551)
[junit4:junit4]    > 
[junit4:junit4]   2> 4 T1340 oas.SolrTestCaseJ4.setUp ###Starting testDistribSearch
[junit4:junit4]   2> 4 T1340 oejs.Server.doStart jetty-8.1.2.v20120308
[junit4:junit4]   2> 11 T1340 oejs.AbstractConnector.doStart Started SocketConnector@0.0.0.0:57062
[junit4:junit4]   2> 12 T1340 oasc.SolrResourceLoader.locateSolrHome JNDI not configured for solr (NoInitialContextEx)
[junit4:junit4]   2> 12 T1340 oasc.SolrResourceLoader.locateSolrHome using system property solr.solr.home: /mnt/ssd/jenkins/workspace/Lucene-Solr-trunk-Linux/checkout/solr/build/solr-core/test-files/solr
[junit4:junit4]   2> 12 T1340 oasc.SolrResourceLoader.<init> new SolrResourceLoader for deduced Solr Home: '/mnt/ssd/jenkins/workspace/Lucene-Solr-trunk-Linux/checkout/solr/build/solr-core/test-files/solr/'
[junit4:junit4]   2> 20 T1340 oass.SolrDispatchFilter.init SolrDispatchFilter.init()
[junit4:junit4]   2> 20 T1340 oasc.SolrResourceLoader.locateSolrHome JNDI not configured for solr (NoInitialContextEx)
[junit4:junit4]   2> 20 T1340 oasc.SolrResourceLoader.locateSolrHome using system property solr.solr.home: /mnt/ssd/jenkins/workspace/Lucene-Solr-trunk-Linux/checkout/solr/build/solr-core/test-files/solr
[junit4:junit4]   2> 20 T1340 oasc.CoreContainer$Initializer.initialize looking for solr.xml: /mnt/ssd/jenkins/workspace/Lucene-Solr-trunk-Linux/checkout/solr/build/solr-core/test-files/solr/solr.xml
[junit4:junit4]   2> 21 T1340 oasc.CoreContainer.<init> New CoreContainer 31428857
[junit4:junit4]   2> 21 T1340 oasc.CoreContainer.load Loading CoreContainer using Solr Home: '/mnt/ssd/jenkins/workspace/Lucene-Solr-trunk-Linux/checkout/solr/build/solr-core/test-files/solr/'
[junit4:junit4]   2> 21 T1340 oasc.SolrResourceLoader.<init> new SolrResourceLoader for directory: '/mnt/ssd/jenkins/workspace/Lucene-Solr-trunk-Linux/checkout/solr/build/solr-core/test-files/solr/'
[junit4:junit4]   2> 32 T1340 oasc.CoreContainer.load Registering Log Listener
[junit4:junit4]   2> 51 T1340 oasc.CoreContainer.create Creating SolrCore 'collection1' using instanceDir: /mnt/ssd/jenkins/workspace/Lucene-Solr-trunk-Linux/checkout/solr/build/solr-core/test-files/solr/collection1
[junit4:junit4]   2> 52 T1340 oasc.SolrResourceLoader.<init> new SolrResourceLoader for directory: '/mnt/ssd/jenkins/workspace/Lucene-Solr-trunk-Linux/checkout/solr/build/solr-core/test-files/solr/collection1/'
[junit4:junit4]   2> 52 T1340 oasc.SolrResourceLoader.replaceClassLoader Adding 'file:/mnt/ssd/jenkins/workspace/Lucene-Solr-trunk-Linux/checkout/solr/build/solr-core/test-files/solr/collection1/lib/README' to classloader
[junit4:junit4]   2> 53 T1340 oasc.SolrResourceLoader.replaceClassLoader Adding 'file:/mnt/ssd/jenkins/workspace/Lucene-Solr-trunk-Linux/checkout/solr/build/solr-core/test-files/solr/collection1/lib/classes/' to classloader
[junit4:junit4]   2> 91 T1340 oasc.SolrConfig.<init> Using Lucene MatchVersion: LUCENE_50
[junit4:junit4]   2> 125 T1340 oasc.SolrConfig.<init> Loaded SolrConfig: solrconfig-elevate.xml
[junit4:junit4]   2> 125 T1340 oass.IndexSchema.readSchema Reading Solr Schema
[junit4:junit4]   2> 128 T1340 oass.IndexSchema.readSchema Schema name=example
[junit4:junit4]   2> 267 T1340 oass.IndexSchema.readSchema default search field in schema is text
[junit4:junit4]   2> 270 T1340 oass.IndexSchema.readSchema unique key field: id
[junit4:junit4]   2> 272 T1340 oasc.SolrCore.<init> [collection1] Opening new SolrCore at /mnt/ssd/jenkins/workspace/Lucene-Solr-trunk-Linux/checkout/solr/build/solr-core/test-files/solr/collection1/, dataDir=./org.apache.solr.handler.component.DistributedQueryElevationComponentTest-1343810572411/control/data/
[junit4:junit4]   2> 272 T1340 oasc.JmxMonitoredMap.<init> JMX monitoring is enabled. Adding Solr mbeans to JMX Server: com.sun.jmx.mbeanserver.JmxMBeanServer@ea3050
[junit4:junit4]   2> 273 T1340 oasc.SolrCore.getNewIndexDir WARNING New index directory detected: old=null new=./org.apache.solr.handler.component.DistributedQueryElevationComponentTest-1343810572411/control/data/index/
[junit4:junit4]   2> 273 T1340 oasc.SolrCore.initIndex WARNING [collection1] Solr index directory './org.apache.solr.handler.component.DistributedQueryElevationComponentTest-1343810572411/control/data/index' doesn't exist. Creating new index...
[junit4:junit4]   2> 274 T1340 oasc.SolrDeletionPolicy.onCommit SolrDeletionPolicy.onCommit: commits:num=1
[junit4:junit4]   2> 		commit{dir=MockDirWrapper(NRTCachingDirectory(org.apache.lucene.store.RAMDirectory@dd246f lockFactory=org.apache.lucene.store.SingleInstanceLockFactory@15131f7; maxCacheMB=0.841796875 maxMergeSizeMB=0.6201171875)),segFN=segments_1,generation=1,filenames=[segments_1]
[junit4:junit4]   2> 274 T1340 oasc.SolrDeletionPolicy.updateCommits newest commit = 1
[junit4:junit4]   2> 275 T1340 oasc.RequestHandlers.initHandlersFromConfig created /update: solr.UpdateRequestHandler
[junit4:junit4]   2> 276 T1340 oasc.RequestHandlers.initHandlersFromConfig created /elevate: org.apache.solr.handler.component.SearchHandler
[junit4:junit4]   2> 276 T1340 oasc.RequestHandlers.initHandlersFromConfig created /dataElevate: org.apache.solr.handler.component.SearchHandler
[junit4:junit4]   2> 276 T1340 oashl.XMLLoader.init xsltCacheLifetimeSeconds=60
[junit4:junit4]   2> 277 T1340 oasc.RequestHandlers.initHandlersFromConfig WARNING no default request handler is registered (either '/select' or 'standard')
[junit4:junit4]   2> 278 T1340 oasc.SolrCore.initDeprecatedSupport WARNING solrconfig.xml uses deprecated <admin/gettableFiles>, Please update your config to use the ShowFileRequestHandler.
[junit4:junit4]   2> 278 T1340 oasc.SolrCore.initDeprecatedSupport WARNING adding ShowFileRequestHandler with hidden files: [BAD-SCHEMA-DUP-DYNAMICFIELD.XML, FRENCHARTICLES.TXT, SCHEMA-REPLICATION1.XML, KEEP-2.TXT, SOLRCONFIG-PHRASESUGGEST.XML, SYNONYMS.TXT, THROW.ERROR.ON.ADD.UPDATEPROCESSOR.JS, BAD-SCHEMA-UNIQUEKEY-MULTIVALUED.XML, SOLRCONFIG-SLAVE.XML, SOLRCONFIG-DELPOLICY1.XML, SCHEMA-STOP-KEEP.XML, SCHEMA-IB.XML, SOLRCONFIG-TERMINDEX.XML, STOPWORDS.TXT, BAD-SCHEMA-DUP-FIELD.XML, SCHEMA11.XML, SCHEMA-FOLDING.XML, SCHEMA-NOT-REQUIRED-UNIQUE-KEY.XML, SCHEMA-MINIMAL.XML, SOLRCONFIG-TLOG.XML, MAPPING-ISOLATIN1ACCENT.TXT, SOLRCONFIG_CODEC.XML, STOPWITHBOM.TXT, BAD-SCHEMA-NOT-INDEXED-BUT-TF.XML, WDFTYPES.TXT, SCHEMA-NUMERIC.XML, SOLRCONFIG-ALTDIRECTORY.XML, SOLRCONFIG-HIGHLIGHT.XML, SOLRCONFIG-ELEVATE.XML, SOLRCONFIG_PERF.XML, SCHEMA-SPELLCHECKER.XML, BAD-SOLRCONFIG-INVALID-SCRIPTFILE.XML, BAD-SCHEMA-NOT-INDEXED-BUT-POS.XML, SOLRCONFIG-SIMPLELOCK.XML, MISSING.FUNCTIONS.UPDATEPROCESSOR.JS, SOLRCONFIG-LAZYWRITER.XML, TRIVIAL.UPDATEPROCESSOR1.JS, CONDITIONAL.UPDATEPROCESSOR.JS, SOLRCONFIG-ENABLEPLUGIN.XML, SOLRCONFIG-TRANSFORMERS.XML, SOLRCONFIG-CACHING.XML, SOLRCONFIG-XINCLUDE.XML, OPEN-EXCHANGE-RATES.JSON, DA_UTF8.XML, SOLRCONFIG-QUERYSENDER-NOQUERY.XML, SCHEMA-REPLICATION2.XML, SOLRCONFIG-DELPOLICY2.XML, BAD-SCHEMA-ANALYZER-CLASS-AND-NESTED.XML, BAD-SCHEMA-UNIQUEKEY-USES-DEFAULT.XML, TRIVIAL.UPDATEPROCESSOR0.JS, SCHEMA-REQUIRED-FIELDS.XML, ADDFIELDS.UPDATEPROCESSOR.JS, BAD-SCHEMA-NOT-INDEXED-BUT-NORMS.XML, SCHEMA-TRIE.XML, BAD-SCHEMA-EXTERNAL-FILEFIELD.XML, BAD-SOLRCONFIG-MISSING-SCRIPTFILE.XML, HUNSPELL-TEST.DIC, SOLRCONFIG-REPEATER.XML, ELEVATE.XML, BAD-MP-SOLRCONFIG.XML, SOLRCONFIG-MASTER1-KEEPONEBACKUP.XML, STOP-2.TXT, SCHEMA-LUCENEMATCHVERSION.XML, SCHEMA12.XML, BAD-SCHEMA-SIM-GLOBAL-VS-FT-MISMATCH.XML, STOPWORDSWRONGENCODING.TXT, STOP-1.TXT, PROTWORDS.TXT, COMPOUNDDICTIONARY.TXT, SCHEMA15.XML, SOLRCONFIG-SOLR-749.XML, BAD-SOLRCONFIG-BOGUS-SCRIPTENGINE-NAME.XML, SOLRCONFIG-SCRIPT-UPDATEPROCESSOR.XML, SOLRCONFIG-MASTER3.XML, SOLRCONFIG-UPDATE-PROCESSOR-CHAINS.XML, PHRASESUGGEST.TXT, SCHEMA-BM25.XML, BAD-SCHEMA-DUP-FIELDTYPE.XML, BAD-SCHEMA-UNIQUEKEY-IS-COPYFIELD-DEST.XML, SOLRCONFIG-MASTER2.XML, BAD-SCHEMA-CODEC-GLOBAL-VS-FT-MISMATCH.XML, SCHEMA-DFR.XML, BAD-SCHEMA-NONTEXT-ANALYZER.XML, SOLRCONFIG-MASTER1.XML, SOLRCONFIG-FUNCTIONQUERY.XML, SOLRCONFIG-QUERYSENDER.XML, CURRENCY.XML, BAD_SOLRCONFIG.XML, SOLRCONFIG-SLAVE1.XML, SCHEMA.XML, SCHEMA-COLLATE.XML, SCHEMA-CHARFILTERS.XML, BAD-SCHEMA-OMIT-TF-BUT-NOT-POS.XML, HYPHENATION.DTD, STEMDICT.TXT, OLD_SYNONYMS.TXT, SOLRCONFIG-BASIC.XML, SCHEMA-PHRASESUGGEST.XML, SOLRCONFIG-SPELLCHECKCOMPONENT.XML, DA_COMPOUNDDICTIONARY.TXT, SOLRCONFIG-PROPINJECT.XML, SOLRCONFIG-REQHANDLER.INCL, STOPTYPES-1.TXT, SCHEMA-COPYFIELD-TEST.XML, SOLRCONFIG-MERGEPOLICY.XML, SOLRCONFIG-PROPINJECT-INDEXDEFAULT.XML, SCHEMA-LMJELINEKMERCER.XML, SOLRCONFIG-SOLCOREPROPERTIES.XML, SOLRCONFIG-MASTER.XML, XSLT, SCHEMA-LMDIRICHLET.XML, SOLRCONFIG-SPELLCHECKER.XML, SOLRCONFIG-NATIVELOCK.XML, SOLRCONFIG-NOCACHE.XML, SCHEMASURROUND.XML, SCHEMA-REVERSED.XML, SCHEMA_CODEC.XML, SCHEMA-TFIDF.XML, SCHEMA-BINARYFIELD.XML, SCHEMA-SIM.XML, STOP-SNOWBALL.TXT, HUNSPELL-TEST.AFF, MISSLEADING.EXTENSION.UPDATEPROCESSOR.JS.TXT, KEEP-1.TXT, STOPTYPES-2.TXT]
[junit4:junit4]   2> 281 T1340 oass.SolrIndexSearcher.<init> Opening Searcher@fe5cf7 main
[junit4:junit4]   2> 281 T1340 oass.SolrIndexSearcher.getIndexDir WARNING WARNING: Directory impl does not support setting indexDir: org.apache.lucene.store.MockDirectoryWrapper
[junit4:junit4]   2> 281 T1340 oasu.CommitTracker.<init> Hard AutoCommit: disabled
[junit4:junit4]   2> 281 T1340 oasu.CommitTracker.<init> Soft AutoCommit: disabled
[junit4:junit4]   2> 282 T1340 oashc.QueryElevationComponent.inform Loading QueryElevation from: /mnt/ssd/jenkins/workspace/Lucene-Solr-trunk-Linux/checkout/solr/build/solr-core/test-files/solr/collection1/conf/elevate.xml
[junit4:junit4]   2> 288 T1340 oashc.QueryElevationComponent.inform Loading QueryElevation from: /mnt/ssd/jenkins/workspace/Lucene-Solr-trunk-Linux/checkout/solr/build/solr-core/test-files/solr/collection1/conf/elevate.xml
[junit4:junit4]   2> 295 T1340 oashc.HttpShardHandlerFactory.getParameter Setting socketTimeout to: 0
[junit4:junit4]   2> 295 T1340 oashc.HttpShardHandlerFactory.getParameter Setting urlScheme to: http://
[junit4:junit4]   2> 295 T1340 oashc.HttpShardHandlerFactory.getParameter Setting connTimeout to: 0
[junit4:junit4]   2> 295 T1340 oashc.HttpShardHandlerFactory.getParameter Setting maxConnectionsPerHost to: 20
[junit4:junit4]   2> 296 T1340 oashc.HttpShardHandlerFactory.getParameter Setting corePoolSize to: 0
[junit4:junit4]   2> 296 T1340 oashc.HttpShardHandlerFactory.getParameter Setting maximumPoolSize to: 2147483647
[junit4:junit4]   2> 296 T1340 oashc.HttpShardHandlerFactory.getParameter Setting maxThreadIdleTime to: 5
[junit4:junit4]   2> 296 T1340 oashc.HttpShardHandlerFactory.getParameter Setting sizeOfQueue to: -1
[junit4:junit4]   2> 296 T1340 oashc.HttpShardHandlerFactory.getParameter Setting fairnessPolicy to: false
[junit4:junit4]   2> 297 T1340 oascsi.HttpClientUtil.createClient Creating new http client, config:maxConnectionsPerHost=20&maxConnections=10000&socketTimeout=0&connTimeout=0&retry=false
[junit4:junit4]   2> 299 T1350 oasc.SolrCore.registerSearcher [collection1] Registered new searcher Searcher@fe5cf7 main{StandardDirectoryReader(segments_1:1)}
[junit4:junit4]   2> 299 T1340 oasc.CoreContainer.register registering core: collection1
[junit4:junit4]   2> 300 T1340 oass.SolrDispatchFilter.init user.dir=/mnt/ssd/jenkins/workspace/Lucene-Solr-trunk-Linux/checkout/solr/build/solr-core/test/J1
[junit4:junit4]   2> 300 T1340 oass.SolrDispatchFilter.init SolrDispatchFilter.init() done
[junit4:junit4]   2> 300 T1340 oascsi.HttpClientUtil.createClient Creating new http client, config:maxConnections=128&maxConnectionsPerHost=32&followRedirects=false
[junit4:junit4]   2> 302 T1340 oejs.Server.doStart jetty-8.1.2.v20120308
[junit4:junit4]   2> 304 T1340 oejs.AbstractConnector.doStart Started SocketConnector@0.0.0.0:58034
[junit4:junit4]   2> 304 T1340 oasc.SolrResourceLoader.locateSolrHome JNDI not configured for solr (NoInitialContextEx)
[junit4:junit4]   2> 304 T1340 oasc.SolrResourceLoader.locateSolrHome using system property solr.solr.home: /mnt/ssd/jenkins/workspace/Lucene-Solr-trunk-Linux/checkout/solr/build/solr-core/test-files/solr
[junit4:junit4]   2> 304 T1340 oasc.SolrResourceLoader.<init> new SolrResourceLoader for deduced Solr Home: '/mnt/ssd/jenkins/workspace/Lucene-Solr-trunk-Linux/checkout/solr/build/solr-core/test-files/solr/'
[junit4:junit4]   2> 311 T1340 oass.SolrDispatchFilter.init SolrDispatchFilter.init()
[junit4:junit4]   2> 311 T1340 oasc.SolrResourceLoader.locateSolrHome JNDI not configured for solr (NoInitialContextEx)
[junit4:junit4]   2> 311 T1340 oasc.SolrResourceLoader.locateSolrHome using system property solr.solr.home: /mnt/ssd/jenkins/workspace/Lucene-Solr-trunk-Linux/checkout/solr/build/solr-core/test-files/solr
[junit4:junit4]   2> 311 T1340 oasc.CoreContainer$Initializer.initialize looking for solr.xml: /mnt/ssd/jenkins/workspace/Lucene-Solr-trunk-Linux/checkout/solr/build/solr-core/test-files/solr/solr.xml
[junit4:junit4]   2> 312 T1340 oasc.CoreContainer.<init> New CoreContainer 2217922
[junit4:junit4]   2> 312 T1340 oasc.CoreContainer.load Loading CoreContainer using Solr Home: '/mnt/ssd/jenkins/workspace/Lucene-Solr-trunk-Linux/checkout/solr/build/solr-core/test-files/solr/'
[junit4:junit4]   2> 312 T1340 oasc.SolrResourceLoader.<init> new SolrResourceLoader for directory: '/mnt/ssd/jenkins/workspace/Lucene-Solr-trunk-Linux/checkout/solr/build/solr-core/test-files/solr/'
[junit4:junit4]   2> 323 T1340 oasc.CoreContainer.load Registering Log Listener
[junit4:junit4]   2> 338 T1340 oasc.CoreContainer.create Creating SolrCore 'collection1' using instanceDir: /mnt/ssd/jenkins/workspace/Lucene-Solr-trunk-Linux/checkout/solr/build/solr-core/test-files/solr/collection1
[junit4:junit4]   2> 338 T1340 oasc.SolrResourceLoader.<init> new SolrResourceLoader for directory: '/mnt/ssd/jenkins/workspace/Lucene-Solr-trunk-Linux/checkout/solr/build/solr-core/test-files/solr/collection1/'
[junit4:junit4]   2> 338 T1340 oasc.SolrResourceLoader.replaceClassLoader Adding 'file:/mnt/ssd/jenkins/workspace/Lucene-Solr-trunk-Linux/checkout/solr/build/solr-core/test-files/solr/collection1/lib/README' to classloader
[junit4:junit4]   2> 339 T1340 oasc.SolrResourceLoader.replaceClassLoader Adding 'file:/mnt/ssd/jenkins/workspace/Lucene-Solr-trunk-Linux/checkout/solr/build/solr-core/test-files/solr/collection1/lib/classes/' to classloader
[junit4:junit4]   2> 359 T1340 oasc.SolrConfig.<init> Using Lucene MatchVersion: LUCENE_50
[junit4:junit4]   2> 392 T1340 oasc.SolrConfig.<init> Loaded SolrConfig: solrconfig-elevate.xml
[junit4:junit4]   2> 393 T1340 oass.IndexSchema.readSchema Reading Solr Schema
[junit4:junit4]   2> 395 T1340 oass.IndexSchema.readSchema Schema name=example
[junit4:junit4]   2> 536 T1340 oass.IndexSchema.readSchema default search field in schema is text
[junit4:junit4]   2> 538 T1340 oass.IndexSchema.readSchema unique key field: id
[junit4:junit4]   2> 540 T1340 oasc.SolrCore.<init> [collection1] Opening new SolrCore at /mnt/ssd/jenkins/workspace/Lucene-Solr-trunk-Linux/checkout/solr/build/solr-core/test-files/solr/collection1/, dataDir=./org.apache.solr.handler.component.DistributedQueryElevationComponentTest-1343810572411/shard0/data/
[junit4:junit4]   2> 540 T1340 oasc.JmxMonitoredMap.<init> JMX monitoring is enabled. Adding Solr mbeans to JMX Server: com.sun.jmx.mbeanserver.JmxMBeanServer@ea3050
[junit4:junit4]   2> 541 T1340 oasc.SolrCore.getNewIndexDir WARNING New index directory detected: old=null new=./org.apache.solr.handler.component.DistributedQueryElevationComponentTest-1343810572411/shard0/data/index/
[junit4:junit4]   2> 541 T1340 oasc.SolrCore.initIndex WARNING [collection1] Solr index directory './org.apache.solr.handler.component.DistributedQueryElevationComponentTest-1343810572411/shard0/data/index' doesn't exist. Creating new index...
[junit4:junit4]   2> 542 T1340 oasc.SolrDeletionPolicy.onCommit SolrDeletionPolicy.onCommit: commits:num=1
[junit4:junit4]   2> 		commit{dir=MockDirWrapper(NRTCachingDirectory(org.apache.lucene.store.RAMDirectory@e9010 lockFactory=org.apache.lucene.store.SingleInstanceLockFactory@922e97; maxCacheMB=0.513671875 maxMergeSizeMB=0.9150390625)),segFN=segments_1,generation=1,filenames=[segments_1]
[junit4:junit4]   2> 542 T1340 oasc.SolrDeletionPolicy.updateCommits newest commit = 1
[junit4:junit4]   2> 543 T1340 oasc.RequestHandlers.initHandlersFromConfig created /update: solr.UpdateRequestHandler
[junit4:junit4]   2> 543 T1340 oasc.RequestHandlers.initHandlersFromConfig created /elevate: org.apache.solr.handler.component.SearchHandler
[junit4:junit4]   2> 544 T1340 oasc.RequestHandlers.initHandlersFromConfig created /dataElevate: org.apache.solr.handler.component.SearchHandler
[junit4:junit4]   2> 544 T1340 oashl.XMLLoader.init xsltCacheLifetimeSeconds=60
[junit4:junit4]   2> 544 T1340 oasc.RequestHandlers.initHandlersFromConfig WARNING no default request handler is registered (either '/select' or 'standard')
[junit4:junit4]   2> 546 T1340 oasc.SolrCore.initDeprecatedSupport WARNING solrconfig.xml uses deprecated <admin/gettableFiles>, Please update your config to use the ShowFileRequestHandler.
[junit4:junit4]   2> 546 T1340 oasc.SolrCore.initDeprecatedSupport WARNING adding ShowFileRequestHandler with hidden files: [BAD-SCHEMA-DUP-DYNAMICFIELD.XML, FRENCHARTICLES.TXT, SCHEMA-REPLICATION1.XML, KEEP-2.TXT, SOLRCONFIG-PHRASESUGGEST.XML, SYNONYMS.TXT, THROW.ERROR.ON.ADD.UPDATEPROCESSOR.JS, BAD-SCHEMA-UNIQUEKEY-MULTIVALUED.XML, SOLRCONFIG-SLAVE.XML, SOLRCONFIG-DELPOLICY1.XML, SCHEMA-STOP-KEEP.XML, SCHEMA-IB.XML, SOLRCONFIG-TERMINDEX.XML, STOPWORDS.TXT, BAD-SCHEMA-DUP-FIELD.XML, SCHEMA11.XML, SCHEMA-FOLDING.XML, SCHEMA-NOT-REQUIRED-UNIQUE-KEY.XML, SCHEMA-MINIMAL.XML, SOLRCONFIG-TLOG.XML, MAPPING-ISOLATIN1ACCENT.TXT, SOLRCONFIG_CODEC.XML, STOPWITHBOM.TXT, BAD-SCHEMA-NOT-INDEXED-BUT-TF.XML, WDFTYPES.TXT, SCHEMA-NUMERIC.XML, SOLRCONFIG-ALTDIRECTORY.XML, SOLRCONFIG-HIGHLIGHT.XML, SOLRCONFIG-ELEVATE.XML, SOLRCONFIG_PERF.XML, SCHEMA-SPELLCHECKER.XML, BAD-SOLRCONFIG-INVALID-SCRIPTFILE.XML, BAD-SCHEMA-NOT-INDEXED-BUT-POS.XML, SOLRCONFIG-SIMPLELOCK.XML, MISSING.FUNCTIONS.UPDATEPROCESSOR.JS, SOLRCONFIG-LAZYWRITER.XML, TRIVIAL.UPDATEPROCESSOR1.JS, CONDITIONAL.UPDATEPROCESSOR.JS, SOLRCONFIG-ENABLEPLUGIN.XML, SOLRCONFIG-TRANSFORMERS.XML, SOLRCONFIG-CACHING.XML, SOLRCONFIG-XINCLUDE.XML, OPEN-EXCHANGE-RATES.JSON, DA_UTF8.XML, SOLRCONFIG-QUERYSENDER-NOQUERY.XML, SCHEMA-REPLICATION2.XML, SOLRCONFIG-DELPOLICY2.XML, BAD-SCHEMA-ANALYZER-CLASS-AND-NESTED.XML, BAD-SCHEMA-UNIQUEKEY-USES-DEFAULT.XML, TRIVIAL.UPDATEPROCESSOR0.JS, SCHEMA-REQUIRED-FIELDS.XML, ADDFIELDS.UPDATEPROCESSOR.JS, BAD-SCHEMA-NOT-INDEXED-BUT-NORMS.XML, SCHEMA-TRIE.XML, BAD-SCHEMA-EXTERNAL-FILEFIELD.XML, BAD-SOLRCONFIG-MISSING-SCRIPTFILE.XML, HUNSPELL-TEST.DIC, SOLRCONFIG-REPEATER.XML, ELEVATE.XML, BAD-MP-SOLRCONFIG.XML, SOLRCONFIG-MASTER1-KEEPONEBACKUP.XML, STOP-2.TXT, SCHEMA-LUCENEMATCHVERSION.XML, SCHEMA12.XML, BAD-SCHEMA-SIM-GLOBAL-VS-FT-MISMATCH.XML, STOPWORDSWRONGENCODING.TXT, STOP-1.TXT, PROTWORDS.TXT, COMPOUNDDICTIONARY.TXT, SCHEMA15.XML, SOLRCONFIG-SOLR-749.XML, BAD-SOLRCONFIG-BOGUS-SCRIPTENGINE-NAME.XML, SOLRCONFIG-SCRIPT-UPDATEPROCESSOR.XML, SOLRCONFIG-MASTER3.XML, SOLRCONFIG-UPDATE-PROCESSOR-CHAINS.XML, PHRASESUGGEST.TXT, SCHEMA-BM25.XML, BAD-SCHEMA-DUP-FIELDTYPE.XML, BAD-SCHEMA-UNIQUEKEY-IS-COPYFIELD-DEST.XML, SOLRCONFIG-MASTER2.XML, BAD-SCHEMA-CODEC-GLOBAL-VS-FT-MISMATCH.XML, SCHEMA-DFR.XML, BAD-SCHEMA-NONTEXT-ANALYZER.XML, SOLRCONFIG-MASTER1.XML, SOLRCONFIG-FUNCTIONQUERY.XML, SOLRCONFIG-QUERYSENDER.XML, CURRENCY.XML, BAD_SOLRCONFIG.XML, SOLRCONFIG-SLAVE1.XML, SCHEMA.XML, SCHEMA-COLLATE.XML, SCHEMA-CHARFILTERS.XML, BAD-SCHEMA-OMIT-TF-BUT-NOT-POS.XML, HYPHENATION.DTD, STEMDICT.TXT, OLD_SYNONYMS.TXT, SOLRCONFIG-BASIC.XML, SCHEMA-PHRASESUGGEST.XML, SOLRCONFIG-SPELLCHECKCOMPONENT.XML, DA_COMPOUNDDICTIONARY.TXT, SOLRCONFIG-PROPINJECT.XML, SOLRCONFIG-REQHANDLER.INCL, STOPTYPES-1.TXT, SCHEMA-COPYFIELD-TEST.XML, SOLRCONFIG-MERGEPOLICY.XML, SOLRCONFIG-PROPINJECT-INDEXDEFAULT.XML, SCHEMA-LMJELINEKMERCER.XML, SOLRCONFIG-SOLCOREPROPERTIES.XML, SOLRCONFIG-MASTER.XML, XSLT, SCHEMA-LMDIRICHLET.XML, SOLRCONFIG-SPELLCHECKER.XML, SOLRCONFIG-NATIVELOCK.XML, SOLRCONFIG-NOCACHE.XML, SCHEMASURROUND.XML, SCHEMA-REVERSED.XML, SCHEMA_CODEC.XML, SCHEMA-TFIDF.XML, SCHEMA-BINARYFIELD.XML, SCHEMA-SIM.XML, STOP-SNOWBALL.TXT, HUNSPELL-TEST.AFF, MISSLEADING.EXTENSION.UPDATEPROCESSOR.JS.TXT, KEEP-1.TXT, STOPTYPES-2.TXT]
[junit4:junit4]   2> 549 T1340 oass.SolrIndexSearcher.<init> Opening Searcher@6b483 main
[junit4:junit4]   2> 549 T1340 oass.SolrIndexSearcher.getIndexDir WARNING WARNING: Directory impl does not support setting indexDir: org.apache.lucene.store.MockDirectoryWrapper
[junit4:junit4]   2> 549 T1340 oasu.CommitTracker.<init> Hard AutoCommit: disabled
[junit4:junit4]   2> 550 T1340 oasu.CommitTracker.<init> Soft AutoCommit: disabled
[junit4:junit4]   2> 550 T1340 oashc.QueryElevationComponent.inform Loading QueryElevation from: /mnt/ssd/jenkins/workspace/Lucene-Solr-trunk-Linux/checkout/solr/build/solr-core/test-files/solr/collection1/conf/elevate.xml
[junit4:junit4]   2> 556 T1340 oashc.QueryElevationComponent.inform Loading QueryElevation from: /mnt/ssd/jenkins/workspace/Lucene-Solr-trunk-Linux/checkout/solr/build/solr-core/test-files/solr/collection1/conf/elevate.xml
[junit4:junit4]   2> 563 T1340 oashc.HttpShardHandlerFactory.getParameter Setting socketTimeout to: 0
[junit4:junit4]   2> 563 T1340 oashc.HttpShardHandlerFactory.getParameter Setting urlScheme to: http://
[junit4:junit4]   2> 563 T1340 oashc.HttpShardHandlerFactory.getParameter Setting connTimeout to: 0
[junit4:junit4]   2> 564 T1340 oashc.HttpShardHandlerFactory.getParameter Setting maxConnectionsPerHost to: 20
[junit4:junit4]   2> 564 T1340 oashc.HttpShardHandlerFactory.getParameter Setting corePoolSize to: 0
[junit4:junit4]   2> 564 T1340 oashc.HttpShardHandlerFactory.getParameter Setting maximumPoolSize to: 2147483647
[junit4:junit4]   2> 564 T1340 oashc.HttpShardHandlerFactory.getParameter Setting maxThreadIdleTime to: 5
[junit4:junit4]   2> 564 T1340 oashc.HttpShardHandlerFactory.getParameter Setting sizeOfQueue to: -1
[junit4:junit4]   2> 565 T1340 oashc.HttpShardHandlerFactory.getParameter Setting fairnessPolicy to: false
[junit4:junit4]   2> 565 T1340 oascsi.HttpClientUtil.createClient Creating new http client, config:maxConnectionsPerHost=20&maxConnections=10000&socketTimeout=0&connTimeout=0&retry=false
[junit4:junit4]   2> 568 T1340 oasc.CoreContainer.register registering core: collection1
[junit4:junit4]   2> 568 T1360 oasc.SolrCore.registerSearcher [collection1] Registered new searcher Searcher@6b483 main{StandardDirectoryReader(segments_1:1)}
[junit4:junit4]   2> 568 T1340 oass.SolrDispatchFilter.init user.dir=/mnt/ssd/jenkins/workspace/Lucene-Solr-trunk-Linux/checkout/solr/build/solr-core/test/J1
[junit4:junit4]   2> 568 T1340 oass.SolrDispatchFilter.init SolrDispatchFilter.init() done
[junit4:junit4]   2> 569 T1340 oascsi.HttpClientUtil.createClient Creating new http client, config:maxConnections=128&maxConnectionsPerHost=32&followRedirects=false
[junit4:junit4]   2> 571 T1340 oejs.Server.doStart jetty-8.1.2.v20120308
[junit4:junit4]   2> 573 T1340 oejs.AbstractConnector.doStart Started SocketConnector@0.0.0.0:51449
[junit4:junit4]   2> 574 T1340 oasc.SolrResourceLoader.locateSolrHome JNDI not configured for solr (NoInitialContextEx)
[junit4:junit4]   2> 574 T1340 oasc.SolrResourceLoader.locateSolrHome using system property solr.solr.home: /mnt/ssd/jenkins/workspace/Lucene-Solr-trunk-Linux/checkout/solr/build/solr-core/test-files/solr
[junit4:junit4]   2> 574 T1340 oasc.SolrResourceLoader.<init> new SolrResourceLoader for deduced Solr Home: '/mnt/ssd/jenkins/workspace/Lucene-Solr-trunk-Linux/checkout/solr/build/solr-core/test-files/solr/'
[junit4:junit4]   2> 581 T1340 oass.SolrDispatchFilter.init SolrDispatchFilter.init()
[junit4:junit4]   2> 581 T1340 oasc.SolrResourceLoader.locateSolrHome JNDI not configured for solr (NoInitialContextEx)
[junit4:junit4]   2> 581 T1340 oasc.SolrResourceLoader.locateSolrHome using system property solr.solr.home: /mnt/ssd/jenkins/workspace/Lucene-Solr-trunk-Linux/checkout/solr/build/solr-core/test-files/solr
[junit4:junit4]   2> 581 T1340 oasc.CoreContainer$Initializer.initialize looking for solr.xml: /mnt/ssd/jenkins/workspace/Lucene-Solr-trunk-Linux/checkout/solr/build/solr-core/test-files/solr/solr.xml
[junit4:junit4]   2> 582 T1340 oasc.CoreContainer.<init> New CoreContainer 6800564
[junit4:junit4]   2> 582 T1340 oasc.CoreContainer.load Loading CoreContainer using Solr Home: '/mnt/ssd/jenkins/workspace/Lucene-Solr-trunk-Linux/checkout/solr/build/solr-core/test-files/solr/'
[junit4:junit4]   2> 582 T1340 oasc.SolrResourceLoader.<init> new SolrResourceLoader for directory: '/mnt/ssd/jenkins/workspace/Lucene-Solr-trunk-Linux/checkout/solr/build/solr-core/test-files/solr/'
[junit4:junit4]   2> 591 T1340 oasc.CoreContainer.load Registering Log Listener
[junit4:junit4]   2> 603 T1340 oasc.CoreContainer.create Creating SolrCore 'collection1' using instanceDir: /mnt/ssd/jenkins/workspace/Lucene-Solr-trunk-Linux/checkout/solr/build/solr-core/test-files/solr/collection1
[junit4:junit4]   2> 603 T1340 oasc.SolrResourceLoader.<init> new SolrResourceLoader for directory: '/mnt/ssd/jenkins/workspace/Lucene-Solr-trunk-Linux/checkout/solr/build/solr-core/test-files/solr/collection1/'
[junit4:junit4]   2> 604 T1340 oasc.SolrResourceLoader.replaceClassLoader Adding 'file:/mnt/ssd/jenkins/workspace/Lucene-Solr-trunk-Linux/checkout/solr/build/solr-core/test-files/solr/collection1/lib/README' to classloader
[junit4:junit4]   2> 604 T1340 oasc.SolrResourceLoader.replaceClassLoader Adding 'file:/mnt/ssd/jenkins/workspace/Lucene-Solr-trunk-Linux/checkout/solr/build/solr-core/test-files/solr/collection1/lib/classes/' to classloader
[junit4:junit4]   2> 624 T1340 oasc.SolrConfig.<init> Using Lucene MatchVersion: LUCENE_50
[junit4:junit4]   2> 658 T1340 oasc.SolrConfig.<init> Loaded SolrConfig: solrconfig-elevate.xml
[junit4:junit4]   2> 658 T1340 oass.IndexSchema.readSchema Reading Solr Schema
[junit4:junit4]   2> 661 T1340 oass.IndexSchema.readSchema Schema name=example
[junit4:junit4]   2> 798 T1340 oass.IndexSchema.readSchema default search field in schema is text
[junit4:junit4]   2> 800 T1340 oass.IndexSchema.readSchema unique key field: id
[junit4:junit4]   2> 802 T1340 oasc.SolrCore.<init> [collection1] Opening new SolrCore at /mnt/ssd/jenkins/workspace/Lucene-Solr-trunk-Linux/checkout/solr/build/solr-core/test-files/solr/collection1/, dataDir=./org.apache.solr.handler.component.DistributedQueryElevationComponentTest-1343810572411/shard1/data/
[junit4:junit4]   2> 803 T1340 oasc.JmxMonitoredMap.<init> JMX monitoring is enabled. Adding Solr mbeans to JMX Server: com.sun.jmx.mbeanserver.JmxMBeanServer@ea3050
[junit4:junit4]   2> 803 T1340 oasc.SolrCore.getNewIndexDir WARNING New index directory detected: old=null new=./org.apache.solr.handler.component.DistributedQueryElevationComponentTest-1343810572411/shard1/data/index/
[junit4:junit4]   2> 803 T1340 oasc.SolrCore.initIndex WARNING [collection1] Solr index directory './org.apache.solr.handler.component.DistributedQueryElevationComponentTest-1343810572411/shard1/data/index' doesn't exist. Creating new index...
[junit4:junit4]   2> 805 T1340 oasc.SolrDeletionPolicy.onCommit SolrDeletionPolicy.onCommit: commits:num=1
[junit4:junit4]   2> 		commit{dir=MockDirWrapper(org.apache.lucene.store.RAMDirectory@b697c5 lockFactory=org.apache.lucene.store.SingleInstanceLockFactory@27e7e5),segFN=segments_1,generation=1,filenames=[segments_1]
[junit4:junit4]   2> 805 T1340 oasc.SolrDeletionPolicy.updateCommits newest commit = 1
[junit4:junit4]   2> 806 T1340 oasc.RequestHandlers.initHandlersFromConfig created /update: solr.UpdateRequestHandler
[junit4:junit4]   2> 806 T1340 oasc.RequestHandlers.initHandlersFromConfig created /elevate: org.apache.solr.handler.component.SearchHandler
[junit4:junit4]   2> 806 T1340 oasc.RequestHandlers.initHandlersFromConfig created /dataElevate: org.apache.solr.handler.component.SearchHandler
[junit4:junit4]   2> 807 T1340 oashl.XMLLoader.init xsltCacheLifetimeSeconds=60
[junit4:junit4]   2> 807 T1340 oasc.RequestHandlers.initHandlersFromConfig WARNING no default request handler is registered (either '/select' or 'standard')
[junit4:junit4]   2> 808 T1340 oasc.SolrCore.initDeprecatedSupport WARNING solrconfig.xml uses deprecated <admin/gettableFiles>, Please update your config to use the ShowFileRequestHandler.
[junit4:junit4]   2> 809 T1340 oasc.SolrCore.initDeprecatedSupport WARNING adding ShowFileRequestHandler with hidden files: [BAD-SCHEMA-DUP-DYNAMICFIELD.XML, FRENCHARTICLES.TXT, SCHEMA-REPLICATION1.XML, KEEP-2.TXT, SOLRCONFIG-PHRASESUGGEST.XML, SYNONYMS.TXT, THROW.ERROR.ON.ADD.UPDATEPROCESSOR.JS, BAD-SCHEMA-UNIQUEKEY-MULTIVALUED.XML, SOLRCONFIG-SLAVE.XML, SOLRCONFIG-DELPOLICY1.XML, SCHEMA-STOP-KEEP.XML, SCHEMA-IB.XML, SOLRCONFIG-TERMINDEX.XML, STOPWORDS.TXT, BAD-SCHEMA-DUP-FIELD.XML, SCHEMA11.XML, SCHEMA-FOLDING.XML, SCHEMA-NOT-REQUIRED-UNIQUE-KEY.XML, SCHEMA-MINIMAL.XML, SOLRCONFIG-TLOG.XML, MAPPING-ISOLATIN1ACCENT.TXT, SOLRCONFIG_CODEC.XML, STOPWITHBOM.TXT, BAD-SCHEMA-NOT-INDEXED-BUT-TF.XML, WDFTYPES.TXT, SCHEMA-NUMERIC.XML, SOLRCONFIG-ALTDIRECTORY.XML, SOLRCONFIG-HIGHLIGHT.XML, SOLRCONFIG-ELEVATE.XML, SOLRCONFIG_PERF.XML, SCHEMA-SPELLCHECKER.XML, BAD-SOLRCONFIG-INVALID-SCRIPTFILE.XML, BAD-SCHEMA-NOT-INDEXED-BUT-POS.XML, SOLRCONFIG-SIMPLELOCK.XML, MISSING.FUNCTIONS.UPDATEPROCESSOR.JS, SOLRCONFIG-LAZYWRITER.XML, TRIVIAL.UPDATEPROCESSOR1.JS, CONDITIONAL.UPDATEPROCESSOR.JS, SOLRCONFIG-ENABLEPLUGIN.XML, SOLRCONFIG-TRANSFORMERS.XML, SOLRCONFIG-CACHING.XML, SOLRCONFIG-XINCLUDE.XML, OPEN-EXCHANGE-RATES.JSON, DA_UTF8.XML, SOLRCONFIG-QUERYSENDER-NOQUERY.XML, SCHEMA-REPLICATION2.XML, SOLRCONFIG-DELPOLICY2.XML, BAD-SCHEMA-ANALYZER-CLASS-AND-NESTED.XML, BAD-SCHEMA-UNIQUEKEY-USES-DEFAULT.XML, TRIVIAL.UPDATEPROCESSOR0.JS, SCHEMA-REQUIRED-FIELDS.XML, ADDFIELDS.UPDATEPROCESSOR.JS, BAD-SCHEMA-NOT-INDEXED-BUT-NORMS.XML, SCHEMA-TRIE.XML, BAD-SCHEMA-EXTERNAL-FILEFIELD.XML, BAD-SOLRCONFIG-MISSING-SCRIPTFILE.XML, HUNSPELL-TEST.DIC, SOLRCONFIG-REPEATER.XML, ELEVATE.XML, BAD-MP-SOLRCONFIG.XML, SOLRCONFIG-MASTER1-KEEPONEBACKUP.XML, STOP-2.TXT, SCHEMA-LUCENEMATCHVERSION.XML, SCHEMA12.XML, BAD-SCHEMA-SIM-GLOBAL-VS-FT-MISMATCH.XML, STOPWORDSWRONGENCODING.TXT, STOP-1.TXT, PROTWORDS.TXT, COMPOUNDDICTIONARY.TXT, SCHEMA15.XML, SOLRCONFIG-SOLR-749.XML, BAD-SOLRCONFIG-BOGUS-SCRIPTENGINE-NAME.XML, SOLRCONFIG-SCRIPT-UPDATEPROCESSOR.XML, SOLRCONFIG-MASTER3.XML, SOLRCONFIG-UPDATE-PROCESSOR-CHAINS.XML, PHRASESUGGEST.TXT, SCHEMA-BM25.XML, BAD-SCHEMA-DUP-FIELDTYPE.XML, BAD-SCHEMA-UNIQUEKEY-IS-COPYFIELD-DEST.XML, SOLRCONFIG-MASTER2.XML, BAD-SCHEMA-CODEC-GLOBAL-VS-FT-MISMATCH.XML, SCHEMA-DFR.XML, BAD-SCHEMA-NONTEXT-ANALYZER.XML, SOLRCONFIG-MASTER1.XML, SOLRCONFIG-FUNCTIONQUERY.XML, SOLRCONFIG-QUERYSENDER.XML, CURRENCY.XML, BAD_SOLRCONFIG.XML, SOLRCONFIG-SLAVE1.XML, SCHEMA.XML, SCHEMA-COLLATE.XML, SCHEMA-CHARFILTERS.XML, BAD-SCHEMA-OMIT-TF-BUT-NOT-POS.XML, HYPHENATION.DTD, STEMDICT.TXT, OLD_SYNONYMS.TXT, SOLRCONFIG-BASIC.XML, SCHEMA-PHRASESUGGEST.XML, SOLRCONFIG-SPELLCHECKCOMPONENT.XML, DA_COMPOUNDDICTIONARY.TXT, SOLRCONFIG-PROPINJECT.XML, SOLRCONFIG-REQHANDLER.INCL, STOPTYPES-1.TXT, SCHEMA-COPYFIELD-TEST.XML, SOLRCONFIG-MERGEPOLICY.XML, SOLRCONFIG-PROPINJECT-INDEXDEFAULT.XML, SCHEMA-LMJELINEKMERCER.XML, SOLRCONFIG-SOLCOREPROPERTIES.XML, SOLRCONFIG-MASTER.XML, XSLT, SCHEMA-LMDIRICHLET.XML, SOLRCONFIG-SPELLCHECKER.XML, SOLRCONFIG-NATIVELOCK.XML, SOLRCONFIG-NOCACHE.XML, SCHEMASURROUND.XML, SCHEMA-REVERSED.XML, SCHEMA_CODEC.XML, SCHEMA-TFIDF.XML, SCHEMA-BINARYFIELD.XML, SCHEMA-SIM.XML, STOP-SNOWBALL.TXT, HUNSPELL-TEST.AFF, MISSLEADING.EXTENSION.UPDATEPROCESSOR.JS.TXT, KEEP-1.TXT, STOPTYPES-2.TXT]
[junit4:junit4]   2> 811 T1340 oass.SolrIndexSearcher.<init> Opening Searcher@100ec5f main
[junit4:junit4]   2> 811 T1340 oass.SolrIndexSearcher.getIndexDir WARNING WARNING: Directory impl does not support setting indexDir: org.apache.lucene.store.MockDirectoryWrapper
[junit4:junit4]   2> 812 T1340 oasu.CommitTracker.<init> Hard AutoCommit: disabled
[junit4:junit4]   2> 812 T1340 oasu.CommitTracker.<init> Soft AutoCommit: disabled
[junit4:junit4]   2> 812 T1340 oashc.QueryElevationComponent.inform Loading QueryElevation from: /mnt/ssd/jenkins/workspace/Lucene-Solr-trunk-Linux/checkout/solr/build/solr-core/test-files/solr/collection1/conf/elevate.xml
[junit4:junit4]   2> 819 T1340 oashc.QueryElevationComponent.inform Loading QueryElevation from: /mnt/ssd/jenkins/workspace/Lucene-Solr-trunk-Linux/checkout/solr/build/solr-core/test-files/solr/collection1/conf/elevate.xml
[junit4:junit4]   2> 825 T1340 oashc.HttpShardHandlerFactory.getParameter Setting socketTimeout to: 0
[junit4:junit4]   2> 825 T1340 oashc.HttpShardHandlerFactory.getParameter Setting urlScheme to: http://
[junit4:junit4]   2> 825 T1340 oashc.HttpShardHandlerFactory.getParameter Setting connTimeout to: 0
[junit4:junit4]   2> 826 T1340 oashc.HttpShardHandlerFactory.getParameter Setting maxConnectionsPerHost to: 20
[junit4:junit4]   2> 826 T1340 oashc.HttpShardHandlerFactory.getParameter Setting corePoolSize to: 0
[junit4:junit4]   2> 826 T1340 oashc.HttpShardHandlerFactory.getParameter Setting maximumPoolSize to: 2147483647
[junit4:junit4]   2> 826 T1340 oashc.HttpShardHandlerFactory.getParameter Setting maxThreadIdleTime to: 5
[junit4:junit4]   2> 827 T1340 oashc.HttpShardHandlerFactory.getParameter Setting sizeOfQueue to: -1
[junit4:junit4]   2> 827 T1340 oashc.HttpShardHandlerFactory.getParameter Setting fairnessPolicy to: false
[junit4:junit4]   2> 827 T1340 oascsi.HttpClientUtil.createClient Creating new http client, config:maxConnectionsPerHost=20&maxConnections=10000&socketTimeout=0&connTimeout=0&retry=false
[junit4:junit4]   2> 830 T1370 oasc.SolrCore.registerSearcher [collection1] Registered new searcher Searcher@100ec5f main{StandardDirectoryReader(segments_1:1)}
[junit4:junit4]   2> 829 T1340 oasc.CoreContainer.register registering core: collection1
[junit4:junit4]   2> 830 T1340 oass.SolrDispatchFilter.init user.dir=/mnt/ssd/jenkins/workspace/Lucene-Solr-trunk-Linux/checkout/solr/build/solr-core/test/J1
[junit4:junit4]   2> 830 T1340 oass.SolrDispatchFilter.init SolrDispatchFilter.init() done
[junit4:junit4]   2> 830 T1340 oascsi.HttpClientUtil.createClient Creating new http client, config:maxConnections=128&maxConnectionsPerHost=32&followRedirects=false
[junit4:junit4]   2> 833 T1340 oejs.Server.doStart jetty-8.1.2.v20120308
[junit4:junit4]   2> 834 T1340 oejs.AbstractConnector.doStart Started SocketConnector@0.0.0.0:37570
[junit4:junit4]   2> 835 T1340 oasc.SolrResourceLoader.locateSolrHome JNDI not configured for solr (NoInitialContextEx)
[junit4:junit4]   2> 835 T1340 oasc.SolrResourceLoader.locateSolrHome using system property solr.solr.home: /mnt/ssd/jenkins/workspace/Lucene-Solr-trunk-Linux/checkout/solr/build/solr-core/test-files/solr
[junit4:junit4]   2> 835 T1340 oasc.SolrResourceLoader.<init> new SolrResourceLoader for deduced Solr Home: '/mnt/ssd/jenkins/workspace/Lucene-Solr-trunk-Linux/checkout/solr/build/solr-core/test-files/solr/'
[junit4:junit4]   2> 842 T1340 oass.SolrDispatchFilter.init SolrDispatchFilter.init()
[junit4:junit4]   2> 842 T1340 oasc.SolrResourceLoader.locateSolrHome JNDI not configured for solr (NoInitialContextEx)
[junit4:junit4]   2> 842 T1340 oasc.SolrResourceLoader.locateSolrHome using system property solr.solr.home: /mnt/ssd/jenkins/workspace/Lucene-Solr-trunk-Linux/checkout/solr/build/solr-core/test-files/solr
[junit4:junit4]   2> 842 T1340 oasc.CoreContainer$Initializer.initialize looking for solr.xml: /mnt/ssd/jenkins/workspace/Lucene-Solr-trunk-Linux/checkout/solr/build/solr-core/test-files/solr/solr.xml
[junit4:junit4]   2> 843 T1340 oasc.CoreContainer.<init> New CoreContainer 6712068
[junit4:junit4]   2> 843 T1340 oasc.CoreContainer.load Loading CoreContainer using Solr Home: '/mnt/ssd/jenkins/workspace/Lucene-Solr-trunk-Linux/checkout/solr/build/solr-core/test-files/solr/'
[junit4:junit4]   2> 843 T1340 oasc.SolrResourceLoader.<init> new SolrResourceLoader for directory: '/mnt/ssd/jenkins/workspace/Lucene-Solr-trunk-Linux/checkout/solr/build/solr-core/test-files/solr/'
[junit4:junit4]   2> 852 T1340 oasc.CoreContainer.load Registering Log Listener
[junit4:junit4]   2> 863 T1340 oasc.CoreContainer.create Creating SolrCore 'collection1' using instanceDir: /mnt/ssd/jenkins/workspace/Lucene-Solr-trunk-Linux/checkout/solr/build/solr-core/test-files/solr/collection1
[junit4:junit4]   2> 863 T1340 oasc.SolrResourceLoader.<init> new SolrResourceLoader for directory: '/mnt/ssd/jenkins/workspace/Lucene-Solr-trunk-Linux/checkout/solr/build/solr-core/test-files/solr/collection1/'
[junit4:junit4]   2> 864 T1340 oasc.SolrResourceLoader.replaceClassLoader Adding 'file:/mnt/ssd/jenkins/workspace/Lucene-Solr-trunk-Linux/checkout/solr/build/solr-core/test-files/solr/collection1/lib/README' to classloader
[junit4:junit4]   2> 864 T1340 oasc.SolrResourceLoader.replaceClassLoader Adding 'file:/mnt/ssd/jenkins/workspace/Lucene-Solr-trunk-Linux/checkout/solr/build/solr-core/test-files/solr/collection1/lib/classes/' to classloader
[junit4:junit4]   2> 885 T1340 oasc.SolrConfig.<init> Using Lucene MatchVersion: LUCENE_50
[junit4:junit4]   2> 919 T1340 oasc.SolrConfig.<init> Loaded SolrConfig: solrconfig-elevate.xml
[junit4:junit4]   2> 919 T1340 oass.IndexSchema.readSchema Reading Solr Schema
[junit4:junit4]   2> 922 T1340 oass.IndexSchema.readSchema Schema name=example
[junit4:junit4]   2> 1060 T1340 oass.IndexSchema.readSchema default search field in schema is text
[junit4:junit4]   2> 1062 T1340 oass.IndexSchema.readSchema unique key field: id
[junit4:junit4]   2> 1064 T1340 oasc.SolrCore.<init> [collection1] Opening new SolrCore at /mnt/ssd/jenkins/workspace/Lucene-Solr-trunk-Linux/checkout/solr/build/solr-core/test-files/solr/collection1/, dataDir=./org.apache.solr.handler.component.DistributedQueryElevationComponentTest-1343810572411/shard2/data/
[junit4:junit4]   2> 1065 T1340 oasc.JmxMonitoredMap.<init> JMX monitoring is enabled. Adding Solr mbeans to JMX Server: com.sun.jmx.mbeanserver.JmxMBeanServer@ea3050
[junit4:junit4]   2> 1065 T1340 oasc.SolrCore.getNewIndexDir WARNING New index directory detected: old=null new=./org.apache.solr.handler.component.DistributedQueryElevationComponentTest-1343810572411/shard2/data/index/
[junit4:junit4]   2> 1065 T1340 oasc.SolrCore.initIndex WARNING [collection1] Solr index directory './org.apache.solr.handler.component.DistributedQueryElevationComponentTest-1343810572411/shard2/data/index' doesn't exist. Creating new index...
[junit4:junit4]   2> 1066 T1340 oasc.SolrDeletionPolicy.onCommit SolrDeletionPolicy.onCommit: commits:num=1
[junit4:junit4]   2> 		commit{dir=MockDirWrapper(org.apache.lucene.store.RAMDirectory@924636 lockFactory=org.apache.lucene.store.SingleInstanceLockFactory@1597744),segFN=segments_1,generation=1,filenames=[segments_1]
[junit4:junit4]   2> 1066 T1340 oasc.SolrDeletionPolicy.updateCommits newest commit = 1
[junit4:junit4]   2> 1067 T1340 oasc.RequestHandlers.initHandlersFromConfig created /update: solr.UpdateRequestHandler
[junit4:junit4]   2> 1067 T1340 oasc.RequestHandlers.initHandlersFromConfig created /elevate: org.apache.solr.handler.component.SearchHandler
[junit4:junit4]   2> 1068 T1340 oasc.RequestHandlers.initHandlersFromConfig created /dataElevate: org.apache.solr.handler.component.SearchHandler
[junit4:junit4]   2> 1068 T1340 oashl.XMLLoader.init xsltCacheLifetimeSeconds=60
[junit4:junit4]   2> 1068 T1340 oasc.RequestHandlers.initHandlersFromConfig WARNING no default request handler is registered (either '/select' or 'standard')
[junit4:junit4]   2> 1069 T1340 oasc.SolrCore.initDeprecatedSupport WARNING solrconfig.xml uses deprecated <admin/gettableFiles>, Please update your config to use the ShowFileRequestHandler.
[junit4:junit4]   2> 1070 T1340 oasc.SolrCore.initDeprecatedSupport WARNING adding ShowFileRequestHandler with hidden files: [BAD-SCHEMA-DUP-DYNAMICFIELD.XML, FRENCHARTICLES.TXT, SCHEMA-REPLICATION1.XML, KEEP-2.TXT, SOLRCONFIG-PHRASESUGGEST.XML, SYNONYMS.TXT, THROW.ERROR.ON.ADD.UPDATEPROCESSOR.JS, BAD-SCHEMA-UNIQUEKEY-MULTIVALUED.XML, SOLRCONFIG-SLAVE.XML, SOLRCONFIG-DELPOLICY1.XML, SCHEMA-STOP-KEEP.XML, SCHEMA-IB.XML, SOLRCONFIG-TERMINDEX.XML, STOPWORDS.TXT, BAD-SCHEMA-DUP-FIELD.XML, SCHEMA11.XML, SCHEMA-FOLDING.XML, SCHEMA-NOT-REQUIRED-UNIQUE-KEY.XML, SCHEMA-MINIMAL.XML, SOLRCONFIG-TLOG.XML, MAPPING-ISOLATIN1ACCENT.TXT, SOLRCONFIG_CODEC.XML, STOPWITHBOM.TXT, BAD-SCHEMA-NOT-INDEXED-BUT-TF.XML, WDFTYPES.TXT, SCHEMA-NUMERIC.XML, SOLRCONFIG-ALTDIRECTORY.XML, SOLRCONFIG-HIGHLIGHT.XML, SOLRCONFIG-ELEVATE.XML, SOLRCONFIG_PERF.XML, SCHEMA-SPELLCHECKER.XML, BAD-SOLRCONFIG-INVALID-SCRIPTFILE.XML, BAD-SCHEMA-NOT-INDEXED-BUT-POS.XML, SOLRCONFIG-SIMPLELOCK.XML, MISSING.FUNCTIONS.UPDATEPROCESSOR.JS, SOLRCONFIG-LAZYWRITER.XML, TRIVIAL.UPDATEPROCESSOR1.JS, CONDITIONAL.UPDATEPROCESSOR.JS, SOLRCONFIG-ENABLEPLUGIN.XML, SOLRCONFIG-TRANSFORMERS.XML, SOLRCONFIG-CACHING.XML, SOLRCONFIG-XINCLUDE.XML, OPEN-EXCHANGE-RATES.JSON, DA_UTF8.XML, SOLRCONFIG-QUERYSENDER-NOQUERY.XML, SCHEMA-REPLICATION2.XML, SOLRCONFIG-DELPOLICY2.XML, BAD-SCHEMA-ANALYZER-CLASS-AND-NESTED.XML, BAD-SCHEMA-UNIQUEKEY-USES-DEFAULT.XML, TRIVIAL.UPDATEPROCESSOR0.JS, SCHEMA-REQUIRED-FIELDS.XML, ADDFIELDS.UPDATEPROCESSOR.JS, BAD-SCHEMA-NOT-INDEXED-BUT-NORMS.XML, SCHEMA-TRIE.XML, BAD-SCHEMA-EXTERNAL-FILEFIELD.XML, BAD-SOLRCONFIG-MISSING-SCRIPTFILE.XML, HUNSPELL-TEST.DIC, SOLRCONFIG-REPEATER.XML, ELEVATE.XML, BAD-MP-SOLRCONFIG.XML, SOLRCONFIG-MASTER1-KEEPONEBACKUP.XML, STOP-2.TXT, SCHEMA-LUCENEMATCHVERSION.XML, SCHEMA12.XML, BAD-SCHEMA-SIM-GLOBAL-VS-FT-MISMATCH.XML, STOPWORDSWRONGENCODING.TXT, STOP-1.TXT, PROTWORDS.TXT, COMPOUNDDICTIONARY.TXT, SCHEMA15.XML, SOLRCONFIG-SOLR-749.XML, BAD-SOLRCONFIG-BOGUS-SCRIPTENGINE-NAME.XML, SOLRCONFIG-SCRIPT-UPDATEPROCESSOR.XML, SOLRCONFIG-MASTER3.XML, SOLRCONFIG-UPDATE-PROCESSOR-CHAINS.XML, PHRASESUGGEST.TXT, SCHEMA-BM25.XML, BAD-SCHEMA-DUP-FIELDTYPE.XML, BAD-SCHEMA-UNIQUEKEY-IS-COPYFIELD-DEST.XML, SOLRCONFIG-MASTER2.XML, BAD-SCHEMA-CODEC-GLOBAL-VS-FT-MISMATCH.XML, SCHEMA-DFR.XML, BAD-SCHEMA-NONTEXT-ANALYZER.XML, SOLRCONFIG-MASTER1.XML, SOLRCONFIG-FUNCTIONQUERY.XML, SOLRCONFIG-QUERYSENDER.XML, CURRENCY.XML, BAD_SOLRCONFIG.XML, SOLRCONFIG-SLAVE1.XML, SCHEMA.XML, SCHEMA-COLLATE.XML, SCHEMA-CHARFILTERS.XML, BAD-SCHEMA-OMIT-TF-BUT-NOT-POS.XML, HYPHENATION.DTD, STEMDICT.TXT, OLD_SYNONYMS.TXT, SOLRCONFIG-BASIC.XML, SCHEMA-PHRASESUGGEST.XML, SOLRCONFIG-SPELLCHECKCOMPONENT.XML, DA_COMPOUNDDICTIONARY.TXT, SOLRCONFIG-PROPINJECT.XML, SOLRCONFIG-REQHANDLER.INCL, STOPTYPES-1.TXT, SCHEMA-COPYFIELD-TEST.XML, SOLRCONFIG-MERGEPOLICY.XML, SOLRCONFIG-PROPINJECT-INDEXDEFAULT.XML, SCHEMA-LMJELINEKMERCER.XML, SOLRCONFIG-SOLCOREPROPERTIES.XML, SOLRCONFIG-MASTER.XML, XSLT, SCHEMA-LMDIRICHLET.XML, SOLRCONFIG-SPELLCHECKER.XML, SOLRCONFIG-NATIVELOCK.XML, SOLRCONFIG-NOCACHE.XML, SCHEMASURROUND.XML, SCHEMA-REVERSED.XML, SCHEMA_CODEC.XML, SCHEMA-TFIDF.XML, SCHEMA-BINARYFIELD.XML, SCHEMA-SIM.XML, STOP-SNOWBALL.TXT, HUNSPELL-TEST.AFF, MISSLEADING.EXTENSION.UPDATEPROCESSOR.JS.TXT, KEEP-1.TXT, STOPTYPES-2.TXT]
[junit4:junit4]   2> 1072 T1340 oass.SolrIndexSearcher.<init> Opening Searcher@1c9a489 main
[junit4:junit4]   2> 1072 T1340 oass.SolrIndexSearcher.getIndexDir WARNING WARNING: Directory impl does not support setting indexDir: org.apache.lucene.store.MockDirectoryWrapper
[junit4:junit4]   2> 1073 T1340 oasu.CommitTracker.<init> Hard AutoCommit: disabled
[junit4:junit4]   2> 1073 T1340 oasu.CommitTracker.<init> Soft AutoCommit: disabled
[junit4:junit4]   2> 1073 T1340 oashc.QueryElevationComponent.inform Loading QueryElevation from: /mnt/ssd/jenkins/workspace/Lucene-Solr-trunk-Linux/checkout/solr/build/solr-core/test-files/solr/collection1/conf/elevate.xml
[junit4:junit4]   2> 1080 T1340 oashc.QueryElevationComponent.inform Loading QueryElevation from: /mnt/ssd/jenkins/workspace/Lucene-Solr-trunk-Linux/checkout/solr/build/solr-core/test-files/solr/collection1/conf/elevate.xml
[junit4:junit4]   2> 1086 T1340 oashc.HttpShardHandlerFactory.getParameter Setting socketTimeout to: 0
[junit4:junit4]   2> 1087 T1340 oashc.HttpShardHandlerFactory.getParameter Setting urlScheme to: http://
[junit4:junit4]   2> 1087 T1340 oashc.HttpShardHandlerFactory.getParameter Setting connTimeout to: 0
[junit4:junit4]   2> 1087 T1340 oashc.HttpShardHandlerFactory.getParameter Setting maxConnectionsPerHost to: 20
[junit4:junit4]   2> 1088 T1340 oashc.HttpShardHandlerFactory.getParameter Setting corePoolSize to: 0
[junit4:junit4]   2> 1088 T1340 oashc.HttpShardHandlerFactory.getParameter Setting maximumPoolSize to: 2147483647
[junit4:junit4]   2> 1088 T1340 oashc.HttpShardHandlerFactory.getParameter Setting maxThreadIdleTime to: 5
[junit4:junit4]   2> 1088 T1340 oashc.HttpShardHandlerFactory.getParameter Setting sizeOfQueue to: -1
[junit4:junit4]   2> 1089 T1340 oashc.HttpShardHandlerFactory.getParameter Setting fairnessPolicy to: false
[junit4:junit4]   2> 1089 T1340 oascsi.HttpClientUtil.createClient Creating new http client, config:maxConnectionsPerHost=20&maxConnections=10000&socketTimeout=0&connTimeout=0&retry=false
[junit4:junit4]   2> 1093 T1340 oasc.CoreContainer.register registering core: collection1
[junit4:junit4]   2> 1093 T1340 oass.SolrDispatchFilter.init user.dir=/mnt/ssd/jenkins/workspace/Lucene-Solr-trunk-Linux/checkout/solr/build/solr-core/test/J1
[junit4:junit4]   2> 1093 T1340 oass.SolrDispatchFilter.init SolrDispatchFilter.init() done
[junit4:junit4]   2> 1094 T1340 oascsi.HttpClientUtil.createClient Creating new http client, config:maxConnections=128&maxConnectionsPerHost=32&followRedirects=false
[junit4:junit4]   2> 1096 T1380 oasc.SolrCore.registerSearcher [collection1] Registered new searcher Searcher@1c9a489 main{StandardDirectoryReader(segments_1:1)}
[junit4:junit4]   2> ASYNC  NEW_CORE C51 name=collection1 org.apache.solr.core.SolrCore@4088eb
[junit4:junit4]   2> 1101 T1343 C51 oasu.DirectUpdateHandler2.deleteAll [collection1] REMOVING ALL DOCUMENTS FROM INDEX
[junit4:junit4]   2> 1103 T1343 C51 oasc.SolrDeletionPolicy.onInit SolrDeletionPolicy.onInit: commits:num=1
[junit4:junit4]   2> 		commit{dir=MockDirWrapper(NRTCachingDirectory(org.apache.lucene.store.RAMDirectory@dd246f lockFactory=org.apache.lucene.store.SingleInstanceLockFactory@15131f7; maxCacheMB=0.841796875 maxMergeSizeMB=0.6201171875)),segFN=segments_1,generation=1,filenames=[segments_1]
[junit4:junit4]   2> 1103 T1343 C51 oasc.SolrDeletionPolicy.updateCommits newest commit = 1
[junit4:junit4]   2> 1104 T1343 C51 UPDATE [collection1] webapp=/solr path=/update params={wt=javabin&version=2} {deleteByQuery=*:*} 0 3
[junit4:junit4]   2> ASYNC  NEW_CORE C52 name=collection1 org.apache.solr.core.SolrCore@124f7e3
[junit4:junit4]   2> 1109 T1353 C52 oasu.DirectUpdateHandler2.deleteAll [collection1] REMOVING ALL DOCUMENTS FROM INDEX
[junit4:junit4]   2> 1111 T1353 C52 oasc.SolrDeletionPolicy.onInit SolrDeletionPolicy.onInit: commits:num=1
[junit4:junit4]   2> 		commit{dir=MockDirWrapper(NRTCachingDirectory(org.apache.lucene.store.RAMDirectory@e9010 lockFactory=org.apache.lucene.store.SingleInstanceLockFactory@922e97; maxCacheMB=0.513671875 maxMergeSizeMB=0.9150390625)),segFN=segments_1,generation=1,filenames=[segments_1]
[junit4:junit4]   2> 1112 T1353 C52 oasc.SolrDeletionPolicy.updateCommits newest commit = 1
[junit4:junit4]   2> 1113 T1353 C52 UPDATE [collection1] webapp=/solr path=/update params={wt=javabin&version=2} {deleteByQuery=*:*} 0 4
[junit4:junit4]   2> ASYNC  NEW_CORE C53 name=collection1 org.apache.solr.core.SolrCore@90be31
[junit4:junit4]   2> 1118 T1363 C53 oasu.DirectUpdateHandler2.deleteAll [collection1] REMOVING ALL DOCUMENTS FROM INDEX
[junit4:junit4]   2> 1120 T1363 C53 oasc.SolrDeletionPolicy.onInit SolrDeletionPolicy.onInit: commits:num=1
[junit4:junit4]   2> 		commit{dir=MockDirWrapper(org.apache.lucene.store.RAMDirectory@b697c5 lockFactory=org.apache.lucene.store.SingleInstanceLockFactory@27e7e5),segFN=segments_1,generation=1,filenames=[segments_1]
[junit4:junit4]   2> 1121 T1363 C53 oasc.SolrDeletionPolicy.updateCommits newest commit = 1
[junit4:junit4]   2> 1121 T1363 C53 UPDATE [collection1] webapp=/solr path=/update params={wt=javabin&version=2} {deleteByQuery=*:*} 0 3
[junit4:junit4]   2> ASYNC  NEW_CORE C54 name=collection1 org.apache.solr.core.SolrCore@1f254a1
[junit4:junit4]   2> 1126 T1373 C54 oasu.DirectUpdateHandler2.deleteAll [collection1] REMOVING ALL DOCUMENTS FROM INDEX
[junit4:junit4]   2> 1128 T1373 C54 oasc.SolrDeletionPolicy.onInit SolrDeletionPolicy.onInit: commits:num=1
[junit4:junit4]   2> 		commit{dir=MockDirWrapper(org.apache.lucene.store.RAMDirectory@924636 lockFactory=org.apache.lucene.store.SingleInstanceLockFactory@1597744),segFN=segments_1,generation=1,filenames=[segments_1]
[junit4:junit4]   2> 1128 T1373 C54 oasc.SolrDeletionPolicy.updateCommits newest commit = 1
[junit4:junit4]   2> 1128 T1373 C54 UPDATE [collection1] webapp=/solr path=/update params={wt=javabin&version=2} {deleteByQuery=*:*} 0 2
[junit4:junit4]   2> 1131 T1343 C51 UPDATE [collection1] webapp=/solr path=/update params={wt=javabin&version=2} {add=[1]} 0 0
[junit4:junit4]   2> 1134 T1353 C52 UPDATE [collection1] webapp=/solr path=/update params={wt=javabin&version=2} {add=[1]} 0 1
[junit4:junit4]   2> 1136 T1343 C51 UPDATE [collection1] webapp=/solr path=/update params={wt=javabin&version=2} {add=[2]} 0 0
[junit4:junit4]   2> 1139 T1363 C53 UPDATE [collection1] webapp=/solr path=/update params={wt=javabin&version=2} {add=[2]} 0 1
[junit4:junit4]   2> 1141 T1343 C51 UPDATE [collection1] webapp=/solr path=/update params={wt=javabin&version=2} {add=[3]} 0 0
[junit4:junit4]   2> 1143 T1373 C54 UPDATE [collection1] webapp=/solr path=/update params={wt=javabin&version=2} {add=[3]} 0 0
[junit4:junit4]   2> 1146 T1343 C51 UPDATE [collection1] webapp=/solr path=/update params={wt=javabin&version=2} {add=[4]} 0 1
[junit4:junit4]   2> 1148 T1353 C52 UPDATE [collection1] webapp=/solr path=/update params={wt=javabin&version=2} {add=[4]} 0 1
[junit4:junit4]   2> 1150 T1343 C51 UPDATE [collection1] webapp=/solr path=/update params={wt=javabin&version=2} {add=[5]} 0 1
[junit4:junit4]   2> 1152 T1363 C53 UPDATE [collection1] webapp=/solr path=/update params={wt=javabin&version=2} {add=[5]} 0 0
[junit4:junit4]   2> 1154 T1343 C51 UPDATE [collection1] webapp=/solr path=/update params={wt=javabin&version=2} {add=[6]} 0 0
[junit4:junit4]   2> 1156 T1373 C54 UPDATE [collection1] webapp=/solr path=/update params={wt=javabin&version=2} {add=[6]} 0 0
[junit4:junit4]   2> 1158 T1343 C51 UPDATE [collection1] webapp=/solr path=/update params={wt=javabin&version=2} {add=[7]} 0 0
[junit4:junit4]   2> 1161 T1373 C54 UPDATE [collection1] webapp=/solr path=/update params={wt=javabin&version=2} {add=[7]} 0 1
[junit4:junit4]   2> 1163 T1343 C51 oasu.DirectUpdateHandler2.commit start commit{flags=0,_version_=0,optimize=false,openSearcher=true,waitSearcher=true,expungeDeletes=false,softCommit=false}
[junit4:junit4]   2> 1169 T1343 C51 oasc.SolrDeletionPolicy.onCommit SolrDeletionPolicy.onCommit: commits:num=2
[junit4:junit4]   2> 		commit{dir=MockDirWrapper(NRTCachingDirectory(org.apache.lucene.store.RAMDirectory@dd246f lockFactory=org.apache.lucene.store.SingleInstanceLockFactory@15131f7; maxCacheMB=0.841796875 maxMergeSizeMB=0.6201171875)),segFN=segments_1,generation=1,filenames=[segments_1]
[junit4:junit4]   2> 		commit{dir=MockDirWrapper(NRTCachingDirectory(org.apache.lucene.store.RAMDirectory@dd246f lockFactory=org.apache.lucene.store.SingleInstanceLockFactory@15131f7; maxCacheMB=0.841796875 maxMergeSizeMB=0.6201171875)),segFN=segments_2,generation=2,filenames=[_0_nrm.cfe, _0_MockSep_0.pyl, _0.si, _0_MockSep_0.tib, _0.fdt, _0_nrm.cfs, _0_MockSep_0.tii, _0_Asserting_0.tim, _0_MockSep_0.frq, _0.fnm, _0_Asserting_0.frq, _0_MockSep_0.skp, _0_MockSep_0.pos, _0.fdx, _0_Asserting_0.prx, _0_MockSep_0.doc, _0_Asserting_0.tip, segments_2]
[junit4:junit4]   2> 1170 T1343 C51 oasc.SolrDeletionPolicy.updateCommits newest commit = 2
[junit4:junit4]   2> 1172 T1343 C51 oass.SolrIndexSearcher.<init> Opening Searcher@ac6a14 main
[junit4:junit4]   2> 1172 T1343 C51 oass.SolrIndexSearcher.getIndexDir WARNING WARNING: Directory impl does not support setting indexDir: org.apache.lucene.store.MockDirectoryWrapper
[junit4:junit4]   2> 1173 T1343 C51 oasu.DirectUpdateHandler2.commit end_commit_flush
[junit4:junit4]   2> 1174 T1350 oasc.SolrCore.registerSearcher [collection1] Registered new searcher Searcher@ac6a14 main{StandardDirectoryReader(segments_2:4 _0(5.0):C7)}
[junit4:junit4]   2> 1174 T1343 C51 UPDATE [collection1] webapp=/solr path=/update params={waitSearcher=true&version=2&wt=javabin&softCommit=false&commit=true} {commit=} 0 11
[junit4:junit4]   2> 1178 T1353 C52 oasu.DirectUpdateHandler2.commit start commit{flags=0,_version_=0,optimize=false,openSearcher=true,waitSearcher=true,expungeDeletes=false,softCommit=false}
[junit4:junit4]   2> 1180 T1353 C52 oasc.SolrDeletionPolicy.onCommit SolrDeletionPolicy.onCommit: commits:num=2
[junit4:junit4]   2> 		commit{dir=MockDirWrapper(NRTCachingDirectory(org.apache.lucene.store.RAMDirectory@e9010 lockFactory=org.apache.lucene.store.SingleInstanceLockFactory@922e97; maxCacheMB=0.513671875 maxMergeSizeMB=0.9150390625)),segFN=segments_1,generation=1,filenames=[segments_1]
[junit4:junit4]   2> 		commit{dir=MockDirWrapper(NRTCachingDirectory(org.apache.lucene.store.RAMDirectory@e9010 lockFactory=org.apache.lucene.store.SingleInstanceLockFactory@922e97; maxCacheMB=0.513671875 maxMergeSizeMB=0.9150390625)),segFN=segments_2,generation=2,filenames=[_0_nrm.cfe, _0_MockSep_0.pyl, _0.si, _0_MockSep_0.tib, _0.fdt, _0_nrm.cfs, _0_MockSep_0.tii, _0_Asserting_0.tim, _0_MockSep_0.frq, _0.fnm, _0_Asserting_0.frq, _0_MockSep_0.skp, _0_MockSep_0.pos, _0.fdx, _0_Asserting_0.prx, _0_MockSep_0.doc, _0_Asserting_0.tip, segments_2]
[junit4:junit4]   2> 1181 T1353 C52 oasc.SolrDeletionPolicy.updateCommits newest commit = 2
[junit4:junit4]   2> 1182 T1353 C52 oass.SolrIndexSearcher.<init> Opening Searcher@ce82d6 main
[junit4:junit4]   2> 1182 T1353 C52 oass.SolrIndexSearcher.getIndexDir WARNING WARNING: Directory impl does not support setting indexDir: org.apache.lucene.store.MockDirectoryWrapper
[junit4:junit4]   2> 1183 T1353 C52 oasu.DirectUpdateHandler2.commit end_commit_flush
[junit4:junit4]   2> 1183 T1360 oasc.SolrCore.registerSearcher [collection1] Registered new searcher Searcher@ce82d6 main{StandardDirectoryReader(segments_2:4 _0(5.0):C2)}
[junit4:junit4]   2> 1184 T1353 C52 UPDATE [collection1] webapp=/solr path=/update params={waitSearcher=true&version=2&wt=javabin&softCommit=false&commit=true} {commit=} 0 6
[junit4:junit4]   2> 1186 T1363 C53 oasu.DirectUpdateHandler2.commit start commit{flags=0,_version_=0,optimize=false,openSearcher=true,waitSearcher=true,expungeDeletes=false,softCommit=false}
[junit4:junit4]   2> 1188 T1363 C53 oasc.SolrDeletionPolicy.onCommit SolrDeletionPolicy.onCommit: commits:num=2
[junit4:junit4]   2> 		commit{dir=MockDirWrapper(org.apache.lucene.store.RAMDirectory@b697c5 lockFactory=org.apache.lucene.store.SingleInstanceLockFactory@27e7e5),segFN=segments_1,generation=1,filenames=[segments_1]
[junit4:junit4]   2> 		commit{dir=MockDirWrapper(org.apache.lucene.store.RAMDirectory@b697c5 lockFactory=org.apache.lucene.store.SingleInstanceLockFactory@27e7e5),segFN=segments_2,generation=2,filenames=[_0_nrm.cfe, _0_MockSep_0.pyl, _0.si, _0_MockSep_0.tib, _0.fdt, _0_nrm.cfs, _0_MockSep_0.tii, _0_Asserting_0.tim, _0_MockSep_0.frq, _0.fnm, _0_Asserting_0.frq, _0_MockSep_0.skp, _0_MockSep_0.pos, _0.fdx, _0_Asserting_0.prx, _0_MockSep_0.doc, _0_Asserting_0.tip, segments_2]
[junit4:junit4]   2> 1188 T1363 C53 oasc.SolrDeletionPolicy.updateCommits newest commit = 2
[junit4:junit4]   2> 1190 T1363 C53 oass.SolrIndexSearcher.<init> Opening Searcher@2e01da main
[junit4:junit4]   2> 1190 T1363 C53 oass.SolrIndexSearcher.getIndexDir WARNING WARNING: Directory impl does not support setting indexDir: org.apache.lucene.store.MockDirectoryWrapper
[junit4:junit4]   2> 1191 T1370 oasc.SolrCore.registerSearcher [collection1] Registered new searcher Searcher@2e01da main{StandardDirectoryReader(segments_2:4 _0(5.0):C2)}
[junit4:junit4]   2> 1191 T1363 C53 oasu.DirectUpdateHandler2.commit end_commit_flush
[junit4:junit4]   2> 1192 T1363 C53 UPDATE [collection1] webapp=/solr path=/update params={waitSearcher=true&version=2&wt=javabin&softCommit=false&commit=true} {commit=} 0 6
[junit4:junit4]   2> 1194 T1373 C54 oasu.DirectUpdateHandler2.commit start commit{flags=0,_version_=0,optimize=false,openSearcher=true,waitSearcher=true,expungeDeletes=false,softCommit=false}
[junit4:junit4]   2> 1196 T1373 C54 oasc.SolrDeletionPolicy.onCommit SolrDeletionPolicy.onCommit: commits:num=2
[junit4:junit4]   2> 		commit{dir=MockDirWrapper(org.apache.lucene.store.RAMDirectory@924636 lockFactory=org.apache.lucene.store.SingleInstanceLockFactory@1597744),segFN=segments_1,generation=1,filenames=[segments_1]
[junit4:junit4]   2> 		commit{dir=MockDirWrapper(org.apache.lucene.store.RAMDirectory@924636 lockFactory=org.apache.lucene.store.SingleInstanceLockFactory@1597744),segFN=segments_2,generation=2,filenames=[_0_nrm.cfe, _0_MockSep_0.pyl, _0.si, _0_MockSep_0.tib, _0.fdt, _0_nrm.cfs, _0_MockSep_0.tii, _0_Asserting_0.tim, _0_MockSep_0.frq, _0.fnm, _0_Asserting_0.frq, _0_MockSep_0.skp, _0_MockSep_0.pos, _0.fdx, _0_Asserting_0.prx, _0_MockSep_0.doc, _0_Asserting_0.tip, segments_2]
[junit4:junit4]   2> 1196 T1373 C54 oasc.SolrDeletionPolicy.updateCommits newest commit = 2
[junit4:junit4]   2> 1197 T1373 C54 oass.SolrIndexSearcher.<init> Opening Searcher@1eeb964 main
[junit4:junit4]   2> 1198 T1373 C54 oass.SolrIndexSearcher.getIndexDir WARNING WARNING: Directory impl does not support setting indexDir: org.apache.lucene.store.MockDirectoryWrapper
[junit4:junit4]   2> 1198 T1373 C54 oasu.DirectUpdateHandler2.commit end_commit_flush
[junit4:junit4]   2> 1199 T1380 oasc.SolrCore.registerSearcher [collection1] Registered new searcher Searcher@1eeb964 main{StandardDirectoryReader(segments_2:4 _0(5.0):C3)}
[junit4:junit4]   2> 1199 T1373 C54 UPDATE [collection1] webapp=/solr path=/update params={waitSearcher=true&version=2&wt=javabin&softCommit=false&commit=true} {commit=} 0 5
[junit4:junit4]   2> 1202 T1343 C51 REQ [collection1] webapp=/solr path=/elevate params={wt=javabin&qt=/elevate&q=*:*&shards.qt=/elevate&rows=500&version=2&sort=id+desc&fl=id,+score,+[elevated]&distrib=false} hits=7 status=0 QTime=1 
[junit4:junit4]   2> 1237 T1374 C54 REQ [collection1] webapp=/solr path=/elevate params={wt=javabin&q=*:*&shards.qt=/elevate&rows=500&version=2&sort=id+desc&NOW=1343810573611&fl=id,score&qt=/elevate&start=0&shard.url=localhost:37570/solr&isShard=true&fsv=true&distrib=false} hits=3 status=0 QTime=0 
[junit4:junit4]   2> 1237 T1354 C52 REQ [collection1] webapp=/solr path=/elevate params={wt=javabin&q=*:*&shards.qt=/elevate&rows=500&version=2&sort=id+desc&NOW=1343810573611&fl=id,score&qt=/elevate&start=0&shard.url=localhost:58034/solr&isShard=true&fsv=true&distrib=false} hits=2 status=0 QTime=0 
[junit4:junit4]   2> 1238 T1364 C53 REQ [collection1] webapp=/solr path=/elevate params={wt=javabin&q=*:*&shards.qt=/elevate&rows=500&version=2&sort=id+desc&NOW=1343810573611&fl=id,score&qt=/elevate&start=0&shard.url=[::1]:33332/solr|localhost:51449/solr&isShard=true&fsv=true&distrib=false} hits=2 status=0 QTime=1 
[junit4:junit4]   2> 1240 T1364 C53 REQ [collection1] webapp=/solr path=/elevate params={wt=javabin&q=*:*&shards.qt=/elevate&rows=500&version=2&NOW=1343810573611&fl=id,+score,+[elevated]&ids=5.0,2.0&qt=/elevate&shard.url=[::1]:33332/solr|localhost:51449/solr&isShard=true&distrib=false} status=0 QTime=0 
[junit4:junit4]   2> 1240 T1374 C54 REQ [collection1] webapp=/solr path=/elevate params={wt=javabin&q=*:*&shards.qt=/elevate&rows=500&version=2&NOW=1343810573611&fl=id,+score,+[elevated]&ids=7.0,3.0,6.0&qt=/elevate&shard.url=localhost:37570/solr&isShard=true&distrib=false} status=0 QTime=0 
[junit4:junit4]   2> 1240 T1354 C52 REQ [collection1] webapp=/solr path=/elevate params={wt=javabin&q=*:*&shards.qt=/elevate&rows=500&version=2&NOW=1343810573611&fl=id,+score,+[elevated]&ids=4.0,1.0&qt=/elevate&shard.url=localhost:58034/solr&isShard=true&distrib=false} status=0 QTime=0 
[junit4:junit4]   2> 1241 T1353 C52 REQ [collection1] webapp=/solr path=/elevate params={shards=localhost:58034/solr,[::1]:33332/solr|localhost:51449/solr,localhost:37570/solr&wt=javabin&qt=/elevate&q=*:*&shards.qt=/elevate&rows=500&version=2&sort=id+desc&fl=id,+score,+[elevated]} status=0 QTime=37 
[junit4:junit4]   2> 1242 T1340 oas.BaseDistributedSearchTestCase.compareResponses SEVERE Mismatched responses:
[junit4:junit4]   2> 	{responseHeader={status=0,QTime=37,params={shards=localhost:58034/solr,[::1]:33332/solr|localhost:51449/solr,localhost:37570/solr,wt=javabin,qt=/elevate,q=*:*,shards.qt=/elevate,rows=500,version=2,sort=id desc,fl=id, score, [elevated]}},response={numFound=7,start=0,maxScore=1.0,docs=[SolrDocument{id=7.0, [elevated]=false, score=1.0}, SolrDocument{id=6.0, [elevated]=false, score=1.0}, SolrDocument{id=5.0, [elevated]=false, score=1.0}, SolrDocument{id=4.0, [elevated]=false, score=1.0}, SolrDocument{id=3.0, [elevated]=false, score=1.0}, SolrDocument{id=2.0, [elevated]=false, score=1.0}, SolrDocument{id=1.0, [elevated]=false, score=1.0}]}}
[junit4:junit4]   2> 	{responseHeader={status=0,QTime=1,params={wt=javabin,qt=/elevate,q=*:*,shards.qt=/elevate,rows=500,version=2,sort=id desc,fl=id, score, [elevated],distrib=false}},response={numFound=7,start=0,maxScore=1.0,docs=[SolrDocument{id=7.0, score=1.0, [elevated]=false}, SolrDocument{id=6.0, score=1.0, [elevated]=false}, SolrDocument{id=5.0, score=1.0, [elevated]=false}, SolrDocument{id=4.0, score=1.0, [elevated]=false}, SolrDocument{id=3.0, score=1.0, [elevated]=false}, SolrDocument{id=2.0, score=1.0, [elevated]=false}, SolrDocument{id=1.0, score=1.0, [elevated]=false}]}}
[junit4:junit4]   2> 1243 T1340 oasc.CoreContainer.shutdown Shutting down CoreContainer instance=31428857
[junit4:junit4]   2> 1244 T1340 oasc.SolrCore.close [collection1]  CLOSING SolrCore org.apache.solr.core.SolrCore@4088eb
[junit4:junit4]   2> 1244 T1340 oasc.SolrCore.closeSearcher [collection1] Closing main searcher on request.
[junit4:junit4]   2> 1245 T1340 oasu.DirectUpdateHandler2.close closing DirectUpdateHandler2{commits=1,autocommits=0,soft autocommits=0,optimizes=0,rollbacks=0,expungeDeletes=0,docsPending=0,adds=0,deletesById=0,deletesByQuery=0,errors=0,cumulative_adds=7,cumulative_deletesById=0,cumulative_deletesByQuery=1,cumulative_errors=0}
[junit4:junit4]   2> 1250 T1340 oejsh.ContextHandler.doStop stopped o.e.j.s.ServletContextHandler{/solr,null}
[junit4:junit4]   2> 1302 T1340 oasc.CoreContainer.shutdown Shutting down CoreContainer instance=2217922
[junit4:junit4]   2> 1303 T1340 oasc.SolrCore.close [collection1]  CLOSING SolrCore org.apache.solr.core.SolrCore@124f7e3
[junit4:junit4]   2> 1304 T1340 oasc.SolrCore.closeSearcher [collection1] Closing main searcher on request.
[junit4:junit4]   2> 1304 T1340 oasu.DirectUpdateHandler2.close closing DirectUpdateHandler2{commits=1,autocommits=0,soft autocommits=0,optimizes=0,rollbacks=0,expungeDeletes=0,docsPending=0,adds=0,deletesById=0,deletesByQuery=0,errors=0,cumulative_adds=2,cumulative_deletesById=0,cumulative_deletesByQuery=1,cumulative_errors=0}
[junit4:junit4]   2> 1308 T1340 oejsh.ContextHandler.doStop stopped o.e.j.s.ServletContextHandler{/solr,null}
[junit4:junit4]   2> 1360 T1340 oasc.CoreContainer.shutdown Shutting down CoreContainer instance=6800564
[junit4:junit4]   2> 1361 T1340 oasc.SolrCore.close [collection1]  CLOSING SolrCore org.apache.solr.core.SolrCore@90be31
[junit4:junit4]   2> 1361 T1340 oasc.SolrCore.closeSearcher [collection1] Closing main searcher on request.
[junit4:junit4]   2> 1362 T1340 oasu.DirectUpdateHandler2.close closing DirectUpdateHandler2{commits=1,autocommits=0,soft autocommits=0,optimizes=0,rollbacks=0,expungeDeletes=0,docsPending=0,adds=0,deletesById=0,deletesByQuery=0,errors=0,cumulative_adds=2,cumulative_deletesById=0,cumulative_deletesByQuery=1,cumulative_errors=0}
[junit4:junit4]   2> 1365 T1340 oejsh.ContextHandler.doStop stopped o.e.j.s.ServletContextHandler{/solr,null}
[junit4:junit4]   2> 1417 T1340 oasc.CoreContainer.shutdown Shutting down CoreContainer instance=6712068
[junit4:junit4]   2> 1418 T1340 oasc.SolrCore.close [collection1]  CLOSING SolrCore org.apache.solr.core.SolrCore@1f254a1
[junit4:junit4]   2> 1419 T1340 oasc.SolrCore.closeSearcher [collection1] Closing main searcher on request.
[junit4:junit4]   2> 1419 T1340 oasu.DirectUpdateHandler2.close closing DirectUpdateHandler2{commits=1,autocommits=0,soft autocommits=0,optimizes=0,rollbacks=0,expungeDeletes=0,docsPending=0,adds=0,deletesById=0,deletesByQuery=0,errors=0,cumulative_adds=3,cumulative_deletesById=0,cumulative_deletesByQuery=1,cumulative_errors=0}
[junit4:junit4]   2> 1422 T1340 oejsh.ContextHandler.doStop stopped o.e.j.s.ServletContextHandler{/solr,null}
[junit4:junit4]   2> 1429 T1253 oaz.ClientCnxn$SendThread.startConnect Opening socket connection to server localhost.localdomain/127.0.0.1:34241
[junit4:junit4]   2> 1430 T1253 oaz.ClientCnxn$SendThread.run WARNING Session 0x138e158f5af0010 for server null, unexpected error, closing socket connection and attempting reconnect java.net.ConnectException: Connection refused
[junit4:junit4]   2> 	at sun.nio.ch.SocketChannelImpl.checkConnect(Native Method)
[junit4:junit4]   2> 	at sun.nio.ch.SocketChannelImpl.finishConnect(SocketChannelImpl.java:692)
[junit4:junit4]   2> 	at org.apache.zookeeper.ClientCnxn$SendThread.run(ClientCnxn.java:1143)
[junit4:junit4]   2> 
[junit4:junit4]   2> 1474 T1340 oas.SolrTestCaseJ4.tearDown ###Ending testDistribSearch
[junit4:junit4]   2> NOTE: reproduce with: ant test  -Dtestcase=DistributedQueryElevationComponentTest -Dtests.method=testDistribSearch -Dtests.seed=2848A833E22CAC91 -Dtests.multiplier=3 -Dtests.slow=true -Dtests.locale=es_CR -Dtests.timezone=Africa/Bangui -Dtests.file.encoding=UTF-8
[junit4:junit4]   2>
[junit4:junit4]    > (@AfterClass output)
[junit4:junit4]   2> 1511 T1340 oas.SolrTestCaseJ4.deleteCore ###deleteCore
[junit4:junit4]   2> NOTE: test params are: codec=Lucene40: {id=PostingsFormat(name=MockSep), text=PostingsFormat(name=Asserting), field_t=PostingsFormat(name=MockSep), plow_t=PostingsFormat(name=Asserting), int_i=PostingsFormat(name=Asserting)}, sim=DefaultSimilarity, locale=es_CR, timezone=Africa/Bangui
[junit4:junit4]   2> NOTE: Linux 3.2.0-27-generic i386/Oracle Corporation 1.8.0-ea (32-bit)/cpus=8,threads=1,free=142133824,total=273219584
[junit4:junit4]   2> NOTE: All tests run in this JVM: [TimeZoneUtilsTest, QueryElevationComponentTest, ZkNodePropsTest, OpenExchangeRatesOrgProviderTest, OverseerTest, HighlighterTest, TestQueryTypes, SolrPluginUtilsTest, SimpleFacetsTest, TestStressRecovery, TestRemoteStreaming, TestPHPSerializedResponseWriter, SolrIndexConfigTest, TestPluginEnable, TestCharFilters, SuggesterTSTTest, ZkControllerTest, TestJoin, SpellCheckCollatorTest, LukeRequestHandlerTest, TestGroupingSearch, OutputWriterTest, TestQuerySenderListener, TestBinaryResponseWriter, SoftAutoCommitTest, MultiTermTest, TestFoldingMultitermQuery, FullSolrCloudTest, XsltUpdateRequestHandlerTest, SuggesterTest, FieldMutatingUpdateProcessorTest, FileUtilsTest, TestSolrDeletionPolicy2, PolyFieldTest, SpellingQueryConverterTest, PrimitiveFieldTypeTest, TestLRUCache, IndexSchemaTest, TestWriterPerf, TestSolrQueryParser, JsonLoaderTest, SystemInfoHandlerTest, IndexBasedSpellCheckerTest, TestCSVLoader, TestOmitPositions, TestPropInjectDefaults, StatelessScriptUpdateProcessorFactoryTest, ZkCLITest, LegacyHTMLStripCharFilterTest, UUIDFieldTest, DistributedQueryElevationComponentTest]
[junit4:junit4]   2> 
[junit4:junit4] Completed on J1 in 1.52s, 1 test, 1 failure <<< FAILURES!

[...truncated 378 lines...]
BUILD FAILED
/mnt/ssd/jenkins/workspace/Lucene-Solr-trunk-Linux/checkout/build.xml:29: The following error occurred while executing this line:
/mnt/ssd/jenkins/workspace/Lucene-Solr-trunk-Linux/checkout/solr/build.xml:144: The following error occurred while executing this line:
/mnt/ssd/jenkins/workspace/Lucene-Solr-trunk-Linux/checkout/lucene/module-build.xml:62: The following error occurred while executing this line:
/mnt/ssd/jenkins/workspace/Lucene-Solr-trunk-Linux/checkout/lucene/common-build.xml:1095: The following error occurred while executing this line:
/mnt/ssd/jenkins/workspace/Lucene-Solr-trunk-Linux/checkout/lucene/common-build.xml:790: There were test failures: 223 suites, 899 tests, 1 failure, 5 ignored

Total time: 18 minutes 28 seconds
Build step 'Execute shell' marked build as failure
Archiving artifacts
Recording test results
Email was triggered for: Failure
Sending email for trigger: Failure



Mime
View raw message