lucene-dev mailing list archives

Site index · List index
Message view « Date » · « Thread »
Top « Date » · « Thread »
From Policeman Jenkins Server <jenk...@sd-datasolutions.de>
Subject [JENKINS] Lucene-Solr-trunk-Linux (32bit/ibm-j9-jdk6) - Build # 420 - Failure!
Date Mon, 13 Aug 2012 17:12:35 GMT
Build: http://jenkins.sd-datasolutions.de/job/Lucene-Solr-trunk-Linux/420/
Java: 32bit/ibm-j9-jdk6 

10 tests failed.
REGRESSION:  org.apache.lucene.index.TestStressIndexing2.testMultiConfig

Error Message:
Captured an uncaught exception in thread: Thread[id=731, name=Thread-433, state=RUNNABLE, group=TGRP-TestStressIndexing2]

Stack Trace:
com.carrotsearch.randomizedtesting.UncaughtExceptionError: Captured an uncaught exception in thread: Thread[id=731, name=Thread-433, state=RUNNABLE, group=TGRP-TestStressIndexing2]
Caused by: junit.framework.AssertionFailedError: java.lang.AssertionError
	at __randomizedtesting.SeedInfo.seed([9FD532EAE266FE0]:0)
	at junit.framework.Assert.fail(Assert.java:50)
	at org.apache.lucene.index.TestStressIndexing2$IndexingThread.run(TestStressIndexing2.java:879)


REGRESSION:  org.apache.lucene.index.TestStressIndexing2.testRandomIWReader

Error Message:
Captured an uncaught exception in thread: Thread[id=754, name=Thread-456, state=RUNNABLE, group=TGRP-TestStressIndexing2]

Stack Trace:
com.carrotsearch.randomizedtesting.UncaughtExceptionError: Captured an uncaught exception in thread: Thread[id=754, name=Thread-456, state=RUNNABLE, group=TGRP-TestStressIndexing2]
Caused by: junit.framework.AssertionFailedError: java.lang.AssertionError
	at __randomizedtesting.SeedInfo.seed([9FD532EAE266FE0]:0)
	at junit.framework.Assert.fail(Assert.java:50)
	at org.apache.lucene.index.TestStressIndexing2$IndexingThread.run(TestStressIndexing2.java:879)


REGRESSION:  org.apache.lucene.index.TestStressIndexing2.testRandom

Error Message:
Captured an uncaught exception in thread: Thread[id=763, name=Thread-465, state=RUNNABLE, group=TGRP-TestStressIndexing2]

Stack Trace:
com.carrotsearch.randomizedtesting.UncaughtExceptionError: Captured an uncaught exception in thread: Thread[id=763, name=Thread-465, state=RUNNABLE, group=TGRP-TestStressIndexing2]
Caused by: junit.framework.AssertionFailedError: java.lang.AssertionError
	at __randomizedtesting.SeedInfo.seed([9FD532EAE266FE0]:0)
	at junit.framework.Assert.fail(Assert.java:50)
	at org.apache.lucene.index.TestStressIndexing2$IndexingThread.run(TestStressIndexing2.java:879)


REGRESSION:  org.apache.lucene.search.TestQueryWrapperFilter.testThousandDocuments

Error Message:


Stack Trace:
java.lang.AssertionError
	at __randomizedtesting.SeedInfo.seed([9FD532EAE266FE0:341CD22709A23B35]:0)
	at org.apache.lucene.util.packed.GrowableWriter.ensureCapacity(GrowableWriter.java:70)
	at org.apache.lucene.util.packed.GrowableWriter.set(GrowableWriter.java:83)
	at org.apache.lucene.util.fst.FST.pack(FST.java:1505)
	at org.apache.lucene.codecs.memory.MemoryPostingsFormat$TermsWriter.finish(MemoryPostingsFormat.java:273)
	at org.apache.lucene.index.FreqProxTermsWriterPerField.flush(FreqProxTermsWriterPerField.java:550)
	at org.apache.lucene.index.FreqProxTermsWriter.flush(FreqProxTermsWriter.java:85)
	at org.apache.lucene.index.TermsHash.flush(TermsHash.java:117)
	at org.apache.lucene.index.DocInverter.flush(DocInverter.java:53)
	at org.apache.lucene.index.DocFieldProcessor.flush(DocFieldProcessor.java:82)
	at org.apache.lucene.index.DocumentsWriterPerThread.flush(DocumentsWriterPerThread.java:481)
	at org.apache.lucene.index.DocumentsWriter.doFlush(DocumentsWriter.java:419)
	at org.apache.lucene.index.DocumentsWriter.postUpdate(DocumentsWriter.java:313)
	at org.apache.lucene.index.DocumentsWriter.updateDocument(DocumentsWriter.java:386)
	at org.apache.lucene.index.IndexWriter.updateDocument(IndexWriter.java:1428)
	at org.apache.lucene.index.IndexWriter.addDocument(IndexWriter.java:1107)
	at org.apache.lucene.index.RandomIndexWriter.addDocument(RandomIndexWriter.java:186)
	at org.apache.lucene.index.RandomIndexWriter.addDocument(RandomIndexWriter.java:145)
	at org.apache.lucene.search.TestQueryWrapperFilter.testThousandDocuments(TestQueryWrapperFilter.java:133)
	at sun.reflect.NativeMethodAccessorImpl.invoke0(Native Method)
	at sun.reflect.NativeMethodAccessorImpl.invoke(NativeMethodAccessorImpl.java:48)
	at sun.reflect.DelegatingMethodAccessorImpl.invoke(DelegatingMethodAccessorImpl.java:25)
	at java.lang.reflect.Method.invoke(Method.java:600)
	at com.carrotsearch.randomizedtesting.RandomizedRunner.invoke(RandomizedRunner.java:1559)
	at com.carrotsearch.randomizedtesting.RandomizedRunner.access$600(RandomizedRunner.java:79)
	at com.carrotsearch.randomizedtesting.RandomizedRunner$6.evaluate(RandomizedRunner.java:737)
	at com.carrotsearch.randomizedtesting.RandomizedRunner$7.evaluate(RandomizedRunner.java:773)
	at com.carrotsearch.randomizedtesting.RandomizedRunner$8.evaluate(RandomizedRunner.java:787)
	at org.apache.lucene.util.TestRuleSetupTeardownChained$1.evaluate(TestRuleSetupTeardownChained.java:50)
	at org.apache.lucene.util.TestRuleFieldCacheSanity$1.evaluate(TestRuleFieldCacheSanity.java:32)
	at org.apache.lucene.util.AbstractBeforeAfterRule$1.evaluate(AbstractBeforeAfterRule.java:45)
	at com.carrotsearch.randomizedtesting.rules.SystemPropertiesInvariantRule$1.evaluate(SystemPropertiesInvariantRule.java:55)
	at org.apache.lucene.util.TestRuleThreadAndTestName$1.evaluate(TestRuleThreadAndTestName.java:48)
	at org.apache.lucene.util.TestRuleIgnoreAfterMaxFailures$1.evaluate(TestRuleIgnoreAfterMaxFailures.java:70)
	at org.apache.lucene.util.TestRuleMarkFailure$1.evaluate(TestRuleMarkFailure.java:48)
	at com.carrotsearch.randomizedtesting.rules.StatementAdapter.evaluate(StatementAdapter.java:36)
	at com.carrotsearch.randomizedtesting.ThreadLeakControl$StatementRunner.run(ThreadLeakControl.java:345)
	at com.carrotsearch.randomizedtesting.ThreadLeakControl.forkTimeoutingTask(ThreadLeakControl.java:769)
	at com.carrotsearch.randomizedtesting.ThreadLeakControl$3.evaluate(ThreadLeakControl.java:429)
	at com.carrotsearch.randomizedtesting.RandomizedRunner.runSingleTest(RandomizedRunner.java:746)
	at com.carrotsearch.randomizedtesting.RandomizedRunner$3.evaluate(RandomizedRunner.java:648)
	at com.carrotsearch.randomizedtesting.RandomizedRunner$4.evaluate(RandomizedRunner.java:682)
	at com.carrotsearch.randomizedtesting.RandomizedRunner$5.evaluate(RandomizedRunner.java:693)
	at org.apache.lucene.util.AbstractBeforeAfterRule$1.evaluate(AbstractBeforeAfterRule.java:45)
	at org.apache.lucene.util.TestRuleStoreClassName$1.evaluate(TestRuleStoreClassName.java:38)
	at com.carrotsearch.randomizedtesting.rules.SystemPropertiesInvariantRule$1.evaluate(SystemPropertiesInvariantRule.java:55)
	at com.carrotsearch.randomizedtesting.rules.NoShadowingOrOverridesOnMethodsRule$1.evaluate(NoShadowingOrOverridesOnMethodsRule.java:39)
	at com.carrotsearch.randomizedtesting.rules.NoShadowingOrOverridesOnMethodsRule$1.evaluate(NoShadowingOrOverridesOnMethodsRule.java:39)
	at org.apache.lucene.util.TestRuleAssertionsRequired$1.evaluate(TestRuleAssertionsRequired.java:40)
	at org.apache.lucene.util.TestRuleMarkFailure$1.evaluate(TestRuleMarkFailure.java:48)
	at org.apache.lucene.util.TestRuleIgnoreAfterMaxFailures$1.evaluate(TestRuleIgnoreAfterMaxFailures.java:70)
	at org.apache.lucene.util.TestRuleIgnoreTestSuites$1.evaluate(TestRuleIgnoreTestSuites.java:55)
	at com.carrotsearch.randomizedtesting.rules.StatementAdapter.evaluate(StatementAdapter.java:36)
	at com.carrotsearch.randomizedtesting.ThreadLeakControl$StatementRunner.run(ThreadLeakControl.java:345)
	at java.lang.Thread.run(Thread.java:736)


REGRESSION:  org.apache.lucene.store.TestNRTCachingDirectory.testNRTAndCommit

Error Message:


Stack Trace:
java.lang.AssertionError
	at __randomizedtesting.SeedInfo.seed([9FD532EAE266FE0:4846BED3CA166EC4]:0)
	at org.apache.lucene.util.packed.GrowableWriter.ensureCapacity(GrowableWriter.java:70)
	at org.apache.lucene.util.packed.GrowableWriter.set(GrowableWriter.java:83)
	at org.apache.lucene.util.fst.FST.pack(FST.java:1505)
	at org.apache.lucene.codecs.memory.MemoryPostingsFormat$TermsWriter.finish(MemoryPostingsFormat.java:273)
	at org.apache.lucene.codecs.TermsConsumer.merge(TermsConsumer.java:213)
	at org.apache.lucene.codecs.FieldsConsumer.merge(FieldsConsumer.java:61)
	at org.apache.lucene.index.SegmentMerger.mergeTerms(SegmentMerger.java:323)
	at org.apache.lucene.index.SegmentMerger.merge(SegmentMerger.java:110)
	at org.apache.lucene.index.IndexWriter.mergeMiddle(IndexWriter.java:3586)
	at org.apache.lucene.index.IndexWriter.merge(IndexWriter.java:3201)
	at org.apache.lucene.index.SerialMergeScheduler.merge(SerialMergeScheduler.java:36)
	at org.apache.lucene.index.IndexWriter.maybeMerge(IndexWriter.java:1799)
	at org.apache.lucene.index.IndexWriter.maybeMerge(IndexWriter.java:1793)
	at org.apache.lucene.index.IndexWriter.getReader(IndexWriter.java:386)
	at org.apache.lucene.index.StandardDirectoryReader.doOpenFromWriter(StandardDirectoryReader.java:265)
	at org.apache.lucene.index.StandardDirectoryReader.doOpenIfChanged(StandardDirectoryReader.java:240)
	at org.apache.lucene.index.StandardDirectoryReader.doOpenIfChanged(StandardDirectoryReader.java:230)
	at org.apache.lucene.index.DirectoryReader.openIfChanged(DirectoryReader.java:166)
	at org.apache.lucene.store.TestNRTCachingDirectory.testNRTAndCommit(TestNRTCachingDirectory.java:68)
	at sun.reflect.NativeMethodAccessorImpl.invoke0(Native Method)
	at sun.reflect.NativeMethodAccessorImpl.invoke(NativeMethodAccessorImpl.java:48)
	at sun.reflect.DelegatingMethodAccessorImpl.invoke(DelegatingMethodAccessorImpl.java:25)
	at java.lang.reflect.Method.invoke(Method.java:600)
	at com.carrotsearch.randomizedtesting.RandomizedRunner.invoke(RandomizedRunner.java:1559)
	at com.carrotsearch.randomizedtesting.RandomizedRunner.access$600(RandomizedRunner.java:79)
	at com.carrotsearch.randomizedtesting.RandomizedRunner$6.evaluate(RandomizedRunner.java:737)
	at com.carrotsearch.randomizedtesting.RandomizedRunner$7.evaluate(RandomizedRunner.java:773)
	at com.carrotsearch.randomizedtesting.RandomizedRunner$8.evaluate(RandomizedRunner.java:787)
	at org.apache.lucene.util.TestRuleSetupTeardownChained$1.evaluate(TestRuleSetupTeardownChained.java:50)
	at org.apache.lucene.util.TestRuleFieldCacheSanity$1.evaluate(TestRuleFieldCacheSanity.java:32)
	at org.apache.lucene.util.AbstractBeforeAfterRule$1.evaluate(AbstractBeforeAfterRule.java:45)
	at com.carrotsearch.randomizedtesting.rules.SystemPropertiesInvariantRule$1.evaluate(SystemPropertiesInvariantRule.java:55)
	at org.apache.lucene.util.TestRuleThreadAndTestName$1.evaluate(TestRuleThreadAndTestName.java:48)
	at org.apache.lucene.util.TestRuleIgnoreAfterMaxFailures$1.evaluate(TestRuleIgnoreAfterMaxFailures.java:70)
	at org.apache.lucene.util.TestRuleMarkFailure$1.evaluate(TestRuleMarkFailure.java:48)
	at com.carrotsearch.randomizedtesting.rules.StatementAdapter.evaluate(StatementAdapter.java:36)
	at com.carrotsearch.randomizedtesting.ThreadLeakControl$StatementRunner.run(ThreadLeakControl.java:345)
	at com.carrotsearch.randomizedtesting.ThreadLeakControl.forkTimeoutingTask(ThreadLeakControl.java:769)
	at com.carrotsearch.randomizedtesting.ThreadLeakControl$3.evaluate(ThreadLeakControl.java:429)
	at com.carrotsearch.randomizedtesting.RandomizedRunner.runSingleTest(RandomizedRunner.java:746)
	at com.carrotsearch.randomizedtesting.RandomizedRunner$3.evaluate(RandomizedRunner.java:648)
	at com.carrotsearch.randomizedtesting.RandomizedRunner$4.evaluate(RandomizedRunner.java:682)
	at com.carrotsearch.randomizedtesting.RandomizedRunner$5.evaluate(RandomizedRunner.java:693)
	at org.apache.lucene.util.AbstractBeforeAfterRule$1.evaluate(AbstractBeforeAfterRule.java:45)
	at org.apache.lucene.util.TestRuleStoreClassName$1.evaluate(TestRuleStoreClassName.java:38)
	at com.carrotsearch.randomizedtesting.rules.SystemPropertiesInvariantRule$1.evaluate(SystemPropertiesInvariantRule.java:55)
	at com.carrotsearch.randomizedtesting.rules.NoShadowingOrOverridesOnMethodsRule$1.evaluate(NoShadowingOrOverridesOnMethodsRule.java:39)
	at com.carrotsearch.randomizedtesting.rules.NoShadowingOrOverridesOnMethodsRule$1.evaluate(NoShadowingOrOverridesOnMethodsRule.java:39)
	at org.apache.lucene.util.TestRuleAssertionsRequired$1.evaluate(TestRuleAssertionsRequired.java:40)
	at org.apache.lucene.util.TestRuleMarkFailure$1.evaluate(TestRuleMarkFailure.java:48)
	at org.apache.lucene.util.TestRuleIgnoreAfterMaxFailures$1.evaluate(TestRuleIgnoreAfterMaxFailures.java:70)
	at org.apache.lucene.util.TestRuleIgnoreTestSuites$1.evaluate(TestRuleIgnoreTestSuites.java:55)
	at com.carrotsearch.randomizedtesting.rules.StatementAdapter.evaluate(StatementAdapter.java:36)
	at com.carrotsearch.randomizedtesting.ThreadLeakControl$StatementRunner.run(ThreadLeakControl.java:345)
	at java.lang.Thread.run(Thread.java:736)


REGRESSION:  org.apache.lucene.store.TestRAMDirectory.testSeekToEOFThenBack

Error Message:


Stack Trace:
java.lang.AssertionError
	at __randomizedtesting.SeedInfo.seed([9FD532EAE266FE0:809A32DFD197D203]:0)
	at org.apache.lucene.util.packed.GrowableWriter.ensureCapacity(GrowableWriter.java:70)
	at org.apache.lucene.util.packed.GrowableWriter.set(GrowableWriter.java:83)
	at org.apache.lucene.util.fst.FST.pack(FST.java:1505)
	at org.apache.lucene.codecs.memory.MemoryPostingsFormat$TermsWriter.finish(MemoryPostingsFormat.java:273)
	at org.apache.lucene.index.FreqProxTermsWriterPerField.flush(FreqProxTermsWriterPerField.java:550)
	at org.apache.lucene.index.FreqProxTermsWriter.flush(FreqProxTermsWriter.java:85)
	at org.apache.lucene.index.TermsHash.flush(TermsHash.java:117)
	at org.apache.lucene.index.DocInverter.flush(DocInverter.java:53)
	at org.apache.lucene.index.DocFieldProcessor.flush(DocFieldProcessor.java:82)
	at org.apache.lucene.index.DocumentsWriterPerThread.flush(DocumentsWriterPerThread.java:481)
	at org.apache.lucene.index.DocumentsWriter.doFlush(DocumentsWriter.java:419)
	at org.apache.lucene.index.DocumentsWriter.flushAllThreads(DocumentsWriter.java:551)
	at org.apache.lucene.index.IndexWriter.doFlush(IndexWriter.java:2838)
	at org.apache.lucene.index.IndexWriter.flush(IndexWriter.java:2814)
	at org.apache.lucene.index.IndexWriter.closeInternal(IndexWriter.java:890)
	at org.apache.lucene.index.IndexWriter.close(IndexWriter.java:845)
	at org.apache.lucene.index.IndexWriter.close(IndexWriter.java:807)
	at org.apache.lucene.store.TestRAMDirectory.setUp(TestRAMDirectory.java:64)
	at sun.reflect.GeneratedMethodAccessor5.invoke(Unknown Source)
	at sun.reflect.DelegatingMethodAccessorImpl.invoke(DelegatingMethodAccessorImpl.java:25)
	at java.lang.reflect.Method.invoke(Method.java:600)
	at com.carrotsearch.randomizedtesting.RandomizedRunner.invoke(RandomizedRunner.java:1559)
	at com.carrotsearch.randomizedtesting.RandomizedRunner.access$600(RandomizedRunner.java:79)
	at com.carrotsearch.randomizedtesting.RandomizedRunner$7.evaluate(RandomizedRunner.java:771)
	at com.carrotsearch.randomizedtesting.RandomizedRunner$8.evaluate(RandomizedRunner.java:787)
	at org.apache.lucene.util.TestRuleSetupTeardownChained$1.evaluate(TestRuleSetupTeardownChained.java:50)
	at org.apache.lucene.util.TestRuleFieldCacheSanity$1.evaluate(TestRuleFieldCacheSanity.java:32)
	at org.apache.lucene.util.AbstractBeforeAfterRule$1.evaluate(AbstractBeforeAfterRule.java:45)
	at com.carrotsearch.randomizedtesting.rules.SystemPropertiesInvariantRule$1.evaluate(SystemPropertiesInvariantRule.java:55)
	at org.apache.lucene.util.TestRuleThreadAndTestName$1.evaluate(TestRuleThreadAndTestName.java:48)
	at org.apache.lucene.util.TestRuleIgnoreAfterMaxFailures$1.evaluate(TestRuleIgnoreAfterMaxFailures.java:70)
	at org.apache.lucene.util.TestRuleMarkFailure$1.evaluate(TestRuleMarkFailure.java:48)
	at com.carrotsearch.randomizedtesting.rules.StatementAdapter.evaluate(StatementAdapter.java:36)
	at com.carrotsearch.randomizedtesting.ThreadLeakControl$StatementRunner.run(ThreadLeakControl.java:345)
	at com.carrotsearch.randomizedtesting.ThreadLeakControl.forkTimeoutingTask(ThreadLeakControl.java:769)
	at com.carrotsearch.randomizedtesting.ThreadLeakControl$3.evaluate(ThreadLeakControl.java:429)
	at com.carrotsearch.randomizedtesting.RandomizedRunner.runSingleTest(RandomizedRunner.java:746)
	at com.carrotsearch.randomizedtesting.RandomizedRunner$3.evaluate(RandomizedRunner.java:648)
	at com.carrotsearch.randomizedtesting.RandomizedRunner$4.evaluate(RandomizedRunner.java:682)
	at com.carrotsearch.randomizedtesting.RandomizedRunner$5.evaluate(RandomizedRunner.java:693)
	at org.apache.lucene.util.AbstractBeforeAfterRule$1.evaluate(AbstractBeforeAfterRule.java:45)
	at org.apache.lucene.util.TestRuleStoreClassName$1.evaluate(TestRuleStoreClassName.java:38)
	at com.carrotsearch.randomizedtesting.rules.SystemPropertiesInvariantRule$1.evaluate(SystemPropertiesInvariantRule.java:55)
	at com.carrotsearch.randomizedtesting.rules.NoShadowingOrOverridesOnMethodsRule$1.evaluate(NoShadowingOrOverridesOnMethodsRule.java:39)
	at com.carrotsearch.randomizedtesting.rules.NoShadowingOrOverridesOnMethodsRule$1.evaluate(NoShadowingOrOverridesOnMethodsRule.java:39)
	at org.apache.lucene.util.TestRuleAssertionsRequired$1.evaluate(TestRuleAssertionsRequired.java:40)
	at org.apache.lucene.util.TestRuleMarkFailure$1.evaluate(TestRuleMarkFailure.java:48)
	at org.apache.lucene.util.TestRuleIgnoreAfterMaxFailures$1.evaluate(TestRuleIgnoreAfterMaxFailures.java:70)
	at org.apache.lucene.util.TestRuleIgnoreTestSuites$1.evaluate(TestRuleIgnoreTestSuites.java:55)
	at com.carrotsearch.randomizedtesting.rules.StatementAdapter.evaluate(StatementAdapter.java:36)
	at com.carrotsearch.randomizedtesting.ThreadLeakControl$StatementRunner.run(ThreadLeakControl.java:345)
	at java.lang.Thread.run(Thread.java:736)


REGRESSION:  org.apache.lucene.store.TestRAMDirectory.testIllegalEOF

Error Message:


Stack Trace:
java.lang.AssertionError
	at __randomizedtesting.SeedInfo.seed([9FD532EAE266FE0:2C61909166084F23]:0)
	at org.apache.lucene.util.packed.GrowableWriter.ensureCapacity(GrowableWriter.java:70)
	at org.apache.lucene.util.packed.GrowableWriter.set(GrowableWriter.java:83)
	at org.apache.lucene.util.fst.FST.pack(FST.java:1505)
	at org.apache.lucene.codecs.memory.MemoryPostingsFormat$TermsWriter.finish(MemoryPostingsFormat.java:273)
	at org.apache.lucene.index.FreqProxTermsWriterPerField.flush(FreqProxTermsWriterPerField.java:550)
	at org.apache.lucene.index.FreqProxTermsWriter.flush(FreqProxTermsWriter.java:85)
	at org.apache.lucene.index.TermsHash.flush(TermsHash.java:117)
	at org.apache.lucene.index.DocInverter.flush(DocInverter.java:53)
	at org.apache.lucene.index.DocFieldProcessor.flush(DocFieldProcessor.java:82)
	at org.apache.lucene.index.DocumentsWriterPerThread.flush(DocumentsWriterPerThread.java:481)
	at org.apache.lucene.index.DocumentsWriter.doFlush(DocumentsWriter.java:419)
	at org.apache.lucene.index.DocumentsWriter.flushAllThreads(DocumentsWriter.java:551)
	at org.apache.lucene.index.IndexWriter.doFlush(IndexWriter.java:2838)
	at org.apache.lucene.index.IndexWriter.flush(IndexWriter.java:2814)
	at org.apache.lucene.index.IndexWriter.closeInternal(IndexWriter.java:890)
	at org.apache.lucene.index.IndexWriter.close(IndexWriter.java:845)
	at org.apache.lucene.index.IndexWriter.close(IndexWriter.java:807)
	at org.apache.lucene.store.TestRAMDirectory.setUp(TestRAMDirectory.java:64)
	at sun.reflect.GeneratedMethodAccessor5.invoke(Unknown Source)
	at sun.reflect.DelegatingMethodAccessorImpl.invoke(DelegatingMethodAccessorImpl.java:25)
	at java.lang.reflect.Method.invoke(Method.java:600)
	at com.carrotsearch.randomizedtesting.RandomizedRunner.invoke(RandomizedRunner.java:1559)
	at com.carrotsearch.randomizedtesting.RandomizedRunner.access$600(RandomizedRunner.java:79)
	at com.carrotsearch.randomizedtesting.RandomizedRunner$7.evaluate(RandomizedRunner.java:771)
	at com.carrotsearch.randomizedtesting.RandomizedRunner$8.evaluate(RandomizedRunner.java:787)
	at org.apache.lucene.util.TestRuleSetupTeardownChained$1.evaluate(TestRuleSetupTeardownChained.java:50)
	at org.apache.lucene.util.TestRuleFieldCacheSanity$1.evaluate(TestRuleFieldCacheSanity.java:32)
	at org.apache.lucene.util.AbstractBeforeAfterRule$1.evaluate(AbstractBeforeAfterRule.java:45)
	at com.carrotsearch.randomizedtesting.rules.SystemPropertiesInvariantRule$1.evaluate(SystemPropertiesInvariantRule.java:55)
	at org.apache.lucene.util.TestRuleThreadAndTestName$1.evaluate(TestRuleThreadAndTestName.java:48)
	at org.apache.lucene.util.TestRuleIgnoreAfterMaxFailures$1.evaluate(TestRuleIgnoreAfterMaxFailures.java:70)
	at org.apache.lucene.util.TestRuleMarkFailure$1.evaluate(TestRuleMarkFailure.java:48)
	at com.carrotsearch.randomizedtesting.rules.StatementAdapter.evaluate(StatementAdapter.java:36)
	at com.carrotsearch.randomizedtesting.ThreadLeakControl$StatementRunner.run(ThreadLeakControl.java:345)
	at com.carrotsearch.randomizedtesting.ThreadLeakControl.forkTimeoutingTask(ThreadLeakControl.java:769)
	at com.carrotsearch.randomizedtesting.ThreadLeakControl$3.evaluate(ThreadLeakControl.java:429)
	at com.carrotsearch.randomizedtesting.RandomizedRunner.runSingleTest(RandomizedRunner.java:746)
	at com.carrotsearch.randomizedtesting.RandomizedRunner$3.evaluate(RandomizedRunner.java:648)
	at com.carrotsearch.randomizedtesting.RandomizedRunner$4.evaluate(RandomizedRunner.java:682)
	at com.carrotsearch.randomizedtesting.RandomizedRunner$5.evaluate(RandomizedRunner.java:693)
	at org.apache.lucene.util.AbstractBeforeAfterRule$1.evaluate(AbstractBeforeAfterRule.java:45)
	at org.apache.lucene.util.TestRuleStoreClassName$1.evaluate(TestRuleStoreClassName.java:38)
	at com.carrotsearch.randomizedtesting.rules.SystemPropertiesInvariantRule$1.evaluate(SystemPropertiesInvariantRule.java:55)
	at com.carrotsearch.randomizedtesting.rules.NoShadowingOrOverridesOnMethodsRule$1.evaluate(NoShadowingOrOverridesOnMethodsRule.java:39)
	at com.carrotsearch.randomizedtesting.rules.NoShadowingOrOverridesOnMethodsRule$1.evaluate(NoShadowingOrOverridesOnMethodsRule.java:39)
	at org.apache.lucene.util.TestRuleAssertionsRequired$1.evaluate(TestRuleAssertionsRequired.java:40)
	at org.apache.lucene.util.TestRuleMarkFailure$1.evaluate(TestRuleMarkFailure.java:48)
	at org.apache.lucene.util.TestRuleIgnoreAfterMaxFailures$1.evaluate(TestRuleIgnoreAfterMaxFailures.java:70)
	at org.apache.lucene.util.TestRuleIgnoreTestSuites$1.evaluate(TestRuleIgnoreTestSuites.java:55)
	at com.carrotsearch.randomizedtesting.rules.StatementAdapter.evaluate(StatementAdapter.java:36)
	at com.carrotsearch.randomizedtesting.ThreadLeakControl$StatementRunner.run(ThreadLeakControl.java:345)
	at java.lang.Thread.run(Thread.java:736)


REGRESSION:  org.apache.lucene.store.TestRAMDirectory.testRAMDirectory

Error Message:


Stack Trace:
java.lang.AssertionError
	at __randomizedtesting.SeedInfo.seed([9FD532EAE266FE0:13670C86260521D3]:0)
	at org.apache.lucene.util.packed.GrowableWriter.ensureCapacity(GrowableWriter.java:70)
	at org.apache.lucene.util.packed.GrowableWriter.set(GrowableWriter.java:83)
	at org.apache.lucene.util.fst.FST.pack(FST.java:1505)
	at org.apache.lucene.codecs.memory.MemoryPostingsFormat$TermsWriter.finish(MemoryPostingsFormat.java:273)
	at org.apache.lucene.index.FreqProxTermsWriterPerField.flush(FreqProxTermsWriterPerField.java:550)
	at org.apache.lucene.index.FreqProxTermsWriter.flush(FreqProxTermsWriter.java:85)
	at org.apache.lucene.index.TermsHash.flush(TermsHash.java:117)
	at org.apache.lucene.index.DocInverter.flush(DocInverter.java:53)
	at org.apache.lucene.index.DocFieldProcessor.flush(DocFieldProcessor.java:82)
	at org.apache.lucene.index.DocumentsWriterPerThread.flush(DocumentsWriterPerThread.java:481)
	at org.apache.lucene.index.DocumentsWriter.doFlush(DocumentsWriter.java:419)
	at org.apache.lucene.index.DocumentsWriter.flushAllThreads(DocumentsWriter.java:551)
	at org.apache.lucene.index.IndexWriter.doFlush(IndexWriter.java:2838)
	at org.apache.lucene.index.IndexWriter.flush(IndexWriter.java:2814)
	at org.apache.lucene.index.IndexWriter.closeInternal(IndexWriter.java:890)
	at org.apache.lucene.index.IndexWriter.close(IndexWriter.java:845)
	at org.apache.lucene.index.IndexWriter.close(IndexWriter.java:807)
	at org.apache.lucene.store.TestRAMDirectory.setUp(TestRAMDirectory.java:64)
	at sun.reflect.GeneratedMethodAccessor5.invoke(Unknown Source)
	at sun.reflect.DelegatingMethodAccessorImpl.invoke(DelegatingMethodAccessorImpl.java:25)
	at java.lang.reflect.Method.invoke(Method.java:600)
	at com.carrotsearch.randomizedtesting.RandomizedRunner.invoke(RandomizedRunner.java:1559)
	at com.carrotsearch.randomizedtesting.RandomizedRunner.access$600(RandomizedRunner.java:79)
	at com.carrotsearch.randomizedtesting.RandomizedRunner$7.evaluate(RandomizedRunner.java:771)
	at com.carrotsearch.randomizedtesting.RandomizedRunner$8.evaluate(RandomizedRunner.java:787)
	at org.apache.lucene.util.TestRuleSetupTeardownChained$1.evaluate(TestRuleSetupTeardownChained.java:50)
	at org.apache.lucene.util.TestRuleFieldCacheSanity$1.evaluate(TestRuleFieldCacheSanity.java:32)
	at org.apache.lucene.util.AbstractBeforeAfterRule$1.evaluate(AbstractBeforeAfterRule.java:45)
	at com.carrotsearch.randomizedtesting.rules.SystemPropertiesInvariantRule$1.evaluate(SystemPropertiesInvariantRule.java:55)
	at org.apache.lucene.util.TestRuleThreadAndTestName$1.evaluate(TestRuleThreadAndTestName.java:48)
	at org.apache.lucene.util.TestRuleIgnoreAfterMaxFailures$1.evaluate(TestRuleIgnoreAfterMaxFailures.java:70)
	at org.apache.lucene.util.TestRuleMarkFailure$1.evaluate(TestRuleMarkFailure.java:48)
	at com.carrotsearch.randomizedtesting.rules.StatementAdapter.evaluate(StatementAdapter.java:36)
	at com.carrotsearch.randomizedtesting.ThreadLeakControl$StatementRunner.run(ThreadLeakControl.java:345)
	at com.carrotsearch.randomizedtesting.ThreadLeakControl.forkTimeoutingTask(ThreadLeakControl.java:769)
	at com.carrotsearch.randomizedtesting.ThreadLeakControl$3.evaluate(ThreadLeakControl.java:429)
	at com.carrotsearch.randomizedtesting.RandomizedRunner.runSingleTest(RandomizedRunner.java:746)
	at com.carrotsearch.randomizedtesting.RandomizedRunner$3.evaluate(RandomizedRunner.java:648)
	at com.carrotsearch.randomizedtesting.RandomizedRunner$4.evaluate(RandomizedRunner.java:682)
	at com.carrotsearch.randomizedtesting.RandomizedRunner$5.evaluate(RandomizedRunner.java:693)
	at org.apache.lucene.util.AbstractBeforeAfterRule$1.evaluate(AbstractBeforeAfterRule.java:45)
	at org.apache.lucene.util.TestRuleStoreClassName$1.evaluate(TestRuleStoreClassName.java:38)
	at com.carrotsearch.randomizedtesting.rules.SystemPropertiesInvariantRule$1.evaluate(SystemPropertiesInvariantRule.java:55)
	at com.carrotsearch.randomizedtesting.rules.NoShadowingOrOverridesOnMethodsRule$1.evaluate(NoShadowingOrOverridesOnMethodsRule.java:39)
	at com.carrotsearch.randomizedtesting.rules.NoShadowingOrOverridesOnMethodsRule$1.evaluate(NoShadowingOrOverridesOnMethodsRule.java:39)
	at org.apache.lucene.util.TestRuleAssertionsRequired$1.evaluate(TestRuleAssertionsRequired.java:40)
	at org.apache.lucene.util.TestRuleMarkFailure$1.evaluate(TestRuleMarkFailure.java:48)
	at org.apache.lucene.util.TestRuleIgnoreAfterMaxFailures$1.evaluate(TestRuleIgnoreAfterMaxFailures.java:70)
	at org.apache.lucene.util.TestRuleIgnoreTestSuites$1.evaluate(TestRuleIgnoreTestSuites.java:55)
	at com.carrotsearch.randomizedtesting.rules.StatementAdapter.evaluate(StatementAdapter.java:36)
	at com.carrotsearch.randomizedtesting.ThreadLeakControl$StatementRunner.run(ThreadLeakControl.java:345)
	at java.lang.Thread.run(Thread.java:736)


REGRESSION:  org.apache.lucene.store.TestRAMDirectory.testRAMDirectorySize

Error Message:


Stack Trace:
java.lang.AssertionError
	at __randomizedtesting.SeedInfo.seed([9FD532EAE266FE0:95A7A17E07C5D57E]:0)
	at org.apache.lucene.util.packed.GrowableWriter.ensureCapacity(GrowableWriter.java:70)
	at org.apache.lucene.util.packed.GrowableWriter.set(GrowableWriter.java:83)
	at org.apache.lucene.util.fst.FST.pack(FST.java:1505)
	at org.apache.lucene.codecs.memory.MemoryPostingsFormat$TermsWriter.finish(MemoryPostingsFormat.java:273)
	at org.apache.lucene.index.FreqProxTermsWriterPerField.flush(FreqProxTermsWriterPerField.java:550)
	at org.apache.lucene.index.FreqProxTermsWriter.flush(FreqProxTermsWriter.java:85)
	at org.apache.lucene.index.TermsHash.flush(TermsHash.java:117)
	at org.apache.lucene.index.DocInverter.flush(DocInverter.java:53)
	at org.apache.lucene.index.DocFieldProcessor.flush(DocFieldProcessor.java:82)
	at org.apache.lucene.index.DocumentsWriterPerThread.flush(DocumentsWriterPerThread.java:481)
	at org.apache.lucene.index.DocumentsWriter.doFlush(DocumentsWriter.java:419)
	at org.apache.lucene.index.DocumentsWriter.flushAllThreads(DocumentsWriter.java:551)
	at org.apache.lucene.index.IndexWriter.doFlush(IndexWriter.java:2838)
	at org.apache.lucene.index.IndexWriter.flush(IndexWriter.java:2814)
	at org.apache.lucene.index.IndexWriter.closeInternal(IndexWriter.java:890)
	at org.apache.lucene.index.IndexWriter.close(IndexWriter.java:845)
	at org.apache.lucene.index.IndexWriter.close(IndexWriter.java:807)
	at org.apache.lucene.store.TestRAMDirectory.setUp(TestRAMDirectory.java:64)
	at sun.reflect.GeneratedMethodAccessor5.invoke(Unknown Source)
	at sun.reflect.DelegatingMethodAccessorImpl.invoke(DelegatingMethodAccessorImpl.java:25)
	at java.lang.reflect.Method.invoke(Method.java:600)
	at com.carrotsearch.randomizedtesting.RandomizedRunner.invoke(RandomizedRunner.java:1559)
	at com.carrotsearch.randomizedtesting.RandomizedRunner.access$600(RandomizedRunner.java:79)
	at com.carrotsearch.randomizedtesting.RandomizedRunner$7.evaluate(RandomizedRunner.java:771)
	at com.carrotsearch.randomizedtesting.RandomizedRunner$8.evaluate(RandomizedRunner.java:787)
	at org.apache.lucene.util.TestRuleSetupTeardownChained$1.evaluate(TestRuleSetupTeardownChained.java:50)
	at org.apache.lucene.util.TestRuleFieldCacheSanity$1.evaluate(TestRuleFieldCacheSanity.java:32)
	at org.apache.lucene.util.AbstractBeforeAfterRule$1.evaluate(AbstractBeforeAfterRule.java:45)
	at com.carrotsearch.randomizedtesting.rules.SystemPropertiesInvariantRule$1.evaluate(SystemPropertiesInvariantRule.java:55)
	at org.apache.lucene.util.TestRuleThreadAndTestName$1.evaluate(TestRuleThreadAndTestName.java:48)
	at org.apache.lucene.util.TestRuleIgnoreAfterMaxFailures$1.evaluate(TestRuleIgnoreAfterMaxFailures.java:70)
	at org.apache.lucene.util.TestRuleMarkFailure$1.evaluate(TestRuleMarkFailure.java:48)
	at com.carrotsearch.randomizedtesting.rules.StatementAdapter.evaluate(StatementAdapter.java:36)
	at com.carrotsearch.randomizedtesting.ThreadLeakControl$StatementRunner.run(ThreadLeakControl.java:345)
	at com.carrotsearch.randomizedtesting.ThreadLeakControl.forkTimeoutingTask(ThreadLeakControl.java:769)
	at com.carrotsearch.randomizedtesting.ThreadLeakControl$3.evaluate(ThreadLeakControl.java:429)
	at com.carrotsearch.randomizedtesting.RandomizedRunner.runSingleTest(RandomizedRunner.java:746)
	at com.carrotsearch.randomizedtesting.RandomizedRunner$3.evaluate(RandomizedRunner.java:648)
	at com.carrotsearch.randomizedtesting.RandomizedRunner$4.evaluate(RandomizedRunner.java:682)
	at com.carrotsearch.randomizedtesting.RandomizedRunner$5.evaluate(RandomizedRunner.java:693)
	at org.apache.lucene.util.AbstractBeforeAfterRule$1.evaluate(AbstractBeforeAfterRule.java:45)
	at org.apache.lucene.util.TestRuleStoreClassName$1.evaluate(TestRuleStoreClassName.java:38)
	at com.carrotsearch.randomizedtesting.rules.SystemPropertiesInvariantRule$1.evaluate(SystemPropertiesInvariantRule.java:55)
	at com.carrotsearch.randomizedtesting.rules.NoShadowingOrOverridesOnMethodsRule$1.evaluate(NoShadowingOrOverridesOnMethodsRule.java:39)
	at com.carrotsearch.randomizedtesting.rules.NoShadowingOrOverridesOnMethodsRule$1.evaluate(NoShadowingOrOverridesOnMethodsRule.java:39)
	at org.apache.lucene.util.TestRuleAssertionsRequired$1.evaluate(TestRuleAssertionsRequired.java:40)
	at org.apache.lucene.util.TestRuleMarkFailure$1.evaluate(TestRuleMarkFailure.java:48)
	at org.apache.lucene.util.TestRuleIgnoreAfterMaxFailures$1.evaluate(TestRuleIgnoreAfterMaxFailures.java:70)
	at org.apache.lucene.util.TestRuleIgnoreTestSuites$1.evaluate(TestRuleIgnoreTestSuites.java:55)
	at com.carrotsearch.randomizedtesting.rules.StatementAdapter.evaluate(StatementAdapter.java:36)
	at com.carrotsearch.randomizedtesting.ThreadLeakControl$StatementRunner.run(ThreadLeakControl.java:345)
	at java.lang.Thread.run(Thread.java:736)


REGRESSION:  org.apache.lucene.util.fst.TestFSTs.testRandomWords

Error Message:


Stack Trace:
java.lang.AssertionError
	at __randomizedtesting.SeedInfo.seed([9FD532EAE266FE0:776CE8116729C025]:0)
	at org.apache.lucene.util.packed.GrowableWriter.ensureCapacity(GrowableWriter.java:70)
	at org.apache.lucene.util.packed.GrowableWriter.set(GrowableWriter.java:83)
	at org.apache.lucene.util.fst.FST.pack(FST.java:1505)
	at org.apache.lucene.util.fst.TestFSTs$FSTTester.doTest(TestFSTs.java:542)
	at org.apache.lucene.util.fst.TestFSTs$FSTTester.doTest(TestFSTs.java:384)
	at org.apache.lucene.util.fst.TestFSTs.doTest(TestFSTs.java:268)
	at org.apache.lucene.util.fst.TestFSTs.testRandomWords(TestFSTs.java:1056)
	at org.apache.lucene.util.fst.TestFSTs.testRandomWords(TestFSTs.java:1030)
	at sun.reflect.NativeMethodAccessorImpl.invoke0(Native Method)
	at sun.reflect.NativeMethodAccessorImpl.invoke(NativeMethodAccessorImpl.java:48)
	at sun.reflect.DelegatingMethodAccessorImpl.invoke(DelegatingMethodAccessorImpl.java:25)
	at java.lang.reflect.Method.invoke(Method.java:600)
	at com.carrotsearch.randomizedtesting.RandomizedRunner.invoke(RandomizedRunner.java:1559)
	at com.carrotsearch.randomizedtesting.RandomizedRunner.access$600(RandomizedRunner.java:79)
	at com.carrotsearch.randomizedtesting.RandomizedRunner$6.evaluate(RandomizedRunner.java:737)
	at com.carrotsearch.randomizedtesting.RandomizedRunner$7.evaluate(RandomizedRunner.java:773)
	at com.carrotsearch.randomizedtesting.RandomizedRunner$8.evaluate(RandomizedRunner.java:787)
	at org.apache.lucene.util.TestRuleSetupTeardownChained$1.evaluate(TestRuleSetupTeardownChained.java:50)
	at org.apache.lucene.util.TestRuleFieldCacheSanity$1.evaluate(TestRuleFieldCacheSanity.java:32)
	at org.apache.lucene.util.AbstractBeforeAfterRule$1.evaluate(AbstractBeforeAfterRule.java:45)
	at com.carrotsearch.randomizedtesting.rules.SystemPropertiesInvariantRule$1.evaluate(SystemPropertiesInvariantRule.java:55)
	at org.apache.lucene.util.TestRuleThreadAndTestName$1.evaluate(TestRuleThreadAndTestName.java:48)
	at org.apache.lucene.util.TestRuleIgnoreAfterMaxFailures$1.evaluate(TestRuleIgnoreAfterMaxFailures.java:70)
	at org.apache.lucene.util.TestRuleMarkFailure$1.evaluate(TestRuleMarkFailure.java:48)
	at com.carrotsearch.randomizedtesting.rules.StatementAdapter.evaluate(StatementAdapter.java:36)
	at com.carrotsearch.randomizedtesting.ThreadLeakControl$StatementRunner.run(ThreadLeakControl.java:345)
	at com.carrotsearch.randomizedtesting.ThreadLeakControl.forkTimeoutingTask(ThreadLeakControl.java:769)
	at com.carrotsearch.randomizedtesting.ThreadLeakControl$3.evaluate(ThreadLeakControl.java:429)
	at com.carrotsearch.randomizedtesting.RandomizedRunner.runSingleTest(RandomizedRunner.java:746)
	at com.carrotsearch.randomizedtesting.RandomizedRunner$3.evaluate(RandomizedRunner.java:648)
	at com.carrotsearch.randomizedtesting.RandomizedRunner$4.evaluate(RandomizedRunner.java:682)
	at com.carrotsearch.randomizedtesting.RandomizedRunner$5.evaluate(RandomizedRunner.java:693)
	at org.apache.lucene.util.AbstractBeforeAfterRule$1.evaluate(AbstractBeforeAfterRule.java:45)
	at org.apache.lucene.util.TestRuleStoreClassName$1.evaluate(TestRuleStoreClassName.java:38)
	at com.carrotsearch.randomizedtesting.rules.SystemPropertiesInvariantRule$1.evaluate(SystemPropertiesInvariantRule.java:55)
	at com.carrotsearch.randomizedtesting.rules.NoShadowingOrOverridesOnMethodsRule$1.evaluate(NoShadowingOrOverridesOnMethodsRule.java:39)
	at com.carrotsearch.randomizedtesting.rules.NoShadowingOrOverridesOnMethodsRule$1.evaluate(NoShadowingOrOverridesOnMethodsRule.java:39)
	at org.apache.lucene.util.TestRuleAssertionsRequired$1.evaluate(TestRuleAssertionsRequired.java:40)
	at org.apache.lucene.util.TestRuleMarkFailure$1.evaluate(TestRuleMarkFailure.java:48)
	at org.apache.lucene.util.TestRuleIgnoreAfterMaxFailures$1.evaluate(TestRuleIgnoreAfterMaxFailures.java:70)
	at org.apache.lucene.util.TestRuleIgnoreTestSuites$1.evaluate(TestRuleIgnoreTestSuites.java:55)
	at com.carrotsearch.randomizedtesting.rules.StatementAdapter.evaluate(StatementAdapter.java:36)
	at com.carrotsearch.randomizedtesting.ThreadLeakControl$StatementRunner.run(ThreadLeakControl.java:345)
	at java.lang.Thread.run(Thread.java:736)




Build Log:
[...truncated 241 lines...]
[junit4:junit4] Suite: org.apache.lucene.util.fst.TestFSTs
[junit4:junit4] IGNOR/A 0.61s J1 | TestFSTs.testBigSet
[junit4:junit4]    > Assumption #1: 'nightly' test group is disabled (@Nightly)
[junit4:junit4]   2> NOTE: reproduce with: ant test  -Dtestcase=TestFSTs -Dtests.method=testRandomWords -Dtests.seed=9FD532EAE266FE0 -Dtests.multiplier=3 -Dtests.slow=true -Dtests.locale=cs_CZ_EURO -Dtests.timezone=Asia/Krasnoyarsk -Dtests.file.encoding=US-ASCII
[junit4:junit4] FAILURE 0.58s J1 | TestFSTs.testRandomWords <<<
[junit4:junit4]    > Throwable #1: java.lang.AssertionError
[junit4:junit4]    > 	at __randomizedtesting.SeedInfo.seed([9FD532EAE266FE0:776CE8116729C025]:0)
[junit4:junit4]    > 	at org.apache.lucene.util.packed.GrowableWriter.ensureCapacity(GrowableWriter.java:70)
[junit4:junit4]    > 	at org.apache.lucene.util.packed.GrowableWriter.set(GrowableWriter.java:83)
[junit4:junit4]    > 	at org.apache.lucene.util.fst.FST.pack(FST.java:1505)
[junit4:junit4]    > 	at org.apache.lucene.util.fst.TestFSTs$FSTTester.doTest(TestFSTs.java:542)
[junit4:junit4]    > 	at org.apache.lucene.util.fst.TestFSTs$FSTTester.doTest(TestFSTs.java:384)
[junit4:junit4]    > 	at org.apache.lucene.util.fst.TestFSTs.doTest(TestFSTs.java:268)
[junit4:junit4]    > 	at org.apache.lucene.util.fst.TestFSTs.testRandomWords(TestFSTs.java:1056)
[junit4:junit4]    > 	at org.apache.lucene.util.fst.TestFSTs.testRandomWords(TestFSTs.java:1030)
[junit4:junit4]    > 	at sun.reflect.NativeMethodAccessorImpl.invoke0(Native Method)
[junit4:junit4]    > 	at sun.reflect.NativeMethodAccessorImpl.invoke(NativeMethodAccessorImpl.java:48)
[junit4:junit4]    > 	at sun.reflect.DelegatingMethodAccessorImpl.invoke(DelegatingMethodAccessorImpl.java:25)
[junit4:junit4]    > 	at java.lang.reflect.Method.invoke(Method.java:600)
[junit4:junit4]    > 	at com.carrotsearch.randomizedtesting.RandomizedRunner.invoke(RandomizedRunner.java:1559)
[junit4:junit4]    > 	at com.carrotsearch.randomizedtesting.RandomizedRunner.access$600(RandomizedRunner.java:79)
[junit4:junit4]    > 	at com.carrotsearch.randomizedtesting.RandomizedRunner$6.evaluate(RandomizedRunner.java:737)
[junit4:junit4]    > 	at com.carrotsearch.randomizedtesting.RandomizedRunner$7.evaluate(RandomizedRunner.java:773)
[junit4:junit4]    > 	at com.carrotsearch.randomizedtesting.RandomizedRunner$8.evaluate(RandomizedRunner.java:787)
[junit4:junit4]    > 	at org.apache.lucene.util.TestRuleSetupTeardownChained$1.evaluate(TestRuleSetupTeardownChained.java:50)
[junit4:junit4]    > 	at org.apache.lucene.util.TestRuleFieldCacheSanity$1.evaluate(TestRuleFieldCacheSanity.java:32)
[junit4:junit4]    > 	at org.apache.lucene.util.AbstractBeforeAfterRule$1.evaluate(AbstractBeforeAfterRule.java:45)
[junit4:junit4]    > 	at com.carrotsearch.randomizedtesting.rules.SystemPropertiesInvariantRule$1.evaluate(SystemPropertiesInvariantRule.java:55)
[junit4:junit4]    > 	at org.apache.lucene.util.TestRuleThreadAndTestName$1.evaluate(TestRuleThreadAndTestName.java:48)
[junit4:junit4]    > 	at org.apache.lucene.util.TestRuleIgnoreAfterMaxFailures$1.evaluate(TestRuleIgnoreAfterMaxFailures.java:70)
[junit4:junit4]    > 	at org.apache.lucene.util.TestRuleMarkFailure$1.evaluate(TestRuleMarkFailure.java:48)
[junit4:junit4]    > 	at com.carrotsearch.randomizedtesting.rules.StatementAdapter.evaluate(StatementAdapter.java:36)
[junit4:junit4]    > 	at com.carrotsearch.randomizedtesting.ThreadLeakControl$StatementRunner.run(ThreadLeakControl.java:345)
[junit4:junit4]    > 	at com.carrotsearch.randomizedtesting.ThreadLeakControl.forkTimeoutingTask(ThreadLeakControl.java:769)
[junit4:junit4]    > 	at com.carrotsearch.randomizedtesting.ThreadLeakControl$3.evaluate(ThreadLeakControl.java:429)
[junit4:junit4]    > 	at com.carrotsearch.randomizedtesting.RandomizedRunner.runSingleTest(RandomizedRunner.java:746)
[junit4:junit4]    > 	at com.carrotsearch.randomizedtesting.RandomizedRunner$3.evaluate(RandomizedRunner.java:648)
[junit4:junit4]    > 	at com.carrotsearch.randomizedtesting.RandomizedRunner$4.evaluate(RandomizedRunner.java:682)
[junit4:junit4]    > 	at com.carrotsearch.randomizedtesting.RandomizedRunner$5.evaluate(RandomizedRunner.java:693)
[junit4:junit4]    > 	at org.apache.lucene.util.AbstractBeforeAfterRule$1.evaluate(AbstractBeforeAfterRule.java:45)
[junit4:junit4]    > 	at org.apache.lucene.util.TestRuleStoreClassName$1.evaluate(TestRuleStoreClassName.java:38)
[junit4:junit4]    > 	at com.carrotsearch.randomizedtesting.rules.SystemPropertiesInvariantRule$1.evaluate(SystemPropertiesInvariantRule.java:55)
[junit4:junit4]    > 	at com.carrotsearch.randomizedtesting.rules.NoShadowingOrOverridesOnMethodsRule$1.evaluate(NoShadowingOrOverridesOnMethodsRule.java:39)
[junit4:junit4]    > 	at com.carrotsearch.randomizedtesting.rules.NoShadowingOrOverridesOnMethodsRule$1.evaluate(NoShadowingOrOverridesOnMethodsRule.java:39)
[junit4:junit4]    > 	at org.apache.lucene.util.TestRuleAssertionsRequired$1.evaluate(TestRuleAssertionsRequired.java:40)
[junit4:junit4]    > 	at org.apache.lucene.util.TestRuleMarkFailure$1.evaluate(TestRuleMarkFailure.java:48)
[junit4:junit4]    > 	at org.apache.lucene.util.TestRuleIgnoreAfterMaxFailures$1.evaluate(TestRuleIgnoreAfterMaxFailures.java:70)
[junit4:junit4]    > 	at org.apache.lucene.util.TestRuleIgnoreTestSuites$1.evaluate(TestRuleIgnoreTestSuites.java:55)
[junit4:junit4]    > 	at com.carrotsearch.randomizedtesting.rules.StatementAdapter.evaluate(StatementAdapter.java:36)
[junit4:junit4]    > 	at com.carrotsearch.randomizedtesting.ThreadLeakControl$StatementRunner.run(ThreadLeakControl.java:345)
[junit4:junit4]    > 	at java.lang.Thread.run(Thread.java:736)
[junit4:junit4]   2> NOTE: test params are: codec=Lucene40: {titleTokenized=MockVariableIntBlock(baseBlockSize=99), body=PostingsFormat(name=MockRandom), docid=PostingsFormat(name=TestBloomFilteredLucene40Postings), title=PostingsFormat(name=Asserting), field=PostingsFormat(name=MockRandom), id=PostingsFormat(name=TestBloomFilteredLucene40Postings), date=PostingsFormat(name=MockRandom)}, sim=DefaultSimilarity, locale=cs_CZ_EURO, timezone=Asia/Krasnoyarsk
[junit4:junit4]   2> NOTE: Linux 3.2.0-29-generic x86/IBM Corporation 1.6.0 (32-bit)/cpus=8,threads=1,free=5246208,total=14930432
[junit4:junit4]   2> NOTE: All tests run in this JVM: [TestSpanMultiTermQueryWrapper, TestSimilarityBase, TestPayloadExplanations, TestNewestSegment, TestPerSegmentDeletes, TestBinaryDocument, TestDocCount, TestFSTs]
[junit4:junit4] Completed on J1 in 26.50s, 17 tests, 1 failure, 1 skipped <<< FAILURES!

[...truncated 61 lines...]
[junit4:junit4] Suite: org.apache.lucene.store.TestRAMDirectory
[junit4:junit4]   2> NOTE: reproduce with: ant test  -Dtestcase=TestRAMDirectory -Dtests.method=testSeekToEOFThenBack -Dtests.seed=9FD532EAE266FE0 -Dtests.multiplier=3 -Dtests.slow=true -Dtests.locale=nl_BE_PREEURO -Dtests.timezone=Asia/Dili -Dtests.file.encoding=US-ASCII
[junit4:junit4] FAILURE 0.04s J1 | TestRAMDirectory.testSeekToEOFThenBack <<<
[junit4:junit4]    > Throwable #1: java.lang.AssertionError
[junit4:junit4]    > 	at __randomizedtesting.SeedInfo.seed([9FD532EAE266FE0:809A32DFD197D203]:0)
[junit4:junit4]    > 	at org.apache.lucene.util.packed.GrowableWriter.ensureCapacity(GrowableWriter.java:70)
[junit4:junit4]    > 	at org.apache.lucene.util.packed.GrowableWriter.set(GrowableWriter.java:83)
[junit4:junit4]    > 	at org.apache.lucene.util.fst.FST.pack(FST.java:1505)
[junit4:junit4]    > 	at org.apache.lucene.codecs.memory.MemoryPostingsFormat$TermsWriter.finish(MemoryPostingsFormat.java:273)
[junit4:junit4]    > 	at org.apache.lucene.index.FreqProxTermsWriterPerField.flush(FreqProxTermsWriterPerField.java:550)
[junit4:junit4]    > 	at org.apache.lucene.index.FreqProxTermsWriter.flush(FreqProxTermsWriter.java:85)
[junit4:junit4]    > 	at org.apache.lucene.index.TermsHash.flush(TermsHash.java:117)
[junit4:junit4]    > 	at org.apache.lucene.index.DocInverter.flush(DocInverter.java:53)
[junit4:junit4]    > 	at org.apache.lucene.index.DocFieldProcessor.flush(DocFieldProcessor.java:82)
[junit4:junit4]    > 	at org.apache.lucene.index.DocumentsWriterPerThread.flush(DocumentsWriterPerThread.java:481)
[junit4:junit4]    > 	at org.apache.lucene.index.DocumentsWriter.doFlush(DocumentsWriter.java:419)
[junit4:junit4]    > 	at org.apache.lucene.index.DocumentsWriter.flushAllThreads(DocumentsWriter.java:551)
[junit4:junit4]    > 	at org.apache.lucene.index.IndexWriter.doFlush(IndexWriter.java:2838)
[junit4:junit4]    > 	at org.apache.lucene.index.IndexWriter.flush(IndexWriter.java:2814)
[junit4:junit4]    > 	at org.apache.lucene.index.IndexWriter.closeInternal(IndexWriter.java:890)
[junit4:junit4]    > 	at org.apache.lucene.index.IndexWriter.close(IndexWriter.java:845)
[junit4:junit4]    > 	at org.apache.lucene.index.IndexWriter.close(IndexWriter.java:807)
[junit4:junit4]    > 	at org.apache.lucene.store.TestRAMDirectory.setUp(TestRAMDirectory.java:64)
[junit4:junit4]    > 	at sun.reflect.GeneratedMethodAccessor5.invoke(Unknown Source)
[junit4:junit4]    > 	at sun.reflect.DelegatingMethodAccessorImpl.invoke(DelegatingMethodAccessorImpl.java:25)
[junit4:junit4]    > 	at java.lang.reflect.Method.invoke(Method.java:600)
[junit4:junit4]    > 	at com.carrotsearch.randomizedtesting.RandomizedRunner.invoke(RandomizedRunner.java:1559)
[junit4:junit4]    > 	at com.carrotsearch.randomizedtesting.RandomizedRunner.access$600(RandomizedRunner.java:79)
[junit4:junit4]    > 	at com.carrotsearch.randomizedtesting.RandomizedRunner$7.evaluate(RandomizedRunner.java:771)
[junit4:junit4]    > 	at com.carrotsearch.randomizedtesting.RandomizedRunner$8.evaluate(RandomizedRunner.java:787)
[junit4:junit4]    > 	at org.apache.lucene.util.TestRuleSetupTeardownChained$1.evaluate(TestRuleSetupTeardownChained.java:50)
[junit4:junit4]    > 	at org.apache.lucene.util.TestRuleFieldCacheSanity$1.evaluate(TestRuleFieldCacheSanity.java:32)
[junit4:junit4]    > 	at org.apache.lucene.util.AbstractBeforeAfterRule$1.evaluate(AbstractBeforeAfterRule.java:45)
[junit4:junit4]    > 	at com.carrotsearch.randomizedtesting.rules.SystemPropertiesInvariantRule$1.evaluate(SystemPropertiesInvariantRule.java:55)
[junit4:junit4]    > 	at org.apache.lucene.util.TestRuleThreadAndTestName$1.evaluate(TestRuleThreadAndTestName.java:48)
[junit4:junit4]    > 	at org.apache.lucene.util.TestRuleIgnoreAfterMaxFailures$1.evaluate(TestRuleIgnoreAfterMaxFailures.java:70)
[junit4:junit4]    > 	at org.apache.lucene.util.TestRuleMarkFailure$1.evaluate(TestRuleMarkFailure.java:48)
[junit4:junit4]    > 	at com.carrotsearch.randomizedtesting.rules.StatementAdapter.evaluate(StatementAdapter.java:36)
[junit4:junit4]    > 	at com.carrotsearch.randomizedtesting.ThreadLeakControl$StatementRunner.run(ThreadLeakControl.java:345)
[junit4:junit4]    > 	at com.carrotsearch.randomizedtesting.ThreadLeakControl.forkTimeoutingTask(ThreadLeakControl.java:769)
[junit4:junit4]    > 	at com.carrotsearch.randomizedtesting.ThreadLeakControl$3.evaluate(ThreadLeakControl.java:429)
[junit4:junit4]    > 	at com.carrotsearch.randomizedtesting.RandomizedRunner.runSingleTest(RandomizedRunner.java:746)
[junit4:junit4]    > 	at com.carrotsearch.randomizedtesting.RandomizedRunner$3.evaluate(RandomizedRunner.java:648)
[junit4:junit4]    > 	at com.carrotsearch.randomizedtesting.RandomizedRunner$4.evaluate(RandomizedRunner.java:682)
[junit4:junit4]    > 	at com.carrotsearch.randomizedtesting.RandomizedRunner$5.evaluate(RandomizedRunner.java:693)
[junit4:junit4]    > 	at org.apache.lucene.util.AbstractBeforeAfterRule$1.evaluate(AbstractBeforeAfterRule.java:45)
[junit4:junit4]    > 	at org.apache.lucene.util.TestRuleStoreClassName$1.evaluate(TestRuleStoreClassName.java:38)
[junit4:junit4]    > 	at com.carrotsearch.randomizedtesting.rules.SystemPropertiesInvariantRule$1.evaluate(SystemPropertiesInvariantRule.java:55)
[junit4:junit4]    > 	at com.carrotsearch.randomizedtesting.rules.NoShadowingOrOverridesOnMethodsRule$1.evaluate(NoShadowingOrOverridesOnMethodsRule.java:39)
[junit4:junit4]    > 	at com.carrotsearch.randomizedtesting.rules.NoShadowingOrOverridesOnMethodsRule$1.evaluate(NoShadowingOrOverridesOnMethodsRule.java:39)
[junit4:junit4]    > 	at org.apache.lucene.util.TestRuleAssertionsRequired$1.evaluate(TestRuleAssertionsRequired.java:40)
[junit4:junit4]    > 	at org.apache.lucene.util.TestRuleMarkFailure$1.evaluate(TestRuleMarkFailure.java:48)
[junit4:junit4]    > 	at org.apache.lucene.util.TestRuleIgnoreAfterMaxFailures$1.evaluate(TestRuleIgnoreAfterMaxFailures.java:70)
[junit4:junit4]    > 	at org.apache.lucene.util.TestRuleIgnoreTestSuites$1.evaluate(TestRuleIgnoreTestSuites.java:55)
[junit4:junit4]    > 	at com.carrotsearch.randomizedtesting.rules.StatementAdapter.evaluate(StatementAdapter.java:36)
[junit4:junit4]    > 	at com.carrotsearch.randomizedtesting.ThreadLeakControl$StatementRunner.run(ThreadLeakControl.java:345)
[junit4:junit4]    > 	at java.lang.Thread.run(Thread.java:736)
[junit4:junit4]   2> NOTE: reproduce with: ant test  -Dtestcase=TestRAMDirectory -Dtests.method=testIllegalEOF -Dtests.seed=9FD532EAE266FE0 -Dtests.multiplier=3 -Dtests.slow=true -Dtests.locale=nl_BE_PREEURO -Dtests.timezone=Asia/Dili -Dtests.file.encoding=US-ASCII
[junit4:junit4] FAILURE 0.07s J1 | TestRAMDirectory.testIllegalEOF <<<
[junit4:junit4]    > Throwable #1: java.lang.AssertionError
[junit4:junit4]    > 	at __randomizedtesting.SeedInfo.seed([9FD532EAE266FE0:2C61909166084F23]:0)
[junit4:junit4]    > 	at org.apache.lucene.util.packed.GrowableWriter.ensureCapacity(GrowableWriter.java:70)
[junit4:junit4]    > 	at org.apache.lucene.util.packed.GrowableWriter.set(GrowableWriter.java:83)
[junit4:junit4]    > 	at org.apache.lucene.util.fst.FST.pack(FST.java:1505)
[junit4:junit4]    > 	at org.apache.lucene.codecs.memory.MemoryPostingsFormat$TermsWriter.finish(MemoryPostingsFormat.java:273)
[junit4:junit4]    > 	at org.apache.lucene.index.FreqProxTermsWriterPerField.flush(FreqProxTermsWriterPerField.java:550)
[junit4:junit4]    > 	at org.apache.lucene.index.FreqProxTermsWriter.flush(FreqProxTermsWriter.java:85)
[junit4:junit4]    > 	at org.apache.lucene.index.TermsHash.flush(TermsHash.java:117)
[junit4:junit4]    > 	at org.apache.lucene.index.DocInverter.flush(DocInverter.java:53)
[junit4:junit4]    > 	at org.apache.lucene.index.DocFieldProcessor.flush(DocFieldProcessor.java:82)
[junit4:junit4]    > 	at org.apache.lucene.index.DocumentsWriterPerThread.flush(DocumentsWriterPerThread.java:481)
[junit4:junit4]    > 	at org.apache.lucene.index.DocumentsWriter.doFlush(DocumentsWriter.java:419)
[junit4:junit4]    > 	at org.apache.lucene.index.DocumentsWriter.flushAllThreads(DocumentsWriter.java:551)
[junit4:junit4]    > 	at org.apache.lucene.index.IndexWriter.doFlush(IndexWriter.java:2838)
[junit4:junit4]    > 	at org.apache.lucene.index.IndexWriter.flush(IndexWriter.java:2814)
[junit4:junit4]    > 	at org.apache.lucene.index.IndexWriter.closeInternal(IndexWriter.java:890)
[junit4:junit4]    > 	at org.apache.lucene.index.IndexWriter.close(IndexWriter.java:845)
[junit4:junit4]    > 	at org.apache.lucene.index.IndexWriter.close(IndexWriter.java:807)
[junit4:junit4]    > 	at org.apache.lucene.store.TestRAMDirectory.setUp(TestRAMDirectory.java:64)
[junit4:junit4]    > 	at sun.reflect.GeneratedMethodAccessor5.invoke(Unknown Source)
[junit4:junit4]    > 	at sun.reflect.DelegatingMethodAccessorImpl.invoke(DelegatingMethodAccessorImpl.java:25)
[junit4:junit4]    > 	at java.lang.reflect.Method.invoke(Method.java:600)
[junit4:junit4]    > 	at com.carrotsearch.randomizedtesting.RandomizedRunner.invoke(RandomizedRunner.java:1559)
[junit4:junit4]    > 	at com.carrotsearch.randomizedtesting.RandomizedRunner.access$600(RandomizedRunner.java:79)
[junit4:junit4]    > 	at com.carrotsearch.randomizedtesting.RandomizedRunner$7.evaluate(RandomizedRunner.java:771)
[junit4:junit4]    > 	at com.carrotsearch.randomizedtesting.RandomizedRunner$8.evaluate(RandomizedRunner.java:787)
[junit4:junit4]    > 	at org.apache.lucene.util.TestRuleSetupTeardownChained$1.evaluate(TestRuleSetupTeardownChained.java:50)
[junit4:junit4]    > 	at org.apache.lucene.util.TestRuleFieldCacheSanity$1.evaluate(TestRuleFieldCacheSanity.java:32)
[junit4:junit4]    > 	at org.apache.lucene.util.AbstractBeforeAfterRule$1.evaluate(AbstractBeforeAfterRule.java:45)
[junit4:junit4]    > 	at com.carrotsearch.randomizedtesting.rules.SystemPropertiesInvariantRule$1.evaluate(SystemPropertiesInvariantRule.java:55)
[junit4:junit4]    > 	at org.apache.lucene.util.TestRuleThreadAndTestName$1.evaluate(TestRuleThreadAndTestName.java:48)
[junit4:junit4]    > 	at org.apache.lucene.util.TestRuleIgnoreAfterMaxFailures$1.evaluate(TestRuleIgnoreAfterMaxFailures.java:70)
[junit4:junit4]    > 	at org.apache.lucene.util.TestRuleMarkFailure$1.evaluate(TestRuleMarkFailure.java:48)
[junit4:junit4]    > 	at com.carrotsearch.randomizedtesting.rules.StatementAdapter.evaluate(StatementAdapter.java:36)
[junit4:junit4]    > 	at com.carrotsearch.randomizedtesting.ThreadLeakControl$StatementRunner.run(ThreadLeakControl.java:345)
[junit4:junit4]    > 	at com.carrotsearch.randomizedtesting.ThreadLeakControl.forkTimeoutingTask(ThreadLeakControl.java:769)
[junit4:junit4]    > 	at com.carrotsearch.randomizedtesting.ThreadLeakControl$3.evaluate(ThreadLeakControl.java:429)
[junit4:junit4]    > 	at com.carrotsearch.randomizedtesting.RandomizedRunner.runSingleTest(RandomizedRunner.java:746)
[junit4:junit4]    > 	at com.carrotsearch.randomizedtesting.RandomizedRunner$3.evaluate(RandomizedRunner.java:648)
[junit4:junit4]    > 	at com.carrotsearch.randomizedtesting.RandomizedRunner$4.evaluate(RandomizedRunner.java:682)
[junit4:junit4]    > 	at com.carrotsearch.randomizedtesting.RandomizedRunner$5.evaluate(RandomizedRunner.java:693)
[junit4:junit4]    > 	at org.apache.lucene.util.AbstractBeforeAfterRule$1.evaluate(AbstractBeforeAfterRule.java:45)
[junit4:junit4]    > 	at org.apache.lucene.util.TestRuleStoreClassName$1.evaluate(TestRuleStoreClassName.java:38)
[junit4:junit4]    > 	at com.carrotsearch.randomizedtesting.rules.SystemPropertiesInvariantRule$1.evaluate(SystemPropertiesInvariantRule.java:55)
[junit4:junit4]    > 	at com.carrotsearch.randomizedtesting.rules.NoShadowingOrOverridesOnMethodsRule$1.evaluate(NoShadowingOrOverridesOnMethodsRule.java:39)
[junit4:junit4]    > 	at com.carrotsearch.randomizedtesting.rules.NoShadowingOrOverridesOnMethodsRule$1.evaluate(NoShadowingOrOverridesOnMethodsRule.java:39)
[junit4:junit4]    > 	at org.apache.lucene.util.TestRuleAssertionsRequired$1.evaluate(TestRuleAssertionsRequired.java:40)
[junit4:junit4]    > 	at org.apache.lucene.util.TestRuleMarkFailure$1.evaluate(TestRuleMarkFailure.java:48)
[junit4:junit4]    > 	at org.apache.lucene.util.TestRuleIgnoreAfterMaxFailures$1.evaluate(TestRuleIgnoreAfterMaxFailures.java:70)
[junit4:junit4]    > 	at org.apache.lucene.util.TestRuleIgnoreTestSuites$1.evaluate(TestRuleIgnoreTestSuites.java:55)
[junit4:junit4]    > 	at com.carrotsearch.randomizedtesting.rules.StatementAdapter.evaluate(StatementAdapter.java:36)
[junit4:junit4]    > 	at com.carrotsearch.randomizedtesting.ThreadLeakControl$StatementRunner.run(ThreadLeakControl.java:345)
[junit4:junit4]    > 	at java.lang.Thread.run(Thread.java:736)
[junit4:junit4]   2> NOTE: reproduce with: ant test  -Dtestcase=TestRAMDirectory -Dtests.method=testRAMDirectory -Dtests.seed=9FD532EAE266FE0 -Dtests.multiplier=3 -Dtests.slow=true -Dtests.locale=nl_BE_PREEURO -Dtests.timezone=Asia/Dili -Dtests.file.encoding=US-ASCII
[junit4:junit4] FAILURE 0.03s J1 | TestRAMDirectory.testRAMDirectory <<<
[junit4:junit4]    > Throwable #1: java.lang.AssertionError
[junit4:junit4]    > 	at __randomizedtesting.SeedInfo.seed([9FD532EAE266FE0:13670C86260521D3]:0)
[junit4:junit4]    > 	at org.apache.lucene.util.packed.GrowableWriter.ensureCapacity(GrowableWriter.java:70)
[junit4:junit4]    > 	at org.apache.lucene.util.packed.GrowableWriter.set(GrowableWriter.java:83)
[junit4:junit4]    > 	at org.apache.lucene.util.fst.FST.pack(FST.java:1505)
[junit4:junit4]    > 	at org.apache.lucene.codecs.memory.MemoryPostingsFormat$TermsWriter.finish(MemoryPostingsFormat.java:273)
[junit4:junit4]    > 	at org.apache.lucene.index.FreqProxTermsWriterPerField.flush(FreqProxTermsWriterPerField.java:550)
[junit4:junit4]    > 	at org.apache.lucene.index.FreqProxTermsWriter.flush(FreqProxTermsWriter.java:85)
[junit4:junit4]    > 	at org.apache.lucene.index.TermsHash.flush(TermsHash.java:117)
[junit4:junit4]    > 	at org.apache.lucene.index.DocInverter.flush(DocInverter.java:53)
[junit4:junit4]    > 	at org.apache.lucene.index.DocFieldProcessor.flush(DocFieldProcessor.java:82)
[junit4:junit4]    > 	at org.apache.lucene.index.DocumentsWriterPerThread.flush(DocumentsWriterPerThread.java:481)
[junit4:junit4]    > 	at org.apache.lucene.index.DocumentsWriter.doFlush(DocumentsWriter.java:419)
[junit4:junit4]    > 	at org.apache.lucene.index.DocumentsWriter.flushAllThreads(DocumentsWriter.java:551)
[junit4:junit4]    > 	at org.apache.lucene.index.IndexWriter.doFlush(IndexWriter.java:2838)
[junit4:junit4]    > 	at org.apache.lucene.index.IndexWriter.flush(IndexWriter.java:2814)
[junit4:junit4]    > 	at org.apache.lucene.index.IndexWriter.closeInternal(IndexWriter.java:890)
[junit4:junit4]    > 	at org.apache.lucene.index.IndexWriter.close(IndexWriter.java:845)
[junit4:junit4]    > 	at org.apache.lucene.index.IndexWriter.close(IndexWriter.java:807)
[junit4:junit4]    > 	at org.apache.lucene.store.TestRAMDirectory.setUp(TestRAMDirectory.java:64)
[junit4:junit4]    > 	at sun.reflect.GeneratedMethodAccessor5.invoke(Unknown Source)
[junit4:junit4]    > 	at sun.reflect.DelegatingMethodAccessorImpl.invoke(DelegatingMethodAccessorImpl.java:25)
[junit4:junit4]    > 	at java.lang.reflect.Method.invoke(Method.java:600)
[junit4:junit4]    > 	at com.carrotsearch.randomizedtesting.RandomizedRunner.invoke(RandomizedRunner.java:1559)
[junit4:junit4]    > 	at com.carrotsearch.randomizedtesting.RandomizedRunner.access$600(RandomizedRunner.java:79)
[junit4:junit4]    > 	at com.carrotsearch.randomizedtesting.RandomizedRunner$7.evaluate(RandomizedRunner.java:771)
[junit4:junit4]    > 	at com.carrotsearch.randomizedtesting.RandomizedRunner$8.evaluate(RandomizedRunner.java:787)
[junit4:junit4]    > 	at org.apache.lucene.util.TestRuleSetupTeardownChained$1.evaluate(TestRuleSetupTeardownChained.java:50)
[junit4:junit4]    > 	at org.apache.lucene.util.TestRuleFieldCacheSanity$1.evaluate(TestRuleFieldCacheSanity.java:32)
[junit4:junit4]    > 	at org.apache.lucene.util.AbstractBeforeAfterRule$1.evaluate(AbstractBeforeAfterRule.java:45)
[junit4:junit4]    > 	at com.carrotsearch.randomizedtesting.rules.SystemPropertiesInvariantRule$1.evaluate(SystemPropertiesInvariantRule.java:55)
[junit4:junit4]    > 	at org.apache.lucene.util.TestRuleThreadAndTestName$1.evaluate(TestRuleThreadAndTestName.java:48)
[junit4:junit4]    > 	at org.apache.lucene.util.TestRuleIgnoreAfterMaxFailures$1.evaluate(TestRuleIgnoreAfterMaxFailures.java:70)
[junit4:junit4]    > 	at org.apache.lucene.util.TestRuleMarkFailure$1.evaluate(TestRuleMarkFailure.java:48)
[junit4:junit4]    > 	at com.carrotsearch.randomizedtesting.rules.StatementAdapter.evaluate(StatementAdapter.java:36)
[junit4:junit4]    > 	at com.carrotsearch.randomizedtesting.ThreadLeakControl$StatementRunner.run(ThreadLeakControl.java:345)
[junit4:junit4]    > 	at com.carrotsearch.randomizedtesting.ThreadLeakControl.forkTimeoutingTask(ThreadLeakControl.java:769)
[junit4:junit4]    > 	at com.carrotsearch.randomizedtesting.ThreadLeakControl$3.evaluate(ThreadLeakControl.java:429)
[junit4:junit4]    > 	at com.carrotsearch.randomizedtesting.RandomizedRunner.runSingleTest(RandomizedRunner.java:746)
[junit4:junit4]    > 	at com.carrotsearch.randomizedtesting.RandomizedRunner$3.evaluate(RandomizedRunner.java:648)
[junit4:junit4]    > 	at com.carrotsearch.randomizedtesting.RandomizedRunner$4.evaluate(RandomizedRunner.java:682)
[junit4:junit4]    > 	at com.carrotsearch.randomizedtesting.RandomizedRunner$5.evaluate(RandomizedRunner.java:693)
[junit4:junit4]    > 	at org.apache.lucene.util.AbstractBeforeAfterRule$1.evaluate(AbstractBeforeAfterRule.java:45)
[junit4:junit4]    > 	at org.apache.lucene.util.TestRuleStoreClassName$1.evaluate(TestRuleStoreClassName.java:38)
[junit4:junit4]    > 	at com.carrotsearch.randomizedtesting.rules.SystemPropertiesInvariantRule$1.evaluate(SystemPropertiesInvariantRule.java:55)
[junit4:junit4]    > 	at com.carrotsearch.randomizedtesting.rules.NoShadowingOrOverridesOnMethodsRule$1.evaluate(NoShadowingOrOverridesOnMethodsRule.java:39)
[junit4:junit4]    > 	at com.carrotsearch.randomizedtesting.rules.NoShadowingOrOverridesOnMethodsRule$1.evaluate(NoShadowingOrOverridesOnMethodsRule.java:39)
[junit4:junit4]    > 	at org.apache.lucene.util.TestRuleAssertionsRequired$1.evaluate(TestRuleAssertionsRequired.java:40)
[junit4:junit4]    > 	at org.apache.lucene.util.TestRuleMarkFailure$1.evaluate(TestRuleMarkFailure.java:48)
[junit4:junit4]    > 	at org.apache.lucene.util.TestRuleIgnoreAfterMaxFailures$1.evaluate(TestRuleIgnoreAfterMaxFailures.java:70)
[junit4:junit4]    > 	at org.apache.lucene.util.TestRuleIgnoreTestSuites$1.evaluate(TestRuleIgnoreTestSuites.java:55)
[junit4:junit4]    > 	at com.carrotsearch.randomizedtesting.rules.StatementAdapter.evaluate(StatementAdapter.java:36)
[junit4:junit4]    > 	at com.carrotsearch.randomizedtesting.ThreadLeakControl$StatementRunner.run(ThreadLeakControl.java:345)
[junit4:junit4]    > 	at java.lang.Thread.run(Thread.java:736)
[junit4:junit4]   2> NOTE: reproduce with: ant test  -Dtestcase=TestRAMDirectory -Dtests.method=testRAMDirectorySize -Dtests.seed=9FD532EAE266FE0 -Dtests.multiplier=3 -Dtests.slow=true -Dtests.locale=nl_BE_PREEURO -Dtests.timezone=Asia/Dili -Dtests.file.encoding=US-ASCII
[junit4:junit4] FAILURE 0.03s J1 | TestRAMDirectory.testRAMDirectorySize <<<
[junit4:junit4]    > Throwable #1: java.lang.AssertionError
[junit4:junit4]    > 	at __randomizedtesting.SeedInfo.seed([9FD532EAE266FE0:95A7A17E07C5D57E]:0)
[junit4:junit4]    > 	at org.apache.lucene.util.packed.GrowableWriter.ensureCapacity(GrowableWriter.java:70)
[junit4:junit4]    > 	at org.apache.lucene.util.packed.GrowableWriter.set(GrowableWriter.java:83)
[junit4:junit4]    > 	at org.apache.lucene.util.fst.FST.pack(FST.java:1505)
[junit4:junit4]    > 	at org.apache.lucene.codecs.memory.MemoryPostingsFormat$TermsWriter.finish(MemoryPostingsFormat.java:273)
[junit4:junit4]    > 	at org.apache.lucene.index.FreqProxTermsWriterPerField.flush(FreqProxTermsWriterPerField.java:550)
[junit4:junit4]    > 	at org.apache.lucene.index.FreqProxTermsWriter.flush(FreqProxTermsWriter.java:85)
[junit4:junit4]    > 	at org.apache.lucene.index.TermsHash.flush(TermsHash.java:117)
[junit4:junit4]    > 	at org.apache.lucene.index.DocInverter.flush(DocInverter.java:53)
[junit4:junit4]    > 	at org.apache.lucene.index.DocFieldProcessor.flush(DocFieldProcessor.java:82)
[junit4:junit4]    > 	at org.apache.lucene.index.DocumentsWriterPerThread.flush(DocumentsWriterPerThread.java:481)
[junit4:junit4]    > 	at org.apache.lucene.index.DocumentsWriter.doFlush(DocumentsWriter.java:419)
[junit4:junit4]    > 	at org.apache.lucene.index.DocumentsWriter.flushAllThreads(DocumentsWriter.java:551)
[junit4:junit4]    > 	at org.apache.lucene.index.IndexWriter.doFlush(IndexWriter.java:2838)
[junit4:junit4]    > 	at org.apache.lucene.index.IndexWriter.flush(IndexWriter.java:2814)
[junit4:junit4]    > 	at org.apache.lucene.index.IndexWriter.closeInternal(IndexWriter.java:890)
[junit4:junit4]    > 	at org.apache.lucene.index.IndexWriter.close(IndexWriter.java:845)
[junit4:junit4]    > 	at org.apache.lucene.index.IndexWriter.close(IndexWriter.java:807)
[junit4:junit4]    > 	at org.apache.lucene.store.TestRAMDirectory.setUp(TestRAMDirectory.java:64)
[junit4:junit4]    > 	at sun.reflect.GeneratedMethodAccessor5.invoke(Unknown Source)
[junit4:junit4]    > 	at sun.reflect.DelegatingMethodAccessorImpl.invoke(DelegatingMethodAccessorImpl.java:25)
[junit4:junit4]    > 	at java.lang.reflect.Method.invoke(Method.java:600)
[junit4:junit4]    > 	at com.carrotsearch.randomizedtesting.RandomizedRunner.invoke(RandomizedRunner.java:1559)
[junit4:junit4]    > 	at com.carrotsearch.randomizedtesting.RandomizedRunner.access$600(RandomizedRunner.java:79)
[junit4:junit4]    > 	at com.carrotsearch.randomizedtesting.RandomizedRunner$7.evaluate(RandomizedRunner.java:771)
[junit4:junit4]    > 	at com.carrotsearch.randomizedtesting.RandomizedRunner$8.evaluate(RandomizedRunner.java:787)
[junit4:junit4]    > 	at org.apache.lucene.util.TestRuleSetupTeardownChained$1.evaluate(TestRuleSetupTeardownChained.java:50)
[junit4:junit4]    > 	at org.apache.lucene.util.TestRuleFieldCacheSanity$1.evaluate(TestRuleFieldCacheSanity.java:32)
[junit4:junit4]    > 	at org.apache.lucene.util.AbstractBeforeAfterRule$1.evaluate(AbstractBeforeAfterRule.java:45)
[junit4:junit4]    > 	at com.carrotsearch.randomizedtesting.rules.SystemPropertiesInvariantRule$1.evaluate(SystemPropertiesInvariantRule.java:55)
[junit4:junit4]    > 	at org.apache.lucene.util.TestRuleThreadAndTestName$1.evaluate(TestRuleThreadAndTestName.java:48)
[junit4:junit4]    > 	at org.apache.lucene.util.TestRuleIgnoreAfterMaxFailures$1.evaluate(TestRuleIgnoreAfterMaxFailures.java:70)
[junit4:junit4]    > 	at org.apache.lucene.util.TestRuleMarkFailure$1.evaluate(TestRuleMarkFailure.java:48)
[junit4:junit4]    > 	at com.carrotsearch.randomizedtesting.rules.StatementAdapter.evaluate(StatementAdapter.java:36)
[junit4:junit4]    > 	at com.carrotsearch.randomizedtesting.ThreadLeakControl$StatementRunner.run(ThreadLeakControl.java:345)
[junit4:junit4]    > 	at com.carrotsearch.randomizedtesting.ThreadLeakControl.forkTimeoutingTask(ThreadLeakControl.java:769)
[junit4:junit4]    > 	at com.carrotsearch.randomizedtesting.ThreadLeakControl$3.evaluate(ThreadLeakControl.java:429)
[junit4:junit4]    > 	at com.carrotsearch.randomizedtesting.RandomizedRunner.runSingleTest(RandomizedRunner.java:746)
[junit4:junit4]    > 	at com.carrotsearch.randomizedtesting.RandomizedRunner$3.evaluate(RandomizedRunner.java:648)
[junit4:junit4]    > 	at com.carrotsearch.randomizedtesting.RandomizedRunner$4.evaluate(RandomizedRunner.java:682)
[junit4:junit4]    > 	at com.carrotsearch.randomizedtesting.RandomizedRunner$5.evaluate(RandomizedRunner.java:693)
[junit4:junit4]    > 	at org.apache.lucene.util.AbstractBeforeAfterRule$1.evaluate(AbstractBeforeAfterRule.java:45)
[junit4:junit4]    > 	at org.apache.lucene.util.TestRuleStoreClassName$1.evaluate(TestRuleStoreClassName.java:38)
[junit4:junit4]    > 	at com.carrotsearch.randomizedtesting.rules.SystemPropertiesInvariantRule$1.evaluate(SystemPropertiesInvariantRule.java:55)
[junit4:junit4]    > 	at com.carrotsearch.randomizedtesting.rules.NoShadowingOrOverridesOnMethodsRule$1.evaluate(NoShadowingOrOverridesOnMethodsRule.java:39)
[junit4:junit4]    > 	at com.carrotsearch.randomizedtesting.rules.NoShadowingOrOverridesOnMethodsRule$1.evaluate(NoShadowingOrOverridesOnMethodsRule.java:39)
[junit4:junit4]    > 	at org.apache.lucene.util.TestRuleAssertionsRequired$1.evaluate(TestRuleAssertionsRequired.java:40)
[junit4:junit4]    > 	at org.apache.lucene.util.TestRuleMarkFailure$1.evaluate(TestRuleMarkFailure.java:48)
[junit4:junit4]    > 	at org.apache.lucene.util.TestRuleIgnoreAfterMaxFailures$1.evaluate(TestRuleIgnoreAfterMaxFailures.java:70)
[junit4:junit4]    > 	at org.apache.lucene.util.TestRuleIgnoreTestSuites$1.evaluate(TestRuleIgnoreTestSuites.java:55)
[junit4:junit4]    > 	at com.carrotsearch.randomizedtesting.rules.StatementAdapter.evaluate(StatementAdapter.java:36)
[junit4:junit4]    > 	at com.carrotsearch.randomizedtesting.ThreadLeakControl$StatementRunner.run(ThreadLeakControl.java:345)
[junit4:junit4]    > 	at java.lang.Thread.run(Thread.java:736)
[junit4:junit4]   2> NOTE: test params are: codec=Lucene40: {content=PostingsFormat(name=Memory doPackFST= true)}, sim=RandomSimilarityProvider(queryNorm=true,coord=crazy): {}, locale=nl_BE_PREEURO, timezone=Asia/Dili
[junit4:junit4]   2> NOTE: Linux 3.2.0-29-generic x86/IBM Corporation 1.6.0 (32-bit)/cpus=8,threads=1,free=5373400,total=14425088
[junit4:junit4]   2> NOTE: All tests run in this JVM: [TestSpanMultiTermQueryWrapper, TestSimilarityBase, TestPayloadExplanations, TestNewestSegment, TestPerSegmentDeletes, TestBinaryDocument, TestDocCount, TestFSTs, TestConcurrentMergeScheduler, TestNorms, TestMergeSchedulerExternal, TestLongPostings, TestRamUsageEstimatorOnWildAnimals, TestTermRangeFilter, TestRAMDirectory]
[junit4:junit4] Completed on J1 in 0.20s, 4 tests, 4 failures <<< FAILURES!

[...truncated 448 lines...]
[junit4:junit4] Suite: org.apache.lucene.store.TestNRTCachingDirectory
[junit4:junit4]   2> NOTE: reproduce with: ant test  -Dtestcase=TestNRTCachingDirectory -Dtests.method=testNRTAndCommit -Dtests.seed=9FD532EAE266FE0 -Dtests.multiplier=3 -Dtests.slow=true -Dtests.locale=ja -Dtests.timezone=Atlantic/Jan_Mayen -Dtests.file.encoding=US-ASCII
[junit4:junit4] FAILURE 0.72s J1 | TestNRTCachingDirectory.testNRTAndCommit <<<
[junit4:junit4]    > Throwable #1: java.lang.AssertionError
[junit4:junit4]    > 	at __randomizedtesting.SeedInfo.seed([9FD532EAE266FE0:4846BED3CA166EC4]:0)
[junit4:junit4]    > 	at org.apache.lucene.util.packed.GrowableWriter.ensureCapacity(GrowableWriter.java:70)
[junit4:junit4]    > 	at org.apache.lucene.util.packed.GrowableWriter.set(GrowableWriter.java:83)
[junit4:junit4]    > 	at org.apache.lucene.util.fst.FST.pack(FST.java:1505)
[junit4:junit4]    > 	at org.apache.lucene.codecs.memory.MemoryPostingsFormat$TermsWriter.finish(MemoryPostingsFormat.java:273)
[junit4:junit4]    > 	at org.apache.lucene.codecs.TermsConsumer.merge(TermsConsumer.java:213)
[junit4:junit4]    > 	at org.apache.lucene.codecs.FieldsConsumer.merge(FieldsConsumer.java:61)
[junit4:junit4]    > 	at org.apache.lucene.index.SegmentMerger.mergeTerms(SegmentMerger.java:323)
[junit4:junit4]    > 	at org.apache.lucene.index.SegmentMerger.merge(SegmentMerger.java:110)
[junit4:junit4]    > 	at org.apache.lucene.index.IndexWriter.mergeMiddle(IndexWriter.java:3586)
[junit4:junit4]    > 	at org.apache.lucene.index.IndexWriter.merge(IndexWriter.java:3201)
[junit4:junit4]    > 	at org.apache.lucene.index.SerialMergeScheduler.merge(SerialMergeScheduler.java:36)
[junit4:junit4]    > 	at org.apache.lucene.index.IndexWriter.maybeMerge(IndexWriter.java:1799)
[junit4:junit4]    > 	at org.apache.lucene.index.IndexWriter.maybeMerge(IndexWriter.java:1793)
[junit4:junit4]    > 	at org.apache.lucene.index.IndexWriter.getReader(IndexWriter.java:386)
[junit4:junit4]    > 	at org.apache.lucene.index.StandardDirectoryReader.doOpenFromWriter(StandardDirectoryReader.java:265)
[junit4:junit4]    > 	at org.apache.lucene.index.StandardDirectoryReader.doOpenIfChanged(StandardDirectoryReader.java:240)
[junit4:junit4]    > 	at org.apache.lucene.index.StandardDirectoryReader.doOpenIfChanged(StandardDirectoryReader.java:230)
[junit4:junit4]    > 	at org.apache.lucene.index.DirectoryReader.openIfChanged(DirectoryReader.java:166)
[junit4:junit4]    > 	at org.apache.lucene.store.TestNRTCachingDirectory.testNRTAndCommit(TestNRTCachingDirectory.java:68)
[junit4:junit4]    > 	at sun.reflect.NativeMethodAccessorImpl.invoke0(Native Method)
[junit4:junit4]    > 	at sun.reflect.NativeMethodAccessorImpl.invoke(NativeMethodAccessorImpl.java:48)
[junit4:junit4]    > 	at sun.reflect.DelegatingMethodAccessorImpl.invoke(DelegatingMethodAccessorImpl.java:25)
[junit4:junit4]    > 	at java.lang.reflect.Method.invoke(Method.java:600)
[junit4:junit4]    > 	at com.carrotsearch.randomizedtesting.RandomizedRunner.invoke(RandomizedRunner.java:1559)
[junit4:junit4]    > 	at com.carrotsearch.randomizedtesting.RandomizedRunner.access$600(RandomizedRunner.java:79)
[junit4:junit4]    > 	at com.carrotsearch.randomizedtesting.RandomizedRunner$6.evaluate(RandomizedRunner.java:737)
[junit4:junit4]    > 	at com.carrotsearch.randomizedtesting.RandomizedRunner$7.evaluate(RandomizedRunner.java:773)
[junit4:junit4]    > 	at com.carrotsearch.randomizedtesting.RandomizedRunner$8.evaluate(RandomizedRunner.java:787)
[junit4:junit4]    > 	at org.apache.lucene.util.TestRuleSetupTeardownChained$1.evaluate(TestRuleSetupTeardownChained.java:50)
[junit4:junit4]    > 	at org.apache.lucene.util.TestRuleFieldCacheSanity$1.evaluate(TestRuleFieldCacheSanity.java:32)
[junit4:junit4]    > 	at org.apache.lucene.util.AbstractBeforeAfterRule$1.evaluate(AbstractBeforeAfterRule.java:45)
[junit4:junit4]    > 	at com.carrotsearch.randomizedtesting.rules.SystemPropertiesInvariantRule$1.evaluate(SystemPropertiesInvariantRule.java:55)
[junit4:junit4]    > 	at org.apache.lucene.util.TestRuleThreadAndTestName$1.evaluate(TestRuleThreadAndTestName.java:48)
[junit4:junit4]    > 	at org.apache.lucene.util.TestRuleIgnoreAfterMaxFailures$1.evaluate(TestRuleIgnoreAfterMaxFailures.java:70)
[junit4:junit4]    > 	at org.apache.lucene.util.TestRuleMarkFailure$1.evaluate(TestRuleMarkFailure.java:48)
[junit4:junit4]    > 	at com.carrotsearch.randomizedtesting.rules.StatementAdapter.evaluate(StatementAdapter.java:36)
[junit4:junit4]    > 	at com.carrotsearch.randomizedtesting.ThreadLeakControl$StatementRunner.run(ThreadLeakControl.java:345)
[junit4:junit4]    > 	at com.carrotsearch.randomizedtesting.ThreadLeakControl.forkTimeoutingTask(ThreadLeakControl.java:769)
[junit4:junit4]    > 	at com.carrotsearch.randomizedtesting.ThreadLeakControl$3.evaluate(ThreadLeakControl.java:429)
[junit4:junit4]    > 	at com.carrotsearch.randomizedtesting.RandomizedRunner.runSingleTest(RandomizedRunner.java:746)
[junit4:junit4]    > 	at com.carrotsearch.randomizedtesting.RandomizedRunner$3.evaluate(RandomizedRunner.java:648)
[junit4:junit4]    > 	at com.carrotsearch.randomizedtesting.RandomizedRunner$4.evaluate(RandomizedRunner.java:682)
[junit4:junit4]    > 	at com.carrotsearch.randomizedtesting.RandomizedRunner$5.evaluate(RandomizedRunner.java:693)
[junit4:junit4]    > 	at org.apache.lucene.util.AbstractBeforeAfterRule$1.evaluate(AbstractBeforeAfterRule.java:45)
[junit4:junit4]    > 	at org.apache.lucene.util.TestRuleStoreClassName$1.evaluate(TestRuleStoreClassName.java:38)
[junit4:junit4]    > 	at com.carrotsearch.randomizedtesting.rules.SystemPropertiesInvariantRule$1.evaluate(SystemPropertiesInvariantRule.java:55)
[junit4:junit4]    > 	at com.carrotsearch.randomizedtesting.rules.NoShadowingOrOverridesOnMethodsRule$1.evaluate(NoShadowingOrOverridesOnMethodsRule.java:39)
[junit4:junit4]    > 	at com.carrotsearch.randomizedtesting.rules.NoShadowingOrOverridesOnMethodsRule$1.evaluate(NoShadowingOrOverridesOnMethodsRule.java:39)
[junit4:junit4]    > 	at org.apache.lucene.util.TestRuleAssertionsRequired$1.evaluate(TestRuleAssertionsRequired.java:40)
[junit4:junit4]    > 	at org.apache.lucene.util.TestRuleMarkFailure$1.evaluate(TestRuleMarkFailure.java:48)
[junit4:junit4]    > 	at org.apache.lucene.util.TestRuleIgnoreAfterMaxFailures$1.evaluate(TestRuleIgnoreAfterMaxFailures.java:70)
[junit4:junit4]    > 	at org.apache.lucene.util.TestRuleIgnoreTestSuites$1.evaluate(TestRuleIgnoreTestSuites.java:55)
[junit4:junit4]    > 	at com.carrotsearch.randomizedtesting.rules.StatementAdapter.evaluate(StatementAdapter.java:36)
[junit4:junit4]    > 	at com.carrotsearch.randomizedtesting.ThreadLeakControl$StatementRunner.run(ThreadLeakControl.java:345)
[junit4:junit4]    > 	at java.lang.Thread.run(Thread.java:736)
[junit4:junit4]   2> NOTE: test params are: codec=Lucene40: {titleTokenized=Lucene40(minBlockSize=87 maxBlockSize=269), body=Pulsing40(freqCutoff=4 minBlockSize=87 maxBlockSize=269), docid=PostingsFormat(name=Memory doPackFST= true), title=PostingsFormat(name=MockRandom), date=Pulsing40(freqCutoff=4 minBlockSize=87 maxBlockSize=269)}, sim=RandomSimilarityProvider(queryNorm=true,coord=yes): {titleTokenized=DFR I(n)1, body=IB SPL-D1}, locale=ja, timezone=Atlantic/Jan_Mayen
[junit4:junit4]   2> NOTE: Linux 3.2.0-29-generic x86/IBM Corporation 1.6.0 (32-bit)/cpus=8,threads=1,free=5523744,total=19283456
[junit4:junit4]   2> NOTE: All tests run in this JVM: [TestSpanMultiTermQueryWrapper, TestSimilarityBase, TestPayloadExplanations, TestNewestSegment, TestPerSegmentDeletes, TestBinaryDocument, TestDocCount, TestFSTs, TestConcurrentMergeScheduler, TestNorms, TestMergeSchedulerExternal, TestLongPostings, TestRamUsageEstimatorOnWildAnimals, TestTermRangeFilter, TestRAMDirectory, TestBytesRefHash, TestComplexExplanationsOfNonMatches, TestCodecs, TestFieldsReader, TestMatchAllDocsQuery, TestLock, TestSentinelIntSet, TestPostingsOffsets, TestDateTools, TestTypePromotion, TestIndexWriterOnDiskFull, TestDocTermOrds, TestLookaheadTokenFilter, TestSegmentTermDocs, TestDoc, TestFieldValueFilter, TestAutomatonQuery, TestMultiThreadTermVectors, TestTermVectorsWriter, TestTermsEnum, TestNamedSPILoader, TestRecyclingByteBlockAllocator, TestParallelTermEnum, TestTopScoreDocCollector, TestNumericTokenStream, TestTopDocsMerge, TestAttributeSource, TestDocValuesScoring, TestDateFilter, TestConjunctions, TestIndexInput, Nested1, TestStressIndexing, TestUnicodeUtil, TestOmitPositions, TestLucene40PostingsReader, Test2BPostings, TestIsCurrent, TestNeverDelete, Test10KPulsings, TestCloseableThreadLocal, TestStressNRT, TestStressAdvance, TestBooleanQuery, TestDirectory, TestDocument, TestDirectoryReader, TestAutomatonQueryUnicode, TestBooleanOr, TestPackedInts, TestLockFactory, TestIOUtils, TestRollingBuffer, TestIntBlockCodec, TestUniqueTermCount, TestMultiValuedNumericRangeQuery, TestNumericRangeQuery64, TestConsistentFieldNumbers, TestToken, TestSameTokenSamePosition, TestCharFilter, TestRegexpRandom2, TestSearcherManager, TestNRTThreads, TestAddIndexes, TestIndexWriterMerging, TestMultiMMap, TestSearchAfter, TestIndexWriterDelete, TestDirectoryReaderReopen, TestBufferedIndexInput, TestNRTCachingDirectory]
[junit4:junit4] Completed on J1 in 0.76s, 5 tests, 1 failure <<< FAILURES!

[...truncated 100 lines...]
[junit4:junit4] Suite: org.apache.lucene.index.TestStressIndexing2
[junit4:junit4]   2> java.lang.AssertionError
[junit4:junit4]   2> 	at org.apache.lucene.util.packed.GrowableWriter.ensureCapacity(GrowableWriter.java:70)
[junit4:junit4]   2> 	at org.apache.lucene.util.packed.GrowableWriter.set(GrowableWriter.java:83)
[junit4:junit4]   2> 	at org.apache.lucene.util.fst.FST.pack(FST.java:1505)
[junit4:junit4]   2> 	at org.apache.lucene.codecs.memory.MemoryPostingsFormat$TermsWriter.finish(MemoryPostingsFormat.java:273)
[junit4:junit4]   2> 	at org.apache.lucene.index.FreqProxTermsWriterPerField.flush(FreqProxTermsWriterPerField.java:550)
[junit4:junit4]   2> 	at org.apache.lucene.index.FreqProxTermsWriter.flush(FreqProxTermsWriter.java:85)
[junit4:junit4]   2> 	at org.apache.lucene.index.TermsHash.flush(TermsHash.java:117)
[junit4:junit4]   2> 	at org.apache.lucene.index.DocInverter.flush(DocInverter.java:53)java.lang.AssertionError
[junit4:junit4]   2> 
[junit4:junit4]   2> 	at org.apache.lucene.index.DocFieldProcessor.flush(DocFieldProcessor.java:82)
[junit4:junit4]   2> 	at org.apache.lucene.index.DocumentsWriterPerThread.flush(DocumentsWriterPerThread.java:481)
[junit4:junit4]   2> 	at org.apache.lucene.index.DocumentsWriter.doFlush(DocumentsWriter.java:419)
[junit4:junit4]   2> 	at org.apache.lucene.index.DocumentsWriter.postUpdate(DocumentsWriter.java:313)	at org.apache.lucene.util.packed.GrowableWriter.ensureCapacity(GrowableWriter.java:70)
[junit4:junit4]   2> 
[junit4:junit4]   2> 	at org.apache.lucene.index.DocumentsWriter.updateDocument(DocumentsWriter.java:386)	at org.apache.lucene.util.packed.GrowableWriter.set(GrowableWriter.java:83)
[junit4:junit4]   2> 
[junit4:junit4]   2> 	at org.apache.lucene.index.IndexWriter.updateDocument(IndexWriter.java:1428)	at org.apache.lucene.util.fst.FST.pack(FST.java:1505)
[junit4:junit4]   2> 
[junit4:junit4]   2> 	at org.apache.lucene.index.IndexWriter.updateDocument(IndexWriter.java:1400)	at org.apache.lucene.codecs.memory.MemoryPostingsFormat$TermsWriter.finish(MemoryPostingsFormat.java:273)
[junit4:junit4]   2> 
[junit4:junit4]   2> 	at org.apache.lucene.index.TestStressIndexing2$IndexingThread.indexDoc(TestStressIndexing2.java:840)	at org.apache.lucene.index.FreqProxTermsWriterPerField.flush(FreqProxTermsWriterPerField.java:550)
[junit4:junit4]   2> 
[junit4:junit4]   2> 	at org.apache.lucene.index.TestStressIndexing2$IndexingThread.run(TestStressIndexing2.java:874)	at org.apache.lucene.index.FreqProxTermsWriter.flush(FreqProxTermsWriter.java:85)
[junit4:junit4]   2> 
[junit4:junit4]   2> 	at org.apache.lucene.index.TermsHash.flush(TermsHash.java:117)
[junit4:junit4]   2> 	at org.apache.lucene.index.DocInverter.flush(DocInverter.java:53)
[junit4:junit4]   2> 	at org.apache.lucene.index.DocFieldProcessor.flush(DocFieldProcessor.java:82)
[junit4:junit4]   2> 	at org.apache.lucene.index.DocumentsWriterPerThread.flush(DocumentsWriterPerThread.java:481)
[junit4:junit4]   2> 	at org.apache.lucene.index.DocumentsWriter.doFlush(DocumentsWriter.java:419)
[junit4:junit4]   2> 	at org.apache.lucene.index.DocumentsWriter.postUpdate(DocumentsWriter.java:313)
[junit4:junit4]   2> 	at org.apache.lucene.index.DocumentsWriter.updateDocument(DocumentsWriter.java:386)
[junit4:junit4]   2> 	at org.apache.lucene.index.IndexWriter.updateDocument(IndexWriter.java:1428)
[junit4:junit4]   2> 	at org.apache.lucene.index.IndexWriter.updateDocument(IndexWriter.java:1400)
[junit4:junit4]   2> 	at org.apache.lucene.index.TestStressIndexing2$IndexingThread.indexDoc(TestStressIndexing2.java:840)
[junit4:junit4]   2> 	at org.apache.lucene.index.TestStressIndexing2$IndexingThread.run(TestStressIndexing2.java:874)
[junit4:junit4]   2> 13.08.2012 22:57:17 com.carrotsearch.randomizedtesting.RandomizedRunner$QueueUncaughtExceptionsHandler uncaughtException
[junit4:junit4]   2> WARNING: Uncaught exception in thread: Thread[Thread-433,5,TGRP-TestStressIndexing2]
[junit4:junit4]   2> Throwable occurred: junit.framework.AssertionFailedError: java.lang.AssertionError
[junit4:junit4]   2> 	at __randomizedtesting.SeedInfo.seed([9FD532EAE266FE0]:0)
[junit4:junit4]   2> 	at junit.framework.Assert.fail(Assert.java:50)
[junit4:junit4]   2> 	at org.apache.lucene.index.TestStressIndexing2$IndexingThread.run(TestStressIndexing2.java:879)
[junit4:junit4]   2> 13.08.2012 22:57:17 com.carrotsearch.randomizedtesting.RandomizedRunner$QueueUncaughtExceptionsHandler uncaughtException
[junit4:junit4]   2> WARNING: Uncaught exception in thread: Thread[Thread-432,5,TGRP-TestStressIndexing2]
[junit4:junit4]   2> Throwable occurred: junit.framework.AssertionFailedError: java.lang.AssertionError
[junit4:junit4]   2> 	at __randomizedtesting.SeedInfo.seed([9FD532EAE266FE0]:0)
[junit4:junit4]   2> 	at junit.framework.Assert.fail(Assert.java:50)
[junit4:junit4]   2> 	at org.apache.lucene.index.TestStressIndexing2$IndexingThread.run(TestStressIndexing2.java:879)
[junit4:junit4]   2> java.lang.AssertionError
[junit4:junit4]   2> 	at org.apache.lucene.util.packed.GrowableWriter.ensureCapacity(GrowableWriter.java:70)
[junit4:junit4]   2> 	at org.apache.lucene.util.packed.GrowableWriter.set(GrowableWriter.java:83)
[junit4:junit4]   2> 	at org.apache.lucene.util.fst.FST.pack(FST.java:1505)
[junit4:junit4]   2> 	at org.apache.lucene.codecs.memory.MemoryPostingsFormat$TermsWriter.finish(MemoryPostingsFormat.java:273)
[junit4:junit4]   2> 	at org.apache.lucene.index.FreqProxTermsWriterPerField.flush(FreqProxTermsWriterPerField.java:550)
[junit4:junit4]   2> 	at org.apache.lucene.index.FreqProxTermsWriter.flush(FreqProxTermsWriter.java:85)
[junit4:junit4]   2> 	at org.apache.lucene.index.TermsHash.flush(TermsHash.java:117)
[junit4:junit4]   2> 	at org.apache.lucene.index.DocInverter.flush(DocInverter.java:53)
[junit4:junit4]   2> 	at org.apache.lucene.index.DocFieldProcessor.flush(DocFieldProcessor.java:82)
[junit4:junit4]   2> 	at org.apache.lucene.index.DocumentsWriterPerThread.flush(DocumentsWriterPerThread.java:481)
[junit4:junit4]   2> 	at org.apache.lucene.index.DocumentsWriter.doFlush(DocumentsWriter.java:419)
[junit4:junit4]   2> 	at org.apache.lucene.index.DocumentsWriter.postUpdate(DocumentsWriter.java:313)
[junit4:junit4]   2> 	at org.apache.lucene.index.DocumentsWriter.updateDocument(DocumentsWriter.java:386)
[junit4:junit4]   2> 	at org.apache.lucene.index.IndexWriter.updateDocument(IndexWriter.java:1428)
[junit4:junit4]   2> 	at org.apache.lucene.index.IndexWriter.updateDocument(IndexWriter.java:1400)
[junit4:junit4]   2> 	at org.apache.lucene.index.TestStressIndexing2$IndexingThread.indexDoc(TestStressIndexing2.java:840)
[junit4:junit4]   2> 	at org.apache.lucene.index.TestStressIndexing2$IndexingThread.run(TestStressIndexing2.java:874)
[junit4:junit4]   2> 13.08.2012 22:57:17 com.carrotsearch.randomizedtesting.RandomizedRunner$QueueUncaughtExceptionsHandler uncaughtException
[junit4:junit4]   2> WARNING: Uncaught exception in thread: Thread[Thread-441,5,TGRP-TestStressIndexing2]
[junit4:junit4]   2> Throwable occurred: junit.framework.AssertionFailedError: java.lang.AssertionError
[junit4:junit4]   2> 	at __randomizedtesting.SeedInfo.seed([9FD532EAE266FE0]:0)
[junit4:junit4]   2> 	at junit.framework.Assert.fail(Assert.java:50)
[junit4:junit4]   2> 	at org.apache.lucene.index.TestStressIndexing2$IndexingThread.run(TestStressIndexing2.java:879)
[junit4:junit4]   2> java.lang.AssertionError
[junit4:junit4]   2> 	at org.apache.lucene.util.packed.GrowableWriter.ensureCapacity(GrowableWriter.java:70)
[junit4:junit4]   2> 	at org.apache.lucene.util.packed.GrowableWriter.set(GrowableWriter.java:83)
[junit4:junit4]   2> 	at org.apache.lucene.util.fst.FST.pack(FST.java:1505)
[junit4:junit4]   2> 	at org.apache.lucene.codecs.memory.MemoryPostingsFormat$TermsWriter.finish(MemoryPostingsFormat.java:273)
[junit4:junit4]   2> 	at org.apache.lucene.index.FreqProxTermsWriterPerField.flush(FreqProxTermsWriterPerField.java:550)
[junit4:junit4]   2> 	at org.apache.lucene.index.FreqProxTermsWriter.flush(FreqProxTermsWriter.java:85)
[junit4:junit4]   2> 	at org.apache.lucene.index.TermsHash.flush(TermsHash.java:117)
[junit4:junit4]   2> 	at org.apache.lucene.index.DocInverter.flush(DocInverter.java:53)
[junit4:junit4]   2> 	at org.apache.lucene.index.DocFieldProcessor.flush(DocFieldProcessor.java:82)
[junit4:junit4]   2> 	at org.apache.lucene.index.DocumentsWriterPerThread.flush(DocumentsWriterPerThread.java:481)
[junit4:junit4]   2> 	at org.apache.lucene.index.DocumentsWriter.doFlush(DocumentsWriter.java:419)
[junit4:junit4]   2> 	at org.apache.lucene.index.DocumentsWriter.postUpdate(DocumentsWriter.java:313)
[junit4:junit4]   2> 	at org.apache.lucene.index.DocumentsWriter.updateDocument(DocumentsWriter.java:386)
[junit4:junit4]   2> 	at org.apache.lucene.index.IndexWriter.updateDocument(IndexWriter.java:1428)
[junit4:junit4]   2> 	at org.apache.lucene.index.IndexWriter.updateDocument(IndexWriter.java:1400)
[junit4:junit4]   2> 	at org.apache.lucene.index.TestStressIndexing2$IndexingThread.indexDoc(TestStressIndexing2.java:840)
[junit4:junit4]   2> 	at org.apache.lucene.index.TestStressIndexing2$IndexingThread.run(TestStressIndexing2.java:874)
[junit4:junit4]   2> 13.08.2012 22:57:17 com.carrotsearch.randomizedtesting.RandomizedRunner$QueueUncaughtExceptionsHandler uncaughtException
[junit4:junit4]   2> WARNING: Uncaught exception in thread: Thread[Thread-442,5,TGRP-TestStressIndexing2]
[junit4:junit4]   2> Throwable occurred: junit.framework.AssertionFailedError: java.lang.AssertionError
[junit4:junit4]   2> 	at __randomizedtesting.SeedInfo.seed([9FD532EAE266FE0]:0)
[junit4:junit4]   2> 	at junit.framework.Assert.fail(Assert.java:50)
[junit4:junit4]   2> 	at org.apache.lucene.index.TestStressIndexing2$IndexingThread.run(TestStressIndexing2.java:879)
[junit4:junit4]   2> NOTE: reproduce with: ant test  -Dtestcase=TestStressIndexing2 -Dtests.method=testMultiConfig -Dtests.seed=9FD532EAE266FE0 -Dtests.multiplier=3 -Dtests.slow=true -Dtests.locale=ro -Dtests.timezone=Asia/Kathmandu -Dtests.file.encoding=US-ASCII
[junit4:junit4] ERROR   0.16s J1 | TestStressIndexing2.testMultiConfig <<<
[junit4:junit4]    > Throwable #1: java.lang.AssertionError: r1.numDocs()=8 vs r2.numDocs()=10
[junit4:junit4]    > 	at org.apache.lucene.index.TestStressIndexing2.verifyEquals(TestStressIndexing2.java:309)
[junit4:junit4]    > 	at org.apache.lucene.index.TestStressIndexing2.verifyEquals(TestStressIndexing2.java:278)
[junit4:junit4]    > 	at org.apache.lucene.index.TestStressIndexing2.testMultiConfig(TestStressIndexing2.java:127)
[junit4:junit4]    > 	at sun.reflect.NativeMethodAccessorImpl.invoke0(Native Method)
[junit4:junit4]    > 	at sun.reflect.NativeMethodAccessorImpl.invoke(NativeMethodAccessorImpl.java:48)
[junit4:junit4]    > 	at sun.reflect.DelegatingMethodAccessorImpl.invoke(DelegatingMethodAccessorImpl.java:25)
[junit4:junit4]    > 	at java.lang.reflect.Method.invoke(Method.java:600)
[junit4:junit4]    > 	at com.carrotsearch.randomizedtesting.RandomizedRunner.invoke(RandomizedRunner.java:1559)
[junit4:junit4]    > 	at com.carrotsearch.randomizedtesting.RandomizedRunner.access$600(RandomizedRunner.java:79)
[junit4:junit4]    > 	at com.carrotsearch.randomizedtesting.RandomizedRunner$6.evaluate(RandomizedRunner.java:737)
[junit4:junit4]    > 	at com.carrotsearch.randomizedtesting.RandomizedRunner$7.evaluate(RandomizedRunner.java:773)
[junit4:junit4]    > 	at com.carrotsearch.randomizedtesting.RandomizedRunner$8.evaluate(RandomizedRunner.java:787)
[junit4:junit4]    > 	at org.apache.lucene.util.TestRuleSetupTeardownChained$1.evaluate(TestRuleSetupTeardownChained.java:50)
[junit4:junit4]    > 	at org.apache.lucene.util.TestRuleFieldCacheSanity$1.evaluate(TestRuleFieldCacheSanity.java:32)
[junit4:junit4]    > 	at org.apache.lucene.util.AbstractBeforeAfterRule$1.evaluate(AbstractBeforeAfterRule.java:45)
[junit4:junit4]    > 	at com.carrotsearch.randomizedtesting.rules.SystemPropertiesInvariantRule$1.evaluate(SystemPropertiesInvariantRule.java:55)
[junit4:junit4]    > 	at org.apache.lucene.util.TestRuleThreadAndTestName$1.evaluate(TestRuleThreadAndTestName.java:48)
[junit4:junit4]    > 	at org.apache.lucene.util.TestRuleIgnoreAfterMaxFailures$1.evaluate(TestRuleIgnoreAfterMaxFailures.java:70)
[junit4:junit4]    > 	at org.apache.lucene.util.TestRuleMarkFailure$1.evaluate(TestRuleMarkFailure.java:48)
[junit4:junit4]    > 	at com.carrotsearch.randomizedtesting.rules.StatementAdapter.evaluate(StatementAdapter.java:36)
[junit4:junit4]    > 	at com.carrotsearch.randomizedtesting.ThreadLeakControl$StatementRunner.run(ThreadLeakControl.java:345)
[junit4:junit4]    > 	at com.carrotsearch.randomizedtesting.ThreadLeakControl.forkTimeoutingTask(ThreadLeakControl.java:769)
[junit4:junit4]    > 	at com.carrotsearch.randomizedtesting.ThreadLeakControl$3.evaluate(ThreadLeakControl.java:429)
[junit4:junit4]    > 	at com.carrotsearch.randomizedtesting.RandomizedRunner.runSingleTest(RandomizedRunner.java:746)
[junit4:junit4]    > 	at com.carrotsearch.randomizedtesting.RandomizedRunner$3.evaluate(RandomizedRunner.java:648)
[junit4:junit4]    > 	at com.carrotsearch.randomizedtesting.RandomizedRunner$4.evaluate(RandomizedRunner.java:682)
[junit4:junit4]    > 	at com.carrotsearch.randomizedtesting.RandomizedRunner$5.evaluate(RandomizedRunner.java:693)
[junit4:junit4]    > 	at org.apache.lucene.util.AbstractBeforeAfterRule$1.evaluate(AbstractBeforeAfterRule.java:45)
[junit4:junit4]    > 	at org.apache.lucene.util.TestRuleStoreClassName$1.evaluate(TestRuleStoreClassName.java:38)
[junit4:junit4]    > 	at com.carrotsearch.randomizedtesting.rules.SystemPropertiesInvariantRule$1.evaluate(SystemPropertiesInvariantRule.java:55)
[junit4:junit4]    > 	at com.carrotsearch.randomizedtesting.rules.NoShadowingOrOverridesOnMethodsRule$1.evaluate(NoShadowingOrOverridesOnMethodsRule.java:39)
[junit4:junit4]    > 	at com.carrotsearch.randomizedtesting.rules.NoShadowingOrOverridesOnMethodsRule$1.evaluate(NoShadowingOrOverridesOnMethodsRule.java:39)
[junit4:junit4]    > 	at org.apache.lucene.util.TestRuleAssertionsRequired$1.evaluate(TestRuleAssertionsRequired.java:40)
[junit4:junit4]    > 	at org.apache.lucene.util.TestRuleMarkFailure$1.evaluate(TestRuleMarkFailure.java:48)
[junit4:junit4]    > 	at org.apache.lucene.util.TestRuleIgnoreAfterMaxFailures$1.evaluate(TestRuleIgnoreAfterMaxFailures.java:70)
[junit4:junit4]    > 	at org.apache.lucene.util.TestRuleIgnoreTestSuites$1.evaluate(TestRuleIgnoreTestSuites.java:55)
[junit4:junit4]    > 	at com.carrotsearch.randomizedtesting.rules.StatementAdapter.evaluate(StatementAdapter.java:36)
[junit4:junit4]    > 	at com.carrotsearch.randomizedtesting.ThreadLeakControl$StatementRunner.run(ThreadLeakControl.java:345)
[junit4:junit4]    > 	at java.lang.Thread.run(Thread.java:736)
[junit4:junit4]    > Throwable #2: com.carrotsearch.randomizedtesting.UncaughtExceptionError: Captured an uncaught exception in thread: Thread[id=731, name=Thread-433, state=RUNNABLE, group=TGRP-TestStressIndexing2]
[junit4:junit4]    > Caused by: junit.framework.AssertionFailedError: java.lang.AssertionError
[junit4:junit4]    > 	at __randomizedtesting.SeedInfo.seed([9FD532EAE266FE0]:0)
[junit4:junit4]    > 	at junit.framework.Assert.fail(Assert.java:50)
[junit4:junit4]    > 	at org.apache.lucene.index.TestStressIndexing2$IndexingThread.run(TestStressIndexing2.java:879)
[junit4:junit4]    > Throwable #3: com.carrotsearch.randomizedtesting.UncaughtExceptionError: Captured an uncaught exception in thread: Thread[id=730, name=Thread-432, state=RUNNABLE, group=TGRP-TestStressIndexing2]
[junit4:junit4]    > Caused by: junit.framework.AssertionFailedError: java.lang.AssertionError
[junit4:junit4]    > 	at __randomizedtesting.SeedInfo.seed([9FD532EAE266FE0]:0)
[junit4:junit4]    > 	at junit.framework.Assert.fail(Assert.java:50)
[junit4:junit4]    > 	at org.apache.lucene.index.TestStressIndexing2$IndexingThread.run(TestStressIndexing2.java:879)
[junit4:junit4]    > Throwable #4: com.carrotsearch.randomizedtesting.UncaughtExceptionError: Captured an uncaught exception in thread: Thread[id=739, name=Thread-441, state=RUNNABLE, group=TGRP-TestStressIndexing2]
[junit4:junit4]    > Caused by: junit.framework.AssertionFailedError: java.lang.AssertionError
[junit4:junit4]    > 	at __randomizedtesting.SeedInfo.seed([9FD532EAE266FE0]:0)
[junit4:junit4]    > 	at junit.framework.Assert.fail(Assert.java:50)
[junit4:junit4]    > 	at org.apache.lucene.index.TestStressIndexing2$IndexingThread.run(TestStressIndexing2.java:879)
[junit4:junit4]    > Throwable #5: com.carrotsearch.randomizedtesting.UncaughtExceptionError: Captured an uncaught exception in thread: Thread[id=740, name=Thread-442, state=RUNNABLE, group=TGRP-TestStressIndexing2]
[junit4:junit4]    > Caused by: junit.framework.AssertionFailedError: java.lang.AssertionError
[junit4:junit4]    > 	at __randomizedtesting.SeedInfo.seed([9FD532EAE266FE0]:0)
[junit4:junit4]    > 	at junit.framework.Assert.fail(Assert.java:50)
[junit4:junit4]    > 	at org.apache.lucene.index.TestStressIndexing2$IndexingThread.run(TestStressIndexing2.java:879)
[junit4:junit4]   2> java.lang.AssertionError
[junit4:junit4]   2> 	at org.apache.lucene.util.packed.GrowableWriter.ensureCapacity(GrowableWriter.java:70)
[junit4:junit4]   2> 	at org.apache.lucene.util.packed.GrowableWriter.set(GrowableWriter.java:83)
[junit4:junit4]   2> 	at org.apache.lucene.util.fst.FST.pack(FST.java:1505)
[junit4:junit4]   2> 	at org.apache.lucene.codecs.memory.MemoryPostingsFormat$TermsWriter.finish(MemoryPostingsFormat.java:273)
[junit4:junit4]   2> 	at org.apache.lucene.index.FreqProxTermsWriterPerField.flush(FreqProxTermsWriterPerField.java:550)
[junit4:junit4]   2> 	at org.apache.lucene.index.FreqProxTermsWriter.flush(FreqProxTermsWriter.java:85)
[junit4:junit4]   2> 	at org.apache.lucene.index.TermsHash.flush(TermsHash.java:117)
[junit4:junit4]   2> 	at org.apache.lucene.index.DocInverter.flush(DocInverter.java:53)
[junit4:junit4]   2> 	at org.apache.lucene.index.DocFieldProcessor.flush(DocFieldProcessor.java:82)
[junit4:junit4]   2> 	at org.apache.lucene.index.DocumentsWriterPerThread.flush(DocumentsWriterPerThread.java:481)
[junit4:junit4]   2> 	at org.apache.lucene.index.DocumentsWriter.doFlush(DocumentsWriter.java:419)
[junit4:junit4]   2> 	at org.apache.lucene.index.DocumentsWriter.postUpdate(DocumentsWriter.java:313)
[junit4:junit4]   2> 	at org.apache.lucene.index.DocumentsWriter.updateDocument(DocumentsWriter.java:386)
[junit4:junit4]   2> 	at org.apache.lucene.index.IndexWriter.updateDocument(IndexWriter.java:1428)
[junit4:junit4]   2> 	at org.apache.lucene.index.IndexWriter.updateDocument(IndexWriter.java:1400)
[junit4:junit4]   2> 	at org.apache.lucene.index.TestStressIndexing2$IndexingThread.indexDoc(TestStressIndexing2.java:840)
[junit4:junit4]   2> 	at org.apache.lucene.index.TestStressIndexing2$IndexingThread.run(TestStressIndexing2.java:874)
[junit4:junit4]   2> 13.08.2012 22:57:17 com.carrotsearch.randomizedtesting.RandomizedRunner$QueueUncaughtExceptionsHandler uncaughtException
[junit4:junit4]   2> WARNING: Uncaught exception in thread: Thread[Thread-456,5,TGRP-TestStressIndexing2]
[junit4:junit4]   2> Throwable occurred: junit.framework.AssertionFailedError: java.lang.AssertionError
[junit4:junit4]   2> 	at __randomizedtesting.SeedInfo.seed([9FD532EAE266FE0]:0)
[junit4:junit4]   2> 	at junit.framework.Assert.fail(Assert.java:50)
[junit4:junit4]   2> 	at org.apache.lucene.index.TestStressIndexing2$IndexingThread.run(TestStressIndexing2.java:879)
[junit4:junit4]   2> java.lang.AssertionError
[junit4:junit4]   2> 	at org.apache.lucene.util.packed.GrowableWriter.ensureCapacity(GrowableWriter.java:70)
[junit4:junit4]   2> 	at org.apache.lucene.util.packed.GrowableWriter.set(GrowableWriter.java:83)
[junit4:junit4]   2> 	at org.apache.lucene.util.fst.FST.pack(FST.java:1505)
[junit4:junit4]   2> 	at org.apache.lucene.codecs.memory.MemoryPostingsFormat$TermsWriter.finish(MemoryPostingsFormat.java:273)
[junit4:junit4]   2> 	at org.apache.lucene.index.FreqProxTermsWriterPerField.flush(FreqProxTermsWriterPerField.java:550)
[junit4:junit4]   2> 	at org.apache.lucene.index.FreqProxTermsWriter.flush(FreqProxTermsWriter.java:85)
[junit4:junit4]   2> 	at org.apache.lucene.index.TermsHash.flush(TermsHash.java:117)
[junit4:junit4]   2> 	at org.apache.lucene.index.DocInverter.flush(DocInverter.java:53)
[junit4:junit4]   2> 	at org.apache.lucene.index.DocFieldProcessor.flush(DocFieldProcessor.java:82)
[junit4:junit4]   2> 	at org.apache.lucene.index.DocumentsWriterPerThread.flush(DocumentsWriterPerThread.java:481)
[junit4:junit4]   2> 	at org.apache.lucene.index.DocumentsWriter.doFlush(DocumentsWriter.java:419)
[junit4:junit4]   2> 	at org.apache.lucene.index.DocumentsWriter.postUpdate(DocumentsWriter.java:313)
[junit4:junit4]   2> 	at org.apache.lucene.index.DocumentsWriter.updateDocument(DocumentsWriter.java:386)
[junit4:junit4]   2> 	at org.apache.lucene.index.IndexWriter.updateDocument(IndexWriter.java:1428)
[junit4:junit4]   2> 	at org.apache.lucene.index.IndexWriter.updateDocument(IndexWriter.java:1400)
[junit4:junit4]   2> 	at org.apache.lucene.index.TestStressIndexing2$IndexingThread.indexDoc(TestStressIndexing2.java:840)
[junit4:junit4]   2> 	at org.apache.lucene.index.TestStressIndexing2$IndexingThread.run(TestStressIndexing2.java:874)
[junit4:junit4]   2> 13.08.2012 22:57:17 com.carrotsearch.randomizedtesting.RandomizedRunner$QueueUncaughtExceptionsHandler uncaughtException
[junit4:junit4]   2> WARNING: Uncaught exception in thread: Thread[Thread-454,5,TGRP-TestStressIndexing2]
[junit4:junit4]   2> Throwable occurred: junit.framework.AssertionFailedError: java.lang.AssertionError
[junit4:junit4]   2> 	at __randomizedtesting.SeedInfo.seed([9FD532EAE266FE0]:0)
[junit4:junit4]   2> 	at junit.framework.Assert.fail(Assert.java:50)
[junit4:junit4]   2> 	at org.apache.lucene.index.TestStressIndexing2$IndexingThread.run(TestStressIndexing2.java:879)
[junit4:junit4]   2> NOTE: reproduce with: ant test  -Dtestcase=TestStressIndexing2 -Dtests.method=testRandomIWReader -Dtests.seed=9FD532EAE266FE0 -Dtests.multiplier=3 -Dtests.slow=true -Dtests.locale=ro -Dtests.timezone=Asia/Kathmandu -Dtests.file.encoding=US-ASCII
[junit4:junit4] ERROR   0.04s J1 | TestStressIndexing2.testRandomIWReader <<<
[junit4:junit4]    > Throwable #1: com.carrotsearch.randomizedtesting.UncaughtExceptionError: Captured an uncaught exception in thread: Thread[id=754, name=Thread-456, state=RUNNABLE, group=TGRP-TestStressIndexing2]
[junit4:junit4]    > Caused by: junit.framework.AssertionFailedError: java.lang.AssertionError
[junit4:junit4]    > 	at __randomizedtesting.SeedInfo.seed([9FD532EAE266FE0]:0)
[junit4:junit4]    > 	at junit.framework.Assert.fail(Assert.java:50)
[junit4:junit4]    > 	at org.apache.lucene.index.TestStressIndexing2$IndexingThread.run(TestStressIndexing2.java:879)
[junit4:junit4]    > Throwable #2: com.carrotsearch.randomizedtesting.UncaughtExceptionError: Captured an uncaught exception in thread: Thread[id=752, name=Thread-454, state=RUNNABLE, group=TGRP-TestStressIndexing2]
[junit4:junit4]    > Caused by: junit.framework.AssertionFailedError: java.lang.AssertionError
[junit4:junit4]    > 	at __randomizedtesting.SeedInfo.seed([9FD532EAE266FE0]:0)
[junit4:junit4]    > 	at junit.framework.Assert.fail(Assert.java:50)
[junit4:junit4]    > 	at org.apache.lucene.index.TestStressIndexing2$IndexingThread.run(TestStressIndexing2.java:879)
[junit4:junit4]   2> java.lang.AssertionError
[junit4:junit4]   2> 	at org.apache.lucene.util.packed.GrowableWriter.ensureCapacity(GrowableWriter.java:70)
[junit4:junit4]   2> 	at org.apache.lucene.util.packed.GrowableWriter.set(GrowableWriter.java:83)
[junit4:junit4]   2> 	at org.apache.lucene.util.fst.FST.pack(FST.java:1505)
[junit4:junit4]   2> 	at org.apache.lucene.codecs.memory.MemoryPostingsFormat$TermsWriter.finish(MemoryPostingsFormat.java:273)
[junit4:junit4]   2> 	at org.apache.lucene.index.FreqProxTermsWriterPerField.flush(FreqProxTermsWriterPerField.java:550)
[junit4:junit4]   2> 	at org.apache.lucene.index.FreqProxTermsWriter.flush(FreqProxTermsWriter.java:85)
[junit4:junit4]   2> 	at org.apache.lucene.index.TermsHash.flush(TermsHash.java:117)
[junit4:junit4]   2> 	at org.apache.lucene.index.DocInverter.flush(DocInverter.java:53)
[junit4:junit4]   2> 	at org.apache.lucene.index.DocFieldProcessor.flush(DocFieldProcessor.java:82)
[junit4:junit4]   2> 	at org.apache.lucene.index.DocumentsWriterPerThread.flush(DocumentsWriterPerThread.java:481)
[junit4:junit4]   2> 	at org.apache.lucene.index.DocumentsWriter.doFlush(DocumentsWriter.java:419)
[junit4:junit4]   2> 	at org.apache.lucene.index.DocumentsWriter.postUpdate(DocumentsWriter.java:313)
[junit4:junit4]   2> 	at org.apache.lucene.index.DocumentsWriter.updateDocument(DocumentsWriter.java:386)
[junit4:junit4]   2> 	at org.apache.lucene.index.IndexWriter.updateDocument(IndexWriter.java:1428)
[junit4:junit4]   2> 	at org.apache.lucene.index.IndexWriter.updateDocument(IndexWriter.java:1400)
[junit4:junit4]   2> 	at org.apache.lucene.index.TestStressIndexing2$IndexingThread.indexDoc(TestStressIndexing2.java:840)
[junit4:junit4]   2> 	at org.apache.lucene.index.TestStressIndexing2$IndexingThread.run(TestStressIndexing2.java:874)
[junit4:junit4]   2> 13.08.2012 22:57:17 com.carrotsearch.randomizedtesting.RandomizedRunner$QueueUncaughtExceptionsHandler uncaughtException
[junit4:junit4]   2> WARNING: Uncaught exception in thread: Thread[Thread-465,5,TGRP-TestStressIndexing2]
[junit4:junit4]   2> Throwable occurred: junit.framework.AssertionFailedError: java.lang.AssertionError
[junit4:junit4]   2> 	at __randomizedtesting.SeedInfo.seed([9FD532EAE266FE0]:0)
[junit4:junit4]   2> 	at junit.framework.Assert.fail(Assert.java:50)
[junit4:junit4]   2> 	at org.apache.lucene.index.TestStressIndexing2$IndexingThread.run(TestStressIndexing2.java:879)
[junit4:junit4]   2> java.lang.AssertionError
[junit4:junit4]   2> 	at org.apache.lucene.util.packed.GrowableWriter.ensureCapacity(GrowableWriter.java:70)
[junit4:junit4]   2> 	at org.apache.lucene.util.packed.GrowableWriter.set(GrowableWriter.java:83)
[junit4:junit4]   2> 	at org.apache.lucene.util.fst.FST.pack(FST.java:1505)
[junit4:junit4]   2> 	at org.apache.lucene.codecs.memory.MemoryPostingsFormat$TermsWriter.finish(MemoryPostingsFormat.java:273)
[junit4:junit4]   2> 	at org.apache.lucene.index.FreqProxTermsWriterPerField.flush(FreqProxTermsWriterPerField.java:550)
[junit4:junit4]   2> 	at org.apache.lucene.index.FreqProxTermsWriter.flush(FreqProxTermsWriter.java:85)
[junit4:junit4]   2> 	at org.apache.lucene.index.TermsHash.flush(TermsHash.java:117)
[junit4:junit4]   2> 	at org.apache.lucene.index.DocInverter.flush(DocInverter.java:53)
[junit4:junit4]   2> 	at org.apache.lucene.index.DocFieldProcessor.flush(DocFieldProcessor.java:82)
[junit4:junit4]   2> 	at org.apache.lucene.index.DocumentsWriterPerThread.flush(DocumentsWriterPerThread.java:481)
[junit4:junit4]   2> 	at org.apache.lucene.index.DocumentsWriter.doFlush(DocumentsWriter.java:419)
[junit4:junit4]   2> 	at org.apache.lucene.index.DocumentsWriter.postUpdate(DocumentsWriter.java:313)
[junit4:junit4]   2> 	at org.apache.lucene.index.DocumentsWriter.updateDocument(DocumentsWriter.java:386)
[junit4:junit4]   2> 	at org.apache.lucene.index.IndexWriter.updateDocument(IndexWriter.java:1428)
[junit4:junit4]   2> 	at org.apache.lucene.index.IndexWriter.updateDocument(IndexWriter.java:1400)
[junit4:junit4]   2> 	at org.apache.lucene.index.TestStressIndexing2$IndexingThread.indexDoc(TestStressIndexing2.java:840)
[junit4:junit4]   2> 	at org.apache.lucene.index.TestStressIndexing2$IndexingThread.run(TestStressIndexing2.java:874)
[junit4:junit4]   2> 13.08.2012 22:57:17 com.carrotsearch.randomizedtesting.RandomizedRunner$QueueUncaughtExceptionsHandler uncaughtException
[junit4:junit4]   2> WARNING: Uncaught exception in thread: Thread[Thread-463,5,TGRP-TestStressIndexing2]
[junit4:junit4]   2> Throwable occurred: junit.framework.AssertionFailedError: java.lang.AssertionError
[junit4:junit4]   2> 	at __randomizedtesting.SeedInfo.seed([9FD532EAE266FE0]:0)
[junit4:junit4]   2> 	at junit.framework.Assert.fail(Assert.java:50)
[junit4:junit4]   2> 	at org.apache.lucene.index.TestStressIndexing2$IndexingThread.run(TestStressIndexing2.java:879)
[junit4:junit4]   2> NOTE: reproduce with: ant test  -Dtestcase=TestStressIndexing2 -Dtests.method=testRandom -Dtests.seed=9FD532EAE266FE0 -Dtests.multiplier=3 -Dtests.slow=true -Dtests.locale=ro -Dtests.timezone=Asia/Kathmandu -Dtests.file.encoding=US-ASCII
[junit4:junit4] ERROR   0.03s J1 | TestStressIndexing2.testRandom <<<
[junit4:junit4]    > Throwable #1: java.lang.AssertionError: r1.numDocs()=10 vs r2.numDocs()=11
[junit4:junit4]    > 	at org.apache.lucene.index.TestStressIndexing2.verifyEquals(TestStressIndexing2.java:309)
[junit4:junit4]    > 	at org.apache.lucene.index.TestStressIndexing2.verifyEquals(TestStressIndexing2.java:278)
[junit4:junit4]    > 	at org.apache.lucene.index.TestStressIndexing2.testRandom(TestStressIndexing2.java:91)
[junit4:junit4]    > 	at sun.reflect.NativeMethodAccessorImpl.invoke0(Native Method)
[junit4:junit4]    > 	at sun.reflect.NativeMethodAccessorImpl.invoke(NativeMethodAccessorImpl.java:48)
[junit4:junit4]    > 	at sun.reflect.DelegatingMethodAccessorImpl.invoke(DelegatingMethodAccessorImpl.java:25)
[junit4:junit4]    > 	at java.lang.reflect.Method.invoke(Method.java:600)
[junit4:junit4]    > 	at com.carrotsearch.randomizedtesting.RandomizedRunner.invoke(RandomizedRunner.java:1559)
[junit4:junit4]    > 	at com.carrotsearch.randomizedtesting.RandomizedRunner.access$600(RandomizedRunner.java:79)
[junit4:junit4]    > 	at com.carrotsearch.randomizedtesting.RandomizedRunner$6.evaluate(RandomizedRunner.java:737)
[junit4:junit4]    > 	at com.carrotsearch.randomizedtesting.RandomizedRunner$7.evaluate(RandomizedRunner.java:773)
[junit4:junit4]    > 	at com.carrotsearch.randomizedtesting.RandomizedRunner$8.evaluate(RandomizedRunner.java:787)
[junit4:junit4]    > 	at org.apache.lucene.util.TestRuleSetupTeardownChained$1.evaluate(TestRuleSetupTeardownChained.java:50)
[junit4:junit4]    > 	at org.apache.lucene.util.TestRuleFieldCacheSanity$1.evaluate(TestRuleFieldCacheSanity.java:32)
[junit4:junit4]    > 	at org.apache.lucene.util.AbstractBeforeAfterRule$1.evaluate(AbstractBeforeAfterRule.java:45)
[junit4:junit4]    > 	at com.carrotsearch.randomizedtesting.rules.SystemPropertiesInvariantRule$1.evaluate(SystemPropertiesInvariantRule.java:55)
[junit4:junit4]    > 	at org.apache.lucene.util.TestRuleThreadAndTestName$1.evaluate(TestRuleThreadAndTestName.java:48)
[junit4:junit4]    > 	at org.apache.lucene.util.TestRuleIgnoreAfterMaxFailures$1.evaluate(TestRuleIgnoreAfterMaxFailures.java:70)
[junit4:junit4]    > 	at org.apache.lucene.util.TestRuleMarkFailure$1.evaluate(TestRuleMarkFailure.java:48)
[junit4:junit4]    > 	at com.carrotsearch.randomizedtesting.rules.StatementAdapter.evaluate(StatementAdapter.java:36)
[junit4:junit4]    > 	at com.carrotsearch.randomizedtesting.ThreadLeakControl$StatementRunner.run(ThreadLeakControl.java:345)
[junit4:junit4]    > 	at com.carrotsearch.randomizedtesting.ThreadLeakControl.forkTimeoutingTask(ThreadLeakControl.java:769)
[junit4:junit4]    > 	at com.carrotsearch.randomizedtesting.ThreadLeakControl$3.evaluate(ThreadLeakControl.java:429)
[junit4:junit4]    > 	at com.carrotsearch.randomizedtesting.RandomizedRunner.runSingleTest(RandomizedRunner.java:746)
[junit4:junit4]    > 	at com.carrotsearch.randomizedtesting.RandomizedRunner$3.evaluate(RandomizedRunner.java:648)
[junit4:junit4]    > 	at com.carrotsearch.randomizedtesting.RandomizedRunner$4.evaluate(RandomizedRunner.java:682)
[junit4:junit4]    > 	at com.carrotsearch.randomizedtesting.RandomizedRunner$5.evaluate(RandomizedRunner.java:693)
[junit4:junit4]    > 	at org.apache.lucene.util.AbstractBeforeAfterRule$1.evaluate(AbstractBeforeAfterRule.java:45)
[junit4:junit4]    > 	at org.apache.lucene.util.TestRuleStoreClassName$1.evaluate(TestRuleStoreClassName.java:38)
[junit4:junit4]    > 	at com.carrotsearch.randomizedtesting.rules.SystemPropertiesInvariantRule$1.evaluate(SystemPropertiesInvariantRule.java:55)
[junit4:junit4]    > 	at com.carrotsearch.randomizedtesting.rules.NoShadowingOrOverridesOnMethodsRule$1.evaluate(NoShadowingOrOverridesOnMethodsRule.java:39)
[junit4:junit4]    > 	at com.carrotsearch.randomizedtesting.rules.NoShadowingOrOverridesOnMethodsRule$1.evaluate(NoShadowingOrOverridesOnMethodsRule.java:39)
[junit4:junit4]    > 	at org.apache.lucene.util.TestRuleAssertionsRequired$1.evaluate(TestRuleAssertionsRequired.java:40)
[junit4:junit4]    > 	at org.apache.lucene.util.TestRuleMarkFailure$1.evaluate(TestRuleMarkFailure.java:48)
[junit4:junit4]    > 	at org.apache.lucene.util.TestRuleIgnoreAfterMaxFailures$1.evaluate(TestRuleIgnoreAfterMaxFailures.java:70)
[junit4:junit4]    > 	at org.apache.lucene.util.TestRuleIgnoreTestSuites$1.evaluate(TestRuleIgnoreTestSuites.java:55)
[junit4:junit4]    > 	at com.carrotsearch.randomizedtesting.rules.StatementAdapter.evaluate(StatementAdapter.java:36)
[junit4:junit4]    > 	at com.carrotsearch.randomizedtesting.ThreadLeakControl$StatementRunner.run(ThreadLeakControl.java:345)
[junit4:junit4]    > 	at java.lang.Thread.run(Thread.java:736)
[junit4:junit4]    > Throwable #2: com.carrotsearch.randomizedtesting.UncaughtExceptionError: Captured an uncaught exception in thread: Thread[id=763, name=Thread-465, state=RUNNABLE, group=TGRP-TestStressIndexing2]
[junit4:junit4]    > Caused by: junit.framework.AssertionFailedError: java.lang.AssertionError
[junit4:junit4]    > 	at __randomizedtesting.SeedInfo.seed([9FD532EAE266FE0]:0)
[junit4:junit4]    > 	at junit.framework.Assert.fail(Assert.java:50)
[junit4:junit4]    > 	at org.apache.lucene.index.TestStressIndexing2$IndexingThread.run(TestStressIndexing2.java:879)
[junit4:junit4]    > Throwable #3: com.carrotsearch.randomizedtesting.UncaughtExceptionError: Captured an uncaught exception in thread: Thread[id=761, name=Thread-463, state=RUNNABLE, group=TGRP-TestStressIndexing2]
[junit4:junit4]    > Caused by: junit.framework.AssertionFailedError: java.lang.AssertionError
[junit4:junit4]    > 	at __randomizedtesting.SeedInfo.seed([9FD532EAE266FE0]:0)
[junit4:junit4]    > 	at junit.framework.Assert.fail(Assert.java:50)
[junit4:junit4]    > 	at org.apache.lucene.index.TestStressIndexing2$IndexingThread.run(TestStressIndexing2.java:879)
[junit4:junit4]   2> NOTE: test params are: codec=Lucene40: {f95=PostingsFormat(name=TestBloomFilteredLucene40Postings), f52=PostingsFormat(name=Memory doPackFST= true), f97=PostingsFormat(name=Direct), f53=PostingsFormat(name=Direct), f11=PostingsFormat(name=TestBloomFilteredLucene40Postings), f99=PostingsFormat(name=TestBloomFilteredLucene40Postings), f12=PostingsFormat(name=Memory doPackFST= true), f56=PostingsFormat(name=Memory doPackFST= true), f13=PostingsFormat(name=Direct), f57=PostingsFormat(name=Direct), f58=PostingsFormat(name=MockSep), f14=PostingsFormat(name=MockSep), f16=PostingsFormat(name=Memory doPackFST= true), f17=PostingsFormat(name=Direct), f3=PostingsFormat(name=MockSep), f19=PostingsFormat(name=TestBloomFilteredLucene40Postings), f5=PostingsFormat(name=Memory doPackFST= true), f8=PostingsFormat(name=TestBloomFilteredLucene40Postings), id=PostingsFormat(name=Memory doPackFST= true), f61=PostingsFormat(name=MockSep), f62=PostingsFormat(name=TestBloomFilteredLucene40Postings), f65=PostingsFormat(name=MockSep), f22=PostingsFormat(name=TestBloomFilteredLucene40Postings), f24=PostingsFormat(name=Direct), f68=PostingsFormat(name=Direct), f25=PostingsFormat(name=MockSep), f26=PostingsFormat(name=TestBloomFilteredLucene40Postings), f27=PostingsFormat(name=Memory doPackFST= true), f28=PostingsFormat(name=Direct), f72=PostingsFormat(name=MockSep), f75=PostingsFormat(name=Direct), f32=PostingsFormat(name=MockSep), f34=PostingsFormat(name=Memory doPackFST= true), f78=PostingsFormat(name=Memory doPackFST= true), f79=PostingsFormat(name=Direct), f35=PostingsFormat(name=Direct), f80=PostingsFormat(name=TestBloomFilteredLucene40Postings), f82=PostingsFormat(name=Direct), f84=PostingsFormat(name=TestBloomFilteredLucene40Postings), f41=PostingsFormat(name=Memory doPackFST= true), f85=PostingsFormat(name=Memory doPackFST= true), f42=PostingsFormat(name=Direct), f43=PostingsFormat(name=MockSep), f44=PostingsFormat(name=TestBloomFilteredLucene40Postings), f45=PostingsFormat(name=Memory doPackFST= true), f46=PostingsFormat(name=Direct), f47=PostingsFormat(name=MockSep), f48=PostingsFormat(name=TestBloomFilteredLucene40Postings), f49=PostingsFormat(name=Memory doPackFST= true), f90=PostingsFormat(name=MockSep), f92=PostingsFormat(name=Memory doPackFST= true)}, sim=DefaultSimilarity, locale=ro, timezone=Asia/Kathmandu
[junit4:junit4]   2> NOTE: Linux 3.2.0-29-generic x86/IBM Corporation 1.6.0 (32-bit)/cpus=8,threads=1,free=87646488,total=111059456
[junit4:junit4]   2> NOTE: All tests run in this JVM: [TestSpanMultiTermQueryWrapper, TestSimilarityBase, TestPayloadExplanations, TestNewestSegment, TestPerSegmentDeletes, TestBinaryDocument, TestDocCount, TestFSTs, TestConcurrentMergeScheduler, TestNorms, TestMergeSchedulerExternal, TestLongPostings, TestRamUsageEstimatorOnWildAnimals, TestTermRangeFilter, TestRAMDirectory, TestBytesRefHash, TestComplexExplanationsOfNonMatches, TestCodecs, TestFieldsReader, TestMatchAllDocsQuery, TestLock, TestSentinelIntSet, TestPostingsOffsets, TestDateTools, TestTypePromotion, TestIndexWriterOnDiskFull, TestDocTermOrds, TestLookaheadTokenFilter, TestSegmentTermDocs, TestDoc, TestFieldValueFilter, TestAutomatonQuery, TestMultiThreadTermVectors, TestTermVectorsWriter, TestTermsEnum, TestNamedSPILoader, TestRecyclingByteBlockAllocator, TestParallelTermEnum, TestTopScoreDocCollector, TestNumericTokenStream, TestTopDocsMerge, TestAttributeSource, TestDocValuesScoring, TestDateFilter, TestConjunctions, TestIndexInput, Nested1, TestStressIndexing, TestUnicodeUtil, TestOmitPositions, TestLucene40PostingsReader, Test2BPostings, TestIsCurrent, TestNeverDelete, Test10KPulsings, TestCloseableThreadLocal, TestStressNRT, TestStressAdvance, TestBooleanQuery, TestDirectory, TestDocument, TestDirectoryReader, TestAutomatonQueryUnicode, TestBooleanOr, TestPackedInts, TestLockFactory, TestIOUtils, TestRollingBuffer, TestIntBlockCodec, TestUniqueTermCount, TestMultiValuedNumericRangeQuery, TestNumericRangeQuery64, TestConsistentFieldNumbers, TestToken, TestSameTokenSamePosition, TestCharFilter, TestRegexpRandom2, TestSearcherManager, TestNRTThreads, TestAddIndexes, TestIndexWriterMerging, TestMultiMMap, TestSearchAfter, TestIndexWriterDelete, TestDirectoryReaderReopen, TestBufferedIndexInput, TestNRTCachingDirectory, TestCollectionUtil, TestSimpleExplanations, TestCustomNorms, TestDeterminizeLexicon, TestIndexWriterNRTIsCurrent, TestNRTReaderWithThreads, TestDocValuesIndexing, TestHugeRamFile, Test2BDocs, TestDoubleBarrelLRUCache, TestCrashCausesCorruptIndex, TestUTF32ToUTF8, TestPerFieldPostingsFormat, TestStressIndexing2]
[junit4:junit4] Completed on J1 in 0.24s, 3 tests, 3 errors <<< FAILURES!

[...truncated 46 lines...]
[junit4:junit4] Suite: org.apache.lucene.search.TestQueryWrapperFilter
[junit4:junit4]   2> NOTE: reproduce with: ant test  -Dtestcase=TestQueryWrapperFilter -Dtests.method=testThousandDocuments -Dtests.seed=9FD532EAE266FE0 -Dtests.multiplier=3 -Dtests.slow=true -Dtests.locale=it_CH -Dtests.timezone=Australia/North -Dtests.file.encoding=US-ASCII
[junit4:junit4] FAILURE 0.03s J1 | TestQueryWrapperFilter.testThousandDocuments <<<
[junit4:junit4]    > Throwable #1: java.lang.AssertionError
[junit4:junit4]    > 	at __randomizedtesting.SeedInfo.seed([9FD532EAE266FE0:341CD22709A23B35]:0)
[junit4:junit4]    > 	at org.apache.lucene.util.packed.GrowableWriter.ensureCapacity(GrowableWriter.java:70)
[junit4:junit4]    > 	at org.apache.lucene.util.packed.GrowableWriter.set(GrowableWriter.java:83)
[junit4:junit4]    > 	at org.apache.lucene.util.fst.FST.pack(FST.java:1505)
[junit4:junit4]    > 	at org.apache.lucene.codecs.memory.MemoryPostingsFormat$TermsWriter.finish(MemoryPostingsFormat.java:273)
[junit4:junit4]    > 	at org.apache.lucene.index.FreqProxTermsWriterPerField.flush(FreqProxTermsWriterPerField.java:550)
[junit4:junit4]    > 	at org.apache.lucene.index.FreqProxTermsWriter.flush(FreqProxTermsWriter.java:85)
[junit4:junit4]    > 	at org.apache.lucene.index.TermsHash.flush(TermsHash.java:117)
[junit4:junit4]    > 	at org.apache.lucene.index.DocInverter.flush(DocInverter.java:53)
[junit4:junit4]    > 	at org.apache.lucene.index.DocFieldProcessor.flush(DocFieldProcessor.java:82)
[junit4:junit4]    > 	at org.apache.lucene.index.DocumentsWriterPerThread.flush(DocumentsWriterPerThread.java:481)
[junit4:junit4]    > 	at org.apache.lucene.index.DocumentsWriter.doFlush(DocumentsWriter.java:419)
[junit4:junit4]    > 	at org.apache.lucene.index.DocumentsWriter.postUpdate(DocumentsWriter.java:313)
[junit4:junit4]    > 	at org.apache.lucene.index.DocumentsWriter.updateDocument(DocumentsWriter.java:386)
[junit4:junit4]    > 	at org.apache.lucene.index.IndexWriter.updateDocument(IndexWriter.java:1428)
[junit4:junit4]    > 	at org.apache.lucene.index.IndexWriter.addDocument(IndexWriter.java:1107)
[junit4:junit4]    > 	at org.apache.lucene.index.RandomIndexWriter.addDocument(RandomIndexWriter.java:186)
[junit4:junit4]    > 	at org.apache.lucene.index.RandomIndexWriter.addDocument(RandomIndexWriter.java:145)
[junit4:junit4]    > 	at org.apache.lucene.search.TestQueryWrapperFilter.testThousandDocuments(TestQueryWrapperFilter.java:133)
[junit4:junit4]    > 	at sun.reflect.NativeMethodAccessorImpl.invoke0(Native Method)
[junit4:junit4]    > 	at sun.reflect.NativeMethodAccessorImpl.invoke(NativeMethodAccessorImpl.java:48)
[junit4:junit4]    > 	at sun.reflect.DelegatingMethodAccessorImpl.invoke(DelegatingMethodAccessorImpl.java:25)
[junit4:junit4]    > 	at java.lang.reflect.Method.invoke(Method.java:600)
[junit4:junit4]    > 	at com.carrotsearch.randomizedtesting.RandomizedRunner.invoke(RandomizedRunner.java:1559)
[junit4:junit4]    > 	at com.carrotsearch.randomizedtesting.RandomizedRunner.access$600(RandomizedRunner.java:79)
[junit4:junit4]    > 	at com.carrotsearch.randomizedtesting.RandomizedRunner$6.evaluate(RandomizedRunner.java:737)
[junit4:junit4]    > 	at com.carrotsearch.randomizedtesting.RandomizedRunner$7.evaluate(RandomizedRunner.java:773)
[junit4:junit4]    > 	at com.carrotsearch.randomizedtesting.RandomizedRunner$8.evaluate(RandomizedRunner.java:787)
[junit4:junit4]    > 	at org.apache.lucene.util.TestRuleSetupTeardownChained$1.evaluate(TestRuleSetupTeardownChained.java:50)
[junit4:junit4]    > 	at org.apache.lucene.util.TestRuleFieldCacheSanity$1.evaluate(TestRuleFieldCacheSanity.java:32)
[junit4:junit4]    > 	at org.apache.lucene.util.AbstractBeforeAfterRule$1.evaluate(AbstractBeforeAfterRule.java:45)
[junit4:junit4]    > 	at com.carrotsearch.randomizedtesting.rules.SystemPropertiesInvariantRule$1.evaluate(SystemPropertiesInvariantRule.java:55)
[junit4:junit4]    > 	at org.apache.lucene.util.TestRuleThreadAndTestName$1.evaluate(TestRuleThreadAndTestName.java:48)
[junit4:junit4]    > 	at org.apache.lucene.util.TestRuleIgnoreAfterMaxFailures$1.evaluate(TestRuleIgnoreAfterMaxFailures.java:70)
[junit4:junit4]    > 	at org.apache.lucene.util.TestRuleMarkFailure$1.evaluate(TestRuleMarkFailure.java:48)
[junit4:junit4]    > 	at com.carrotsearch.randomizedtesting.rules.StatementAdapter.evaluate(StatementAdapter.java:36)
[junit4:junit4]    > 	at com.carrotsearch.randomizedtesting.ThreadLeakControl$StatementRunner.run(ThreadLeakControl.java:345)
[junit4:junit4]    > 	at com.carrotsearch.randomizedtesting.ThreadLeakControl.forkTimeoutingTask(ThreadLeakControl.java:769)
[junit4:junit4]    > 	at com.carrotsearch.randomizedtesting.ThreadLeakControl$3.evaluate(ThreadLeakControl.java:429)
[junit4:junit4]    > 	at com.carrotsearch.randomizedtesting.RandomizedRunner.runSingleTest(RandomizedRunner.java:746)
[junit4:junit4]    > 	at com.carrotsearch.randomizedtesting.RandomizedRunner$3.evaluate(RandomizedRunner.java:648)
[junit4:junit4]    > 	at com.carrotsearch.randomizedtesting.RandomizedRunner$4.evaluate(RandomizedRunner.java:682)
[junit4:junit4]    > 	at com.carrotsearch.randomizedtesting.RandomizedRunner$5.evaluate(RandomizedRunner.java:693)
[junit4:junit4]    > 	at org.apache.lucene.util.AbstractBeforeAfterRule$1.evaluate(AbstractBeforeAfterRule.java:45)
[junit4:junit4]    > 	at org.apache.lucene.util.TestRuleStoreClassName$1.evaluate(TestRuleStoreClassName.java:38)
[junit4:junit4]    > 	at com.carrotsearch.randomizedtesting.rules.SystemPropertiesInvariantRule$1.evaluate(SystemPropertiesInvariantRule.java:55)
[junit4:junit4]    > 	at com.carrotsearch.randomizedtesting.rules.NoShadowingOrOverridesOnMethodsRule$1.evaluate(NoShadowingOrOverridesOnMethodsRule.java:39)
[junit4:junit4]    > 	at com.carrotsearch.randomizedtesting.rules.NoShadowingOrOverridesOnMethodsRule$1.evaluate(NoShadowingOrOverridesOnMethodsRule.java:39)
[junit4:junit4]    > 	at org.apache.lucene.util.TestRuleAssertionsRequired$1.evaluate(TestRuleAssertionsRequired.java:40)
[junit4:junit4]    > 	at org.apache.lucene.util.TestRuleMarkFailure$1.evaluate(TestRuleMarkFailure.java:48)
[junit4:junit4]    > 	at org.apache.lucene.util.TestRuleIgnoreAfterMaxFailures$1.evaluate(TestRuleIgnoreAfterMaxFailures.java:70)
[junit4:junit4]    > 	at org.apache.lucene.util.TestRuleIgnoreTestSuites$1.evaluate(TestRuleIgnoreTestSuites.java:55)
[junit4:junit4]    > 	at com.carrotsearch.randomizedtesting.rules.StatementAdapter.evaluate(StatementAdapter.java:36)
[junit4:junit4]    > 	at com.carrotsearch.randomizedtesting.ThreadLeakControl$StatementRunner.run(ThreadLeakControl.java:345)
[junit4:junit4]    > 	at java.lang.Thread.run(Thread.java:736)
[junit4:junit4]   2> NOTE: test params are: codec=Lucene40: {field=PostingsFormat(name=Memory doPackFST= true), id=PostingsFormat(name=TestBloomFilteredLucene40Postings)}, sim=DefaultSimilarity, locale=it_CH, timezone=Australia/North
[junit4:junit4]   2> NOTE: Linux 3.2.0-29-generic x86/IBM Corporation 1.6.0 (32-bit)/cpus=8,threads=1,free=54654288,total=105634304
[junit4:junit4]   2> NOTE: All tests run in this JVM: [TestSpanMultiTermQueryWrapper, TestSimilarityBase, TestPayloadExplanations, TestNewestSegment, TestPerSegmentDeletes, TestBinaryDocument, TestDocCount, TestFSTs, TestConcurrentMergeScheduler, TestNorms, TestMergeSchedulerExternal, TestLongPostings, TestRamUsageEstimatorOnWildAnimals, TestTermRangeFilter, TestRAMDirectory, TestBytesRefHash, TestComplexExplanationsOfNonMatches, TestCodecs, TestFieldsReader, TestMatchAllDocsQuery, TestLock, TestSentinelIntSet, TestPostingsOffsets, TestDateTools, TestTypePromotion, TestIndexWriterOnDiskFull, TestDocTermOrds, TestLookaheadTokenFilter, TestSegmentTermDocs, TestDoc, TestFieldValueFilter, TestAutomatonQuery, TestMultiThreadTermVectors, TestTermVectorsWriter, TestTermsEnum, TestNamedSPILoader, TestRecyclingByteBlockAllocator, TestParallelTermEnum, TestTopScoreDocCollector, TestNumericTokenStream, TestTopDocsMerge, TestAttributeSource, TestDocValuesScoring, TestDateFilter, TestConjunctions, TestIndexInput, Nested1, TestStressIndexing, TestUnicodeUtil, TestOmitPositions, TestLucene40PostingsReader, Test2BPostings, TestIsCurrent, TestNeverDelete, Test10KPulsings, TestCloseableThreadLocal, TestStressNRT, TestStressAdvance, TestBooleanQuery, TestDirectory, TestDocument, TestDirectoryReader, TestAutomatonQueryUnicode, TestBooleanOr, TestPackedInts, TestLockFactory, TestIOUtils, TestRollingBuffer, TestIntBlockCodec, TestUniqueTermCount, TestMultiValuedNumericRangeQuery, TestNumericRangeQuery64, TestConsistentFieldNumbers, TestToken, TestSameTokenSamePosition, TestCharFilter, TestRegexpRandom2, TestSearcherManager, TestNRTThreads, TestAddIndexes, TestIndexWriterMerging, TestMultiMMap, TestSearchAfter, TestIndexWriterDelete, TestDirectoryReaderReopen, TestBufferedIndexInput, TestNRTCachingDirectory, TestCollectionUtil, TestSimpleExplanations, TestCustomNorms, TestDeterminizeLexicon, TestIndexWriterNRTIsCurrent, TestNRTReaderWithThreads, TestDocValuesIndexing, TestHugeRamFile, Test2BDocs, TestDoubleBarrelLRUCache, TestCrashCausesCorruptIndex, TestUTF32ToUTF8, TestPerFieldPostingsFormat, TestStressIndexing2, TestSpanSearchEquivalence, TestParallelCompositeReader, TestFieldCacheSanityChecker, TestOmitTf, TestDisjunctionMaxQuery, TestSimpleSearchEquivalence, TestFieldMaskingSpanQuery, TestCopyBytes, TestQueryWrapperFilter]
[junit4:junit4] Completed on J1 in 0.12s, 3 tests, 1 failure <<< FAILURES!

[...truncated 248 lines...]
BUILD FAILED
/mnt/ssd/jenkins/workspace/Lucene-Solr-trunk-Linux/build.xml:29: The following error occurred while executing this line:
/mnt/ssd/jenkins/workspace/Lucene-Solr-trunk-Linux/lucene/build.xml:49: The following error occurred while executing this line:
/mnt/ssd/jenkins/workspace/Lucene-Solr-trunk-Linux/lucene/common-build.xml:1105: The following error occurred while executing this line:
/mnt/ssd/jenkins/workspace/Lucene-Solr-trunk-Linux/lucene/common-build.xml:797: There were test failures: 309 suites, 1763 tests, 3 errors, 7 failures, 19 ignored (11 assumptions)

Total time: 6 minutes 48 seconds
Build step 'Invoke Ant' marked build as failure
Recording test results
Description set: Java: 32bit/ibm-j9-jdk6 
Email was triggered for: Failure
Sending email for trigger: Failure



Mime
View raw message