lucene-dev mailing list archives

Site index · List index
Message view « Date » · « Thread »
Top « Date » · « Thread »
From Policeman Jenkins Server <jenk...@sd-datasolutions.de>
Subject [JENKINS] Lucene-Solr-trunk-Linux (32bit/ibm-j9-jdk7) - Build # 407 - Failure!
Date Mon, 13 Aug 2012 06:41:36 GMT
Build: http://jenkins.sd-datasolutions.de/job/Lucene-Solr-trunk-Linux/407/
Java: 32bit/ibm-j9-jdk7 

2 tests failed.
FAILED:  junit.framework.TestSuite.org.apache.lucene.analysis.uima.UIMABaseAnalyzerTest

Error Message:
1 thread leaked from SUITE scope at org.apache.lucene.analysis.uima.UIMABaseAnalyzerTest:
    1) Thread[id=26, name=MemoryPoolMXBean notification dispatcher, state=RUNNABLE, group=TGRP-UIMABaseAnalyzerTest]
        at com.ibm.lang.management.MemoryNotificationThread.processNotificationLoop(Native
Method)         at com.ibm.lang.management.MemoryNotificationThread.run(MemoryNotificationThread.java:54)

Stack Trace:
com.carrotsearch.randomizedtesting.ThreadLeakError: 1 thread leaked from SUITE scope at org.apache.lucene.analysis.uima.UIMABaseAnalyzerTest:

   1) Thread[id=26, name=MemoryPoolMXBean notification dispatcher, state=RUNNABLE, group=TGRP-UIMABaseAnalyzerTest]
        at com.ibm.lang.management.MemoryNotificationThread.processNotificationLoop(Native
Method)
        at com.ibm.lang.management.MemoryNotificationThread.run(MemoryNotificationThread.java:54)
	at __randomizedtesting.SeedInfo.seed([96F19D36A8E67021]:0)


FAILED:  junit.framework.TestSuite.org.apache.lucene.analysis.uima.UIMABaseAnalyzerTest

Error Message:
There are still zombie threads that couldn't be terminated:    1) Thread[id=26, name=MemoryPoolMXBean
notification dispatcher, state=RUNNABLE, group=TGRP-UIMABaseAnalyzerTest]         at com.ibm.lang.management.MemoryNotificationThread.processNotificationLoop(Native
Method)         at com.ibm.lang.management.MemoryNotificationThread.run(MemoryNotificationThread.java:54)

Stack Trace:
com.carrotsearch.randomizedtesting.ThreadLeakError: There are still zombie threads that couldn't
be terminated:
   1) Thread[id=26, name=MemoryPoolMXBean notification dispatcher, state=RUNNABLE, group=TGRP-UIMABaseAnalyzerTest]
        at com.ibm.lang.management.MemoryNotificationThread.processNotificationLoop(Native
Method)
        at com.ibm.lang.management.MemoryNotificationThread.run(MemoryNotificationThread.java:54)
	at __randomizedtesting.SeedInfo.seed([96F19D36A8E67021]:0)




Build Log:
[...truncated 5047 lines...]
[junit4:junit4] Suite: org.apache.lucene.analysis.uima.UIMABaseAnalyzerTest
[junit4:junit4]   2> ?????? 13, 2012 7:40:51 ????????? WhitespaceTokenizer initialize
[junit4:junit4]   2> INFO: "Whitespace tokenizer successfully initialized"
[junit4:junit4]   2> ?????? 13, 2012 7:40:51 ????????? WhitespaceTokenizer typeSystemInit
[junit4:junit4]   2> INFO: "Whitespace tokenizer typesystem initialized"
[junit4:junit4]   2> ?????? 13, 2012 7:40:51 ????????? WhitespaceTokenizer process
[junit4:junit4]   2> INFO: "Whitespace tokenizer starts processing"
[junit4:junit4]   2> ?????? 13, 2012 7:40:51 ????????? WhitespaceTokenizer process
[junit4:junit4]   2> INFO: "Whitespace tokenizer finished processing"
[junit4:junit4]   2> ?????? 13, 2012 7:40:55 ????????? WhitespaceTokenizer initialize
[junit4:junit4]   2> INFO: "Whitespace tokenizer successfully initialized"
[junit4:junit4]   2> ?????? 13, 2012 7:40:55 ????????? WhitespaceTokenizer typeSystemInit
[junit4:junit4]   2> INFO: "Whitespace tokenizer typesystem initialized"
[junit4:junit4]   2> ?????? 13, 2012 7:40:55 ????????? WhitespaceTokenizer process
[junit4:junit4]   2> INFO: "Whitespace tokenizer starts processing"
[junit4:junit4]   2> ?????? 13, 2012 7:40:55 ????????? WhitespaceTokenizer process
[junit4:junit4]   2> INFO: "Whitespace tokenizer finished processing"
[junit4:junit4]   2> ?????? 13, 2012 7:40:55 ????????? WhitespaceTokenizer process
[junit4:junit4]   2> INFO: "Whitespace tokenizer starts processing"
[junit4:junit4]   2> ?????? 13, 2012 7:40:55 ????????? WhitespaceTokenizer process
[junit4:junit4]   2> INFO: "Whitespace tokenizer finished processing"
[junit4:junit4]   2> ?????? 13, 2012 7:40:55 ????????? WhitespaceTokenizer process
[junit4:junit4]   2> INFO: "Whitespace tokenizer starts processing"
[junit4:junit4]   2> ?????? 13, 2012 7:40:55 ????????? WhitespaceTokenizer process
[junit4:junit4]   2> INFO: "Whitespace tokenizer finished processing"
[junit4:junit4]   2> ?????? 13, 2012 7:40:55 ????????? WhitespaceTokenizer process
[junit4:junit4]   2> INFO: "Whitespace tokenizer starts processing"
[junit4:junit4]   2> ?????? 13, 2012 7:40:55 ????????? WhitespaceTokenizer process
[junit4:junit4]   2> INFO: "Whitespace tokenizer finished processing"
[junit4:junit4]   2> Aug 13, 2012 6:40:55 AM com.carrotsearch.randomizedtesting.ThreadLeakControl
checkThreadLeaks
[junit4:junit4]   2> WARNING: Will linger awaiting termination of 1 leaked thread(s).
[junit4:junit4]   2> Aug 13, 2012 6:41:15 AM com.carrotsearch.randomizedtesting.ThreadLeakControl
checkThreadLeaks
[junit4:junit4]   2> SEVERE: 1 thread leaked from SUITE scope at org.apache.lucene.analysis.uima.UIMABaseAnalyzerTest:

[junit4:junit4]   2>    1) Thread[id=26, name=MemoryPoolMXBean notification dispatcher,
state=RUNNABLE, group=TGRP-UIMABaseAnalyzerTest]
[junit4:junit4]   2>         at com.ibm.lang.management.MemoryNotificationThread.processNotificationLoop(Native
Method)
[junit4:junit4]   2>         at com.ibm.lang.management.MemoryNotificationThread.run(MemoryNotificationThread.java:54)
[junit4:junit4]   2> Aug 13, 2012 6:41:15 AM com.carrotsearch.randomizedtesting.ThreadLeakControl
tryToInterruptAll
[junit4:junit4]   2> INFO: Starting to interrupt leaked threads:
[junit4:junit4]   2>    1) Thread[id=26, name=MemoryPoolMXBean notification dispatcher,
state=RUNNABLE, group=TGRP-UIMABaseAnalyzerTest]
[junit4:junit4]   2> Aug 13, 2012 6:41:18 AM com.carrotsearch.randomizedtesting.ThreadLeakControl
tryToInterruptAll
[junit4:junit4]   2> SEVERE: There are still zombie threads that couldn't be terminated:
[junit4:junit4]   2>    1) Thread[id=26, name=MemoryPoolMXBean notification dispatcher,
state=RUNNABLE, group=TGRP-UIMABaseAnalyzerTest]
[junit4:junit4]   2>         at com.ibm.lang.management.MemoryNotificationThread.processNotificationLoop(Native
Method)
[junit4:junit4]   2>         at com.ibm.lang.management.MemoryNotificationThread.run(MemoryNotificationThread.java:54)
[junit4:junit4]   2> NOTE: test params are: codec=Lucene40: {title=PostingsFormat(name=Asserting),
dummy=PostingsFormat(name=Asserting), contents=PostingsFormat(name=Asserting)}, sim=RandomSimilarityProvider(queryNorm=true,coord=no):
{}, locale=te_IN, timezone=Africa/Niamey
[junit4:junit4]   2> NOTE: Linux 3.2.0-29-generic x86/IBM Corporation 1.7.0 (32-bit)/cpus=8,threads=2,free=22092048,total=168034304
[junit4:junit4]   2> NOTE: All tests run in this JVM: [UIMABaseAnalyzerTest]
[junit4:junit4]   2> NOTE: reproduce with: ant test  -Dtestcase=UIMABaseAnalyzerTest -Dtests.seed=96F19D36A8E67021
-Dtests.multiplier=3 -Dtests.slow=true -Dtests.locale=te_IN -Dtests.timezone=Africa/Niamey
-Dtests.file.encoding=US-ASCII
[junit4:junit4] ERROR   0.00s J0 | UIMABaseAnalyzerTest (suite) <<<
[junit4:junit4]    > Throwable #1: com.carrotsearch.randomizedtesting.ThreadLeakError:
1 thread leaked from SUITE scope at org.apache.lucene.analysis.uima.UIMABaseAnalyzerTest:

[junit4:junit4]    >    1) Thread[id=26, name=MemoryPoolMXBean notification dispatcher,
state=RUNNABLE, group=TGRP-UIMABaseAnalyzerTest]
[junit4:junit4]    >         at com.ibm.lang.management.MemoryNotificationThread.processNotificationLoop(Native
Method)
[junit4:junit4]    >         at com.ibm.lang.management.MemoryNotificationThread.run(MemoryNotificationThread.java:54)
[junit4:junit4]    > 	at __randomizedtesting.SeedInfo.seed([96F19D36A8E67021]:0)
[junit4:junit4]    > Throwable #2: com.carrotsearch.randomizedtesting.ThreadLeakError:
There are still zombie threads that couldn't be terminated:
[junit4:junit4]    >    1) Thread[id=26, name=MemoryPoolMXBean notification dispatcher,
state=RUNNABLE, group=TGRP-UIMABaseAnalyzerTest]
[junit4:junit4]    >         at com.ibm.lang.management.MemoryNotificationThread.processNotificationLoop(Native
Method)
[junit4:junit4]    >         at com.ibm.lang.management.MemoryNotificationThread.run(MemoryNotificationThread.java:54)
[junit4:junit4]    > 	at __randomizedtesting.SeedInfo.seed([96F19D36A8E67021]:0)
[junit4:junit4] Completed on J0 in 33.09s, 3 tests, 2 errors <<< FAILURES!

[...truncated 5 lines...]
BUILD FAILED
/mnt/ssd/jenkins/workspace/Lucene-Solr-trunk-Linux/build.xml:29: The following error occurred
while executing this line:
/mnt/ssd/jenkins/workspace/Lucene-Solr-trunk-Linux/lucene/build.xml:480: The following error
occurred while executing this line:
/mnt/ssd/jenkins/workspace/Lucene-Solr-trunk-Linux/lucene/common-build.xml:1507: The following
error occurred while executing this line:
/mnt/ssd/jenkins/workspace/Lucene-Solr-trunk-Linux/lucene/analysis/build.xml:101: The following
error occurred while executing this line:
/mnt/ssd/jenkins/workspace/Lucene-Solr-trunk-Linux/lucene/analysis/build.xml:38: The following
error occurred while executing this line:
/mnt/ssd/jenkins/workspace/Lucene-Solr-trunk-Linux/lucene/module-build.xml:62: The following
error occurred while executing this line:
/mnt/ssd/jenkins/workspace/Lucene-Solr-trunk-Linux/lucene/common-build.xml:1105: The following
error occurred while executing this line:
/mnt/ssd/jenkins/workspace/Lucene-Solr-trunk-Linux/lucene/common-build.xml:797: There were
test failures: 4 suites, 9 tests, 2 suite-level errors

Total time: 10 minutes 49 seconds
Build step 'Invoke Ant' marked build as failure
Recording test results
Description set: 
Email was triggered for: Failure
Sending email for trigger: Failure



Mime
View raw message