lucene-dev mailing list archives

Site index · List index
Message view « Date » · « Thread »
Top « Date » · « Thread »
From Policeman Jenkins Server <jenk...@sd-datasolutions.de>
Subject [JENKINS] Lucene-Solr-4.x-Windows (64bit/jdk1.7.0_06) - Build # 406 - Still Failing!
Date Thu, 23 Aug 2012 14:20:20 GMT
Build: http://jenkins.sd-datasolutions.de/job/Lucene-Solr-4.x-Windows/406/
Java: 64bit/jdk1.7.0_06 -XX:+UseG1GC

1 tests failed.
REGRESSION:  org.apache.solr.spelling.suggest.SuggesterTest.testReload

Error Message:
Exception during query

Stack Trace:
java.lang.RuntimeException: Exception during query
	at __randomizedtesting.SeedInfo.seed([52F31322259ED6B7:95036B21EFDD2EA5]:0)
	at org.apache.solr.SolrTestCaseJ4.assertQ(SolrTestCaseJ4.java:493)
	at org.apache.solr.SolrTestCaseJ4.assertQ(SolrTestCaseJ4.java:460)
	at org.apache.solr.spelling.suggest.SuggesterTest.testReload(SuggesterTest.java:91)
	at sun.reflect.NativeMethodAccessorImpl.invoke0(Native Method)
	at sun.reflect.NativeMethodAccessorImpl.invoke(NativeMethodAccessorImpl.java:57)
	at sun.reflect.DelegatingMethodAccessorImpl.invoke(DelegatingMethodAccessorImpl.java:43)
	at java.lang.reflect.Method.invoke(Method.java:601)
	at com.carrotsearch.randomizedtesting.RandomizedRunner.invoke(RandomizedRunner.java:1559)
	at com.carrotsearch.randomizedtesting.RandomizedRunner.access$600(RandomizedRunner.java:79)
	at com.carrotsearch.randomizedtesting.RandomizedRunner$6.evaluate(RandomizedRunner.java:737)
	at com.carrotsearch.randomizedtesting.RandomizedRunner$7.evaluate(RandomizedRunner.java:773)
	at com.carrotsearch.randomizedtesting.RandomizedRunner$8.evaluate(RandomizedRunner.java:787)
	at com.carrotsearch.randomizedtesting.rules.SystemPropertiesRestoreRule$1.evaluate(SystemPropertiesRestoreRule.java:53)
	at org.apache.lucene.util.TestRuleSetupTeardownChained$1.evaluate(TestRuleSetupTeardownChained.java:50)
	at org.apache.lucene.util.TestRuleFieldCacheSanity$1.evaluate(TestRuleFieldCacheSanity.java:51)
	at org.apache.lucene.util.AbstractBeforeAfterRule$1.evaluate(AbstractBeforeAfterRule.java:45)
	at com.carrotsearch.randomizedtesting.rules.SystemPropertiesInvariantRule$1.evaluate(SystemPropertiesInvariantRule.java:55)
	at org.apache.lucene.util.TestRuleThreadAndTestName$1.evaluate(TestRuleThreadAndTestName.java:48)
	at org.apache.lucene.util.TestRuleIgnoreAfterMaxFailures$1.evaluate(TestRuleIgnoreAfterMaxFailures.java:70)
	at org.apache.lucene.util.TestRuleMarkFailure$1.evaluate(TestRuleMarkFailure.java:48)
	at com.carrotsearch.randomizedtesting.rules.StatementAdapter.evaluate(StatementAdapter.java:36)
	at com.carrotsearch.randomizedtesting.ThreadLeakControl$StatementRunner.run(ThreadLeakControl.java:345)
	at com.carrotsearch.randomizedtesting.ThreadLeakControl.forkTimeoutingTask(ThreadLeakControl.java:769)
	at com.carrotsearch.randomizedtesting.ThreadLeakControl$3.evaluate(ThreadLeakControl.java:429)
	at com.carrotsearch.randomizedtesting.RandomizedRunner.runSingleTest(RandomizedRunner.java:746)
	at com.carrotsearch.randomizedtesting.RandomizedRunner$3.evaluate(RandomizedRunner.java:648)
	at com.carrotsearch.randomizedtesting.RandomizedRunner$4.evaluate(RandomizedRunner.java:682)
	at com.carrotsearch.randomizedtesting.RandomizedRunner$5.evaluate(RandomizedRunner.java:693)
	at com.carrotsearch.randomizedtesting.rules.StatementAdapter.evaluate(StatementAdapter.java:36)
	at com.carrotsearch.randomizedtesting.rules.SystemPropertiesRestoreRule$1.evaluate(SystemPropertiesRestoreRule.java:53)
	at org.apache.lucene.util.AbstractBeforeAfterRule$1.evaluate(AbstractBeforeAfterRule.java:45)
	at org.apache.lucene.util.TestRuleStoreClassName$1.evaluate(TestRuleStoreClassName.java:42)
	at com.carrotsearch.randomizedtesting.rules.SystemPropertiesInvariantRule$1.evaluate(SystemPropertiesInvariantRule.java:55)
	at com.carrotsearch.randomizedtesting.rules.NoShadowingOrOverridesOnMethodsRule$1.evaluate(NoShadowingOrOverridesOnMethodsRule.java:39)
	at com.carrotsearch.randomizedtesting.rules.NoShadowingOrOverridesOnMethodsRule$1.evaluate(NoShadowingOrOverridesOnMethodsRule.java:39)
	at org.apache.lucene.util.TestRuleAssertionsRequired$1.evaluate(TestRuleAssertionsRequired.java:40)
	at org.apache.lucene.util.TestRuleMarkFailure$1.evaluate(TestRuleMarkFailure.java:48)
	at org.apache.lucene.util.TestRuleIgnoreAfterMaxFailures$1.evaluate(TestRuleIgnoreAfterMaxFailures.java:70)
	at org.apache.lucene.util.TestRuleIgnoreTestSuites$1.evaluate(TestRuleIgnoreTestSuites.java:55)
	at com.carrotsearch.randomizedtesting.rules.StatementAdapter.evaluate(StatementAdapter.java:36)
	at com.carrotsearch.randomizedtesting.ThreadLeakControl$StatementRunner.run(ThreadLeakControl.java:345)
	at java.lang.Thread.run(Thread.java:722)
Caused by: java.lang.RuntimeException: REQUEST FAILED: xpath=//lst[@name='spellcheck']/lst[@name='suggestions']/lst[@name='ac']/int[@name='numFound'][.='2']
	xml response was: <?xml version="1.0" encoding="UTF-8"?>
<response>
<lst name="responseHeader"><int name="status">0</int><int name="QTime">1</int></lst><lst name="spellcheck"><lst name="suggestions"/></lst>
</response>

	request was:q=ac&spellcheck.count=2&qt=/suggest&spellcheck.onlyMorePopular=true
	at org.apache.solr.SolrTestCaseJ4.assertQ(SolrTestCaseJ4.java:486)
	... 41 more




Build Log:
[...truncated 7525 lines...]
[junit4:junit4] Suite: org.apache.solr.spelling.suggest.SuggesterTest
[junit4:junit4]   2> 1 T3251 oas.SolrTestCaseJ4.initCore ####initCore
[junit4:junit4]   2> Creating dataDir: C:\Jenkins\workspace\Lucene-Solr-4.x-Windows\solr\build\solr-core\test\J0\.\solrtest-SuggesterTest-1345731407254
[junit4:junit4]   2> 2 T3251 oasc.SolrResourceLoader.<init> new SolrResourceLoader for directory: 'C:\Jenkins\workspace\Lucene-Solr-4.x-Windows\solr\build\solr-core\test-files\solr\collection1\'
[junit4:junit4]   2> 3 T3251 oasc.SolrResourceLoader.replaceClassLoader Adding 'file:/C:/Jenkins/workspace/Lucene-Solr-4.x-Windows/solr/build/solr-core/test-files/solr/collection1/lib/classes/' to classloader
[junit4:junit4]   2> 3 T3251 oasc.SolrResourceLoader.replaceClassLoader Adding 'file:/C:/Jenkins/workspace/Lucene-Solr-4.x-Windows/solr/build/solr-core/test-files/solr/collection1/lib/README' to classloader
[junit4:junit4]   2> 85 T3251 oasc.SolrConfig.<init> Using Lucene MatchVersion: LUCENE_40
[junit4:junit4]   2> 161 T3251 oasc.SolrConfig.<init> Loaded SolrConfig: solrconfig-spellchecker.xml
[junit4:junit4]   2> 163 T3251 oass.IndexSchema.readSchema Reading Solr Schema
[junit4:junit4]   2> 167 T3251 oass.IndexSchema.readSchema Schema name=Solr SpellCheck Test
[junit4:junit4]   2> 220 T3251 oass.IndexSchema.readSchema default search field in schema is text
[junit4:junit4]   2> 224 T3251 oass.IndexSchema.readSchema query parser default operator is OR
[junit4:junit4]   2> 226 T3251 oass.IndexSchema.readSchema unique key field: id
[junit4:junit4]   2> 230 T3251 oasc.SolrResourceLoader.locateSolrHome JNDI not configured for solr (NoInitialContextEx)
[junit4:junit4]   2> 231 T3251 oasc.SolrResourceLoader.locateSolrHome using system property solr.solr.home: C:\Jenkins\workspace\Lucene-Solr-4.x-Windows\solr\build\solr-core\test-files\solr
[junit4:junit4]   2> 231 T3251 oasc.SolrResourceLoader.<init> new SolrResourceLoader for directory: 'C:\Jenkins\workspace\Lucene-Solr-4.x-Windows\solr\build\solr-core\test-files\solr\'
[junit4:junit4]   2> 250 T3251 oasc.CoreContainer.<init> New CoreContainer 1339027385
[junit4:junit4]   2> 250 T3251 oasc.SolrCore.<init> [collection1] Opening new SolrCore at C:\Jenkins\workspace\Lucene-Solr-4.x-Windows\solr\build\solr-core\test-files\solr\collection1\, dataDir=C:\Jenkins\workspace\Lucene-Solr-4.x-Windows\solr\build\solr-core\test\J0\.\solrtest-SuggesterTest-1345731407254\
[junit4:junit4]   2> 252 T3251 oasc.SolrCore.<init> JMX monitoring not detected for core: collection1
[junit4:junit4]   2> 252 T3251 oasc.SolrCore.getNewIndexDir WARNING New index directory detected: old=null new=C:\Jenkins\workspace\Lucene-Solr-4.x-Windows\solr\build\solr-core\test\J0\.\solrtest-SuggesterTest-1345731407254\index/
[junit4:junit4]   2> 253 T3251 oasc.SolrCore.initIndex WARNING [collection1] Solr index directory 'C:\Jenkins\workspace\Lucene-Solr-4.x-Windows\solr\build\solr-core\test\J0\.\solrtest-SuggesterTest-1345731407254\index' doesn't exist. Creating new index...
[junit4:junit4]   2> 255 T3251 oasc.CachingDirectoryFactory.get return new directory for C:\Jenkins\workspace\Lucene-Solr-4.x-Windows\solr\build\solr-core\test\J0\.\solrtest-SuggesterTest-1345731407254\index forceNew:false
[junit4:junit4]   2> 264 T3251 oasc.SolrDeletionPolicy.onCommit SolrDeletionPolicy.onCommit: commits:num=1
[junit4:junit4]   2> 		commit{dir=MockDirWrapper(org.apache.lucene.store.MMapDirectory@C:\Jenkins\workspace\Lucene-Solr-4.x-Windows\solr\build\solr-core\test\J0\solrtest-SuggesterTest-1345731407254\index lockFactory=org.apache.lucene.store.NativeFSLockFactory@3e362985),segFN=segments_1,generation=1,filenames=[segments_1]
[junit4:junit4]   2> 264 T3251 oasc.SolrDeletionPolicy.updateCommits newest commit = 1
[junit4:junit4]   2> 266 T3251 oasc.RequestHandlers.initHandlersFromConfig created standard: solr.StandardRequestHandler
[junit4:junit4]   2> 267 T3251 oasc.RequestHandlers.initHandlersFromConfig created /suggest: org.apache.solr.handler.component.SearchHandler
[junit4:junit4]   2> 267 T3251 oasc.RequestHandlers.initHandlersFromConfig created /suggest_tst: org.apache.solr.handler.component.SearchHandler
[junit4:junit4]   2> 267 T3251 oasc.RequestHandlers.initHandlersFromConfig created /suggest_fst: org.apache.solr.handler.component.SearchHandler
[junit4:junit4]   2> 268 T3251 oasc.RequestHandlers.initHandlersFromConfig created /suggest_wfst: org.apache.solr.handler.component.SearchHandler
[junit4:junit4]   2> 276 T3251 oass.SolrIndexSearcher.<init> Opening Searcher@2f8d257c main
[junit4:junit4]   2> 276 T3251 oass.SolrIndexSearcher.getIndexDir WARNING WARNING: Directory impl does not support setting indexDir: org.apache.lucene.store.MockDirectoryWrapper
[junit4:junit4]   2> 277 T3251 oasu.CommitTracker.<init> Hard AutoCommit: disabled
[junit4:junit4]   2> 277 T3251 oasu.CommitTracker.<init> Soft AutoCommit: disabled
[junit4:junit4]   2> 277 T3251 oashc.SpellCheckComponent.inform Initializing spell checkers
[junit4:junit4]   2> 278 T3251 oasss.Suggester.init init: {name=suggest,classname=org.apache.solr.spelling.suggest.Suggester,lookupImpl=org.apache.solr.spelling.suggest.jaspell.JaspellLookup,field=suggest,storeDir=suggest,buildOnCommit=true,threshold=0.0}
[junit4:junit4]   2> 278 T3251 oasssj.JaspellLookupFactory.create init: {name=suggest,classname=org.apache.solr.spelling.suggest.Suggester,lookupImpl=org.apache.solr.spelling.suggest.jaspell.JaspellLookup,field=suggest,storeDir=suggest,buildOnCommit=true,threshold=0.0}
[junit4:junit4]   2> 279 T3251 oashc.SpellCheckComponent.inform Registering newSearcher listener for spellchecker: suggest
[junit4:junit4]   2> 279 T3251 oashc.SpellCheckComponent.inform No queryConverter defined, using default converter
[junit4:junit4]   2> 280 T3251 oashc.SpellCheckComponent.inform Initializing spell checkers
[junit4:junit4]   2> 280 T3251 oasss.Suggester.init init: {name=suggest_tst,classname=org.apache.solr.spelling.suggest.Suggester,lookupImpl=org.apache.solr.spelling.suggest.tst.TSTLookup,field=suggest,storeDir=suggest_tst,buildOnCommit=true,threshold=0.0}
[junit4:junit4]   2> 282 T3251 oashc.SpellCheckComponent.inform Registering newSearcher listener for spellchecker: suggest_tst
[junit4:junit4]   2> 282 T3251 oashc.SpellCheckComponent.inform No queryConverter defined, using default converter
[junit4:junit4]   2> 282 T3251 oashc.SpellCheckComponent.inform Initializing spell checkers
[junit4:junit4]   2> 283 T3251 oasss.Suggester.init init: {name=suggest_fst,classname=org.apache.solr.spelling.suggest.Suggester,lookupImpl=org.apache.solr.spelling.suggest.fst.FSTLookup,field=suggest,storeDir=suggest_fst,buildOnCommit=true,weightBuckets=5,exactMatchFirst=true}
[junit4:junit4]   2> 283 T3251 oashc.SpellCheckComponent.inform Registering newSearcher listener for spellchecker: suggest_fst
[junit4:junit4]   2> 284 T3251 oashc.SpellCheckComponent.inform No queryConverter defined, using default converter
[junit4:junit4]   2> 284 T3251 oashc.SpellCheckComponent.inform Initializing spell checkers
[junit4:junit4]   2> 285 T3251 oasss.Suggester.init init: {name=suggest_wfst,classname=org.apache.solr.spelling.suggest.Suggester,lookupImpl=org.apache.solr.spelling.suggest.fst.WFSTLookupFactory,field=suggest,storeDir=suggest_wfst,buildOnCommit=true,exactMatchFirst=true}
[junit4:junit4]   2> 286 T3251 oashc.SpellCheckComponent.inform Registering newSearcher listener for spellchecker: suggest_wfst
[junit4:junit4]   2> 286 T3251 oashc.SpellCheckComponent.inform No queryConverter defined, using default converter
[junit4:junit4]   2> 287 T3251 oashc.HttpShardHandlerFactory.getParameter Setting socketTimeout to: 0
[junit4:junit4]   2> 287 T3251 oashc.HttpShardHandlerFactory.getParameter Setting urlScheme to: http://
[junit4:junit4]   2> 287 T3251 oashc.HttpShardHandlerFactory.getParameter Setting connTimeout to: 0
[junit4:junit4]   2> 287 T3251 oashc.HttpShardHandlerFactory.getParameter Setting maxConnectionsPerHost to: 20
[junit4:junit4]   2> 288 T3251 oashc.HttpShardHandlerFactory.getParameter Setting corePoolSize to: 0
[junit4:junit4]   2> 288 T3251 oashc.HttpShardHandlerFactory.getParameter Setting maximumPoolSize to: 2147483647
[junit4:junit4]   2> 288 T3251 oashc.HttpShardHandlerFactory.getParameter Setting maxThreadIdleTime to: 5
[junit4:junit4]   2> 288 T3251 oashc.HttpShardHandlerFactory.getParameter Setting sizeOfQueue to: -1
[junit4:junit4]   2> 289 T3251 oashc.HttpShardHandlerFactory.getParameter Setting fairnessPolicy to: false
[junit4:junit4]   2> 289 T3251 oascsi.HttpClientUtil.createClient Creating new http client, config:maxConnectionsPerHost=20&maxConnections=10000&socketTimeout=0&connTimeout=0&retry=false
[junit4:junit4]   2> 297 T3251 oasc.CoreContainer.register registering core: collection1
[junit4:junit4]   2> 299 T3251 oas.SolrTestCaseJ4.initCore ####initCore end
[junit4:junit4]   2> 307 T3251 oas.SolrTestCaseJ4.setUp ###Starting testAnalyzer
[junit4:junit4]   2> 307 T3251 oasss.Suggester.init init: {lookupImpl=org.apache.solr.spelling.suggest.tst.TSTLookupFactory}
[junit4:junit4]   2> 307 T3251 oas.SolrTestCaseJ4.tearDown ###Ending testAnalyzer
[junit4:junit4]   2> 317 T3251 oas.SolrTestCaseJ4.setUp ###Starting testReload
[junit4:junit4]   2> ASYNC  NEW_CORE C246 name=collection1 org.apache.solr.core.SolrCore@64fa6661
[junit4:junit4]   2> 329 T3251 C246 oasc.SolrDeletionPolicy.onInit SolrDeletionPolicy.onInit: commits:num=1
[junit4:junit4]   2> 		commit{dir=MockDirWrapper(org.apache.lucene.store.MMapDirectory@C:\Jenkins\workspace\Lucene-Solr-4.x-Windows\solr\build\solr-core\test\J0\solrtest-SuggesterTest-1345731407254\index lockFactory=org.apache.lucene.store.NativeFSLockFactory@3e362985),segFN=segments_1,generation=1,filenames=[segments_1]
[junit4:junit4]   2> 330 T3251 C246 oasc.SolrDeletionPolicy.updateCommits newest commit = 1
[junit4:junit4]   2> 333 T3251 C246 UPDATE [collection1] webapp=null path=null params={} {add=[1]} 0 8
[junit4:junit4]   2> 349 T3251 C246 UPDATE [collection1] webapp=null path=null params={} {add=[2]} 0 0
[junit4:junit4]   2> 362 T3251 C246 UPDATE [collection1] webapp=null path=null params={} {add=[3]} 0 0
[junit4:junit4]   2> 374 T3251 C246 oasu.DirectUpdateHandler2.commit start commit{flags=0,_version_=0,optimize=false,openSearcher=true,waitSearcher=true,expungeDeletes=false,softCommit=false}
[junit4:junit4]   2> 394 T3251 C246 oasc.SolrDeletionPolicy.onCommit SolrDeletionPolicy.onCommit: commits:num=2
[junit4:junit4]   2> 		commit{dir=MockDirWrapper(org.apache.lucene.store.MMapDirectory@C:\Jenkins\workspace\Lucene-Solr-4.x-Windows\solr\build\solr-core\test\J0\solrtest-SuggesterTest-1345731407254\index lockFactory=org.apache.lucene.store.NativeFSLockFactory@3e362985),segFN=segments_1,generation=1,filenames=[segments_1]
[junit4:junit4]   2> 		commit{dir=MockDirWrapper(org.apache.lucene.store.MMapDirectory@C:\Jenkins\workspace\Lucene-Solr-4.x-Windows\solr\build\solr-core\test\J0\solrtest-SuggesterTest-1345731407254\index lockFactory=org.apache.lucene.store.NativeFSLockFactory@3e362985),segFN=segments_2,generation=2,filenames=[_0_TestBloomFilteredLucene40Postings_0.tim, _0_TestBloomFilteredLucene40Postings_0.blm, _0_TestBloomFilteredLucene40Postings_0.tip, _0.fnm, _0_Pulsing40_0.tim, _0_MockSep_0.pos, _0_Memory_0.ram, _0_TestBloomFilteredLucene40Postings_0.prx, _0_nrm.cfs, _0_Pulsing40_0.prx, _0_Pulsing40_0.frq, _0_MockSep_0.tib, _0_MockSep_0.skp, _0_nrm.cfe, _0_MockSep_0.frq, _0_Pulsing40_0.tip, segments_2, _0.fdx, _0_TestBloomFilteredLucene40Postings_0.frq, _0_MockSep_0.tii, _0.si, _0_MockSep_0.pyl, _0_MockSep_0.doc, _0.fdt]
[junit4:junit4]   2> 394 T3251 C246 oasc.SolrDeletionPolicy.updateCommits newest commit = 2
[junit4:junit4]   2> 395 T3251 C246 oasc.SolrCore.getSearcher WARNING [collection1] PERFORMANCE WARNING: Overlapping onDeckSearchers=2
[junit4:junit4]   2> 409 T3251 C246 oass.SolrIndexSearcher.<init> Opening Searcher@3248dd2f main
[junit4:junit4]   2> 409 T3251 C246 oass.SolrIndexSearcher.getIndexDir WARNING WARNING: Directory impl does not support setting indexDir: org.apache.lucene.store.MockDirectoryWrapper
[junit4:junit4]   2> 411 T3251 C246 oasu.DirectUpdateHandler2.commit end_commit_flush
[junit4:junit4]   2> 411 T3252 oasc.SolrCore.registerSearcher [collection1] Registered new searcher Searcher@2f8d257c main{StandardDirectoryReader(segments_1:1)}
[junit4:junit4]   2> 411 T3252 oashc.SpellCheckComponent$SpellCheckerListener.newSearcher Loading spell index for spellchecker: suggest
[junit4:junit4]   2> 411 T3252 oasss.Suggester.reload reload()
[junit4:junit4]   2> 412 T3252 oashc.SpellCheckComponent$SpellCheckerListener.newSearcher SEVERE Exception in reloading spell check index for spellchecker: suggest java.io.FileNotFoundException: C:\Jenkins\workspace\Lucene-Solr-4.x-Windows\solr\build\solr-core\test\J0\.\solrtest-SuggesterTest-1345731407254\suggest\jaspell.dat (The system cannot find the file specified)
[junit4:junit4]   2> 	at java.io.FileInputStream.open(Native Method)
[junit4:junit4]   2> 	at java.io.FileInputStream.<init>(FileInputStream.java:138)
[junit4:junit4]   2> 	at org.apache.solr.spelling.suggest.Suggester.reload(Suggester.java:161)
[junit4:junit4]   2> 	at org.apache.solr.handler.component.SpellCheckComponent$SpellCheckerListener.newSearcher(SpellCheckComponent.java:673)
[junit4:junit4]   2> 	at org.apache.solr.core.SolrCore$5.call(SolrCore.java:1452)
[junit4:junit4]   2> 	at java.util.concurrent.FutureTask$Sync.innerRun(FutureTask.java:334)
[junit4:junit4]   2> 	at java.util.concurrent.FutureTask.run(FutureTask.java:166)
[junit4:junit4]   2> 	at java.util.concurrent.ThreadPoolExecutor.runWorker(ThreadPoolExecutor.java:1110)
[junit4:junit4]   2> 	at java.util.concurrent.ThreadPoolExecutor$Worker.run(ThreadPoolExecutor.java:603)
[junit4:junit4]   2> 	at java.lang.Thread.run(Thread.java:722)
[junit4:junit4]   2> 
[junit4:junit4]   2> 412 T3252 oashc.SpellCheckComponent$SpellCheckerListener.newSearcher Loading spell index for spellchecker: suggest_tst
[junit4:junit4]   2> 412 T3252 oasss.Suggester.reload reload()
[junit4:junit4]   2> 413 T3252 oashc.SpellCheckComponent$SpellCheckerListener.newSearcher SEVERE Exception in reloading spell check index for spellchecker: suggest_tst java.io.FileNotFoundException: C:\Jenkins\workspace\Lucene-Solr-4.x-Windows\solr\build\solr-core\test\J0\.\solrtest-SuggesterTest-1345731407254\suggest_tst\tst.dat (The system cannot find the file specified)
[junit4:junit4]   2> 	at java.io.FileInputStream.open(Native Method)
[junit4:junit4]   2> 	at java.io.FileInputStream.<init>(FileInputStream.java:138)
[junit4:junit4]   2> 	at org.apache.solr.spelling.suggest.Suggester.reload(Suggester.java:161)
[junit4:junit4]   2> 	at org.apache.solr.handler.component.SpellCheckComponent$SpellCheckerListener.newSearcher(SpellCheckComponent.java:673)
[junit4:junit4]   2> 	at org.apache.solr.core.SolrCore$5.call(SolrCore.java:1452)
[junit4:junit4]   2> 	at java.util.concurrent.FutureTask$Sync.innerRun(FutureTask.java:334)
[junit4:junit4]   2> 	at java.util.concurrent.FutureTask.run(FutureTask.java:166)
[junit4:junit4]   2> 	at java.util.concurrent.ThreadPoolExecutor.runWorker(ThreadPoolExecutor.java:1110)
[junit4:junit4]   2> 	at java.util.concurrent.ThreadPoolExecutor$Worker.run(ThreadPoolExecutor.java:603)
[junit4:junit4]   2> 	at java.lang.Thread.run(Thread.java:722)
[junit4:junit4]   2> 
[junit4:junit4]   2> 413 T3252 oashc.SpellCheckComponent$SpellCheckerListener.newSearcher Loading spell index for spellchecker: suggest_fst
[junit4:junit4]   2> 413 T3252 oasss.Suggester.reload reload()
[junit4:junit4]   2> 414 T3252 oashc.SpellCheckComponent$SpellCheckerListener.newSearcher SEVERE Exception in reloading spell check index for spellchecker: suggest_fst java.io.FileNotFoundException: C:\Jenkins\workspace\Lucene-Solr-4.x-Windows\solr\build\solr-core\test\J0\.\solrtest-SuggesterTest-1345731407254\suggest_fst\fst.bin (The system cannot find the file specified)
[junit4:junit4]   2> 	at java.io.FileInputStream.open(Native Method)
[junit4:junit4]   2> 	at java.io.FileInputStream.<init>(FileInputStream.java:138)
[junit4:junit4]   2> 	at org.apache.solr.spelling.suggest.Suggester.reload(Suggester.java:161)
[junit4:junit4]   2> 	at org.apache.solr.handler.component.SpellCheckComponent$SpellCheckerListener.newSearcher(SpellCheckComponent.java:673)
[junit4:junit4]   2> 	at org.apache.solr.core.SolrCore$5.call(SolrCore.java:1452)
[junit4:junit4]   2> 	at java.util.concurrent.FutureTask$Sync.innerRun(FutureTask.java:334)
[junit4:junit4]   2> 	at java.util.concurrent.FutureTask.run(FutureTask.java:166)
[junit4:junit4]   2> 	at java.util.concurrent.ThreadPoolExecutor.runWorker(ThreadPoolExecutor.java:1110)
[junit4:junit4]   2> 	at java.util.concurrent.ThreadPoolExecutor$Worker.run(ThreadPoolExecutor.java:603)
[junit4:junit4]   2> 	at java.lang.Thread.run(Thread.java:722)
[junit4:junit4]   2> 
[junit4:junit4]   2> 414 T3252 oashc.SpellCheckComponent$SpellCheckerListener.newSearcher Loading spell index for spellchecker: suggest_wfst
[junit4:junit4]   2> 414 T3252 oasss.Suggester.reload reload()
[junit4:junit4]   2> 415 T3252 oashc.SpellCheckComponent$SpellCheckerListener.newSearcher SEVERE Exception in reloading spell check index for spellchecker: suggest_wfst java.io.FileNotFoundException: C:\Jenkins\workspace\Lucene-Solr-4.x-Windows\solr\build\solr-core\test\J0\.\solrtest-SuggesterTest-1345731407254\suggest_wfst\wfst.bin (The system cannot find the file specified)
[junit4:junit4]   2> 	at java.io.FileInputStream.open(Native Method)
[junit4:junit4]   2> 	at java.io.FileInputStream.<init>(FileInputStream.java:138)
[junit4:junit4]   2> 	at org.apache.solr.spelling.suggest.Suggester.reload(Suggester.java:161)
[junit4:junit4]   2> 	at org.apache.solr.handler.component.SpellCheckComponent$SpellCheckerListener.newSearcher(SpellCheckComponent.java:673)
[junit4:junit4]   2> 	at org.apache.solr.core.SolrCore$5.call(SolrCore.java:1452)
[junit4:junit4]   2> 	at java.util.concurrent.FutureTask$Sync.innerRun(FutureTask.java:334)
[junit4:junit4]   2> 	at java.util.concurrent.FutureTask.run(FutureTask.java:166)
[junit4:junit4]   2> 	at java.util.concurrent.ThreadPoolExecutor.runWorker(ThreadPoolExecutor.java:1110)
[junit4:junit4]   2> 	at java.util.concurrent.ThreadPoolExecutor$Worker.run(ThreadPoolExecutor.java:603)
[junit4:junit4]   2> 	at java.lang.Thread.run(Thread.java:722)
[junit4:junit4]   2> 
[junit4:junit4]   2> 416 T3252 oasc.SolrCore.registerSearcher [collection1] Registered new searcher Searcher@3248dd2f main{StandardDirectoryReader(segments_2:3 _0(4.0.0.2):C3)}
[junit4:junit4]   2> 416 T3251 C246 UPDATE [collection1] webapp=null path=null params={} {commit=} 0 43
[junit4:junit4]   2> 419 T3251 oas.SolrTestCaseJ4.deleteCore ###deleteCore
[junit4:junit4]   2> 421 T3251 oasc.CoreContainer.shutdown Shutting down CoreContainer instance=1339027385
[junit4:junit4]   2> 421 T3251 oasc.SolrCore.close [collection1]  CLOSING SolrCore org.apache.solr.core.SolrCore@64fa6661
[junit4:junit4]   2> 424 T3251 oasc.SolrCore.closeSearcher [collection1] Closing main searcher on request.
[junit4:junit4]   2> 432 T3251 oasu.DirectUpdateHandler2.close closing DirectUpdateHandler2{commits=1,autocommits=0,soft autocommits=0,optimizes=0,rollbacks=0,expungeDeletes=0,docsPending=0,adds=0,deletesById=0,deletesByQuery=0,errors=0,cumulative_adds=3,cumulative_deletesById=0,cumulative_deletesByQuery=0,cumulative_errors=0}
[junit4:junit4]   2> 433 T3251 oasu.DefaultSolrCoreState.decref SolrCoreState ref count has reached 0 - closing IndexWriter
[junit4:junit4]   2> NOTE: per solr.test.leavedatadir, dataDir will not be removed: C:\Jenkins\workspace\Lucene-Solr-4.x-Windows\solr\build\solr-core\test\J0\.\solrtest-SuggesterTest-1345731407254
[junit4:junit4]   2> 457 T3251 oas.SolrTestCaseJ4.initCore ####initCore
[junit4:junit4]   2> 457 T3251 oasc.SolrResourceLoader.<init> new SolrResourceLoader for directory: 'C:\Jenkins\workspace\Lucene-Solr-4.x-Windows\solr\build\solr-core\test-files\solr\collection1\'
[junit4:junit4]   2> 460 T3251 oasc.SolrResourceLoader.replaceClassLoader Adding 'file:/C:/Jenkins/workspace/Lucene-Solr-4.x-Windows/solr/build/solr-core/test-files/solr/collection1/lib/classes/' to classloader
[junit4:junit4]   2> 460 T3251 oasc.SolrResourceLoader.replaceClassLoader Adding 'file:/C:/Jenkins/workspace/Lucene-Solr-4.x-Windows/solr/build/solr-core/test-files/solr/collection1/lib/README' to classloader
[junit4:junit4]   2> 610 T3251 oasc.SolrConfig.<init> Using Lucene MatchVersion: LUCENE_40
[junit4:junit4]   2> 692 T3251 oasc.SolrConfig.<init> Loaded SolrConfig: solrconfig-spellchecker.xml
[junit4:junit4]   2> 693 T3251 oass.IndexSchema.readSchema Reading Solr Schema
[junit4:junit4]   2> 700 T3251 oass.IndexSchema.readSchema Schema name=test
[junit4:junit4]   2> 1819 T3251 oass.OpenExchangeRatesOrgProvider.init Initialized with rates=open-exchange-rates.json, refreshInterval=1440.
[junit4:junit4]   2> 1830 T3251 oass.IndexSchema.readSchema default search field in schema is text
[junit4:junit4]   2> 1835 T3251 oass.IndexSchema.readSchema unique key field: id
[junit4:junit4]   2> 1844 T3251 oass.FileExchangeRateProvider.reload Reloading exchange rates from file currency.xml
[junit4:junit4]   2> 1850 T3251 oass.FileExchangeRateProvider.reload Reloading exchange rates from file currency.xml
[junit4:junit4]   2> 1855 T3251 oass.OpenExchangeRatesOrgProvider.reload Reloading exchange rates from open-exchange-rates.json
[junit4:junit4]   2> 1855 T3251 oass.OpenExchangeRatesOrgProvider.reload Reloading exchange rates from open-exchange-rates.json
[junit4:junit4]   2> 1856 T3251 oasc.SolrResourceLoader.locateSolrHome JNDI not configured for solr (NoInitialContextEx)
[junit4:junit4]   2> 1856 T3251 oasc.SolrResourceLoader.locateSolrHome using system property solr.solr.home: C:\Jenkins\workspace\Lucene-Solr-4.x-Windows\solr\build\solr-core\test-files\solr
[junit4:junit4]   2> 1856 T3251 oasc.SolrResourceLoader.<init> new SolrResourceLoader for directory: 'C:\Jenkins\workspace\Lucene-Solr-4.x-Windows\solr\build\solr-core\test-files\solr\'
[junit4:junit4]   2> 1869 T3251 oasc.CoreContainer.<init> New CoreContainer 268891927
[junit4:junit4]   2> 1871 T3251 oasc.SolrCore.<init> [collection1] Opening new SolrCore at C:\Jenkins\workspace\Lucene-Solr-4.x-Windows\solr\build\solr-core\test-files\solr\collection1\, dataDir=C:\Jenkins\workspace\Lucene-Solr-4.x-Windows\solr\build\solr-core\test\J0\.\solrtest-SuggesterTest-1345731407254\
[junit4:junit4]   2> 1871 T3251 oasc.SolrCore.<init> JMX monitoring not detected for core: collection1
[junit4:junit4]   2> 1871 T3251 oasc.SolrCore.getNewIndexDir WARNING New index directory detected: old=null new=C:\Jenkins\workspace\Lucene-Solr-4.x-Windows\solr\build\solr-core\test\J0\.\solrtest-SuggesterTest-1345731407254\index/
[junit4:junit4]   2> 1873 T3251 oasc.RequestHandlers.initHandlersFromConfig created standard: solr.StandardRequestHandler
[junit4:junit4]   2> 1873 T3251 oasc.RequestHandlers.initHandlersFromConfig created /suggest: org.apache.solr.handler.component.SearchHandler
[junit4:junit4]   2> 1873 T3251 oasc.RequestHandlers.initHandlersFromConfig created /suggest_tst: org.apache.solr.handler.component.SearchHandler
[junit4:junit4]   2> 1874 T3251 oasc.RequestHandlers.initHandlersFromConfig created /suggest_fst: org.apache.solr.handler.component.SearchHandler
[junit4:junit4]   2> 1874 T3251 oasc.RequestHandlers.initHandlersFromConfig created /suggest_wfst: org.apache.solr.handler.component.SearchHandler
[junit4:junit4]   2> 1879 T3251 oasc.CachingDirectoryFactory.get return new directory for C:\Jenkins\workspace\Lucene-Solr-4.x-Windows\solr\build\solr-core\test\J0\.\solrtest-SuggesterTest-1345731407254\index forceNew:false
[junit4:junit4]   2> 1886 T3251 oass.SolrIndexSearcher.<init> Opening Searcher@10dd8cfe main
[junit4:junit4]   2> 1888 T3251 oass.SolrIndexSearcher.getIndexDir WARNING WARNING: Directory impl does not support setting indexDir: org.apache.lucene.store.MockDirectoryWrapper
[junit4:junit4]   2> 1888 T3251 oasu.CommitTracker.<init> Hard AutoCommit: disabled
[junit4:junit4]   2> 1889 T3251 oasu.CommitTracker.<init> Soft AutoCommit: disabled
[junit4:junit4]   2> 1889 T3251 oashc.SpellCheckComponent.inform Initializing spell checkers
[junit4:junit4]   2> 1889 T3251 oasss.Suggester.init init: {name=suggest,classname=org.apache.solr.spelling.suggest.Suggester,lookupImpl=org.apache.solr.spelling.suggest.jaspell.JaspellLookup,field=suggest,storeDir=suggest,buildOnCommit=true,threshold=0.0}
[junit4:junit4]   2> 1889 T3251 oasssj.JaspellLookupFactory.create init: {name=suggest,classname=org.apache.solr.spelling.suggest.Suggester,lookupImpl=org.apache.solr.spelling.suggest.jaspell.JaspellLookup,field=suggest,storeDir=suggest,buildOnCommit=true,threshold=0.0}
[junit4:junit4]   2> 1890 T3251 oasss.Suggester.init WARNING Loading stored lookup data failed java.io.FileNotFoundException: C:\Jenkins\workspace\Lucene-Solr-4.x-Windows\solr\build\solr-core\test\J0\.\solrtest-SuggesterTest-1345731407254\suggest\jaspell.dat (The system cannot find the file specified)
[junit4:junit4]   2> 	at java.io.FileInputStream.open(Native Method)
[junit4:junit4]   2> 	at java.io.FileInputStream.<init>(FileInputStream.java:138)
[junit4:junit4]   2> 	at org.apache.solr.spelling.suggest.Suggester.init(Suggester.java:115)
[junit4:junit4]   2> 	at org.apache.solr.handler.component.SpellCheckComponent.inform(SpellCheckComponent.java:596)
[junit4:junit4]   2> 	at org.apache.solr.core.SolrResourceLoader.inform(SolrResourceLoader.java:592)
[junit4:junit4]   2> 	at org.apache.solr.core.SolrCore.<init>(SolrCore.java:698)
[junit4:junit4]   2> 	at org.apache.solr.core.SolrCore.<init>(SolrCore.java:566)
[junit4:junit4]   2> 	at org.apache.solr.util.TestHarness$Initializer.initialize(TestHarness.java:190)
[junit4:junit4]   2> 	at org.apache.solr.util.TestHarness.<init>(TestHarness.java:114)
[junit4:junit4]   2> 	at org.apache.solr.util.TestHarness.<init>(TestHarness.java:109)
[junit4:junit4]   2> 	at org.apache.solr.util.TestHarness.<init>(TestHarness.java:99)
[junit4:junit4]   2> 	at org.apache.solr.SolrTestCaseJ4.createCore(SolrTestCaseJ4.java:362)
[junit4:junit4]   2> 	at org.apache.solr.SolrTestCaseJ4.initCore(SolrTestCaseJ4.java:355)
[junit4:junit4]   2> 	at org.apache.solr.spelling.suggest.SuggesterTest.testReload(SuggesterTest.java:90)
[junit4:junit4]   2> 	at sun.reflect.NativeMethodAccessorImpl.invoke0(Native Method)
[junit4:junit4]   2> 	at sun.reflect.NativeMethodAccessorImpl.invoke(NativeMethodAccessorImpl.java:57)
[junit4:junit4]   2> 	at sun.reflect.DelegatingMethodAccessorImpl.invoke(DelegatingMethodAccessorImpl.java:43)
[junit4:junit4]   2> 	at java.lang.reflect.Method.invoke(Method.java:601)
[junit4:junit4]   2> 	at com.carrotsearch.randomizedtesting.RandomizedRunner.invoke(RandomizedRunner.java:1559)
[junit4:junit4]   2> 	at com.carrotsearch.randomizedtesting.RandomizedRunner.access$600(RandomizedRunner.java:79)
[junit4:junit4]   2> 	at com.carrotsearch.randomizedtesting.RandomizedRunner$6.evaluate(RandomizedRunner.java:737)
[junit4:junit4]   2> 	at com.carrotsearch.randomizedtesting.RandomizedRunner$7.evaluate(RandomizedRunner.java:773)
[junit4:junit4]   2> 	at com.carrotsearch.randomizedtesting.RandomizedRunner$8.evaluate(RandomizedRunner.java:787)
[junit4:junit4]   2> 	at com.carrotsearch.randomizedtesting.rules.SystemPropertiesRestoreRule$1.evaluate(SystemPropertiesRestoreRule.java:53)
[junit4:junit4]   2> 	at org.apache.lucene.util.TestRuleSetupTeardownChained$1.evaluate(TestRuleSetupTeardownChained.java:50)
[junit4:junit4]   2> 	at org.apache.lucene.util.TestRuleFieldCacheSanity$1.evaluate(TestRuleFieldCacheSanity.java:51)
[junit4:junit4]   2> 	at org.apache.lucene.util.AbstractBeforeAfterRule$1.evaluate(AbstractBeforeAfterRule.java:45)
[junit4:junit4]   2> 	at com.carrotsearch.randomizedtesting.rules.SystemPropertiesInvariantRule$1.evaluate(SystemPropertiesInvariantRule.java:55)
[junit4:junit4]   2> 	at org.apache.lucene.util.TestRuleThreadAndTestName$1.evaluate(TestRuleThreadAndTestName.java:48)
[junit4:junit4]   2> 	at org.apache.lucene.util.TestRuleIgnoreAfterMaxFailures$1.evaluate(TestRuleIgnoreAfterMaxFailures.java:70)
[junit4:junit4]   2> 	at org.apache.lucene.util.TestRuleMarkFailure$1.evaluate(TestRuleMarkFailure.java:48)
[junit4:junit4]   2> 	at com.carrotsearch.randomizedtesting.rules.StatementAdapter.evaluate(StatementAdapter.java:36)
[junit4:junit4]   2> 	at com.carrotsearch.randomizedtesting.ThreadLeakControl$StatementRunner.run(ThreadLeakControl.java:345)
[junit4:junit4]   2> 	at com.carrotsearch.randomizedtesting.ThreadLeakControl.forkTimeoutingTask(ThreadLeakControl.java:769)
[junit4:junit4]   2> 	at com.carrotsearch.randomizedtesting.ThreadLeakControl$3.evaluate(ThreadLeakControl.java:429)
[junit4:junit4]   2> 	at com.carrotsearch.randomizedtesting.RandomizedRunner.runSingleTest(RandomizedRunner.java:746)
[junit4:junit4]   2> 	at com.carrotsearch.randomizedtesting.RandomizedRunner$3.evaluate(RandomizedRunner.java:648)
[junit4:junit4]   2> 	at com.carrotsearch.randomizedtesting.RandomizedRunner$4.evaluate(RandomizedRunner.java:682)
[junit4:junit4]   2> 	at com.carrotsearch.randomizedtesting.RandomizedRunner$5.evaluate(RandomizedRunner.java:693)
[junit4:junit4]   2> 	at com.carrotsearch.randomizedtesting.rules.StatementAdapter.evaluate(StatementAdapter.java:36)
[junit4:junit4]   2> 	at com.carrotsearch.randomizedtesting.rules.SystemPropertiesRestoreRule$1.evaluate(SystemPropertiesRestoreRule.java:53)
[junit4:junit4]   2> 	at org.apache.lucene.util.AbstractBeforeAfterRule$1.evaluate(AbstractBeforeAfterRule.java:45)
[junit4:junit4]   2> 	at org.apache.lucene.util.TestRuleStoreClassName$1.evaluate(TestRuleStoreClassName.java:42)
[junit4:junit4]   2> 	at com.carrotsearch.randomizedtesting.rules.SystemPropertiesInvariantRule$1.evaluate(SystemPropertiesInvariantRule.java:55)
[junit4:junit4]   2> 	at com.carrotsearch.randomizedtesting.rules.NoShadowingOrOverridesOnMethodsRule$1.evaluate(NoShadowingOrOverridesOnMethodsRule.java:39)
[junit4:junit4]   2> 	at com.carrotsearch.randomizedtesting.rules.NoShadowingOrOverridesOnMethodsRule$1.evaluate(NoShadowingOrOverridesOnMethodsRule.java:39)
[junit4:junit4]   2> 	at org.apache.lucene.util.TestRuleAssertionsRequired$1.evaluate(TestRuleAssertionsRequired.java:40)
[junit4:junit4]   2> 	at org.apache.lucene.util.TestRuleMarkFailure$1.evaluate(TestRuleMarkFailure.java:48)
[junit4:junit4]   2> 	at org.apache.lucene.util.TestRuleIgnoreAfterMaxFailures$1.evaluate(TestRuleIgnoreAfterMaxFailures.java:70)
[junit4:junit4]   2> 	at org.apache.lucene.util.TestRuleIgnoreTestSuites$1.evaluate(TestRuleIgnoreTestSuites.java:55)
[junit4:junit4]   2> 	at com.carrotsearch.randomizedtesting.rules.StatementAdapter.evaluate(StatementAdapter.java:36)
[junit4:junit4]   2> 	at com.carrotsearch.randomizedtesting.ThreadLeakControl$StatementRunner.run(ThreadLeakControl.java:345)
[junit4:junit4]   2> 	at java.lang.Thread.run(Thread.java:722)
[junit4:junit4]   2> 
[junit4:junit4]   2> 1891 T3251 oashc.SpellCheckComponent.inform Registering newSearcher listener for spellchecker: suggest
[junit4:junit4]   2> 1891 T3251 oashc.SpellCheckComponent.inform No queryConverter defined, using default converter
[junit4:junit4]   2> 1893 T3251 oashc.SpellCheckComponent.inform Initializing spell checkers
[junit4:junit4]   2> 1893 T3251 oasss.Suggester.init init: {name=suggest_tst,classname=org.apache.solr.spelling.suggest.Suggester,lookupImpl=org.apache.solr.spelling.suggest.tst.TSTLookup,field=suggest,storeDir=suggest_tst,buildOnCommit=true,threshold=0.0}
[junit4:junit4]   2> 1893 T3251 oasss.Suggester.init WARNING Loading stored lookup data failed java.io.FileNotFoundException: C:\Jenkins\workspace\Lucene-Solr-4.x-Windows\solr\build\solr-core\test\J0\.\solrtest-SuggesterTest-1345731407254\suggest_tst\tst.dat (The system cannot find the file specified)
[junit4:junit4]   2> 	at java.io.FileInputStream.open(Native Method)
[junit4:junit4]   2> 	at java.io.FileInputStream.<init>(FileInputStream.java:138)
[junit4:junit4]   2> 	at org.apache.solr.spelling.suggest.Suggester.init(Suggester.java:115)
[junit4:junit4]   2> 	at org.apache.solr.handler.component.SpellCheckComponent.inform(SpellCheckComponent.java:596)
[junit4:junit4]   2> 	at org.apache.solr.core.SolrResourceLoader.inform(SolrResourceLoader.java:592)
[junit4:junit4]   2> 	at org.apache.solr.core.SolrCore.<init>(SolrCore.java:698)
[junit4:junit4]   2> 	at org.apache.solr.core.SolrCore.<init>(SolrCore.java:566)
[junit4:junit4]   2> 	at org.apache.solr.util.TestHarness$Initializer.initialize(TestHarness.java:190)
[junit4:junit4]   2> 	at org.apache.solr.util.TestHarness.<init>(TestHarness.java:114)
[junit4:junit4]   2> 	at org.apache.solr.util.TestHarness.<init>(TestHarness.java:109)
[junit4:junit4]   2> 	at org.apache.solr.util.TestHarness.<init>(TestHarness.java:99)
[junit4:junit4]   2> 	at org.apache.solr.SolrTestCaseJ4.createCore(SolrTestCaseJ4.java:362)
[junit4:junit4]   2> 	at org.apache.solr.SolrTestCaseJ4.initCore(SolrTestCaseJ4.java:355)
[junit4:junit4]   2> 	at org.apache.solr.spelling.suggest.SuggesterTest.testReload(SuggesterTest.java:90)
[junit4:junit4]   2> 	at sun.reflect.NativeMethodAccessorImpl.invoke0(Native Method)
[junit4:junit4]   2> 	at sun.reflect.NativeMethodAccessorImpl.invoke(NativeMethodAccessorImpl.java:57)
[junit4:junit4]   2> 	at sun.reflect.DelegatingMethodAccessorImpl.invoke(DelegatingMethodAccessorImpl.java:43)
[junit4:junit4]   2> 	at java.lang.reflect.Method.invoke(Method.java:601)
[junit4:junit4]   2> 	at com.carrotsearch.randomizedtesting.RandomizedRunner.invoke(RandomizedRunner.java:1559)
[junit4:junit4]   2> 	at com.carrotsearch.randomizedtesting.RandomizedRunner.access$600(RandomizedRunner.java:79)
[junit4:junit4]   2> 	at com.carrotsearch.randomizedtesting.RandomizedRunner$6.evaluate(RandomizedRunner.java:737)
[junit4:junit4]   2> 	at com.carrotsearch.randomizedtesting.RandomizedRunner$7.evaluate(RandomizedRunner.java:773)
[junit4:junit4]   2> 	at com.carrotsearch.randomizedtesting.RandomizedRunner$8.evaluate(RandomizedRunner.java:787)
[junit4:junit4]   2> 	at com.carrotsearch.randomizedtesting.rules.SystemPropertiesRestoreRule$1.evaluate(SystemPropertiesRestoreRule.java:53)
[junit4:junit4]   2> 	at org.apache.lucene.util.TestRuleSetupTeardownChained$1.evaluate(TestRuleSetupTeardownChained.java:50)
[junit4:junit4]   2> 	at org.apache.lucene.util.TestRuleFieldCacheSanity$1.evaluate(TestRuleFieldCacheSanity.java:51)
[junit4:junit4]   2> 	at org.apache.lucene.util.AbstractBeforeAfterRule$1.evaluate(AbstractBeforeAfterRule.java:45)
[junit4:junit4]   2> 	at com.carrotsearch.randomizedtesting.rules.SystemPropertiesInvariantRule$1.evaluate(SystemPropertiesInvariantRule.java:55)
[junit4:junit4]   2> 	at org.apache.lucene.util.TestRuleThreadAndTestName$1.evaluate(TestRuleThreadAndTestName.java:48)
[junit4:junit4]   2> 	at org.apache.lucene.util.TestRuleIgnoreAfterMaxFailures$1.evaluate(TestRuleIgnoreAfterMaxFailures.java:70)
[junit4:junit4]   2> 	at org.apache.lucene.util.TestRuleMarkFailure$1.evaluate(TestRuleMarkFailure.java:48)
[junit4:junit4]   2> 	at com.carrotsearch.randomizedtesting.rules.StatementAdapter.evaluate(StatementAdapter.java:36)
[junit4:junit4]   2> 	at com.carrotsearch.randomizedtesting.ThreadLeakControl$StatementRunner.run(ThreadLeakControl.java:345)
[junit4:junit4]   2> 	at com.carrotsearch.randomizedtesting.ThreadLeakControl.forkTimeoutingTask(ThreadLeakControl.java:769)
[junit4:junit4]   2> 	at com.carrotsearch.randomizedtesting.ThreadLeakControl$3.evaluate(ThreadLeakControl.java:429)
[junit4:junit4]   2> 	at com.carrotsearch.randomizedtesting.RandomizedRunner.runSingleTest(RandomizedRunner.java:746)
[junit4:junit4]   2> 	at com.carrotsearch.randomizedtesting.RandomizedRunner$3.evaluate(RandomizedRunner.java:648)
[junit4:junit4]   2> 	at com.carrotsearch.randomizedtesting.RandomizedRunner$4.evaluate(RandomizedRunner.java:682)
[junit4:junit4]   2> 	at com.carrotsearch.randomizedtesting.RandomizedRunner$5.evaluate(RandomizedRunner.java:693)
[junit4:junit4]   2> 	at com.carrotsearch.randomizedtesting.rules.StatementAdapter.evaluate(StatementAdapter.java:36)
[junit4:junit4]   2> 	at com.carrotsearch.randomizedtesting.rules.SystemPropertiesRestoreRule$1.evaluate(SystemPropertiesRestoreRule.java:53)
[junit4:junit4]   2> 	at org.apache.lucene.util.AbstractBeforeAfterRule$1.evaluate(AbstractBeforeAfterRule.java:45)
[junit4:junit4]   2> 	at org.apache.lucene.util.TestRuleStoreClassName$1.evaluate(TestRuleStoreClassName.java:42)
[junit4:junit4]   2> 	at com.carrotsearch.randomizedtesting.rules.SystemPropertiesInvariantRule$1.evaluate(SystemPropertiesInvariantRule.java:55)
[junit4:junit4]   2> 	at com.carrotsearch.randomizedtesting.rules.NoShadowingOrOverridesOnMethodsRule$1.evaluate(NoShadowingOrOverridesOnMethodsRule.java:39)
[junit4:junit4]   2> 	at com.carrotsearch.randomizedtesting.rules.NoShadowingOrOverridesOnMethodsRule$1.evaluate(NoShadowingOrOverridesOnMethodsRule.java:39)
[junit4:junit4]   2> 	at org.apache.lucene.util.TestRuleAssertionsRequired$1.evaluate(TestRuleAssertionsRequired.java:40)
[junit4:junit4]   2> 	at org.apache.lucene.util.TestRuleMarkFailure$1.evaluate(TestRuleMarkFailure.java:48)
[junit4:junit4]   2> 	at org.apache.lucene.util.TestRuleIgnoreAfterMaxFailures$1.evaluate(TestRuleIgnoreAfterMaxFailures.java:70)
[junit4:junit4]   2> 	at org.apache.lucene.util.TestRuleIgnoreTestSuites$1.evaluate(TestRuleIgnoreTestSuites.java:55)
[junit4:junit4]   2> 	at com.carrotsearch.randomizedtesting.rules.StatementAdapter.evaluate(StatementAdapter.java:36)
[junit4:junit4]   2> 	at com.carrotsearch.randomizedtesting.ThreadLeakControl$StatementRunner.run(ThreadLeakControl.java:345)
[junit4:junit4]   2> 	at java.lang.Thread.run(Thread.java:722)
[junit4:junit4]   2> 
[junit4:junit4]   2> 1894 T3251 oashc.SpellCheckComponent.inform Registering newSearcher listener for spellchecker: suggest_tst
[junit4:junit4]   2> 1895 T3251 oashc.SpellCheckComponent.inform No queryConverter defined, using default converter
[junit4:junit4]   2> 1895 T3251 oashc.SpellCheckComponent.inform Initializing spell checkers
[junit4:junit4]   2> 1895 T3251 oasss.Suggester.init init: {name=suggest_fst,classname=org.apache.solr.spelling.suggest.Suggester,lookupImpl=org.apache.solr.spelling.suggest.fst.FSTLookup,field=suggest,storeDir=suggest_fst,buildOnCommit=true,weightBuckets=5,exactMatchFirst=true}
[junit4:junit4]   2> 1896 T3251 oasss.Suggester.init WARNING Loading stored lookup data failed java.io.FileNotFoundException: C:\Jenkins\workspace\Lucene-Solr-4.x-Windows\solr\build\solr-core\test\J0\.\solrtest-SuggesterTest-1345731407254\suggest_fst\fst.bin (The system cannot find the file specified)
[junit4:junit4]   2> 	at java.io.FileInputStream.open(Native Method)
[junit4:junit4]   2> 	at java.io.FileInputStream.<init>(FileInputStream.java:138)
[junit4:junit4]   2> 	at org.apache.solr.spelling.suggest.Suggester.init(Suggester.java:115)
[junit4:junit4]   2> 	at org.apache.solr.handler.component.SpellCheckComponent.inform(SpellCheckComponent.java:596)
[junit4:junit4]   2> 	at org.apache.solr.core.SolrResourceLoader.inform(SolrResourceLoader.java:592)
[junit4:junit4]   2> 	at org.apache.solr.core.SolrCore.<init>(SolrCore.java:698)
[junit4:junit4]   2> 	at org.apache.solr.core.SolrCore.<init>(SolrCore.java:566)
[junit4:junit4]   2> 	at org.apache.solr.util.TestHarness$Initializer.initialize(TestHarness.java:190)
[junit4:junit4]   2> 	at org.apache.solr.util.TestHarness.<init>(TestHarness.java:114)
[junit4:junit4]   2> 	at org.apache.solr.util.TestHarness.<init>(TestHarness.java:109)
[junit4:junit4]   2> 	at org.apache.solr.util.TestHarness.<init>(TestHarness.java:99)
[junit4:junit4]   2> 	at org.apache.solr.SolrTestCaseJ4.createCore(SolrTestCaseJ4.java:362)
[junit4:junit4]   2> 	at org.apache.solr.SolrTestCaseJ4.initCore(SolrTestCaseJ4.java:355)
[junit4:junit4]   2> 	at org.apache.solr.spelling.suggest.SuggesterTest.testReload(SuggesterTest.java:90)
[junit4:junit4]   2> 	at sun.reflect.NativeMethodAccessorImpl.invoke0(Native Method)
[junit4:junit4]   2> 	at sun.reflect.NativeMethodAccessorImpl.invoke(NativeMethodAccessorImpl.java:57)
[junit4:junit4]   2> 	at sun.reflect.DelegatingMethodAccessorImpl.invoke(DelegatingMethodAccessorImpl.java:43)
[junit4:junit4]   2> 	at java.lang.reflect.Method.invoke(Method.java:601)
[junit4:junit4]   2> 	at com.carrotsearch.randomizedtesting.RandomizedRunner.invoke(RandomizedRunner.java:1559)
[junit4:junit4]   2> 	at com.carrotsearch.randomizedtesting.RandomizedRunner.access$600(RandomizedRunner.java:79)
[junit4:junit4]   2> 	at com.carrotsearch.randomizedtesting.RandomizedRunner$6.evaluate(RandomizedRunner.java:737)
[junit4:junit4]   2> 	at com.carrotsearch.randomizedtesting.RandomizedRunner$7.evaluate(RandomizedRunner.java:773)
[junit4:junit4]   2> 	at com.carrotsearch.randomizedtesting.RandomizedRunner$8.evaluate(RandomizedRunner.java:787)
[junit4:junit4]   2> 	at com.carrotsearch.randomizedtesting.rules.SystemPropertiesRestoreRule$1.evaluate(SystemPropertiesRestoreRule.java:53)
[junit4:junit4]   2> 	at org.apache.lucene.util.TestRuleSetupTeardownChained$1.evaluate(TestRuleSetupTeardownChained.java:50)
[junit4:junit4]   2> 	at org.apache.lucene.util.TestRuleFieldCacheSanity$1.evaluate(TestRuleFieldCacheSanity.java:51)
[junit4:junit4]   2> 	at org.apache.lucene.util.AbstractBeforeAfterRule$1.evaluate(AbstractBeforeAfterRule.java:45)
[junit4:junit4]   2> 	at com.carrotsearch.randomizedtesting.rules.SystemPropertiesInvariantRule$1.evaluate(SystemPropertiesInvariantRule.java:55)
[junit4:junit4]   2> 	at org.apache.lucene.util.TestRuleThreadAndTestName$1.evaluate(TestRuleThreadAndTestName.java:48)
[junit4:junit4]   2> 	at org.apache.lucene.util.TestRuleIgnoreAfterMaxFailures$1.evaluate(TestRuleIgnoreAfterMaxFailures.java:70)
[junit4:junit4]   2> 	at org.apache.lucene.util.TestRuleMarkFailure$1.evaluate(TestRuleMarkFailure.java:48)
[junit4:junit4]   2> 	at com.carrotsearch.randomizedtesting.rules.StatementAdapter.evaluate(StatementAdapter.java:36)
[junit4:junit4]   2> 	at com.carrotsearch.randomizedtesting.ThreadLeakControl$StatementRunner.run(ThreadLeakControl.java:345)
[junit4:junit4]   2> 	at com.carrotsearch.randomizedtesting.ThreadLeakControl.forkTimeoutingTask(ThreadLeakControl.java:769)
[junit4:junit4]   2> 	at com.carrotsearch.randomizedtesting.ThreadLeakControl$3.evaluate(ThreadLeakControl.java:429)
[junit4:junit4]   2> 	at com.carrotsearch.randomizedtesting.RandomizedRunner.runSingleTest(RandomizedRunner.java:746)
[junit4:junit4]   2> 	at com.carrotsearch.randomizedtesting.RandomizedRunner$3.evaluate(RandomizedRunner.java:648)
[junit4:junit4]   2> 	at com.carrotsearch.randomizedtesting.RandomizedRunner$4.evaluate(RandomizedRunner.java:682)
[junit4:junit4]   2> 	at com.carrotsearch.randomizedtesting.RandomizedRunner$5.evaluate(RandomizedRunner.java:693)
[junit4:junit4]   2> 	at com.carrotsearch.randomizedtesting.rules.StatementAdapter.evaluate(StatementAdapter.java:36)
[junit4:junit4]   2> 	at com.carrotsearch.randomizedtesting.rules.SystemPropertiesRestoreRule$1.evaluate(SystemPropertiesRestoreRule.java:53)
[junit4:junit4]   2> 	at org.apache.lucene.util.AbstractBeforeAfterRule$1.evaluate(AbstractBeforeAfterRule.java:45)
[junit4:junit4]   2> 	at org.apache.lucene.util.TestRuleStoreClassName$1.evaluate(TestRuleStoreClassName.java:42)
[junit4:junit4]   2> 	at com.carrotsearch.randomizedtesting.rules.SystemPropertiesInvariantRule$1.evaluate(SystemPropertiesInvariantRule.java:55)
[junit4:junit4]   2> 	at com.carrotsearch.randomizedtesting.rules.NoShadowingOrOverridesOnMethodsRule$1.evaluate(NoShadowingOrOverridesOnMethodsRule.java:39)
[junit4:junit4]   2> 	at com.carrotsearch.randomizedtesting.rules.NoShadowingOrOverridesOnMethodsRule$1.evaluate(NoShadowingOrOverridesOnMethodsRule.java:39)
[junit4:junit4]   2> 	at org.apache.lucene.util.TestRuleAssertionsRequired$1.evaluate(TestRuleAssertionsRequired.java:40)
[junit4:junit4]   2> 	at org.apache.lucene.util.TestRuleMarkFailure$1.evaluate(TestRuleMarkFailure.java:48)
[junit4:junit4]   2> 	at org.apache.lucene.util.TestRuleIgnoreAfterMaxFailures$1.evaluate(TestRuleIgnoreAfterMaxFailures.java:70)
[junit4:junit4]   2> 	at org.apache.lucene.util.TestRuleIgnoreTestSuites$1.evaluate(TestRuleIgnoreTestSuites.java:55)
[junit4:junit4]   2> 	at com.carrotsearch.randomizedtesting.rules.StatementAdapter.evaluate(StatementAdapter.java:36)
[junit4:junit4]   2> 	at com.carrotsearch.randomizedtesting.ThreadLeakControl$StatementRunner.run(ThreadLeakControl.java:345)
[junit4:junit4]   2> 	at java.lang.Thread.run(Thread.java:722)
[junit4:junit4]   2> 
[junit4:junit4]   2> 1897 T3251 oashc.SpellCheckComponent.inform Registering newSearcher listener for spellchecker: suggest_fst
[junit4:junit4]   2> 1897 T3251 oashc.SpellCheckComponent.inform No queryConverter defined, using default converter
[junit4:junit4]   2> 1897 T3251 oashc.SpellCheckComponent.inform Initializing spell checkers
[junit4:junit4]   2> 1899 T3251 oasss.Suggester.init init: {name=suggest_wfst,classname=org.apache.solr.spelling.suggest.Suggester,lookupImpl=org.apache.solr.spelling.suggest.fst.WFSTLookupFactory,field=suggest,storeDir=suggest_wfst,buildOnCommit=true,exactMatchFirst=true}
[junit4:junit4]   2> 1899 T3251 oasss.Suggester.init WARNING Loading stored lookup data failed java.io.FileNotFoundException: C:\Jenkins\workspace\Lucene-Solr-4.x-Windows\solr\build\solr-core\test\J0\.\solrtest-SuggesterTest-1345731407254\suggest_wfst\wfst.bin (The system cannot find the file specified)
[junit4:junit4]   2> 	at java.io.FileInputStream.open(Native Method)
[junit4:junit4]   2> 	at java.io.FileInputStream.<init>(FileInputStream.java:138)
[junit4:junit4]   2> 	at org.apache.solr.spelling.suggest.Suggester.init(Suggester.java:115)
[junit4:junit4]   2> 	at org.apache.solr.handler.component.SpellCheckComponent.inform(SpellCheckComponent.java:596)
[junit4:junit4]   2> 	at org.apache.solr.core.SolrResourceLoader.inform(SolrResourceLoader.java:592)
[junit4:junit4]   2> 	at org.apache.solr.core.SolrCore.<init>(SolrCore.java:698)
[junit4:junit4]   2> 	at org.apache.solr.core.SolrCore.<init>(SolrCore.java:566)
[junit4:junit4]   2> 	at org.apache.solr.util.TestHarness$Initializer.initialize(TestHarness.java:190)
[junit4:junit4]   2> 	at org.apache.solr.util.TestHarness.<init>(TestHarness.java:114)
[junit4:junit4]   2> 	at org.apache.solr.util.TestHarness.<init>(TestHarness.java:109)
[junit4:junit4]   2> 	at org.apache.solr.util.TestHarness.<init>(TestHarness.java:99)
[junit4:junit4]   2> 	at org.apache.solr.SolrTestCaseJ4.createCore(SolrTestCaseJ4.java:362)
[junit4:junit4]   2> 	at org.apache.solr.SolrTestCaseJ4.initCore(SolrTestCaseJ4.java:355)
[junit4:junit4]   2> 	at org.apache.solr.spelling.suggest.SuggesterTest.testReload(SuggesterTest.java:90)
[junit4:junit4]   2> 	at sun.reflect.NativeMethodAccessorImpl.invoke0(Native Method)
[junit4:junit4]   2> 	at sun.reflect.NativeMethodAccessorImpl.invoke(NativeMethodAccessorImpl.java:57)
[junit4:junit4]   2> 	at sun.reflect.DelegatingMethodAccessorImpl.invoke(DelegatingMethodAccessorImpl.java:43)
[junit4:junit4]   2> 	at java.lang.reflect.Method.invoke(Method.java:601)
[junit4:junit4]   2> 	at com.carrotsearch.randomizedtesting.RandomizedRunner.invoke(RandomizedRunner.java:1559)
[junit4:junit4]   2> 	at com.carrotsearch.randomizedtesting.RandomizedRunner.access$600(RandomizedRunner.java:79)
[junit4:junit4]   2> 	at com.carrotsearch.randomizedtesting.RandomizedRunner$6.evaluate(RandomizedRunner.java:737)
[junit4:junit4]   2> 	at com.carrotsearch.randomizedtesting.RandomizedRunner$7.evaluate(RandomizedRunner.java:773)
[junit4:junit4]   2> 	at com.carrotsearch.randomizedtesting.RandomizedRunner$8.evaluate(RandomizedRunner.java:787)
[junit4:junit4]   2> 	at com.carrotsearch.randomizedtesting.rules.SystemPropertiesRestoreRule$1.evaluate(SystemPropertiesRestoreRule.java:53)
[junit4:junit4]   2> 	at org.apache.lucene.util.TestRuleSetupTeardownChained$1.evaluate(TestRuleSetupTeardownChained.java:50)
[junit4:junit4]   2> 	at org.apache.lucene.util.TestRuleFieldCacheSanity$1.evaluate(TestRuleFieldCacheSanity.java:51)
[junit4:junit4]   2> 	at org.apache.lucene.util.AbstractBeforeAfterRule$1.evaluate(AbstractBeforeAfterRule.java:45)
[junit4:junit4]   2> 	at com.carrotsearch.randomizedtesting.rules.SystemPropertiesInvariantRule$1.evaluate(SystemPropertiesInvariantRule.java:55)
[junit4:junit4]   2> 	at org.apache.lucene.util.TestRuleThreadAndTestName$1.evaluate(TestRuleThreadAndTestName.java:48)
[junit4:junit4]   2> 	at org.apache.lucene.util.TestRuleIgnoreAfterMaxFailures$1.evaluate(TestRuleIgnoreAfterMaxFailures.java:70)
[junit4:junit4]   2> 	at org.apache.lucene.util.TestRuleMarkFailure$1.evaluate(TestRuleMarkFailure.java:48)
[junit4:junit4]   2> 	at com.carrotsearch.randomizedtesting.rules.StatementAdapter.evaluate(StatementAdapter.java:36)
[junit4:junit4]   2> 	at com.carrotsearch.randomizedtesting.ThreadLeakControl$StatementRunner.run(ThreadLeakControl.java:345)
[junit4:junit4]   2> 	at com.carrotsearch.randomizedtesting.ThreadLeakControl.forkTimeoutingTask(ThreadLeakControl.java:769)
[junit4:junit4]   2> 	at com.carrotsearch.randomizedtesting.ThreadLeakControl$3.evaluate(ThreadLeakControl.java:429)
[junit4:junit4]   2> 	at com.carrotsearch.randomizedtesting.RandomizedRunner.runSingleTest(RandomizedRunner.java:746)
[junit4:junit4]   2> 	at com.carrotsearch.randomizedtesting.RandomizedRunner$3.evaluate(RandomizedRunner.java:648)
[junit4:junit4]   2> 	at com.carrotsearch.randomizedtesting.RandomizedRunner$4.evaluate(RandomizedRunner.java:682)
[junit4:junit4]   2> 	at com.carrotsearch.randomizedtesting.RandomizedRunner$5.evaluate(RandomizedRunner.java:693)
[junit4:junit4]   2> 	at com.carrotsearch.randomizedtesting.rules.StatementAdapter.evaluate(StatementAdapter.java:36)
[junit4:junit4]   2> 	at com.carrotsearch.randomizedtesting.rules.SystemPropertiesRestoreRule$1.evaluate(SystemPropertiesRestoreRule.java:53)
[junit4:junit4]   2> 	at org.apache.lucene.util.AbstractBeforeAfterRule$1.evaluate(AbstractBeforeAfterRule.java:45)
[junit4:junit4]   2> 	at org.apache.lucene.util.TestRuleStoreClassName$1.evaluate(TestRuleStoreClassName.java:42)
[junit4:junit4]   2> 	at com.carrotsearch.randomizedtesting.rules.SystemPropertiesInvariantRule$1.evaluate(SystemPropertiesInvariantRule.java:55)
[junit4:junit4]   2> 	at com.carrotsearch.randomizedtesting.rules.NoShadowingOrOverridesOnMethodsRule$1.evaluate(NoShadowingOrOverridesOnMethodsRule.java:39)
[junit4:junit4]   2> 	at com.carrotsearch.randomizedtesting.rules.NoShadowingOrOverridesOnMethodsRule$1.evaluate(NoShadowingOrOverridesOnMethodsRule.java:39)
[junit4:junit4]   2> 	at org.apache.lucene.util.TestRuleAssertionsRequired$1.evaluate(TestRuleAssertionsRequired.java:40)
[junit4:junit4]   2> 	at org.apache.lucene.util.TestRuleMarkFailure$1.evaluate(TestRuleMarkFailure.java:48)
[junit4:junit4]   2> 	at org.apache.lucene.util.TestRuleIgnoreAfterMaxFailures$1.evaluate(TestRuleIgnoreAfterMaxFailures.java:70)
[junit4:junit4]   2> 	at org.apache.lucene.util.TestRuleIgnoreTestSuites$1.evaluate(TestRuleIgnoreTestSuites.java:55)
[junit4:junit4]   2> 	at com.carrotsearch.randomizedtesting.rules.StatementAdapter.evaluate(StatementAdapter.java:36)
[junit4:junit4]   2> 	at com.carrotsearch.randomizedtesting.ThreadLeakControl$StatementRunner.run(ThreadLeakControl.java:345)
[junit4:junit4]   2> 	at java.lang.Thread.run(Thread.java:722)
[junit4:junit4]   2> 
[junit4:junit4]   2> 1900 T3251 oashc.SpellCheckComponent.inform Registering newSearcher listener for spellchecker: suggest_wfst
[junit4:junit4]   2> 1900 T3251 oashc.SpellCheckComponent.inform No queryConverter defined, using default converter
[junit4:junit4]   2> 1901 T3251 oashc.HttpShardHandlerFactory.getParameter Setting socketTimeout to: 0
[junit4:junit4]   2> 1901 T3251 oashc.HttpShardHandlerFactory.getParameter Setting urlScheme to: http://
[junit4:junit4]   2> 1901 T3251 oashc.HttpShardHandlerFactory.getParameter Setting connTimeout to: 0
[junit4:junit4]   2> 1901 T3251 oashc.HttpShardHandlerFactory.getParameter Setting maxConnectionsPerHost to: 20
[junit4:junit4]   2> 1902 T3251 oashc.HttpShardHandlerFactory.getParameter Setting corePoolSize to: 0
[junit4:junit4]   2> 1902 T3251 oashc.HttpShardHandlerFactory.getParameter Setting maximumPoolSize to: 2147483647
[junit4:junit4]   2> 1902 T3251 oashc.HttpShardHandlerFactory.getParameter Setting maxThreadIdleTime to: 5
[junit4:junit4]   2> 1904 T3251 oashc.HttpShardHandlerFactory.getParameter Setting sizeOfQueue to: -1
[junit4:junit4]   2> 1904 T3251 oashc.HttpShardHandlerFactory.getParameter Setting fairnessPolicy to: false
[junit4:junit4]   2> 1904 T3251 oascsi.HttpClientUtil.createClient Creating new http client, config:maxConnectionsPerHost=20&maxConnections=10000&socketTimeout=0&connTimeout=0&retry=false
[junit4:junit4]   2> 1908 T3253 oasc.SolrCore.registerSearcher [collection1] Registered new searcher Searcher@10dd8cfe main{StandardDirectoryReader(segments_2:3 _0(4.0.0.2):C3)}
[junit4:junit4]   2> 1908 T3251 oasc.CoreContainer.register registering core: collection1
[junit4:junit4]   2> 1910 T3251 oas.SolrTestCaseJ4.initCore ####initCore end
[junit4:junit4]   2> ASYNC  NEW_CORE C247 name=collection1 org.apache.solr.core.SolrCore@5beb4999
[junit4:junit4]   2> 1911 T3251 C247 REQ [collection1] webapp=null path=null params={q=ac&spellcheck.count=2&qt=/suggest&spellcheck.onlyMorePopular=true} status=0 QTime=1 
[junit4:junit4]   2> 1915 T3251 oas.SolrTestCaseJ4.assertQ SEVERE REQUEST FAILED: xpath=//lst[@name='spellcheck']/lst[@name='suggestions']/lst[@name='ac']/int[@name='numFound'][.='2']
[junit4:junit4]   2> 		xml response was: <?xml version="1.0" encoding="UTF-8"?>
[junit4:junit4]   2> 	<response>
[junit4:junit4]   2> 	<lst name="responseHeader"><int name="status">0</int><int name="QTime">1</int></lst><lst name="spellcheck"><lst name="suggestions"/></lst>
[junit4:junit4]   2> 	</response>
[junit4:junit4]   2> 	
[junit4:junit4]   2> 		request was:q=ac&spellcheck.count=2&qt=/suggest&spellcheck.onlyMorePopular=true
[junit4:junit4]   2> 1916 T3251 oasc.SolrException.log SEVERE REQUEST FAILED: q=ac&spellcheck.count=2&qt=/suggest&spellcheck.onlyMorePopular=true:java.lang.RuntimeException: REQUEST FAILED: xpath=//lst[@name='spellcheck']/lst[@name='suggestions']/lst[@name='ac']/int[@name='numFound'][.='2']
[junit4:junit4]   2> 		xml response was: <?xml version="1.0" encoding="UTF-8"?>
[junit4:junit4]   2> 	<response>
[junit4:junit4]   2> 	<lst name="responseHeader"><int name="status">0</int><int name="QTime">1</int></lst><lst name="spellcheck"><lst name="suggestions"/></lst>
[junit4:junit4]   2> 	</response>
[junit4:junit4]   2> 	
[junit4:junit4]   2> 		request was:q=ac&spellcheck.count=2&qt=/suggest&spellcheck.onlyMorePopular=true
[junit4:junit4]   2> 		at org.apache.solr.SolrTestCaseJ4.assertQ(SolrTestCaseJ4.java:486)
[junit4:junit4]   2> 		at org.apache.solr.SolrTestCaseJ4.assertQ(SolrTestCaseJ4.java:460)
[junit4:junit4]   2> 		at org.apache.solr.spelling.suggest.SuggesterTest.testReload(SuggesterTest.java:91)
[junit4:junit4]   2> 		at sun.reflect.NativeMethodAccessorImpl.invoke0(Native Method)
[junit4:junit4]   2> 		at sun.reflect.NativeMethodAccessorImpl.invoke(NativeMethodAccessorImpl.java:57)
[junit4:junit4]   2> 		at sun.reflect.DelegatingMethodAccessorImpl.invoke(DelegatingMethodAccessorImpl.java:43)
[junit4:junit4]   2> 		at java.lang.reflect.Method.invoke(Method.java:601)
[junit4:junit4]   2> 		at com.carrotsearch.randomizedtesting.RandomizedRunner.invoke(RandomizedRunner.java:1559)
[junit4:junit4]   2> 		at com.carrotsearch.randomizedtesting.RandomizedRunner.access$600(RandomizedRunner.java:79)
[junit4:junit4]   2> 		at com.carrotsearch.randomizedtesting.RandomizedRunner$6.evaluate(RandomizedRunner.java:737)
[junit4:junit4]   2> 		at com.carrotsearch.randomizedtesting.RandomizedRunner$7.evaluate(RandomizedRunner.java:773)
[junit4:junit4]   2> 		at com.carrotsearch.randomizedtesting.RandomizedRunner$8.evaluate(RandomizedRunner.java:787)
[junit4:junit4]   2> 		at com.carrotsearch.randomizedtesting.rules.SystemPropertiesRestoreRule$1.evaluate(SystemPropertiesRestoreRule.java:53)
[junit4:junit4]   2> 		at org.apache.lucene.util.TestRuleSetupTeardownChained$1.evaluate(TestRuleSetupTeardownChained.java:50)
[junit4:junit4]   2> 		at org.apache.lucene.util.TestRuleFieldCacheSanity$1.evaluate(TestRuleFieldCacheSanity.java:51)
[junit4:junit4]   2> 		at org.apache.lucene.util.AbstractBeforeAfterRule$1.evaluate(AbstractBeforeAfterRule.java:45)
[junit4:junit4]   2> 		at com.carrotsearch.randomizedtesting.rules.SystemPropertiesInvariantRule$1.evaluate(SystemPropertiesInvariantRule.java:55)
[junit4:junit4]   2> 		at org.apache.lucene.util.TestRuleThreadAndTestName$1.evaluate(TestRuleThreadAndTestName.java:48)
[junit4:junit4]   2> 		at org.apache.lucene.util.TestRuleIgnoreAfterMaxFailures$1.evaluate(TestRuleIgnoreAfterMaxFailures.java:70)
[junit4:junit4]   2> 		at org.apache.lucene.util.TestRuleMarkFailure$1.evaluate(TestRuleMarkFailure.java:48)
[junit4:junit4]   2> 		at com.carrotsearch.randomizedtesting.rules.StatementAdapter.evaluate(StatementAdapter.java:36)
[junit4:junit4]   2> 		at com.carrotsearch.randomizedtesting.ThreadLeakControl$StatementRunner.run(ThreadLeakControl.java:345)
[junit4:junit4]   2> 		at com.carrotsearch.randomizedtesting.ThreadLeakControl.forkTimeoutingTask(ThreadLeakControl.java:769)
[junit4:junit4]   2> 		at com.carrotsearch.randomizedtesting.ThreadLeakControl$3.evaluate(ThreadLeakControl.java:429)
[junit4:junit4]   2> 		at com.carrotsearch.randomizedtesting.RandomizedRunner.runSingleTest(RandomizedRunner.java:746)
[junit4:junit4]   2> 		at com.carrotsearch.randomizedtesting.RandomizedRunner$3.evaluate(RandomizedRunner.java:648)
[junit4:junit4]   2> 		at com.carrotsearch.randomizedtesting.RandomizedRunner$4.evaluate(RandomizedRunner.java:682)
[junit4:junit4]   2> 		at com.carrotsearch.randomizedtesting.RandomizedRunner$5.evaluate(RandomizedRunner.java:693)
[junit4:junit4]   2> 		at com.carrotsearch.randomizedtesting.rules.StatementAdapter.evaluate(StatementAdapter.java:36)
[junit4:junit4]   2> 		at com.carrotsearch.randomizedtesting.rules.SystemPropertiesRestoreRule$1.evaluate(SystemPropertiesRestoreRule.java:53)
[junit4:junit4]   2> 		at org.apache.lucene.util.AbstractBeforeAfterRule$1.evaluate(AbstractBeforeAfterRule.java:45)
[junit4:junit4]   2> 		at org.apache.lucene.util.TestRuleStoreClassName$1.evaluate(TestRuleStoreClassName.java:42)
[junit4:junit4]   2> 		at com.carrotsearch.randomizedtesting.rules.SystemPropertiesInvariantRule$1.evaluate(SystemPropertiesInvariantRule.java:55)
[junit4:junit4]   2> 		at com.carrotsearch.randomizedtesting.rules.NoShadowingOrOverridesOnMethodsRule$1.evaluate(NoShadowingOrOverridesOnMethodsRule.java:39)
[junit4:junit4]   2> 		at com.carrotsearch.randomizedtesting.rules.NoShadowingOrOverridesOnMethodsRule$1.evaluate(NoShadowingOrOverridesOnMethodsRule.java:39)
[junit4:junit4]   2> 		at org.apache.lucene.util.TestRuleAssertionsRequired$1.evaluate(TestRuleAssertionsRequired.java:40)
[junit4:junit4]   2> 		at org.apache.lucene.util.TestRuleMarkFailure$1.evaluate(TestRuleMarkFailure.java:48)
[junit4:junit4]   2> 		at org.apache.lucene.util.TestRuleIgnoreAfterMaxFailures$1.evaluate(TestRuleIgnoreAfterMaxFailures.java:70)
[junit4:junit4]   2> 		at org.apache.lucene.util.TestRuleIgnoreTestSuites$1.evaluate(TestRuleIgnoreTestSuites.java:55)
[junit4:junit4]   2> 		at com.carrotsearch.randomizedtesting.rules.StatementAdapter.evaluate(StatementAdapter.java:36)
[junit4:junit4]   2> 		at com.carrotsearch.randomizedtesting.ThreadLeakControl$StatementRunner.run(ThreadLeakControl.java:345)
[junit4:junit4]   2> 		at java.lang.Thread.run(Thread.java:722)
[junit4:junit4]   2> 	
[junit4:junit4]   2> 1917 T3251 oas.SolrTestCaseJ4.tearDown ###Ending testReload
[junit4:junit4]   2> NOTE: reproduce with: ant test  -Dtestcase=SuggesterTest -Dtests.method=testReload -Dtests.seed=52F31322259ED6B7 -Dtests.slow=true -Dtests.locale=ar_DZ -Dtests.timezone=America/Indiana/Knox -Dtests.file.encoding=Cp1252
[junit4:junit4] ERROR   1.63s | SuggesterTest.testReload <<<
[junit4:junit4]    > Throwable #1: java.lang.RuntimeException: Exception during query
[junit4:junit4]    > 	at __randomizedtesting.SeedInfo.seed([52F31322259ED6B7:95036B21EFDD2EA5]:0)
[junit4:junit4]    > 	at org.apache.solr.SolrTestCaseJ4.assertQ(SolrTestCaseJ4.java:493)
[junit4:junit4]    > 	at org.apache.solr.SolrTestCaseJ4.assertQ(SolrTestCaseJ4.java:460)
[junit4:junit4]    > 	at org.apache.solr.spelling.suggest.SuggesterTest.testReload(SuggesterTest.java:91)
[junit4:junit4]    > 	at sun.reflect.NativeMethodAccessorImpl.invoke0(Native Method)
[junit4:junit4]    > 	at sun.reflect.NativeMethodAccessorImpl.invoke(NativeMethodAccessorImpl.java:57)
[junit4:junit4]    > 	at sun.reflect.DelegatingMethodAccessorImpl.invoke(DelegatingMethodAccessorImpl.java:43)
[junit4:junit4]    > 	at java.lang.reflect.Method.invoke(Method.java:601)
[junit4:junit4]    > 	at com.carrotsearch.randomizedtesting.RandomizedRunner.invoke(RandomizedRunner.java:1559)
[junit4:junit4]    > 	at com.carrotsearch.randomizedtesting.RandomizedRunner.access$600(RandomizedRunner.java:79)
[junit4:junit4]    > 	at com.carrotsearch.randomizedtesting.RandomizedRunner$6.evaluate(RandomizedRunner.java:737)
[junit4:junit4]    > 	at com.carrotsearch.randomizedtesting.RandomizedRunner$7.evaluate(RandomizedRunner.java:773)
[junit4:junit4]    > 	at com.carrotsearch.randomizedtesting.RandomizedRunner$8.evaluate(RandomizedRunner.java:787)
[junit4:junit4]    > 	at com.carrotsearch.randomizedtesting.rules.SystemPropertiesRestoreRule$1.evaluate(SystemPropertiesRestoreRule.java:53)
[junit4:junit4]    > 	at org.apache.lucene.util.TestRuleSetupTeardownChained$1.evaluate(TestRuleSetupTeardownChained.java:50)
[junit4:junit4]    > 	at org.apache.lucene.util.TestRuleFieldCacheSanity$1.evaluate(TestRuleFieldCacheSanity.java:51)
[junit4:junit4]    > 	at org.apache.lucene.util.AbstractBeforeAfterRule$1.evaluate(AbstractBeforeAfterRule.java:45)
[junit4:junit4]    > 	at com.carrotsearch.randomizedtesting.rules.SystemPropertiesInvariantRule$1.evaluate(SystemPropertiesInvariantRule.java:55)
[junit4:junit4]    > 	at org.apache.lucene.util.TestRuleThreadAndTestName$1.evaluate(TestRuleThreadAndTestName.java:48)
[junit4:junit4]    > 	at org.apache.lucene.util.TestRuleIgnoreAfterMaxFailures$1.evaluate(TestRuleIgnoreAfterMaxFailures.java:70)
[junit4:junit4]    > 	at org.apache.lucene.util.TestRuleMarkFailure$1.evaluate(TestRuleMarkFailure.java:48)
[junit4:junit4]    > 	at com.carrotsearch.randomizedtesting.rules.StatementAdapter.evaluate(StatementAdapter.java:36)
[junit4:junit4]    > 	at com.carrotsearch.randomizedtesting.ThreadLeakControl$StatementRunner.run(ThreadLeakControl.java:345)
[junit4:junit4]    > 	at com.carrotsearch.randomizedtesting.ThreadLeakControl.forkTimeoutingTask(ThreadLeakControl.java:769)
[junit4:junit4]    > 	at com.carrotsearch.randomizedtesting.ThreadLeakControl$3.evaluate(ThreadLeakControl.java:429)
[junit4:junit4]    > 	at com.carrotsearch.randomizedtesting.RandomizedRunner.runSingleTest(RandomizedRunner.java:746)
[junit4:junit4]    > 	at com.carrotsearch.randomizedtesting.RandomizedRunner$3.evaluate(RandomizedRunner.java:648)
[junit4:junit4]    > 	at com.carrotsearch.randomizedtesting.RandomizedRunner$4.evaluate(RandomizedRunner.java:682)
[junit4:junit4]    > 	at com.carrotsearch.randomizedtesting.RandomizedRunner$5.evaluate(RandomizedRunner.java:693)
[junit4:junit4]    > 	at com.carrotsearch.randomizedtesting.rules.StatementAdapter.evaluate(StatementAdapter.java:36)
[junit4:junit4]    > 	at com.carrotsearch.randomizedtesting.rules.SystemPropertiesRestoreRule$1.evaluate(SystemPropertiesRestoreRule.java:53)
[junit4:junit4]    > 	at org.apache.lucene.util.AbstractBeforeAfterRule$1.evaluate(AbstractBeforeAfterRule.java:45)
[junit4:junit4]    > 	at org.apache.lucene.util.TestRuleStoreClassName$1.evaluate(TestRuleStoreClassName.java:42)
[junit4:junit4]    > 	at com.carrotsearch.randomizedtesting.rules.SystemPropertiesInvariantRule$1.evaluate(SystemPropertiesInvariantRule.java:55)
[junit4:junit4]    > 	at com.carrotsearch.randomizedtesting.rules.NoShadowingOrOverridesOnMethodsRule$1.evaluate(NoShadowingOrOverridesOnMethodsRule.java:39)
[junit4:junit4]    > 	at com.carrotsearch.randomizedtesting.rules.NoShadowingOrOverridesOnMethodsRule$1.evaluate(NoShadowingOrOverridesOnMethodsRule.java:39)
[junit4:junit4]    > 	at org.apache.lucene.util.TestRuleAssertionsRequired$1.evaluate(TestRuleAssertionsRequired.java:40)
[junit4:junit4]    > 	at org.apache.lucene.util.TestRuleMarkFailure$1.evaluate(TestRuleMarkFailure.java:48)
[junit4:junit4]    > 	at org.apache.lucene.util.TestRuleIgnoreAfterMaxFailures$1.evaluate(TestRuleIgnoreAfterMaxFailures.java:70)
[junit4:junit4]    > 	at org.apache.lucene.util.TestRuleIgnoreTestSuites$1.evaluate(TestRuleIgnoreTestSuites.java:55)
[junit4:junit4]    > 	at com.carrotsearch.randomizedtesting.rules.StatementAdapter.evaluate(StatementAdapter.java:36)
[junit4:junit4]    > 	at com.carrotsearch.randomizedtesting.ThreadLeakControl$StatementRunner.run(ThreadLeakControl.java:345)
[junit4:junit4]    > 	at java.lang.Thread.run(Thread.java:722)
[junit4:junit4]    > Caused by: java.lang.RuntimeException: REQUEST FAILED: xpath=//lst[@name='spellcheck']/lst[@name='suggestions']/lst[@name='ac']/int[@name='numFound'][.='2']
[junit4:junit4]    > 	xml response was: <?xml version="1.0" encoding="UTF-8"?>
[junit4:junit4]    > <response>
[junit4:junit4]    > <lst name="responseHeader"><int name="status">0</int><int name="QTime">1</int></lst><lst name="spellcheck"><lst name="suggestions"/></lst>
[junit4:junit4]    > </response>
[junit4:junit4]    > 
[junit4:junit4]    > 	request was:q=ac&spellcheck.count=2&qt=/suggest&spellcheck.onlyMorePopular=true
[junit4:junit4]    > 	at org.apache.solr.SolrTestCaseJ4.assertQ(SolrTestCaseJ4.java:486)
[junit4:junit4]    > 	... 41 more
[junit4:junit4]   2> 1938 T3251 oas.SolrTestCaseJ4.setUp ###Starting testRebuild
[junit4:junit4]   2> 1949 T3251 C247 oasc.SolrDeletionPolicy.onInit SolrDeletionPolicy.onInit: commits:num=1
[junit4:junit4]   2> 		commit{dir=MockDirWrapper(NRTCachingDirectory(org.apache.lucene.store.MMapDirectory@C:\Jenkins\workspace\Lucene-Solr-4.x-Windows\solr\build\solr-core\test\J0\solrtest-SuggesterTest-1345731407254\index lockFactory=org.apache.lucene.store.NativeFSLockFactory@284dc05a; maxCacheMB=0.1669921875 maxMergeSizeMB=0.6923828125)),segFN=segments_2,generation=2,filenames=[_0_TestBloomFilteredLucene40Postings_0.tim, _0_TestBloomFilteredLucene40Postings_0.blm, _0_TestBloomFilteredLucene40Postings_0.tip, _0.fnm, _0_Pulsing40_0.tim, _0_MockSep_0.pos, _0_Memory_0.ram, _0_TestBloomFilteredLucene40Postings_0.prx, _0_nrm.cfs, _0_Pulsing40_0.prx, _0_Pulsing40_0.frq, _0_MockSep_0.tib, _0_MockSep_0.skp, _0_nrm.cfe, _0_Pulsing40_0.tip, _0_MockSep_0.frq, segments_2, _0_TestBloomFilteredLucene40Postings_0.frq, _0.fdx, _0_MockSep_0.tii, _0_MockSep_0.doc, _0_MockSep_0.pyl, _0.si, _0.fdt]
[junit4:junit4]   2> 1950 T3251 C247 oasc.SolrDeletionPolicy.updateCommits newest commit = 2
[junit4:junit4]   2> 1951 T3251 C247 UPDATE [collection1] webapp=null path=null params={} {add=[1]} 0 8
[junit4:junit4]   2> 1960 T3251 C247 UPDATE [collection1] webapp=null path=null params={} {add=[2]} 0 1
[junit4:junit4]   2> 1968 T3251 C247 UPDATE [collection1] webapp=null path=null params={} {add=[3]} 0 1
[junit4:junit4]   2> 1976 T3251 C247 oasu.DirectUpdateHandler2.commit start commit{flags=0,_version_=0,optimize=false,openSearcher=true,waitSearcher=true,expungeDeletes=false,softCommit=false}
[junit4:junit4]   2> 2502 T3251 C247 oasc.SolrDeletionPolicy.onCommit SolrDeletionPolicy.onCommit: commits:num=2
[junit4:junit4]   2> 		commit{dir=MockDirWrapper(NRTCachingDirectory(org.apache.lucene.store.MMapDirectory@C:\Jenkins\workspace\Lucene-Solr-4.x-Windows\solr\build\solr-core\test\J0\solrtest-SuggesterTest-1345731407254\index lockFactory=org.apache.lucene.store.NativeFSLockFactory@284dc05a; maxCacheMB=0.1669921875 maxMergeSizeMB=0.6923828125)),segFN=segments_2,generation=2,filenames=[_0_TestBloomFilteredLucene40Postings_0.tim, _0_TestBloomFilteredLucene40Postings_0.blm, _0_TestBloomFilteredLucene40Postings_0.tip, _0.fnm, _0_Pulsing40_0.tim, _0_MockSep_0.pos, _0_Memory_0.ram, _0_TestBloomFilteredLucene40Postings_0.prx, _0_nrm.cfs, _0_Pulsing40_0.prx, _0_Pulsing40_0.frq, _0_MockSep_0.tib, _0_MockSep_0.skp, _0_nrm.cfe, _0_Pulsing40_0.tip, _0_MockSep_0.frq, segments_2, _0_TestBloomFilteredLucene40Postings_0.frq, _0.fdx, _0_MockSep_0.tii, _0_MockSep_0.doc, _0_MockSep_0.pyl, _0.si, _0.fdt]
[junit4:junit4]   2> 		commit{dir=MockDirWrapper(NRTCachingDirectory(org.apache.lucene.store.MMapDirectory@C:\Jenkins\workspace\Lucene-Solr-4.x-Windows\solr\build\solr-core\test\J0\solrtest-SuggesterTest-1345731407254\index lockFactory=org.apache.lucene.store.NativeFSLockFactory@284dc05a; maxCacheMB=0.1669921875 maxMergeSizeMB=0.6923828125)),segFN=segments_3,generation=3,filenames=[_1_MockSep_0.frq, _1_Pulsing40_0.tip, _0_MockSep_0.pos, _1_Pulsing40_0.tim, _0_TestBloomFilteredLucene40Postings_0.prx, _1_TestBloomFilteredLucene40Postings_0.blm, _0_Pulsing40_0.prx, _1.fnm, _0_Pulsing40_0.frq, _1_Pulsing40_0.frq, _1_TestBloomFilteredLucene40Postings_0.tip, _1_Memory_0.ram, _0_MockSep_0.skp, _1_Pulsing40_0.prx, _0_Pulsing40_0.tip, _0_TestBloomFilteredLucene40Postings_0.frq, _1_TestBloomFilteredLucene40Postings_0.tim, _0.si, _0_MockSep_0.doc, _1_MockSep_0.pyl, _1_MockSep_0.doc, _1_nrm.cfs, _0_TestBloomFilteredLucene40Postings_0.tim, _1_MockSep_0.skp, _0_TestBloomFilteredLucene40Postings_0.tip, _0_TestBloomFilteredLucene40Postings_0.blm, _1_TestBloomFilteredLucene40Postings_0.prx, _0_Pulsing40_0.tim, _0.fnm, _1_MockSep_0.pos, _1_MockSep_0.tib, _0_Memory_0.ram, _0_nrm.cfs, _1_TestBloomFilteredLucene40Postings_0.frq, _1_MockSep_0.tii, _1_nrm.cfe, _0_MockSep_0.tib, _1.fdx, _1.fdt, _1.si, _0_nrm.cfe, _0_MockSep_0.frq, _0.fdx, _0_MockSep_0.tii, _0_MockSep_0.pyl, segments_3, _0.fdt]
[junit4:junit4]   2> 2503 T3251 C247 oasc.SolrDeletionPolicy.updateCommits newest commit = 3
[junit4:junit4]   2> 2515 T3251 C247 oass.SolrIndexSearcher.<init> Opening Searcher@1fd62044 main
[junit4:junit4]   2> 2517 T3251 C247 oass.SolrIndexSearcher.getIndexDir WARNING WARNING: Directory impl does not support setting indexDir: org.apache.lucene.store.MockDirectoryWrapper
[junit4:junit4]   2> 2518 T3253 oashc.SpellCheckComponent$SpellCheckerListener.buildSpellIndex Building spell index for spell checker: suggest
[junit4:junit4]   2> 2518 T3251 C247 oasu.DirectUpdateHandler2.commit end_commit_flush
[junit4:junit4]   2> 2518 T3253 oasss.Suggester.build build()
[junit4:junit4]   2> 2524 T3253 oasss.Suggester.build Stored suggest data to: C:\Jenkins\workspace\Lucene-Solr-4.x-Windows\solr\build\solr-core\test\J0\.\solrtest-SuggesterTest-1345731407254\suggest\jaspell.dat
[junit4:junit4]   2> 2524 T3253 oashc.SpellCheckComponent$SpellCheckerListener.buildSpellIndex Building spell index for spell checker: suggest_tst
[junit4:junit4]   2> 2524 T3253 oasss.Suggester.build build()
[junit4:junit4]   2> 2535 T3253 oasss.Suggester.build Stored suggest data to: C:\Jenkins\workspace\Lucene-Solr-4.x-Windows\solr\build\solr-core\test\J0\.\solrtest-SuggesterTest-1345731407254\suggest_tst\tst.dat
[junit4:junit4]   2> 2536 T3253 oashc.SpellCheckComponent$SpellCheckerListener.buildSpellIndex Building spell index for spell checker: suggest_fst
[junit4:junit4]   2> 2536 T3253 oasss.Suggester.build build()
[junit4:junit4]   2> 2546 T3253 oasss.Suggester.build Stored suggest data to: C:\Jenkins\workspace\Lucene-Solr-4.x-Windows\solr\build\solr-core\test\J0\.\solrtest-SuggesterTest-1345731407254\suggest_fst\fst.bin
[junit4:junit4]   2> 2547 T3253 oashc.SpellCheckComponent$SpellCheckerListener.buildSpellIndex Building spell index for spell checker: suggest_wfst
[junit4:junit4]   2> 2547 T3253 oasss.Suggester.build build()
[junit4:junit4]   2> 2553 T3253 oasss.Suggester.build Stored suggest data to: C:\Jenkins\workspace\Lucene-Solr-4.x-Windows\solr\build\solr-core\test\J0\.\solrtest-SuggesterTest-1345731407254\suggest_wfst\wfst.bin
[junit4:junit4]   2> 2553 T3253 oasc.SolrCore.registerSearcher [collection1] Registered new searcher Searcher@1fd62044 main{StandardDirectoryReader(segments_3:5 _0(4.0.0.2):C3 _1(4.0.0.2):C3)}
[junit4:junit4]   2> 2556 T3251 C247 UPDATE [collection1] webapp=null path=null params={} {commit=} 0 580
[junit4:junit4]   2> 2559 T3251 C247 REQ [collection1] webapp=null path=null params={q=ac&spellcheck.count=2&qt=/suggest&spellcheck.onlyMorePopular=true} status=0 QTime=1 
[junit4:junit4]   2> 2569 T3251 C247 UPDATE [collection1] webapp=null path=null params={} {add=[4]} 0 1
[junit4:junit4]   2> 2627 T3251 C247 oasu.DirectUpdateHandler2.commit start commit{flags=0,_version_=0,optimize=false,openSearcher=true,waitSearcher=true,expungeDeletes=false,softCommit=false}
[junit4:junit4]   2> 2896 T3251 C247 oasc.SolrDeletionPolicy.onCommit SolrDeletionPolicy.onCommit: commits:num=2
[junit4:junit4]   2> 		commit{dir=MockDirWrapper(NRTCachingDirectory(org.apache.lucene.store.MMapDirectory@C:\Jenkins\workspace\Lucene-Solr-4.x-Windows\solr\build\solr-core\test\J0\solrtest-SuggesterTest-1345731407254\index lockFactory=org.apache.lucene.store.NativeFSLockFactory@284dc05a; maxCacheMB=0.1669921875 maxMergeSizeMB=0.6923828125)),segFN=segments_3,generation=3,filenames=[_1_MockSep_0.frq, _1_Pulsing40_0.tip, _0_MockSep_0.pos, _1_Pulsing40_0.tim, _0_TestBloomFilteredLucene40Postings_0.prx, _1_TestBloomFilteredLucene40Postings_0.blm, _0_Pulsing40_0.prx, _1.fnm, _0_Pulsing40_0.frq, _1_Pulsing40_0.frq, _1_TestBloomFilteredLucene40Postings_0.tip, _1_Memory_0.ram, _0_MockSep_0.skp, _1_Pulsing40_0.prx, _0_Pulsing40_0.tip, _0_TestBloomFilteredLucene40Postings_0.frq, _1_TestBloomFilteredLucene40Postings_0.tim, _0.si, _0_MockSep_0.doc, _1_MockSep_0.pyl, _1_MockSep_0.doc, _1_nrm.cfs, _0_TestBloomFilteredLucene40Postings_0.tim, _1_MockSep_0.skp, _0_TestBloomFilteredLucene40Postings_0.tip, _0_TestBloomFilteredLucene40Postings_0.blm, _1_TestBloomFilteredLucene40Postings_0.prx, _0_Pulsing40_0.tim, _0.fnm, _1_MockSep_0.pos, _1_MockSep_0.tib, _0_Memory_0.ram, _0_nrm.cfs, _1_TestBloomFilteredLucene40Postings_0.frq, _1_MockSep_0.tii, _1_nrm.cfe, _0_MockSep_0.tib, _1.fdx, _1.fdt, _1.si, _0_nrm.cfe, _0_MockSep_0.frq, _0.fdx, _0_MockSep_0.tii, _0_MockSep_0.pyl, segments_3, _0.fdt]
[junit4:junit4]   2> 		commit{dir=MockDirWrapper(NRTCachingDirectory(org.apache.lucene.store.MMapDirectory@C:\Jenkins\workspace\Lucene-Solr-4.x-Windows\solr\build\solr-core\test\J0\solrtest-SuggesterTest-1345731407254\index lockFactory=org.apache.lucene.store.NativeFSLockFactory@284dc05a; maxCacheMB=0.1669921875 maxMergeSizeMB=0.6923828125)),segFN=segments_4,generation=4,filenames=[_2_TestBloomFilteredLucene40Postings_0.prx, _1_Pulsing40_0.tip, _0_MockSep_0.pos, _2_TestBloomFilteredLucene40Postings_0.blm, _1_Pulsing40_0.tim, _0_Pulsing40_0.prx, _2_MockSep_0.doc, _0_Pulsing40_0.frq, _1.fnm, _1_Pulsing40_0.frq, _0_MockSep_0.skp, _1_Pulsing40_0.prx, _0_TestBloomFilteredLucene40Postings_0.frq, _2_Pulsing40_0.prx, _1_MockSep_0.doc, _1_MockSep_0.pyl, _2_TestBloomFilteredLucene40Postings_0.tim, _0_TestBloomFilteredLucene40Postings_0.tim, _0_TestBloomFilteredLucene40Postings_0.blm, _0_TestBloomFilteredLucene40Postings_0.tip, _1_MockSep_0.skp, _0.fnm, _0_Pulsing40_0.tim, _0_Memory_0.ram, _1_MockSep_0.tib, _2.fdt, _2_MockSep_0.tii, _2_MockSep_0.tib, _2.fdx, _2_Pulsing40_0.frq, _2_TestBloomFilteredLucene40Postings_0.tip, _1_TestBloomFilteredLucene40Postings_0.frq, _1_MockSep_0.tii, _1.fdx, _1.fdt, _2_MockSep_0.pos, _2.si, _1_MockSep_0.frq, _2_Pulsing40_0.tim, _2_MockSep_0.skp, _2_Pulsing40_0.tip, _0_TestBloomFilteredLucene40Postings_0.prx, _1_TestBloomFilteredLucene40Postings_0.blm, _1_TestBloomFilteredLucene40Postings_0.tip, _2_nrm.cfe, _1_Memory_0.ram, _0_Pulsing40_0.tip, _2_Memory_0.ram, _2_nrm.cfs, _0_MockSep_0.doc, _0.si, _1_TestBloomFilteredLucene40Postings_0.tim, _2_TestBloomFilteredLucene40Postings_0.frq, _1_nrm.cfs, _1_TestBloomFilteredLucene40Postings_0.prx, _1_MockSep_0.pos, _2_MockSep_0.frq, _0_nrm.cfs, _2.fnm, _1_nrm.cfe, _0_MockSep_0.tib, _2_MockSep_0.pyl, _1.si, _0_nrm.cfe, _0_MockSep_0.frq, _0.fdx, _0_MockSep_0.tii, _0_MockSep_0.pyl, _0.fdt, segments_4]
[junit4:junit4]   2> 2897 T3251 C247 oasc.SolrDeletionPolicy.updateCommits newest commit = 4
[junit4:junit4]   2> 2920 T3251 C247 oass.SolrIndexSearcher.<init> Opening Searcher@30975ca main
[junit4:junit4]   2> 2920 T3251 C247 oass.SolrIndexSearcher.getIndexDir WARNING WARNING: Directory impl does not support setting indexDir: org.apache.lucene.store.MockDirectoryWrapper
[junit4:junit4]   2> 2922 T3251 C247 oasu.DirectUpdateHandler2.commit end_commit_flush
[junit4:junit4]   2> 2923 T3253 oashc.SpellCheckComponent$SpellCheckerListener.buildSpellIndex Building spell index for spell checker: suggest
[junit4:junit4]   2> 2924 T3253 oasss.Suggester.build build()
[junit4:junit4]   2> 2930 T3253 oasss.Suggester.build Stored suggest data to: C:\Jenkins\workspace\Lucene-Solr-4.x-Windows\solr\build\solr-core\test\J0\.\solrtest-SuggesterTest-1345731407254\suggest\jaspell.dat
[junit4:junit4]   2> 2930 T3253 oashc.SpellCheckComponent$SpellCheckerListener.buildSpellIndex Building spell index for spell checker: suggest_tst
[junit4:junit4]   2> 2930 T3253 oasss.Suggester.build build()
[junit4:junit4]   2> 2940 T3253 oasss.Suggester.build Stored suggest data to: C:\Jenkins\workspace\Lucene-Solr-4.x-Windows\solr\build\solr-core\test\J0\.\solrtest-SuggesterTest-1345731407254\suggest_tst\tst.dat
[junit4:junit4]   2> 2941 T3253 oashc.SpellCheckComponent$SpellCheckerListener.buildSpellIndex Building spell index for spell checker: suggest_fst
[junit4:junit4]   2> 2941 T3253 oasss.Suggester.build build()
[junit4:junit4]   2> 2950 T3253 oasss.Suggester.build Stored suggest data to: C:\Jenkins\workspace\Lucene-Solr-4.x-Windows\solr\build\solr-core\test\J0\.\solrtest-SuggesterTest-1345731407254\suggest_fst\fst.bin
[junit4:junit4]   2> 2951 T3253 oashc.SpellCheckComponent$SpellCheckerListener.buildSpellIndex Building spell index for spell checker: suggest_wfst
[junit4:junit4]   2> 2951 T3253 oasss.Suggester.build build()
[junit4:junit4]   2> 2956 T3253 oasss.Suggester.build Stored suggest data to: C:\Jenkins\workspace\Lucene-Solr-4.x-Windows\solr\build\solr-core\test\J0\.\solrtest-SuggesterTest-1345731407254\suggest_wfst\wfst.bin
[junit4:junit4]   2> 2956 T3253 oasc.SolrCore.registerSearcher [collection1] Registered new searcher Searcher@30975ca main{StandardDirectoryReader(segments_4:7 _0(4.0.0.2):C3 _1(4.0.0.2):C3 _2(4.0.0.2):C1)}
[junit4:junit4]   2> 2957 T3251 C247 UPDATE [collection1] webapp=null path=null params={} {commit=} 0 330
[junit4:junit4]   2> 2961 T3251 C247 REQ [collection1] webapp=null path=null params={q=ac&spellcheck.count=2&qt=/suggest&spellcheck.onlyMorePopular=true} status=0 QTime=0 
[junit4:junit4]   2> 2966 T3251 oas.SolrTestCaseJ4.tearDown ###Ending testRebuild
[junit4:junit4]   2> 2973 T3251 oas.SolrTestCaseJ4.setUp ###Starting testSuggestions
[junit4:junit4]   2> 2979 T3251 C247 UPDATE [collection1] webapp=null path=null params={} {add=[1]} 0 1
[junit4:junit4]   2> 2988 T3251 C247 UPDATE [collection1] webapp=null path=null params={} {add=[2]} 0 0
[junit4:junit4]   2> 2999 T3251 C247 UPDATE [collection1] webapp=null path=null params={} {add=[3]} 0 1
[junit4:junit4]   2> 3006 T3251 C247 oasu.DirectUpdateHandler2.commit start commit{flags=0,_version_=0,optimize=false,openSearcher=true,waitSearcher=true,expungeDeletes=false,softCommit=false}
[junit4:junit4]   2> 3093 T3251 C247 oasc.SolrDeletionPolicy.onCommit SolrDeletionPolicy.onCommit: commits:num=2
[junit4:junit4]   2> 		commit{dir=MockDirWrapper(NRTCachingDirectory(org.apache.lucene.store.MMapDirectory@C:\Jenkins\workspace\Lucene-Solr-4.x-Windows\solr\build\solr-core\test\J0\solrtest-SuggesterTest-1345731407254\index lockFactory=org.apache.lucene.store.NativeFSLockFactory@284dc05a; maxCacheMB=0.1669921875 maxMergeSizeMB=0.6923828125)),segFN=segments_4,generation=4,filenames=[_2_TestBloomFilteredLucene40Postings_0.prx, _1_Pulsing40_0.tip, _0_MockSep_0.pos, _2_TestBloomFilteredLucene40Postings_0.blm, _1_Pulsing40_0.tim, _0_Pulsing40_0.prx, _2_MockSep_0.doc, _0_Pulsing40_0.frq, _1.fnm, _1_Pulsing40_0.frq, _0_MockSep_0.skp, _1_Pulsing40_0.prx, _0_TestBloomFilteredLucene40Postings_0.frq, _2_Pulsing40_0.prx, _1_MockSep_0.doc, _1_MockSep_0.pyl, _2_TestBloomFilteredLucene40Postings_0.tim, _0_TestBloomFilteredLucene40Postings_0.tim, _0_TestBloomFilteredLucene40Postings_0.blm, _0_TestBloomFilteredLucene40Postings_0.tip, _1_MockSep_0.skp, _0.fnm, _0_Pulsing40_0.tim, _0_Memory_0.ram, _1_MockSep_0.tib, _2.fdt, _2_MockSep_0.tii, _2_MockSep_0.tib, _2.fdx, _2_Pulsing40_0.frq, _2_TestBloomFilteredLucene40Postings_0.tip, _1_TestBloomFilteredLucene40Postings_0.frq, _1_MockSep_0.tii, _1.fdx, _1.fdt, _2_MockSep_0.pos, _2.si, _1_MockSep_0.frq, _2_Pulsing40_0.tim, _2_MockSep_0.skp, _2_Pulsing40_0.tip, _0_TestBloomFilteredLucene40Postings_0.prx, _1_TestBloomFilteredLucene40Postings_0.blm, _1_TestBloomFilteredLucene40Postings_0.tip, _2_nrm.cfe, _1_Memory_0.ram, _0_Pulsing40_0.tip, _2_Memory_0.ram, _2_nrm.cfs, _0_MockSep_0.doc, _0.si, _1_TestBloomFilteredLucene40Postings_0.tim, _2_TestBloomFilteredLucene40Postings_0.frq, _1_nrm.cfs, _1_TestBloomFilteredLucene40Postings_0.prx, _1_MockSep_0.pos, _2_MockSep_0.frq, _0_nrm.cfs, _2.fnm, _1_nrm.cfe, _0_MockSep_0.tib, _2_MockSep_0.pyl, _1.si, _0_nrm.cfe, _0_MockSep_0.frq, _0.fdx, _0_MockSep_0.tii, _0_MockSep_0.pyl, _0.fdt, segments_4]
[junit4:junit4]   2> 		commit{dir=MockDirWrapper(NRTCachingDirectory(org.apache.lucene.store.MMapDirectory@C:\Jenkins\workspace\Lucene-Solr-4.x-Windows\solr\build\solr-core\test\J0\solrtest-SuggesterTest-1345731407254\index lockFactory=org.apache.lucene.store.NativeFSLockFactory@284dc05a; maxCacheMB=0.1669921875 maxMergeSizeMB=0.6923828125)),segFN=segments_5,generation=5,filenames=[_3_MockSep_0.doc, _3_nrm.cfe, _3_TestBloomFilteredLucene40Postings_0.prx, _2_TestBloomFilteredLucene40Postings_0.prx, _0_MockSep_0.pos, _2_TestBloomFilteredLucene40Postings_0.blm, _3.fdt, _3_MockSep_0.frq, _0_Pulsing40_0.prx, _0_Pulsing40_0.frq, _2_MockSep_0.doc, _0_MockSep_0.skp, _3_MockSep_0.tib, _0_TestBloomFilteredLucene40Postings_0.frq, _3_TestBloomFilteredLucene40Postings_0.frq, _2_Pulsing40_0.prx, _3_TestBloomFilteredLucene40Postings_0.tim, _0_TestBloomFilteredLucene40Postings_0.tim, _2_TestBloomFilteredLucene40Postings_0.tim, _0_TestBloomFilteredLucene40Postings_0.blm, _0_TestBloomFilteredLucene40Postings_0.tip, _0.fnm, _0_Pulsing40_0.tim, _0_Memory_0.ram, _3_Pulsing40_0.tip, _2.fdt, _2_MockSep_0.tii, _3_MockSep_0.tii, _3_TestBloomFilteredLucene40Postings_0.tip, _2_MockSep_0.tib, _2.fdx, _3_Pulsing40_0.tim, _2_TestBloomFilteredLucene40Postings_0.tip, _2_Pulsing40_0.frq, _3_nrm.cfs, _3_MockSep_0.pos, _3.si, _3_TestBloomFilteredLucene40Postings_0.blm, _2_MockSep_0.pos, _3_Pulsing40_0.frq, _2.si, _2_Pulsing40_0.tim, _2_Pulsing40_0.tip, _2_MockSep_0.skp, _0_TestBloomFilteredLucene40Postings_0.prx, _3.fnm, _3_MockSep_0.pyl, _2_nrm.cfe, _0_Pulsing40_0.tip, _2_Memory_0.ram, _3_Memory_0.ram, _0_MockSep_0.doc, _0.si, _2_nrm.cfs, _2_TestBloomFilteredLucene40Postings_0.frq, _2_MockSep_0.frq, _0_nrm.cfs, _2.fnm, _3.fdx, _0_MockSep_0.tib, _3_Pulsing40_0.prx, _2_MockSep_0.pyl, _0_nrm.cfe, _0_MockSep_0.frq, _0.fdx, _3_MockSep_0.skp, _0_MockSep_0.tii, _0_MockSep_0.pyl, segments_5, _0.fdt]
[junit4:junit4]   2> 3094 T3251 C247 oasc.SolrDeletionPolicy.updateCommits newest commit = 5
[junit4:junit4]   2> 3115 T3251 C247 oass.SolrIndexSearcher.<init> Opening Searcher@74bb849d main
[junit4:junit4]   2> 3116 T3251 C247 oass.SolrIndexSearcher.getIndexDir WARNING WARNING: Directory impl does not support setting indexDir: org.apache.lucene.store.MockDirectoryWrapper
[junit4:junit4]   2> 3116 T3253 oashc.SpellCheckComponent$SpellCheckerListener.buildSpellIndex Building spell index for spell checker: suggest
[junit4:junit4]   2> 3116 T3251 C247 oasu.DirectUpdateHandler2.commit end_commit_flush
[junit4:junit4]   2> 3116 T3253 oasss.Suggester.build build()
[junit4:junit4]   2> 3122 T3253 oasss.Suggester.build Stored suggest data to: C:\Jenkins\workspace\Lucene-Solr-4.x-Windows\solr\build\solr-core\test\J0\.\solrtest-SuggesterTest-1345731407254\suggest\jaspell.dat
[junit4:junit4]   2> 3122 T3253 oashc.SpellCheckComponent$SpellCheckerListener.buildSpellIndex Building spell index for spell checker: suggest_tst
[junit4:junit4]   2> 3122 T3253 oasss.Suggester.build build()
[junit4:junit4]   2> 3130 T3253 oasss.Suggester.build Stored suggest data to: C:\Jenkins\workspace\Lucene-Solr-4.x-Windows\solr\build\solr-core\test\J0\.\solrtest-SuggesterTest-1345731407254\suggest_tst\tst.dat
[junit4:junit4]   2> 3130 T3253 oashc.SpellCheckComponent$SpellCheckerListener.buildSpellIndex Building spell index for spell checker: suggest_fst
[junit4:junit4]   2> 3131 T3253 oasss.Suggester.build build()
[junit4:junit4]   2> 3141 T3253 oasss.Suggester.build Stored suggest data to: C:\Jenkins\workspace\Lucene-Solr-4.x-Windows\solr\build\solr-core\test\J0\.\solrtest-SuggesterTest-1345731407254\suggest_fst\fst.bin
[junit4:junit4]   2> 3141 T3253 oashc.SpellCheckComponent$SpellCheckerListener.buildSpellIndex Building spell index for spell checker: suggest_wfst
[junit4:junit4]   2> 3142 T3253 oasss.Suggester.build build()
[junit4:junit4]   2> 3148 T3253 oasss.Suggester.build Stored suggest data to: C:\Jenkins\workspace\Lucene-Solr-4.x-Windows\solr\build\solr-core\test\J0\.\solrtest-SuggesterTest-1345731407254\suggest_wfst\wfst.bin
[junit4:junit4]   2> 3148 T3253 oasc.SolrCore.registerSearcher [collection1] Registered new searcher Searcher@74bb849d main{StandardDirectoryReader(segments_5:11 _0(4.0.0.2):C3 _2(4.0.0.2):C1 _3(4.0.0.2):C3)}
[junit4:junit4]   2> 3153 T3251 C247 UPDATE [collection1] webapp=null path=null params={} {commit=} 0 147
[junit4:junit4]   2> 3155 T3251 C247 REQ [collection1] webapp=null path=null params={q=ac&spellcheck.count=2&qt=/suggest&spellcheck.onlyMorePopular=true} status=0 QTime=0 
[junit4:junit4]   2> 3162 T3251 oas.SolrTestCaseJ4.tearDown ###Ending testSuggestions
[junit4:junit4]   2> 3163 T3251 oas.SolrTestCaseJ4.deleteCore ###deleteCore
[junit4:junit4]   2> 3163 T3251 oasc.CoreContainer.shutdown Shutting down CoreContainer instance=268891927
[junit4:junit4]   2> 3163 T3251 oasc.SolrCore.close [collection1]  CLOSING SolrCore org.apache.solr.core.SolrCore@5beb4999
[junit4:junit4]   2> 3164 T3251 oasc.SolrCore.closeSearcher [collection1] Closing main searcher on request.
[junit4:junit4]   2> 3166 T3251 oasu.DirectUpdateHandler2.close closing DirectUpdateHandler2{commits=3,autocommits=0,soft autocommits=0,optimizes=0,rollbacks=0,expungeDeletes=0,docsPending=0,adds=0,deletesById=0,deletesByQuery=0,errors=0,cumulative_adds=7,cumulative_deletesById=0,cumulative_deletesByQuery=0,cumulative_errors=0}
[junit4:junit4]   2> 3168 T3251 oasu.DefaultSolrCoreState.decref SolrCoreState ref count has reached 0 - closing IndexWriter
[junit4:junit4]   2> NOTE: test params are: codec=Lucene40: {timestamp=Pulsing40(freqCutoff=1 minBlockSize=71 maxBlockSize=188), range_facet_l=Pulsing40(freqCutoff=1 minBlockSize=71 maxBlockSize=188), id=PostingsFormat(name=Memory doPackFST= true), range_facet_sl=PostingsFormat(name=Memory doPackFST= true), range_facet_si=Pulsing40(freqCutoff=1 minBlockSize=71 maxBlockSize=188), text=PostingsFormat(name=TestBloomFilteredLucene40Postings), multiDefault=Pulsing40(freqCutoff=1 minBlockSize=71 maxBlockSize=188), suggest=Pulsing40(freqCutoff=1 minBlockSize=71 maxBlockSize=188), intDefault=PostingsFormat(name=MockSep), spell=PostingsFormat(name=MockSep)}, sim=DefaultSimilarity, locale=ar_DZ, timezone=America/Indiana/Knox
[junit4:junit4]   2> NOTE: Windows 7 6.1 amd64/Oracle Corporation 1.7.0_06 (64-bit)/cpus=2,threads=1,free=396754656,total=536870912
[junit4:junit4]   2> NOTE: All tests run in this JVM: [TestFoldingMultitermQuery, SolrCmdDistributorTest, AutoCommitTest, TestLuceneMatchVersion, TermVectorComponentDistributedTest, TestQuerySenderNoQuery, CircularListTest, TestBinaryResponseWriter, TestBM25SimilarityFactory, DirectUpdateHandlerTest, UniqFieldsUpdateProcessorFactoryTest, TestMergePolicyConfig, TestDistributedGrouping, StatsComponentTest, SolrInfoMBeanTest, DateMathParserTest, LoggingHandlerTest, TestSolrXMLSerializer, ClusterStateTest, TestSolrDeletionPolicy1, TestLRUCache, PrimitiveFieldTypeTest, SampleTest, ConvertedLegacyTest, TestOmitPositions, SimpleFacetsTest, SolrRequestParserTest, SuggesterWFSTTest, SolrCoreCheckLockOnStartupTest, DocumentAnalysisRequestHandlerTest, JSONWriterTest, TestQueryTypes, SolrIndexConfigTest, TestRealTimeGet, TestCollationField, TestIBSimilarityFactory, SpellCheckComponentTest, TestPerFieldSimilarity, TestPluginEnable, TestJmxMonitoredMap, EchoParamsTest, StandardRequestHandlerTest, MultiTermTest, TestRangeQuery, WordBreakSolrSpellCheckerTest, IndexSchemaRuntimeFieldTest, TestLFUCache, TestFastOutputStream, TermsComponentTest, TestRTGBase, SuggesterTSTTest, TestSolrQueryParser, TestSystemIdResolver, ShowFileRequestHandlerTest, TestUtils, JsonLoaderTest, FullSolrCloudDistribCmdsTest, TestNumberUtils, TestLMDirichletSimilarityFactory, FieldMutatingUpdateProcessorTest, LeaderElectionIntegrationTest, TestRemoteStreaming, XmlUpdateRequestHandlerTest, TestRandomFaceting, TimeZoneUtilsTest, PrimUtilsTest, SoftAutoCommitTest, BasicZkTest, NoCacheHeaderTest, HighlighterConfigTest, TestWordDelimiterFilterFactory, TestCharFilters, ScriptEngineTest, QueryParsingTest, UpdateParamsTest, TestReplicationHandler, ClusterStateUpdateTest, LukeRequestHandlerTest, CurrencyFieldTest, CoreAdminHandlerTest, SignatureUpdateProcessorFactoryTest, HighlighterTest, OpenExchangeRatesOrgProviderTest, SpellCheckCollatorTest, TestFaceting, TestLMJelinekMercerSimilarityFactory, TestMultiCoreConfBootstrap, TestDefaultSimilarityFactory, TestExtendedDismaxParser, TestFastLRUCache, TestPseudoReturnFields, FieldAnalysisRequestHandlerTest, TestCollationKeyRangeQueries, TestPHPSerializedResponseWriter, TestStressVersions, TestStressLucene, ZkCLITest, NotRequiredUniqueKeyTest, FileBasedSpellCheckerTest, MBeansHandlerTest, ResourceLoaderTest, TestBadConfig, UUIDFieldTest, CacheHeaderTest, TestPhraseSuggestions, TestCoreContainer, TestDistributedSearch, BasicDistributedZkTest, OverseerTest, RecoveryZkTest, LeaderElectionTest, DistributedSpellCheckComponentTest, ZkControllerTest, ZkSolrClientTest, TestHashPartitioner, DistributedTermsComponentTest, TestRecovery, TestJoin, SolrCoreTest, IndexBasedSpellCheckerTest, TestSort, TestGroupingSearch, DirectSolrSpellCheckerTest, TestFiltering, PeerSyncTest, QueryElevationComponentTest, SortByFunctionTest, BasicFunctionalityTest, TestJmxIntegration, TestIndexSearcher, TestFunctionQuery, TestTrie, DirectSolrConnectionTest, QueryEqualityTest, TestCSVLoader, PolyFieldTest, SpatialFilterTest, TestCSVResponseWriter, MoreLikeThisHandlerTest, DocumentBuilderTest, DistributedQueryElevationComponentTest, DisMaxRequestHandlerTest, IndexSchemaTest, BinaryUpdateRequestHandlerTest, DistanceFunctionTest, XsltUpdateRequestHandlerTest, MinimalSchemaTest, PingRequestHandlerTest, TermVectorComponentTest, TestSurroundQueryParser, DirectUpdateHandlerOptimizeTest, SolrPluginUtilsTest, TestValueSourceCache, FastVectorHighlighterTest, TestReversedWildcardFilterFactory, DebugComponentTest, ReturnFieldsTest, RequestHandlersTest, SearchHandlerTest, RequiredFieldsTest, SuggesterFSTTest, CopyFieldTest, TestArbitraryIndexDir, TestQueryUtils, SuggesterTest]
[junit4:junit4] Completed in 3.28s, 4 tests, 1 error <<< FAILURES!

[...truncated 172 lines...]
BUILD FAILED
C:\Jenkins\workspace\Lucene-Solr-4.x-Windows\build.xml:29: The following error occurred while executing this line:
C:\Jenkins\workspace\Lucene-Solr-4.x-Windows\solr\build.xml:144: The following error occurred while executing this line:
C:\Jenkins\workspace\Lucene-Solr-4.x-Windows\lucene\module-build.xml:62: The following error occurred while executing this line:
C:\Jenkins\workspace\Lucene-Solr-4.x-Windows\lucene\common-build.xml:1105: The following error occurred while executing this line:
C:\Jenkins\workspace\Lucene-Solr-4.x-Windows\lucene\common-build.xml:797: There were test failures: 227 suites, 908 tests, 1 error, 11 ignored (6 assumptions)

Total time: 36 minutes 29 seconds
Build step 'Invoke Ant' marked build as failure
Recording test results
Description set: Java: 64bit/jdk1.7.0_06 -XX:+UseG1GC
Email was triggered for: Failure
Sending email for trigger: Failure



Mime
View raw message