lucene-dev mailing list archives

Site index · List index
Message view « Date » · « Thread »
Top « Date » · « Thread »
From Policeman Jenkins Server <jenk...@sd-datasolutions.de>
Subject [JENKINS] Lucene-Solr-trunk-Linux (64bit/jdk1.8.0-ea-b49) - Build # 169 - Failure!
Date Sat, 04 Aug 2012 15:21:30 GMT
Build: http://jenkins.sd-datasolutions.de/job/Lucene-Solr-trunk-Linux/169/
Java: 64bit/jdk1.8.0-ea-b49 -XX:+UseConcMarkSweepGC

1 tests failed.
REGRESSION:  org.apache.solr.handler.component.DistributedQueryElevationComponentTest.testDistribSearch

Error Message:
.responseHeader.params.size()==9,9skipped=4,5

Stack Trace:
junit.framework.AssertionFailedError: .responseHeader.params.size()==9,9skipped=4,5
	at __randomizedtesting.SeedInfo.seed([8EAC08EB0DAC5B94:F4A86F37AF33BA8]:0)
	at junit.framework.Assert.fail(Assert.java:50)
	at org.apache.solr.BaseDistributedSearchTestCase.compareResponses(BaseDistributedSearchTestCase.java:670)
	at org.apache.solr.BaseDistributedSearchTestCase.query(BaseDistributedSearchTestCase.java:392)
	at org.apache.solr.handler.component.DistributedQueryElevationComponentTest.doTest(DistributedQueryElevationComponentTest.java:81)
	at org.apache.solr.BaseDistributedSearchTestCase.testDistribSearch(BaseDistributedSearchTestCase.java:679)
	at sun.reflect.NativeMethodAccessorImpl.invoke0(Native Method)
	at sun.reflect.NativeMethodAccessorImpl.invoke(NativeMethodAccessorImpl.java:57)
	at sun.reflect.DelegatingMethodAccessorImpl.invoke(DelegatingMethodAccessorImpl.java:43)
	at java.lang.reflect.Method.invoke(Method.java:474)
	at com.carrotsearch.randomizedtesting.RandomizedRunner.invoke(RandomizedRunner.java:1995)
	at com.carrotsearch.randomizedtesting.RandomizedRunner.access$1100(RandomizedRunner.java:132)
	at com.carrotsearch.randomizedtesting.RandomizedRunner$6.evaluate(RandomizedRunner.java:818)
	at com.carrotsearch.randomizedtesting.RandomizedRunner$7.evaluate(RandomizedRunner.java:877)
	at com.carrotsearch.randomizedtesting.RandomizedRunner$8.evaluate(RandomizedRunner.java:891)
	at com.carrotsearch.randomizedtesting.rules.SystemPropertiesRestoreRule$1.evaluate(SystemPropertiesRestoreRule.java:53)
	at org.apache.lucene.util.TestRuleSetupTeardownChained$1.evaluate(TestRuleSetupTeardownChained.java:50)
	at org.apache.lucene.util.TestRuleFieldCacheSanity$1.evaluate(TestRuleFieldCacheSanity.java:32)
	at org.apache.lucene.util.AbstractBeforeAfterRule$1.evaluate(AbstractBeforeAfterRule.java:45)
	at com.carrotsearch.randomizedtesting.rules.SystemPropertiesInvariantRule$1.evaluate(SystemPropertiesInvariantRule.java:55)
	at org.apache.lucene.util.TestRuleReportUncaughtExceptions$1.evaluate(TestRuleReportUncaughtExceptions.java:68)
	at org.apache.lucene.util.TestRuleThreadAndTestName$1.evaluate(TestRuleThreadAndTestName.java:48)
	at org.apache.lucene.util.TestRuleIgnoreAfterMaxFailures$1.evaluate(TestRuleIgnoreAfterMaxFailures.java:70)
	at org.apache.lucene.util.TestRuleMarkFailure$1.evaluate(TestRuleMarkFailure.java:48)
	at com.carrotsearch.randomizedtesting.RandomizedRunner.runSingleTest(RandomizedRunner.java:825)
	at com.carrotsearch.randomizedtesting.RandomizedRunner.access$700(RandomizedRunner.java:132)
	at com.carrotsearch.randomizedtesting.RandomizedRunner$3$1.run(RandomizedRunner.java:671)
	at com.carrotsearch.randomizedtesting.RandomizedRunner$3.evaluate(RandomizedRunner.java:697)
	at com.carrotsearch.randomizedtesting.RandomizedRunner$4.evaluate(RandomizedRunner.java:736)
	at com.carrotsearch.randomizedtesting.RandomizedRunner$5.evaluate(RandomizedRunner.java:747)
	at com.carrotsearch.randomizedtesting.rules.SystemPropertiesRestoreRule$1.evaluate(SystemPropertiesRestoreRule.java:53)
	at org.apache.lucene.util.AbstractBeforeAfterRule$1.evaluate(AbstractBeforeAfterRule.java:45)
	at org.apache.lucene.util.TestRuleReportUncaughtExceptions$1.evaluate(TestRuleReportUncaughtExceptions.java:68)
	at org.apache.lucene.util.TestRuleStoreClassName$1.evaluate(TestRuleStoreClassName.java:38)
	at com.carrotsearch.randomizedtesting.rules.SystemPropertiesInvariantRule$1.evaluate(SystemPropertiesInvariantRule.java:55)
	at org.apache.lucene.util.TestRuleNoInstanceHooksOverrides$1.evaluate(TestRuleNoInstanceHooksOverrides.java:53)
	at org.apache.lucene.util.TestRuleNoStaticHooksShadowing$1.evaluate(TestRuleNoStaticHooksShadowing.java:52)
	at org.apache.lucene.util.TestRuleAssertionsRequired$1.evaluate(TestRuleAssertionsRequired.java:36)
	at org.apache.lucene.util.TestRuleMarkFailure$1.evaluate(TestRuleMarkFailure.java:48)
	at org.apache.lucene.util.TestRuleIgnoreAfterMaxFailures$1.evaluate(TestRuleIgnoreAfterMaxFailures.java:70)
	at org.apache.lucene.util.TestRuleIgnoreTestSuites$1.evaluate(TestRuleIgnoreTestSuites.java:55)
	at com.carrotsearch.randomizedtesting.RandomizedRunner.runSuite(RandomizedRunner.java:605)
	at com.carrotsearch.randomizedtesting.RandomizedRunner.access$400(RandomizedRunner.java:132)
	at com.carrotsearch.randomizedtesting.RandomizedRunner$2.run(RandomizedRunner.java:551)




Build Log:
[...truncated 7528 lines...]
[junit4:junit4] Suite: org.apache.solr.handler.component.DistributedQueryElevationComponentTest
[junit4:junit4] FAILURE 1.54s J1 | DistributedQueryElevationComponentTest.testDistribSearch
[junit4:junit4]    > Throwable #1: junit.framework.AssertionFailedError: .responseHeader.params.size()==9,9skipped=4,5
[junit4:junit4]    > 	at __randomizedtesting.SeedInfo.seed([8EAC08EB0DAC5B94:F4A86F37AF33BA8]:0)
[junit4:junit4]    > 	at junit.framework.Assert.fail(Assert.java:50)
[junit4:junit4]    > 	at org.apache.solr.BaseDistributedSearchTestCase.compareResponses(BaseDistributedSearchTestCase.java:670)
[junit4:junit4]    > 	at org.apache.solr.BaseDistributedSearchTestCase.query(BaseDistributedSearchTestCase.java:392)
[junit4:junit4]    > 	at org.apache.solr.handler.component.DistributedQueryElevationComponentTest.doTest(DistributedQueryElevationComponentTest.java:81)
[junit4:junit4]    > 	at org.apache.solr.BaseDistributedSearchTestCase.testDistribSearch(BaseDistributedSearchTestCase.java:679)
[junit4:junit4]    > 	at sun.reflect.NativeMethodAccessorImpl.invoke0(Native Method)
[junit4:junit4]    > 	at sun.reflect.NativeMethodAccessorImpl.invoke(NativeMethodAccessorImpl.java:57)
[junit4:junit4]    > 	at sun.reflect.DelegatingMethodAccessorImpl.invoke(DelegatingMethodAccessorImpl.java:43)
[junit4:junit4]    > 	at java.lang.reflect.Method.invoke(Method.java:474)
[junit4:junit4]    > 	at com.carrotsearch.randomizedtesting.RandomizedRunner.invoke(RandomizedRunner.java:1995)
[junit4:junit4]    > 	at com.carrotsearch.randomizedtesting.RandomizedRunner.access$1100(RandomizedRunner.java:132)
[junit4:junit4]    > 	at com.carrotsearch.randomizedtesting.RandomizedRunner$6.evaluate(RandomizedRunner.java:818)
[junit4:junit4]    > 	at com.carrotsearch.randomizedtesting.RandomizedRunner$7.evaluate(RandomizedRunner.java:877)
[junit4:junit4]    > 	at com.carrotsearch.randomizedtesting.RandomizedRunner$8.evaluate(RandomizedRunner.java:891)
[junit4:junit4]    > 	at com.carrotsearch.randomizedtesting.rules.SystemPropertiesRestoreRule$1.evaluate(SystemPropertiesRestoreRule.java:53)
[junit4:junit4]    > 	at org.apache.lucene.util.TestRuleSetupTeardownChained$1.evaluate(TestRuleSetupTeardownChained.java:50)
[junit4:junit4]    > 	at org.apache.lucene.util.TestRuleFieldCacheSanity$1.evaluate(TestRuleFieldCacheSanity.java:32)
[junit4:junit4]    > 	at org.apache.lucene.util.AbstractBeforeAfterRule$1.evaluate(AbstractBeforeAfterRule.java:45)
[junit4:junit4]    > 	at com.carrotsearch.randomizedtesting.rules.SystemPropertiesInvariantRule$1.evaluate(SystemPropertiesInvariantRule.java:55)
[junit4:junit4]    > 	at org.apache.lucene.util.TestRuleReportUncaughtExceptions$1.evaluate(TestRuleReportUncaughtExceptions.java:68)
[junit4:junit4]    > 	at org.apache.lucene.util.TestRuleThreadAndTestName$1.evaluate(TestRuleThreadAndTestName.java:48)
[junit4:junit4]    > 	at org.apache.lucene.util.TestRuleIgnoreAfterMaxFailures$1.evaluate(TestRuleIgnoreAfterMaxFailures.java:70)
[junit4:junit4]    > 	at org.apache.lucene.util.TestRuleMarkFailure$1.evaluate(TestRuleMarkFailure.java:48)
[junit4:junit4]    > 	at com.carrotsearch.randomizedtesting.RandomizedRunner.runSingleTest(RandomizedRunner.java:825)
[junit4:junit4]    > 	at com.carrotsearch.randomizedtesting.RandomizedRunner.access$700(RandomizedRunner.java:132)
[junit4:junit4]    > 	at com.carrotsearch.randomizedtesting.RandomizedRunner$3$1.run(RandomizedRunner.java:671)
[junit4:junit4]    > 	at com.carrotsearch.randomizedtesting.RandomizedRunner$3.evaluate(RandomizedRunner.java:697)
[junit4:junit4]    > 	at com.carrotsearch.randomizedtesting.RandomizedRunner$4.evaluate(RandomizedRunner.java:736)
[junit4:junit4]    > 	at com.carrotsearch.randomizedtesting.RandomizedRunner$5.evaluate(RandomizedRunner.java:747)
[junit4:junit4]    > 	at com.carrotsearch.randomizedtesting.rules.SystemPropertiesRestoreRule$1.evaluate(SystemPropertiesRestoreRule.java:53)
[junit4:junit4]    > 	at org.apache.lucene.util.AbstractBeforeAfterRule$1.evaluate(AbstractBeforeAfterRule.java:45)
[junit4:junit4]    > 	at org.apache.lucene.util.TestRuleReportUncaughtExceptions$1.evaluate(TestRuleReportUncaughtExceptions.java:68)
[junit4:junit4]    > 	at org.apache.lucene.util.TestRuleStoreClassName$1.evaluate(TestRuleStoreClassName.java:38)
[junit4:junit4]    > 	at com.carrotsearch.randomizedtesting.rules.SystemPropertiesInvariantRule$1.evaluate(SystemPropertiesInvariantRule.java:55)
[junit4:junit4]    > 	at org.apache.lucene.util.TestRuleNoInstanceHooksOverrides$1.evaluate(TestRuleNoInstanceHooksOverrides.java:53)
[junit4:junit4]    > 	at org.apache.lucene.util.TestRuleNoStaticHooksShadowing$1.evaluate(TestRuleNoStaticHooksShadowing.java:52)
[junit4:junit4]    > 	at org.apache.lucene.util.TestRuleAssertionsRequired$1.evaluate(TestRuleAssertionsRequired.java:36)
[junit4:junit4]    > 	at org.apache.lucene.util.TestRuleMarkFailure$1.evaluate(TestRuleMarkFailure.java:48)
[junit4:junit4]    > 	at org.apache.lucene.util.TestRuleIgnoreAfterMaxFailures$1.evaluate(TestRuleIgnoreAfterMaxFailures.java:70)
[junit4:junit4]    > 	at org.apache.lucene.util.TestRuleIgnoreTestSuites$1.evaluate(TestRuleIgnoreTestSuites.java:55)
[junit4:junit4]    > 	at com.carrotsearch.randomizedtesting.RandomizedRunner.runSuite(RandomizedRunner.java:605)
[junit4:junit4]    > 	at com.carrotsearch.randomizedtesting.RandomizedRunner.access$400(RandomizedRunner.java:132)
[junit4:junit4]    > 	at com.carrotsearch.randomizedtesting.RandomizedRunner$2.run(RandomizedRunner.java:551)
[junit4:junit4]    > 
[junit4:junit4]   2> 1 T1927 oas.SolrTestCaseJ4.setUp ###Starting testDistribSearch
[junit4:junit4]   2> 2 T1927 oejs.Server.doStart jetty-8.1.2.v20120308
[junit4:junit4]   2> 10 T1927 oejs.AbstractConnector.doStart Started SocketConnector@0.0.0.0:46157
[junit4:junit4]   2> 11 T1927 oasc.SolrResourceLoader.locateSolrHome JNDI not configured for solr (NoInitialContextEx)
[junit4:junit4]   2> 11 T1927 oasc.SolrResourceLoader.locateSolrHome using system property solr.solr.home: /mnt/ssd/jenkins/workspace/Lucene-Solr-trunk-Linux/checkout/solr/build/solr-core/test-files/solr
[junit4:junit4]   2> 11 T1927 oasc.SolrResourceLoader.<init> new SolrResourceLoader for deduced Solr Home: '/mnt/ssd/jenkins/workspace/Lucene-Solr-trunk-Linux/checkout/solr/build/solr-core/test-files/solr/'
[junit4:junit4]   2> 17 T1927 oass.SolrDispatchFilter.init SolrDispatchFilter.init()
[junit4:junit4]   2> 18 T1927 oasc.SolrResourceLoader.locateSolrHome JNDI not configured for solr (NoInitialContextEx)
[junit4:junit4]   2> 18 T1927 oasc.SolrResourceLoader.locateSolrHome using system property solr.solr.home: /mnt/ssd/jenkins/workspace/Lucene-Solr-trunk-Linux/checkout/solr/build/solr-core/test-files/solr
[junit4:junit4]   2> 18 T1927 oasc.CoreContainer$Initializer.initialize looking for solr.xml: /mnt/ssd/jenkins/workspace/Lucene-Solr-trunk-Linux/checkout/solr/build/solr-core/test-files/solr/solr.xml
[junit4:junit4]   2> 18 T1927 oasc.CoreContainer.<init> New CoreContainer 1378442337
[junit4:junit4]   2> 19 T1927 oasc.CoreContainer.load Loading CoreContainer using Solr Home: '/mnt/ssd/jenkins/workspace/Lucene-Solr-trunk-Linux/checkout/solr/build/solr-core/test-files/solr/'
[junit4:junit4]   2> 19 T1927 oasc.SolrResourceLoader.<init> new SolrResourceLoader for directory: '/mnt/ssd/jenkins/workspace/Lucene-Solr-trunk-Linux/checkout/solr/build/solr-core/test-files/solr/'
[junit4:junit4]   2> 27 T1927 oasc.CoreContainer.load Registering Log Listener
[junit4:junit4]   2> 54 T1927 oasc.CoreContainer.create Creating SolrCore 'collection1' using instanceDir: /mnt/ssd/jenkins/workspace/Lucene-Solr-trunk-Linux/checkout/solr/build/solr-core/test-files/solr/collection1
[junit4:junit4]   2> 55 T1927 oasc.SolrResourceLoader.<init> new SolrResourceLoader for directory: '/mnt/ssd/jenkins/workspace/Lucene-Solr-trunk-Linux/checkout/solr/build/solr-core/test-files/solr/collection1/'
[junit4:junit4]   2> 55 T1927 oasc.SolrResourceLoader.replaceClassLoader Adding 'file:/mnt/ssd/jenkins/workspace/Lucene-Solr-trunk-Linux/checkout/solr/build/solr-core/test-files/solr/collection1/lib/README' to classloader
[junit4:junit4]   2> 55 T1927 oasc.SolrResourceLoader.replaceClassLoader Adding 'file:/mnt/ssd/jenkins/workspace/Lucene-Solr-trunk-Linux/checkout/solr/build/solr-core/test-files/solr/collection1/lib/classes/' to classloader
[junit4:junit4]   2> 79 T1927 oasc.SolrConfig.<init> Using Lucene MatchVersion: LUCENE_50
[junit4:junit4]   2> 110 T1927 oasc.SolrConfig.<init> Loaded SolrConfig: solrconfig-elevate.xml
[junit4:junit4]   2> 111 T1927 oass.IndexSchema.readSchema Reading Solr Schema
[junit4:junit4]   2> 113 T1927 oass.IndexSchema.readSchema Schema name=example
[junit4:junit4]   2> 260 T1927 oass.IndexSchema.readSchema default search field in schema is text
[junit4:junit4]   2> 262 T1927 oass.IndexSchema.readSchema unique key field: id
[junit4:junit4]   2> 264 T1927 oasc.SolrCore.<init> [collection1] Opening new SolrCore at /mnt/ssd/jenkins/workspace/Lucene-Solr-trunk-Linux/checkout/solr/build/solr-core/test-files/solr/collection1/, dataDir=./org.apache.solr.handler.component.DistributedQueryElevationComponentTest-1344093593841/control/data/
[junit4:junit4]   2> 265 T1927 oasc.JmxMonitoredMap.<init> JMX monitoring is enabled. Adding Solr mbeans to JMX Server: com.sun.jmx.mbeanserver.JmxMBeanServer@ba528c2
[junit4:junit4]   2> 265 T1927 oasc.SolrCore.getNewIndexDir WARNING New index directory detected: old=null new=./org.apache.solr.handler.component.DistributedQueryElevationComponentTest-1344093593841/control/data/index/
[junit4:junit4]   2> 265 T1927 oasc.SolrCore.initIndex WARNING [collection1] Solr index directory './org.apache.solr.handler.component.DistributedQueryElevationComponentTest-1344093593841/control/data/index' doesn't exist. Creating new index...
[junit4:junit4]   2> 266 T1927 oasc.SolrDeletionPolicy.onCommit SolrDeletionPolicy.onCommit: commits:num=1
[junit4:junit4]   2> 		commit{dir=MockDirWrapper(org.apache.lucene.store.RAMDirectory@66014ed9 lockFactory=org.apache.lucene.store.SingleInstanceLockFactory@59e9474c),segFN=segments_1,generation=1,filenames=[segments_1]
[junit4:junit4]   2> 267 T1927 oasc.SolrDeletionPolicy.updateCommits newest commit = 1
[junit4:junit4]   2> 267 T1927 oasc.RequestHandlers.initHandlersFromConfig created /update: solr.UpdateRequestHandler
[junit4:junit4]   2> 268 T1927 oasc.RequestHandlers.initHandlersFromConfig created /elevate: org.apache.solr.handler.component.SearchHandler
[junit4:junit4]   2> 268 T1927 oasc.RequestHandlers.initHandlersFromConfig created /dataElevate: org.apache.solr.handler.component.SearchHandler
[junit4:junit4]   2> 268 T1927 oashl.XMLLoader.init xsltCacheLifetimeSeconds=60
[junit4:junit4]   2> 269 T1927 oasc.RequestHandlers.initHandlersFromConfig WARNING no default request handler is registered (either '/select' or 'standard')
[junit4:junit4]   2> 269 T1927 oasc.SolrCore.initDeprecatedSupport WARNING solrconfig.xml uses deprecated <admin/gettableFiles>, Please update your config to use the ShowFileRequestHandler.
[junit4:junit4]   2> 270 T1927 oasc.SolrCore.initDeprecatedSupport WARNING adding ShowFileRequestHandler with hidden files: [PROTWORDS.TXT, SOLRCONFIG-DELPOLICY1.XML, STOP-SNOWBALL.TXT, BAD-SCHEMA-CODEC-GLOBAL-VS-FT-MISMATCH.XML, SOLRCONFIG-SLAVE.XML, SOLRCONFIG-MASTER2.XML, SOLRCONFIG-QUERYSENDER.XML, SCHEMA12.XML, SOLRCONFIG-TRANSFORMERS.XML, BAD-SCHEMA-DUP-FIELDTYPE.XML, STOP-1.TXT, SCHEMA-LMJELINEKMERCER.XML, SOLRCONFIG-SCRIPT-UPDATEPROCESSOR.XML, SCHEMA-TRIE.XML, SOLRCONFIG_CODEC.XML, SCHEMA11.XML, SOLRCONFIG-PROPINJECT-INDEXDEFAULT.XML, SCHEMA-NUMERIC.XML, SOLRCONFIG-BASIC.XML, HYPHENATION.DTD, BAD-SCHEMA-DUP-FIELD.XML, OPEN-EXCHANGE-RATES.JSON, SCHEMA15.XML, SCHEMA-IB.XML, SCHEMA-FOLDING.XML, WDFTYPES.TXT, SOLRCONFIG-SPELLCHECKER.XML, XSLT, SOLRCONFIG-CACHING.XML, SOLRCONFIG-HIGHLIGHT.XML, SOLRCONFIG-MASTER3.XML, SOLRCONFIG-REPEATER.XML, STOPWITHBOM.TXT, SOLRCONFIG-QUERYSENDER-NOQUERY.XML, BAD_SOLRCONFIG.XML, SOLRCONFIG-REQHANDLER.INCL, SCHEMA-REPLICATION2.XML, THROW.ERROR.ON.ADD.UPDATEPROCESSOR.JS, BAD-SCHEMA-ANALYZER-CLASS-AND-NESTED.XML, SOLRCONFIG-LAZYWRITER.XML, SOLRCONFIG-ELEVATE.XML, TRIVIAL.UPDATEPROCESSOR0.JS, SCHEMA-DFR.XML, SCHEMA-CHARFILTERS.XML, SOLRCONFIG-MERGEPOLICY.XML, BAD-SCHEMA-SIM-GLOBAL-VS-FT-MISMATCH.XML, CURRENCY.XML, SCHEMA-COLLATE.XML, SOLRCONFIG-MASTER1.XML, SOLRCONFIG-PROPINJECT.XML, COMPOUNDDICTIONARY.TXT, BAD-SCHEMA-UNIQUEKEY-USES-DEFAULT.XML, SCHEMA-PHRASESUGGEST.XML, SCHEMA-MINIMAL.XML, BAD-SCHEMA-NOT-INDEXED-BUT-TF.XML, BAD-SCHEMA-UNIQUEKEY-MULTIVALUED.XML, SCHEMA-TFIDF.XML, SOLRCONFIG-FUNCTIONQUERY.XML, SCHEMA-BM25.XML, BAD-SOLRCONFIG-MISSING-SCRIPTFILE.XML, SCHEMASURROUND.XML, SCHEMA-LUCENEMATCHVERSION.XML, SOLRCONFIG-NOCACHE.XML, BAD-SCHEMA-NOT-INDEXED-BUT-POS.XML, SOLRCONFIG_PERF.XML, SOLRCONFIG-MASTER1-KEEPONEBACKUP.XML, STOPTYPES-1.TXT, BAD-SCHEMA-DUP-DYNAMICFIELD.XML, SOLRCONFIG-XINCLUDE.XML, SOLRCONFIG-ALTDIRECTORY.XML, SOLRCONFIG-SOLR-749.XML, SOLRCONFIG-SOLCOREPROPERTIES.XML, PHRASESUGGEST.TXT, SOLRCONFIG-SPELLCHECKCOMPONENT.XML, BAD-SCHEMA-EXTERNAL-FILEFIELD.XML, OLD_SYNONYMS.TXT, BAD-SOLRCONFIG-INVALID-SCRIPTFILE.XML, STEMDICT.TXT, TRIVIAL.UPDATEPROCESSOR1.JS, SCHEMA-NOT-REQUIRED-UNIQUE-KEY.XML, DA_COMPOUNDDICTIONARY.TXT, SOLRCONFIG-SLAVE1.XML, FRENCHARTICLES.TXT, ELEVATE.XML, BAD-MP-SOLRCONFIG.XML, MAPPING-ISOLATIN1ACCENT.TXT, SCHEMA_CODEC.XML, BAD-SCHEMA-UNIQUEKEY-IS-COPYFIELD-DEST.XML, SCHEMA-REPLICATION1.XML, SOLRCONFIG-PHRASESUGGEST.XML, STOPWORDS.TXT, SOLRCONFIG-TLOG.XML, SOLRCONFIG-DELPOLICY2.XML, BAD-SCHEMA-NOT-INDEXED-BUT-NORMS.XML, KEEP-1.TXT, SCHEMA-BINARYFIELD.XML, SOLRCONFIG-NATIVELOCK.XML, MISSLEADING.EXTENSION.UPDATEPROCESSOR.JS.TXT, BAD-SCHEMA-OMIT-TF-BUT-NOT-POS.XML, STOPTYPES-2.TXT, STOPWORDSWRONGENCODING.TXT, BAD-SCHEMA-NONTEXT-ANALYZER.XML, DA_UTF8.XML, CONDITIONAL.UPDATEPROCESSOR.JS, SCHEMA-REQUIRED-FIELDS.XML, ADDFIELDS.UPDATEPROCESSOR.JS, STOP-2.TXT, SCHEMA-REVERSED.XML, SCHEMA-SPELLCHECKER.XML, SOLRCONFIG-SIMPLELOCK.XML, HUNSPELL-TEST.AFF, KEEP-2.TXT, MISSING.FUNCTIONS.UPDATEPROCESSOR.JS, SOLRCONFIG-ENABLEPLUGIN.XML, SCHEMA-LMDIRICHLET.XML, SOLRCONFIG-UPDATE-PROCESSOR-CHAINS.XML, SCHEMA-STOP-KEEP.XML, SYNONYMS.TXT, SOLRCONFIG-MASTER.XML, SCHEMA.XML, HUNSPELL-TEST.DIC, SCHEMA-COPYFIELD-TEST.XML, SOLRCONFIG-TERMINDEX.XML, BAD-SOLRCONFIG-BOGUS-SCRIPTENGINE-NAME.XML, SCHEMA-SIM.XML]
[junit4:junit4]   2> 272 T1927 oass.SolrIndexSearcher.<init> Opening Searcher@3aca54b9 main
[junit4:junit4]   2> 272 T1927 oass.SolrIndexSearcher.getIndexDir WARNING WARNING: Directory impl does not support setting indexDir: org.apache.lucene.store.MockDirectoryWrapper
[junit4:junit4]   2> 272 T1927 oasu.CommitTracker.<init> Hard AutoCommit: disabled
[junit4:junit4]   2> 272 T1927 oasu.CommitTracker.<init> Soft AutoCommit: disabled
[junit4:junit4]   2> 274 T1927 oashc.QueryElevationComponent.inform Loading QueryElevation from: /mnt/ssd/jenkins/workspace/Lucene-Solr-trunk-Linux/checkout/solr/build/solr-core/test-files/solr/collection1/conf/elevate.xml
[junit4:junit4]   2> 279 T1927 oashc.QueryElevationComponent.inform Loading QueryElevation from: /mnt/ssd/jenkins/workspace/Lucene-Solr-trunk-Linux/checkout/solr/build/solr-core/test-files/solr/collection1/conf/elevate.xml
[junit4:junit4]   2> 284 T1927 oashc.HttpShardHandlerFactory.getParameter Setting socketTimeout to: 0
[junit4:junit4]   2> 285 T1927 oashc.HttpShardHandlerFactory.getParameter Setting urlScheme to: http://
[junit4:junit4]   2> 285 T1927 oashc.HttpShardHandlerFactory.getParameter Setting connTimeout to: 0
[junit4:junit4]   2> 285 T1927 oashc.HttpShardHandlerFactory.getParameter Setting maxConnectionsPerHost to: 20
[junit4:junit4]   2> 285 T1927 oashc.HttpShardHandlerFactory.getParameter Setting corePoolSize to: 0
[junit4:junit4]   2> 286 T1927 oashc.HttpShardHandlerFactory.getParameter Setting maximumPoolSize to: 2147483647
[junit4:junit4]   2> 286 T1927 oashc.HttpShardHandlerFactory.getParameter Setting maxThreadIdleTime to: 5
[junit4:junit4]   2> 286 T1927 oashc.HttpShardHandlerFactory.getParameter Setting sizeOfQueue to: -1
[junit4:junit4]   2> 286 T1927 oashc.HttpShardHandlerFactory.getParameter Setting fairnessPolicy to: false
[junit4:junit4]   2> 286 T1927 oascsi.HttpClientUtil.createClient Creating new http client, config:maxConnectionsPerHost=20&maxConnections=10000&socketTimeout=0&connTimeout=0&retry=false
[junit4:junit4]   2> 288 T1937 oasc.SolrCore.registerSearcher [collection1] Registered new searcher Searcher@3aca54b9 main{StandardDirectoryReader(segments_1:1)}
[junit4:junit4]   2> 288 T1927 oasc.CoreContainer.register registering core: collection1
[junit4:junit4]   2> 289 T1927 oass.SolrDispatchFilter.init user.dir=/mnt/ssd/jenkins/workspace/Lucene-Solr-trunk-Linux/checkout/solr/build/solr-core/test/J1
[junit4:junit4]   2> 289 T1927 oass.SolrDispatchFilter.init SolrDispatchFilter.init() done
[junit4:junit4]   2> 289 T1927 oascsi.HttpClientUtil.createClient Creating new http client, config:maxConnections=128&maxConnectionsPerHost=32&followRedirects=false
[junit4:junit4]   2> 291 T1927 oejs.Server.doStart jetty-8.1.2.v20120308
[junit4:junit4]   2> 292 T1927 oejs.AbstractConnector.doStart Started SocketConnector@0.0.0.0:52952
[junit4:junit4]   2> 293 T1927 oasc.SolrResourceLoader.locateSolrHome JNDI not configured for solr (NoInitialContextEx)
[junit4:junit4]   2> 293 T1927 oasc.SolrResourceLoader.locateSolrHome using system property solr.solr.home: /mnt/ssd/jenkins/workspace/Lucene-Solr-trunk-Linux/checkout/solr/build/solr-core/test-files/solr
[junit4:junit4]   2> 293 T1927 oasc.SolrResourceLoader.<init> new SolrResourceLoader for deduced Solr Home: '/mnt/ssd/jenkins/workspace/Lucene-Solr-trunk-Linux/checkout/solr/build/solr-core/test-files/solr/'
[junit4:junit4]   2> 300 T1927 oass.SolrDispatchFilter.init SolrDispatchFilter.init()
[junit4:junit4]   2> 300 T1927 oasc.SolrResourceLoader.locateSolrHome JNDI not configured for solr (NoInitialContextEx)
[junit4:junit4]   2> 300 T1927 oasc.SolrResourceLoader.locateSolrHome using system property solr.solr.home: /mnt/ssd/jenkins/workspace/Lucene-Solr-trunk-Linux/checkout/solr/build/solr-core/test-files/solr
[junit4:junit4]   2> 300 T1927 oasc.CoreContainer$Initializer.initialize looking for solr.xml: /mnt/ssd/jenkins/workspace/Lucene-Solr-trunk-Linux/checkout/solr/build/solr-core/test-files/solr/solr.xml
[junit4:junit4]   2> 300 T1927 oasc.CoreContainer.<init> New CoreContainer 519734948
[junit4:junit4]   2> 301 T1927 oasc.CoreContainer.load Loading CoreContainer using Solr Home: '/mnt/ssd/jenkins/workspace/Lucene-Solr-trunk-Linux/checkout/solr/build/solr-core/test-files/solr/'
[junit4:junit4]   2> 301 T1927 oasc.SolrResourceLoader.<init> new SolrResourceLoader for directory: '/mnt/ssd/jenkins/workspace/Lucene-Solr-trunk-Linux/checkout/solr/build/solr-core/test-files/solr/'
[junit4:junit4]   2> 309 T1927 oasc.CoreContainer.load Registering Log Listener
[junit4:junit4]   2> 324 T1927 oasc.CoreContainer.create Creating SolrCore 'collection1' using instanceDir: /mnt/ssd/jenkins/workspace/Lucene-Solr-trunk-Linux/checkout/solr/build/solr-core/test-files/solr/collection1
[junit4:junit4]   2> 324 T1927 oasc.SolrResourceLoader.<init> new SolrResourceLoader for directory: '/mnt/ssd/jenkins/workspace/Lucene-Solr-trunk-Linux/checkout/solr/build/solr-core/test-files/solr/collection1/'
[junit4:junit4]   2> 325 T1927 oasc.SolrResourceLoader.replaceClassLoader Adding 'file:/mnt/ssd/jenkins/workspace/Lucene-Solr-trunk-Linux/checkout/solr/build/solr-core/test-files/solr/collection1/lib/README' to classloader
[junit4:junit4]   2> 325 T1927 oasc.SolrResourceLoader.replaceClassLoader Adding 'file:/mnt/ssd/jenkins/workspace/Lucene-Solr-trunk-Linux/checkout/solr/build/solr-core/test-files/solr/collection1/lib/classes/' to classloader
[junit4:junit4]   2> 342 T1927 oasc.SolrConfig.<init> Using Lucene MatchVersion: LUCENE_50
[junit4:junit4]   2> 377 T1927 oasc.SolrConfig.<init> Loaded SolrConfig: solrconfig-elevate.xml
[junit4:junit4]   2> 377 T1927 oass.IndexSchema.readSchema Reading Solr Schema
[junit4:junit4]   2> 379 T1927 oass.IndexSchema.readSchema Schema name=example
[junit4:junit4]   2> 394 T1316 oaz.ClientCnxn$SendThread.startConnect Opening socket connection to server localhost.localdomain/127.0.0.1:50184
[junit4:junit4]   2> 395 T1316 oaz.ClientCnxn$SendThread.run WARNING Session 0x138f2361eb30010 for server null, unexpected error, closing socket connection and attempting reconnect java.net.ConnectException: Connection refused
[junit4:junit4]   2> 	at sun.nio.ch.SocketChannelImpl.checkConnect(Native Method)
[junit4:junit4]   2> 	at sun.nio.ch.SocketChannelImpl.finishConnect(SocketChannelImpl.java:692)
[junit4:junit4]   2> 	at org.apache.zookeeper.ClientCnxn$SendThread.run(ClientCnxn.java:1143)
[junit4:junit4]   2> 
[junit4:junit4]   2> 523 T1927 oass.IndexSchema.readSchema default search field in schema is text
[junit4:junit4]   2> 524 T1927 oass.IndexSchema.readSchema unique key field: id
[junit4:junit4]   2> 526 T1927 oasc.SolrCore.<init> [collection1] Opening new SolrCore at /mnt/ssd/jenkins/workspace/Lucene-Solr-trunk-Linux/checkout/solr/build/solr-core/test-files/solr/collection1/, dataDir=./org.apache.solr.handler.component.DistributedQueryElevationComponentTest-1344093593841/shard0/data/
[junit4:junit4]   2> 527 T1927 oasc.JmxMonitoredMap.<init> JMX monitoring is enabled. Adding Solr mbeans to JMX Server: com.sun.jmx.mbeanserver.JmxMBeanServer@ba528c2
[junit4:junit4]   2> 527 T1927 oasc.SolrCore.getNewIndexDir WARNING New index directory detected: old=null new=./org.apache.solr.handler.component.DistributedQueryElevationComponentTest-1344093593841/shard0/data/index/
[junit4:junit4]   2> 528 T1927 oasc.SolrCore.initIndex WARNING [collection1] Solr index directory './org.apache.solr.handler.component.DistributedQueryElevationComponentTest-1344093593841/shard0/data/index' doesn't exist. Creating new index...
[junit4:junit4]   2> 529 T1927 oasc.SolrDeletionPolicy.onCommit SolrDeletionPolicy.onCommit: commits:num=1
[junit4:junit4]   2> 		commit{dir=MockDirWrapper(org.apache.lucene.store.RAMDirectory@3b78af2c lockFactory=org.apache.lucene.store.SingleInstanceLockFactory@ae77f79),segFN=segments_1,generation=1,filenames=[segments_1]
[junit4:junit4]   2> 529 T1927 oasc.SolrDeletionPolicy.updateCommits newest commit = 1
[junit4:junit4]   2> 530 T1927 oasc.RequestHandlers.initHandlersFromConfig created /update: solr.UpdateRequestHandler
[junit4:junit4]   2> 530 T1927 oasc.RequestHandlers.initHandlersFromConfig created /elevate: org.apache.solr.handler.component.SearchHandler
[junit4:junit4]   2> 530 T1927 oasc.RequestHandlers.initHandlersFromConfig created /dataElevate: org.apache.solr.handler.component.SearchHandler
[junit4:junit4]   2> 531 T1927 oashl.XMLLoader.init xsltCacheLifetimeSeconds=60
[junit4:junit4]   2> 531 T1927 oasc.RequestHandlers.initHandlersFromConfig WARNING no default request handler is registered (either '/select' or 'standard')
[junit4:junit4]   2> 532 T1927 oasc.SolrCore.initDeprecatedSupport WARNING solrconfig.xml uses deprecated <admin/gettableFiles>, Please update your config to use the ShowFileRequestHandler.
[junit4:junit4]   2> 532 T1927 oasc.SolrCore.initDeprecatedSupport WARNING adding ShowFileRequestHandler with hidden files: [PROTWORDS.TXT, SOLRCONFIG-DELPOLICY1.XML, STOP-SNOWBALL.TXT, BAD-SCHEMA-CODEC-GLOBAL-VS-FT-MISMATCH.XML, SOLRCONFIG-SLAVE.XML, SOLRCONFIG-MASTER2.XML, SOLRCONFIG-QUERYSENDER.XML, SCHEMA12.XML, SOLRCONFIG-TRANSFORMERS.XML, BAD-SCHEMA-DUP-FIELDTYPE.XML, STOP-1.TXT, SCHEMA-LMJELINEKMERCER.XML, SOLRCONFIG-SCRIPT-UPDATEPROCESSOR.XML, SCHEMA-TRIE.XML, SOLRCONFIG_CODEC.XML, SCHEMA11.XML, SOLRCONFIG-PROPINJECT-INDEXDEFAULT.XML, SCHEMA-NUMERIC.XML, SOLRCONFIG-BASIC.XML, HYPHENATION.DTD, BAD-SCHEMA-DUP-FIELD.XML, OPEN-EXCHANGE-RATES.JSON, SCHEMA15.XML, SCHEMA-IB.XML, SCHEMA-FOLDING.XML, WDFTYPES.TXT, SOLRCONFIG-SPELLCHECKER.XML, XSLT, SOLRCONFIG-CACHING.XML, SOLRCONFIG-HIGHLIGHT.XML, SOLRCONFIG-MASTER3.XML, SOLRCONFIG-REPEATER.XML, STOPWITHBOM.TXT, SOLRCONFIG-QUERYSENDER-NOQUERY.XML, BAD_SOLRCONFIG.XML, SOLRCONFIG-REQHANDLER.INCL, SCHEMA-REPLICATION2.XML, THROW.ERROR.ON.ADD.UPDATEPROCESSOR.JS, BAD-SCHEMA-ANALYZER-CLASS-AND-NESTED.XML, SOLRCONFIG-LAZYWRITER.XML, SOLRCONFIG-ELEVATE.XML, TRIVIAL.UPDATEPROCESSOR0.JS, SCHEMA-DFR.XML, SCHEMA-CHARFILTERS.XML, SOLRCONFIG-MERGEPOLICY.XML, BAD-SCHEMA-SIM-GLOBAL-VS-FT-MISMATCH.XML, CURRENCY.XML, SCHEMA-COLLATE.XML, SOLRCONFIG-MASTER1.XML, SOLRCONFIG-PROPINJECT.XML, COMPOUNDDICTIONARY.TXT, BAD-SCHEMA-UNIQUEKEY-USES-DEFAULT.XML, SCHEMA-PHRASESUGGEST.XML, SCHEMA-MINIMAL.XML, BAD-SCHEMA-NOT-INDEXED-BUT-TF.XML, BAD-SCHEMA-UNIQUEKEY-MULTIVALUED.XML, SCHEMA-TFIDF.XML, SOLRCONFIG-FUNCTIONQUERY.XML, SCHEMA-BM25.XML, BAD-SOLRCONFIG-MISSING-SCRIPTFILE.XML, SCHEMASURROUND.XML, SCHEMA-LUCENEMATCHVERSION.XML, SOLRCONFIG-NOCACHE.XML, BAD-SCHEMA-NOT-INDEXED-BUT-POS.XML, SOLRCONFIG_PERF.XML, SOLRCONFIG-MASTER1-KEEPONEBACKUP.XML, STOPTYPES-1.TXT, BAD-SCHEMA-DUP-DYNAMICFIELD.XML, SOLRCONFIG-XINCLUDE.XML, SOLRCONFIG-ALTDIRECTORY.XML, SOLRCONFIG-SOLR-749.XML, SOLRCONFIG-SOLCOREPROPERTIES.XML, PHRASESUGGEST.TXT, SOLRCONFIG-SPELLCHECKCOMPONENT.XML, BAD-SCHEMA-EXTERNAL-FILEFIELD.XML, OLD_SYNONYMS.TXT, BAD-SOLRCONFIG-INVALID-SCRIPTFILE.XML, STEMDICT.TXT, TRIVIAL.UPDATEPROCESSOR1.JS, SCHEMA-NOT-REQUIRED-UNIQUE-KEY.XML, DA_COMPOUNDDICTIONARY.TXT, SOLRCONFIG-SLAVE1.XML, FRENCHARTICLES.TXT, ELEVATE.XML, BAD-MP-SOLRCONFIG.XML, MAPPING-ISOLATIN1ACCENT.TXT, SCHEMA_CODEC.XML, BAD-SCHEMA-UNIQUEKEY-IS-COPYFIELD-DEST.XML, SCHEMA-REPLICATION1.XML, SOLRCONFIG-PHRASESUGGEST.XML, STOPWORDS.TXT, SOLRCONFIG-TLOG.XML, SOLRCONFIG-DELPOLICY2.XML, BAD-SCHEMA-NOT-INDEXED-BUT-NORMS.XML, KEEP-1.TXT, SCHEMA-BINARYFIELD.XML, SOLRCONFIG-NATIVELOCK.XML, MISSLEADING.EXTENSION.UPDATEPROCESSOR.JS.TXT, BAD-SCHEMA-OMIT-TF-BUT-NOT-POS.XML, STOPTYPES-2.TXT, STOPWORDSWRONGENCODING.TXT, BAD-SCHEMA-NONTEXT-ANALYZER.XML, DA_UTF8.XML, CONDITIONAL.UPDATEPROCESSOR.JS, SCHEMA-REQUIRED-FIELDS.XML, ADDFIELDS.UPDATEPROCESSOR.JS, STOP-2.TXT, SCHEMA-REVERSED.XML, SCHEMA-SPELLCHECKER.XML, SOLRCONFIG-SIMPLELOCK.XML, HUNSPELL-TEST.AFF, KEEP-2.TXT, MISSING.FUNCTIONS.UPDATEPROCESSOR.JS, SOLRCONFIG-ENABLEPLUGIN.XML, SCHEMA-LMDIRICHLET.XML, SOLRCONFIG-UPDATE-PROCESSOR-CHAINS.XML, SCHEMA-STOP-KEEP.XML, SYNONYMS.TXT, SOLRCONFIG-MASTER.XML, SCHEMA.XML, HUNSPELL-TEST.DIC, SCHEMA-COPYFIELD-TEST.XML, SOLRCONFIG-TERMINDEX.XML, BAD-SOLRCONFIG-BOGUS-SCRIPTENGINE-NAME.XML, SCHEMA-SIM.XML]
[junit4:junit4]   2> 534 T1927 oass.SolrIndexSearcher.<init> Opening Searcher@3aa2928b main
[junit4:junit4]   2> 534 T1927 oass.SolrIndexSearcher.getIndexDir WARNING WARNING: Directory impl does not support setting indexDir: org.apache.lucene.store.MockDirectoryWrapper
[junit4:junit4]   2> 534 T1927 oasu.CommitTracker.<init> Hard AutoCommit: disabled
[junit4:junit4]   2> 535 T1927 oasu.CommitTracker.<init> Soft AutoCommit: disabled
[junit4:junit4]   2> 535 T1927 oashc.QueryElevationComponent.inform Loading QueryElevation from: /mnt/ssd/jenkins/workspace/Lucene-Solr-trunk-Linux/checkout/solr/build/solr-core/test-files/solr/collection1/conf/elevate.xml
[junit4:junit4]   2> 542 T1927 oashc.QueryElevationComponent.inform Loading QueryElevation from: /mnt/ssd/jenkins/workspace/Lucene-Solr-trunk-Linux/checkout/solr/build/solr-core/test-files/solr/collection1/conf/elevate.xml
[junit4:junit4]   2> 549 T1927 oashc.HttpShardHandlerFactory.getParameter Setting socketTimeout to: 0
[junit4:junit4]   2> 550 T1927 oashc.HttpShardHandlerFactory.getParameter Setting urlScheme to: http://
[junit4:junit4]   2> 550 T1927 oashc.HttpShardHandlerFactory.getParameter Setting connTimeout to: 0
[junit4:junit4]   2> 550 T1927 oashc.HttpShardHandlerFactory.getParameter Setting maxConnectionsPerHost to: 20
[junit4:junit4]   2> 551 T1927 oashc.HttpShardHandlerFactory.getParameter Setting corePoolSize to: 0
[junit4:junit4]   2> 551 T1927 oashc.HttpShardHandlerFactory.getParameter Setting maximumPoolSize to: 2147483647
[junit4:junit4]   2> 551 T1927 oashc.HttpShardHandlerFactory.getParameter Setting maxThreadIdleTime to: 5
[junit4:junit4]   2> 551 T1927 oashc.HttpShardHandlerFactory.getParameter Setting sizeOfQueue to: -1
[junit4:junit4]   2> 552 T1927 oashc.HttpShardHandlerFactory.getParameter Setting fairnessPolicy to: false
[junit4:junit4]   2> 552 T1927 oascsi.HttpClientUtil.createClient Creating new http client, config:maxConnectionsPerHost=20&maxConnections=10000&socketTimeout=0&connTimeout=0&retry=false
[junit4:junit4]   2> 554 T1947 oasc.SolrCore.registerSearcher [collection1] Registered new searcher Searcher@3aa2928b main{StandardDirectoryReader(segments_1:1)}
[junit4:junit4]   2> 554 T1927 oasc.CoreContainer.register registering core: collection1
[junit4:junit4]   2> 554 T1927 oass.SolrDispatchFilter.init user.dir=/mnt/ssd/jenkins/workspace/Lucene-Solr-trunk-Linux/checkout/solr/build/solr-core/test/J1
[junit4:junit4]   2> 554 T1927 oass.SolrDispatchFilter.init SolrDispatchFilter.init() done
[junit4:junit4]   2> 555 T1927 oascsi.HttpClientUtil.createClient Creating new http client, config:maxConnections=128&maxConnectionsPerHost=32&followRedirects=false
[junit4:junit4]   2> 556 T1927 oejs.Server.doStart jetty-8.1.2.v20120308
[junit4:junit4]   2> 557 T1927 oejs.AbstractConnector.doStart Started SocketConnector@0.0.0.0:44422
[junit4:junit4]   2> 559 T1927 oasc.SolrResourceLoader.locateSolrHome JNDI not configured for solr (NoInitialContextEx)
[junit4:junit4]   2> 560 T1927 oasc.SolrResourceLoader.locateSolrHome using system property solr.solr.home: /mnt/ssd/jenkins/workspace/Lucene-Solr-trunk-Linux/checkout/solr/build/solr-core/test-files/solr
[junit4:junit4]   2> 560 T1927 oasc.SolrResourceLoader.<init> new SolrResourceLoader for deduced Solr Home: '/mnt/ssd/jenkins/workspace/Lucene-Solr-trunk-Linux/checkout/solr/build/solr-core/test-files/solr/'
[junit4:junit4]   2> 566 T1927 oass.SolrDispatchFilter.init SolrDispatchFilter.init()
[junit4:junit4]   2> 566 T1927 oasc.SolrResourceLoader.locateSolrHome JNDI not configured for solr (NoInitialContextEx)
[junit4:junit4]   2> 566 T1927 oasc.SolrResourceLoader.locateSolrHome using system property solr.solr.home: /mnt/ssd/jenkins/workspace/Lucene-Solr-trunk-Linux/checkout/solr/build/solr-core/test-files/solr
[junit4:junit4]   2> 566 T1927 oasc.CoreContainer$Initializer.initialize looking for solr.xml: /mnt/ssd/jenkins/workspace/Lucene-Solr-trunk-Linux/checkout/solr/build/solr-core/test-files/solr/solr.xml
[junit4:junit4]   2> 567 T1927 oasc.CoreContainer.<init> New CoreContainer 1510974804
[junit4:junit4]   2> 567 T1927 oasc.CoreContainer.load Loading CoreContainer using Solr Home: '/mnt/ssd/jenkins/workspace/Lucene-Solr-trunk-Linux/checkout/solr/build/solr-core/test-files/solr/'
[junit4:junit4]   2> 567 T1927 oasc.SolrResourceLoader.<init> new SolrResourceLoader for directory: '/mnt/ssd/jenkins/workspace/Lucene-Solr-trunk-Linux/checkout/solr/build/solr-core/test-files/solr/'
[junit4:junit4]   2> 580 T1927 oasc.CoreContainer.load Registering Log Listener
[junit4:junit4]   2> 590 T1927 oasc.CoreContainer.create Creating SolrCore 'collection1' using instanceDir: /mnt/ssd/jenkins/workspace/Lucene-Solr-trunk-Linux/checkout/solr/build/solr-core/test-files/solr/collection1
[junit4:junit4]   2> 591 T1927 oasc.SolrResourceLoader.<init> new SolrResourceLoader for directory: '/mnt/ssd/jenkins/workspace/Lucene-Solr-trunk-Linux/checkout/solr/build/solr-core/test-files/solr/collection1/'
[junit4:junit4]   2> 591 T1927 oasc.SolrResourceLoader.replaceClassLoader Adding 'file:/mnt/ssd/jenkins/workspace/Lucene-Solr-trunk-Linux/checkout/solr/build/solr-core/test-files/solr/collection1/lib/README' to classloader
[junit4:junit4]   2> 591 T1927 oasc.SolrResourceLoader.replaceClassLoader Adding 'file:/mnt/ssd/jenkins/workspace/Lucene-Solr-trunk-Linux/checkout/solr/build/solr-core/test-files/solr/collection1/lib/classes/' to classloader
[junit4:junit4]   2> 624 T1927 oasc.SolrConfig.<init> Using Lucene MatchVersion: LUCENE_50
[junit4:junit4]   2> 665 T1927 oasc.SolrConfig.<init> Loaded SolrConfig: solrconfig-elevate.xml
[junit4:junit4]   2> 665 T1927 oass.IndexSchema.readSchema Reading Solr Schema
[junit4:junit4]   2> 668 T1927 oass.IndexSchema.readSchema Schema name=example
[junit4:junit4]   2> 799 T1927 oass.IndexSchema.readSchema default search field in schema is text
[junit4:junit4]   2> 801 T1927 oass.IndexSchema.readSchema unique key field: id
[junit4:junit4]   2> 803 T1927 oasc.SolrCore.<init> [collection1] Opening new SolrCore at /mnt/ssd/jenkins/workspace/Lucene-Solr-trunk-Linux/checkout/solr/build/solr-core/test-files/solr/collection1/, dataDir=./org.apache.solr.handler.component.DistributedQueryElevationComponentTest-1344093593841/shard1/data/
[junit4:junit4]   2> 803 T1927 oasc.JmxMonitoredMap.<init> JMX monitoring is enabled. Adding Solr mbeans to JMX Server: com.sun.jmx.mbeanserver.JmxMBeanServer@ba528c2
[junit4:junit4]   2> 803 T1927 oasc.SolrCore.getNewIndexDir WARNING New index directory detected: old=null new=./org.apache.solr.handler.component.DistributedQueryElevationComponentTest-1344093593841/shard1/data/index/
[junit4:junit4]   2> 804 T1927 oasc.SolrCore.initIndex WARNING [collection1] Solr index directory './org.apache.solr.handler.component.DistributedQueryElevationComponentTest-1344093593841/shard1/data/index' doesn't exist. Creating new index...
[junit4:junit4]   2> 814 T1927 oasc.SolrDeletionPolicy.onCommit SolrDeletionPolicy.onCommit: commits:num=1
[junit4:junit4]   2> 		commit{dir=MockDirWrapper(org.apache.lucene.store.RAMDirectory@5ef71abd lockFactory=org.apache.lucene.store.SingleInstanceLockFactory@192ad220),segFN=segments_1,generation=1,filenames=[segments_1]
[junit4:junit4]   2> 815 T1927 oasc.SolrDeletionPolicy.updateCommits newest commit = 1
[junit4:junit4]   2> 815 T1927 oasc.RequestHandlers.initHandlersFromConfig created /update: solr.UpdateRequestHandler
[junit4:junit4]   2> 816 T1927 oasc.RequestHandlers.initHandlersFromConfig created /elevate: org.apache.solr.handler.component.SearchHandler
[junit4:junit4]   2> 816 T1927 oasc.RequestHandlers.initHandlersFromConfig created /dataElevate: org.apache.solr.handler.component.SearchHandler
[junit4:junit4]   2> 817 T1927 oashl.XMLLoader.init xsltCacheLifetimeSeconds=60
[junit4:junit4]   2> 817 T1927 oasc.RequestHandlers.initHandlersFromConfig WARNING no default request handler is registered (either '/select' or 'standard')
[junit4:junit4]   2> 818 T1927 oasc.SolrCore.initDeprecatedSupport WARNING solrconfig.xml uses deprecated <admin/gettableFiles>, Please update your config to use the ShowFileRequestHandler.
[junit4:junit4]   2> 819 T1927 oasc.SolrCore.initDeprecatedSupport WARNING adding ShowFileRequestHandler with hidden files: [PROTWORDS.TXT, SOLRCONFIG-DELPOLICY1.XML, STOP-SNOWBALL.TXT, BAD-SCHEMA-CODEC-GLOBAL-VS-FT-MISMATCH.XML, SOLRCONFIG-SLAVE.XML, SOLRCONFIG-MASTER2.XML, SOLRCONFIG-QUERYSENDER.XML, SCHEMA12.XML, SOLRCONFIG-TRANSFORMERS.XML, BAD-SCHEMA-DUP-FIELDTYPE.XML, STOP-1.TXT, SCHEMA-LMJELINEKMERCER.XML, SOLRCONFIG-SCRIPT-UPDATEPROCESSOR.XML, SCHEMA-TRIE.XML, SOLRCONFIG_CODEC.XML, SCHEMA11.XML, SOLRCONFIG-PROPINJECT-INDEXDEFAULT.XML, SCHEMA-NUMERIC.XML, SOLRCONFIG-BASIC.XML, HYPHENATION.DTD, BAD-SCHEMA-DUP-FIELD.XML, OPEN-EXCHANGE-RATES.JSON, SCHEMA15.XML, SCHEMA-IB.XML, SCHEMA-FOLDING.XML, WDFTYPES.TXT, SOLRCONFIG-SPELLCHECKER.XML, XSLT, SOLRCONFIG-CACHING.XML, SOLRCONFIG-HIGHLIGHT.XML, SOLRCONFIG-MASTER3.XML, SOLRCONFIG-REPEATER.XML, STOPWITHBOM.TXT, SOLRCONFIG-QUERYSENDER-NOQUERY.XML, BAD_SOLRCONFIG.XML, SOLRCONFIG-REQHANDLER.INCL, SCHEMA-REPLICATION2.XML, THROW.ERROR.ON.ADD.UPDATEPROCESSOR.JS, BAD-SCHEMA-ANALYZER-CLASS-AND-NESTED.XML, SOLRCONFIG-LAZYWRITER.XML, SOLRCONFIG-ELEVATE.XML, TRIVIAL.UPDATEPROCESSOR0.JS, SCHEMA-DFR.XML, SCHEMA-CHARFILTERS.XML, SOLRCONFIG-MERGEPOLICY.XML, BAD-SCHEMA-SIM-GLOBAL-VS-FT-MISMATCH.XML, CURRENCY.XML, SCHEMA-COLLATE.XML, SOLRCONFIG-MASTER1.XML, SOLRCONFIG-PROPINJECT.XML, COMPOUNDDICTIONARY.TXT, BAD-SCHEMA-UNIQUEKEY-USES-DEFAULT.XML, SCHEMA-PHRASESUGGEST.XML, SCHEMA-MINIMAL.XML, BAD-SCHEMA-NOT-INDEXED-BUT-TF.XML, BAD-SCHEMA-UNIQUEKEY-MULTIVALUED.XML, SCHEMA-TFIDF.XML, SOLRCONFIG-FUNCTIONQUERY.XML, SCHEMA-BM25.XML, BAD-SOLRCONFIG-MISSING-SCRIPTFILE.XML, SCHEMASURROUND.XML, SCHEMA-LUCENEMATCHVERSION.XML, SOLRCONFIG-NOCACHE.XML, BAD-SCHEMA-NOT-INDEXED-BUT-POS.XML, SOLRCONFIG_PERF.XML, SOLRCONFIG-MASTER1-KEEPONEBACKUP.XML, STOPTYPES-1.TXT, BAD-SCHEMA-DUP-DYNAMICFIELD.XML, SOLRCONFIG-XINCLUDE.XML, SOLRCONFIG-ALTDIRECTORY.XML, SOLRCONFIG-SOLR-749.XML, SOLRCONFIG-SOLCOREPROPERTIES.XML, PHRASESUGGEST.TXT, SOLRCONFIG-SPELLCHECKCOMPONENT.XML, BAD-SCHEMA-EXTERNAL-FILEFIELD.XML, OLD_SYNONYMS.TXT, BAD-SOLRCONFIG-INVALID-SCRIPTFILE.XML, STEMDICT.TXT, TRIVIAL.UPDATEPROCESSOR1.JS, SCHEMA-NOT-REQUIRED-UNIQUE-KEY.XML, DA_COMPOUNDDICTIONARY.TXT, SOLRCONFIG-SLAVE1.XML, FRENCHARTICLES.TXT, ELEVATE.XML, BAD-MP-SOLRCONFIG.XML, MAPPING-ISOLATIN1ACCENT.TXT, SCHEMA_CODEC.XML, BAD-SCHEMA-UNIQUEKEY-IS-COPYFIELD-DEST.XML, SCHEMA-REPLICATION1.XML, SOLRCONFIG-PHRASESUGGEST.XML, STOPWORDS.TXT, SOLRCONFIG-TLOG.XML, SOLRCONFIG-DELPOLICY2.XML, BAD-SCHEMA-NOT-INDEXED-BUT-NORMS.XML, KEEP-1.TXT, SCHEMA-BINARYFIELD.XML, SOLRCONFIG-NATIVELOCK.XML, MISSLEADING.EXTENSION.UPDATEPROCESSOR.JS.TXT, BAD-SCHEMA-OMIT-TF-BUT-NOT-POS.XML, STOPTYPES-2.TXT, STOPWORDSWRONGENCODING.TXT, BAD-SCHEMA-NONTEXT-ANALYZER.XML, DA_UTF8.XML, CONDITIONAL.UPDATEPROCESSOR.JS, SCHEMA-REQUIRED-FIELDS.XML, ADDFIELDS.UPDATEPROCESSOR.JS, STOP-2.TXT, SCHEMA-REVERSED.XML, SCHEMA-SPELLCHECKER.XML, SOLRCONFIG-SIMPLELOCK.XML, HUNSPELL-TEST.AFF, KEEP-2.TXT, MISSING.FUNCTIONS.UPDATEPROCESSOR.JS, SOLRCONFIG-ENABLEPLUGIN.XML, SCHEMA-LMDIRICHLET.XML, SOLRCONFIG-UPDATE-PROCESSOR-CHAINS.XML, SCHEMA-STOP-KEEP.XML, SYNONYMS.TXT, SOLRCONFIG-MASTER.XML, SCHEMA.XML, HUNSPELL-TEST.DIC, SCHEMA-COPYFIELD-TEST.XML, SOLRCONFIG-TERMINDEX.XML, BAD-SOLRCONFIG-BOGUS-SCRIPTENGINE-NAME.XML, SCHEMA-SIM.XML]
[junit4:junit4]   2> 821 T1927 oass.SolrIndexSearcher.<init> Opening Searcher@5ef9ea4f main
[junit4:junit4]   2> 822 T1927 oass.SolrIndexSearcher.getIndexDir WARNING WARNING: Directory impl does not support setting indexDir: org.apache.lucene.store.MockDirectoryWrapper
[junit4:junit4]   2> 822 T1927 oasu.CommitTracker.<init> Hard AutoCommit: disabled
[junit4:junit4]   2> 822 T1927 oasu.CommitTracker.<init> Soft AutoCommit: disabled
[junit4:junit4]   2> 823 T1927 oashc.QueryElevationComponent.inform Loading QueryElevation from: /mnt/ssd/jenkins/workspace/Lucene-Solr-trunk-Linux/checkout/solr/build/solr-core/test-files/solr/collection1/conf/elevate.xml
[junit4:junit4]   2> 828 T1927 oashc.QueryElevationComponent.inform Loading QueryElevation from: /mnt/ssd/jenkins/workspace/Lucene-Solr-trunk-Linux/checkout/solr/build/solr-core/test-files/solr/collection1/conf/elevate.xml
[junit4:junit4]   2> 834 T1927 oashc.HttpShardHandlerFactory.getParameter Setting socketTimeout to: 0
[junit4:junit4]   2> 835 T1927 oashc.HttpShardHandlerFactory.getParameter Setting urlScheme to: http://
[junit4:junit4]   2> 835 T1927 oashc.HttpShardHandlerFactory.getParameter Setting connTimeout to: 0
[junit4:junit4]   2> 835 T1927 oashc.HttpShardHandlerFactory.getParameter Setting maxConnectionsPerHost to: 20
[junit4:junit4]   2> 835 T1927 oashc.HttpShardHandlerFactory.getParameter Setting corePoolSize to: 0
[junit4:junit4]   2> 836 T1927 oashc.HttpShardHandlerFactory.getParameter Setting maximumPoolSize to: 2147483647
[junit4:junit4]   2> 836 T1927 oashc.HttpShardHandlerFactory.getParameter Setting maxThreadIdleTime to: 5
[junit4:junit4]   2> 836 T1927 oashc.HttpShardHandlerFactory.getParameter Setting sizeOfQueue to: -1
[junit4:junit4]   2> 836 T1927 oashc.HttpShardHandlerFactory.getParameter Setting fairnessPolicy to: false
[junit4:junit4]   2> 836 T1927 oascsi.HttpClientUtil.createClient Creating new http client, config:maxConnectionsPerHost=20&maxConnections=10000&socketTimeout=0&connTimeout=0&retry=false
[junit4:junit4]   2> 839 T1927 oasc.CoreContainer.register registering core: collection1
[junit4:junit4]   2> 839 T1957 oasc.SolrCore.registerSearcher [collection1] Registered new searcher Searcher@5ef9ea4f main{StandardDirectoryReader(segments_1:1)}
[junit4:junit4]   2> 839 T1927 oass.SolrDispatchFilter.init user.dir=/mnt/ssd/jenkins/workspace/Lucene-Solr-trunk-Linux/checkout/solr/build/solr-core/test/J1
[junit4:junit4]   2> 840 T1927 oass.SolrDispatchFilter.init SolrDispatchFilter.init() done
[junit4:junit4]   2> 840 T1927 oascsi.HttpClientUtil.createClient Creating new http client, config:maxConnections=128&maxConnectionsPerHost=32&followRedirects=false
[junit4:junit4]   2> 842 T1927 oejs.Server.doStart jetty-8.1.2.v20120308
[junit4:junit4]   2> 843 T1927 oejs.AbstractConnector.doStart Started SocketConnector@0.0.0.0:54721
[junit4:junit4]   2> 844 T1927 oasc.SolrResourceLoader.locateSolrHome JNDI not configured for solr (NoInitialContextEx)
[junit4:junit4]   2> 845 T1927 oasc.SolrResourceLoader.locateSolrHome using system property solr.solr.home: /mnt/ssd/jenkins/workspace/Lucene-Solr-trunk-Linux/checkout/solr/build/solr-core/test-files/solr
[junit4:junit4]   2> 845 T1927 oasc.SolrResourceLoader.<init> new SolrResourceLoader for deduced Solr Home: '/mnt/ssd/jenkins/workspace/Lucene-Solr-trunk-Linux/checkout/solr/build/solr-core/test-files/solr/'
[junit4:junit4]   2> 852 T1927 oass.SolrDispatchFilter.init SolrDispatchFilter.init()
[junit4:junit4]   2> 852 T1927 oasc.SolrResourceLoader.locateSolrHome JNDI not configured for solr (NoInitialContextEx)
[junit4:junit4]   2> 852 T1927 oasc.SolrResourceLoader.locateSolrHome using system property solr.solr.home: /mnt/ssd/jenkins/workspace/Lucene-Solr-trunk-Linux/checkout/solr/build/solr-core/test-files/solr
[junit4:junit4]   2> 852 T1927 oasc.CoreContainer$Initializer.initialize looking for solr.xml: /mnt/ssd/jenkins/workspace/Lucene-Solr-trunk-Linux/checkout/solr/build/solr-core/test-files/solr/solr.xml
[junit4:junit4]   2> 853 T1927 oasc.CoreContainer.<init> New CoreContainer 93781858
[junit4:junit4]   2> 853 T1927 oasc.CoreContainer.load Loading CoreContainer using Solr Home: '/mnt/ssd/jenkins/workspace/Lucene-Solr-trunk-Linux/checkout/solr/build/solr-core/test-files/solr/'
[junit4:junit4]   2> 853 T1927 oasc.SolrResourceLoader.<init> new SolrResourceLoader for directory: '/mnt/ssd/jenkins/workspace/Lucene-Solr-trunk-Linux/checkout/solr/build/solr-core/test-files/solr/'
[junit4:junit4]   2> 862 T1927 oasc.CoreContainer.load Registering Log Listener
[junit4:junit4]   2> 870 T1927 oasc.CoreContainer.create Creating SolrCore 'collection1' using instanceDir: /mnt/ssd/jenkins/workspace/Lucene-Solr-trunk-Linux/checkout/solr/build/solr-core/test-files/solr/collection1
[junit4:junit4]   2> 870 T1927 oasc.SolrResourceLoader.<init> new SolrResourceLoader for directory: '/mnt/ssd/jenkins/workspace/Lucene-Solr-trunk-Linux/checkout/solr/build/solr-core/test-files/solr/collection1/'
[junit4:junit4]   2> 871 T1927 oasc.SolrResourceLoader.replaceClassLoader Adding 'file:/mnt/ssd/jenkins/workspace/Lucene-Solr-trunk-Linux/checkout/solr/build/solr-core/test-files/solr/collection1/lib/README' to classloader
[junit4:junit4]   2> 871 T1927 oasc.SolrResourceLoader.replaceClassLoader Adding 'file:/mnt/ssd/jenkins/workspace/Lucene-Solr-trunk-Linux/checkout/solr/build/solr-core/test-files/solr/collection1/lib/classes/' to classloader
[junit4:junit4]   2> 900 T1927 oasc.SolrConfig.<init> Using Lucene MatchVersion: LUCENE_50
[junit4:junit4]   2> 928 T1927 oasc.SolrConfig.<init> Loaded SolrConfig: solrconfig-elevate.xml
[junit4:junit4]   2> 929 T1927 oass.IndexSchema.readSchema Reading Solr Schema
[junit4:junit4]   2> 951 T1927 oass.IndexSchema.readSchema Schema name=example
[junit4:junit4]   2> 1100 T1927 oass.IndexSchema.readSchema default search field in schema is text
[junit4:junit4]   2> 1103 T1927 oass.IndexSchema.readSchema unique key field: id
[junit4:junit4]   2> 1105 T1927 oasc.SolrCore.<init> [collection1] Opening new SolrCore at /mnt/ssd/jenkins/workspace/Lucene-Solr-trunk-Linux/checkout/solr/build/solr-core/test-files/solr/collection1/, dataDir=./org.apache.solr.handler.component.DistributedQueryElevationComponentTest-1344093593841/shard2/data/
[junit4:junit4]   2> 1106 T1927 oasc.JmxMonitoredMap.<init> JMX monitoring is enabled. Adding Solr mbeans to JMX Server: com.sun.jmx.mbeanserver.JmxMBeanServer@ba528c2
[junit4:junit4]   2> 1106 T1927 oasc.SolrCore.getNewIndexDir WARNING New index directory detected: old=null new=./org.apache.solr.handler.component.DistributedQueryElevationComponentTest-1344093593841/shard2/data/index/
[junit4:junit4]   2> 1107 T1927 oasc.SolrCore.initIndex WARNING [collection1] Solr index directory './org.apache.solr.handler.component.DistributedQueryElevationComponentTest-1344093593841/shard2/data/index' doesn't exist. Creating new index...
[junit4:junit4]   2> 1108 T1927 oasc.SolrDeletionPolicy.onCommit SolrDeletionPolicy.onCommit: commits:num=1
[junit4:junit4]   2> 		commit{dir=MockDirWrapper(org.apache.lucene.store.RAMDirectory@167037b8 lockFactory=org.apache.lucene.store.SingleInstanceLockFactory@2307b921),segFN=segments_1,generation=1,filenames=[segments_1]
[junit4:junit4]   2> 1109 T1927 oasc.SolrDeletionPolicy.updateCommits newest commit = 1
[junit4:junit4]   2> 1110 T1927 oasc.RequestHandlers.initHandlersFromConfig created /update: solr.UpdateRequestHandler
[junit4:junit4]   2> 1110 T1927 oasc.RequestHandlers.initHandlersFromConfig created /elevate: org.apache.solr.handler.component.SearchHandler
[junit4:junit4]   2> 1111 T1927 oasc.RequestHandlers.initHandlersFromConfig created /dataElevate: org.apache.solr.handler.component.SearchHandler
[junit4:junit4]   2> 1111 T1927 oashl.XMLLoader.init xsltCacheLifetimeSeconds=60
[junit4:junit4]   2> 1111 T1927 oasc.RequestHandlers.initHandlersFromConfig WARNING no default request handler is registered (either '/select' or 'standard')
[junit4:junit4]   2> 1112 T1927 oasc.SolrCore.initDeprecatedSupport WARNING solrconfig.xml uses deprecated <admin/gettableFiles>, Please update your config to use the ShowFileRequestHandler.
[junit4:junit4]   2> 1113 T1927 oasc.SolrCore.initDeprecatedSupport WARNING adding ShowFileRequestHandler with hidden files: [PROTWORDS.TXT, SOLRCONFIG-DELPOLICY1.XML, STOP-SNOWBALL.TXT, BAD-SCHEMA-CODEC-GLOBAL-VS-FT-MISMATCH.XML, SOLRCONFIG-SLAVE.XML, SOLRCONFIG-MASTER2.XML, SOLRCONFIG-QUERYSENDER.XML, SCHEMA12.XML, SOLRCONFIG-TRANSFORMERS.XML, BAD-SCHEMA-DUP-FIELDTYPE.XML, STOP-1.TXT, SCHEMA-LMJELINEKMERCER.XML, SOLRCONFIG-SCRIPT-UPDATEPROCESSOR.XML, SCHEMA-TRIE.XML, SOLRCONFIG_CODEC.XML, SCHEMA11.XML, SOLRCONFIG-PROPINJECT-INDEXDEFAULT.XML, SCHEMA-NUMERIC.XML, SOLRCONFIG-BASIC.XML, HYPHENATION.DTD, BAD-SCHEMA-DUP-FIELD.XML, OPEN-EXCHANGE-RATES.JSON, SCHEMA15.XML, SCHEMA-IB.XML, SCHEMA-FOLDING.XML, WDFTYPES.TXT, SOLRCONFIG-SPELLCHECKER.XML, XSLT, SOLRCONFIG-CACHING.XML, SOLRCONFIG-HIGHLIGHT.XML, SOLRCONFIG-MASTER3.XML, SOLRCONFIG-REPEATER.XML, STOPWITHBOM.TXT, SOLRCONFIG-QUERYSENDER-NOQUERY.XML, BAD_SOLRCONFIG.XML, SOLRCONFIG-REQHANDLER.INCL, SCHEMA-REPLICATION2.XML, THROW.ERROR.ON.ADD.UPDATEPROCESSOR.JS, BAD-SCHEMA-ANALYZER-CLASS-AND-NESTED.XML, SOLRCONFIG-LAZYWRITER.XML, SOLRCONFIG-ELEVATE.XML, TRIVIAL.UPDATEPROCESSOR0.JS, SCHEMA-DFR.XML, SCHEMA-CHARFILTERS.XML, SOLRCONFIG-MERGEPOLICY.XML, BAD-SCHEMA-SIM-GLOBAL-VS-FT-MISMATCH.XML, CURRENCY.XML, SCHEMA-COLLATE.XML, SOLRCONFIG-MASTER1.XML, SOLRCONFIG-PROPINJECT.XML, COMPOUNDDICTIONARY.TXT, BAD-SCHEMA-UNIQUEKEY-USES-DEFAULT.XML, SCHEMA-PHRASESUGGEST.XML, SCHEMA-MINIMAL.XML, BAD-SCHEMA-NOT-INDEXED-BUT-TF.XML, BAD-SCHEMA-UNIQUEKEY-MULTIVALUED.XML, SCHEMA-TFIDF.XML, SOLRCONFIG-FUNCTIONQUERY.XML, SCHEMA-BM25.XML, BAD-SOLRCONFIG-MISSING-SCRIPTFILE.XML, SCHEMASURROUND.XML, SCHEMA-LUCENEMATCHVERSION.XML, SOLRCONFIG-NOCACHE.XML, BAD-SCHEMA-NOT-INDEXED-BUT-POS.XML, SOLRCONFIG_PERF.XML, SOLRCONFIG-MASTER1-KEEPONEBACKUP.XML, STOPTYPES-1.TXT, BAD-SCHEMA-DUP-DYNAMICFIELD.XML, SOLRCONFIG-XINCLUDE.XML, SOLRCONFIG-ALTDIRECTORY.XML, SOLRCONFIG-SOLR-749.XML, SOLRCONFIG-SOLCOREPROPERTIES.XML, PHRASESUGGEST.TXT, SOLRCONFIG-SPELLCHECKCOMPONENT.XML, BAD-SCHEMA-EXTERNAL-FILEFIELD.XML, OLD_SYNONYMS.TXT, BAD-SOLRCONFIG-INVALID-SCRIPTFILE.XML, STEMDICT.TXT, TRIVIAL.UPDATEPROCESSOR1.JS, SCHEMA-NOT-REQUIRED-UNIQUE-KEY.XML, DA_COMPOUNDDICTIONARY.TXT, SOLRCONFIG-SLAVE1.XML, FRENCHARTICLES.TXT, ELEVATE.XML, BAD-MP-SOLRCONFIG.XML, MAPPING-ISOLATIN1ACCENT.TXT, SCHEMA_CODEC.XML, BAD-SCHEMA-UNIQUEKEY-IS-COPYFIELD-DEST.XML, SCHEMA-REPLICATION1.XML, SOLRCONFIG-PHRASESUGGEST.XML, STOPWORDS.TXT, SOLRCONFIG-TLOG.XML, SOLRCONFIG-DELPOLICY2.XML, BAD-SCHEMA-NOT-INDEXED-BUT-NORMS.XML, KEEP-1.TXT, SCHEMA-BINARYFIELD.XML, SOLRCONFIG-NATIVELOCK.XML, MISSLEADING.EXTENSION.UPDATEPROCESSOR.JS.TXT, BAD-SCHEMA-OMIT-TF-BUT-NOT-POS.XML, STOPTYPES-2.TXT, STOPWORDSWRONGENCODING.TXT, BAD-SCHEMA-NONTEXT-ANALYZER.XML, DA_UTF8.XML, CONDITIONAL.UPDATEPROCESSOR.JS, SCHEMA-REQUIRED-FIELDS.XML, ADDFIELDS.UPDATEPROCESSOR.JS, STOP-2.TXT, SCHEMA-REVERSED.XML, SCHEMA-SPELLCHECKER.XML, SOLRCONFIG-SIMPLELOCK.XML, HUNSPELL-TEST.AFF, KEEP-2.TXT, MISSING.FUNCTIONS.UPDATEPROCESSOR.JS, SOLRCONFIG-ENABLEPLUGIN.XML, SCHEMA-LMDIRICHLET.XML, SOLRCONFIG-UPDATE-PROCESSOR-CHAINS.XML, SCHEMA-STOP-KEEP.XML, SYNONYMS.TXT, SOLRCONFIG-MASTER.XML, SCHEMA.XML, HUNSPELL-TEST.DIC, SCHEMA-COPYFIELD-TEST.XML, SOLRCONFIG-TERMINDEX.XML, BAD-SOLRCONFIG-BOGUS-SCRIPTENGINE-NAME.XML, SCHEMA-SIM.XML]
[junit4:junit4]   2> 1116 T1927 oass.SolrIndexSearcher.<init> Opening Searcher@264c33ef main
[junit4:junit4]   2> 1116 T1927 oass.SolrIndexSearcher.getIndexDir WARNING WARNING: Directory impl does not support setting indexDir: org.apache.lucene.store.MockDirectoryWrapper
[junit4:junit4]   2> 1117 T1927 oasu.CommitTracker.<init> Hard AutoCommit: disabled
[junit4:junit4]   2> 1117 T1927 oasu.CommitTracker.<init> Soft AutoCommit: disabled
[junit4:junit4]   2> 1117 T1927 oashc.QueryElevationComponent.inform Loading QueryElevation from: /mnt/ssd/jenkins/workspace/Lucene-Solr-trunk-Linux/checkout/solr/build/solr-core/test-files/solr/collection1/conf/elevate.xml
[junit4:junit4]   2> 1132 T1927 oashc.QueryElevationComponent.inform Loading QueryElevation from: /mnt/ssd/jenkins/workspace/Lucene-Solr-trunk-Linux/checkout/solr/build/solr-core/test-files/solr/collection1/conf/elevate.xml
[junit4:junit4]   2> 1137 T1927 oashc.HttpShardHandlerFactory.getParameter Setting socketTimeout to: 0
[junit4:junit4]   2> 1137 T1927 oashc.HttpShardHandlerFactory.getParameter Setting urlScheme to: http://
[junit4:junit4]   2> 1138 T1927 oashc.HttpShardHandlerFactory.getParameter Setting connTimeout to: 0
[junit4:junit4]   2> 1138 T1927 oashc.HttpShardHandlerFactory.getParameter Setting maxConnectionsPerHost to: 20
[junit4:junit4]   2> 1138 T1927 oashc.HttpShardHandlerFactory.getParameter Setting corePoolSize to: 0
[junit4:junit4]   2> 1138 T1927 oashc.HttpShardHandlerFactory.getParameter Setting maximumPoolSize to: 2147483647
[junit4:junit4]   2> 1138 T1927 oashc.HttpShardHandlerFactory.getParameter Setting maxThreadIdleTime to: 5
[junit4:junit4]   2> 1139 T1927 oashc.HttpShardHandlerFactory.getParameter Setting sizeOfQueue to: -1
[junit4:junit4]   2> 1139 T1927 oashc.HttpShardHandlerFactory.getParameter Setting fairnessPolicy to: false
[junit4:junit4]   2> 1139 T1927 oascsi.HttpClientUtil.createClient Creating new http client, config:maxConnectionsPerHost=20&maxConnections=10000&socketTimeout=0&connTimeout=0&retry=false
[junit4:junit4]   2> 1141 T1967 oasc.SolrCore.registerSearcher [collection1] Registered new searcher Searcher@264c33ef main{StandardDirectoryReader(segments_1:1)}
[junit4:junit4]   2> 1141 T1927 oasc.CoreContainer.register registering core: collection1
[junit4:junit4]   2> 1142 T1927 oass.SolrDispatchFilter.init user.dir=/mnt/ssd/jenkins/workspace/Lucene-Solr-trunk-Linux/checkout/solr/build/solr-core/test/J1
[junit4:junit4]   2> 1142 T1927 oass.SolrDispatchFilter.init SolrDispatchFilter.init() done
[junit4:junit4]   2> 1142 T1927 oascsi.HttpClientUtil.createClient Creating new http client, config:maxConnections=128&maxConnectionsPerHost=32&followRedirects=false
[junit4:junit4]   2> ASYNC  NEW_CORE C93 name=collection1 org.apache.solr.core.SolrCore@9271998
[junit4:junit4]   2> 1150 T1930 C93 oasu.DirectUpdateHandler2.deleteAll [collection1] REMOVING ALL DOCUMENTS FROM INDEX
[junit4:junit4]   2> 1151 T1930 C93 oasc.SolrDeletionPolicy.onInit SolrDeletionPolicy.onInit: commits:num=1
[junit4:junit4]   2> 		commit{dir=MockDirWrapper(org.apache.lucene.store.RAMDirectory@66014ed9 lockFactory=org.apache.lucene.store.SingleInstanceLockFactory@59e9474c),segFN=segments_1,generation=1,filenames=[segments_1]
[junit4:junit4]   2> 1152 T1930 C93 oasc.SolrDeletionPolicy.updateCommits newest commit = 1
[junit4:junit4]   2> 1153 T1930 C93 UPDATE [collection1] webapp=/solr path=/update params={version=2&wt=javabin} {deleteByQuery=*:*} 0 4
[junit4:junit4]   2> ASYNC  NEW_CORE C94 name=collection1 org.apache.solr.core.SolrCore@50760291
[junit4:junit4]   2> 1166 T1940 C94 oasu.DirectUpdateHandler2.deleteAll [collection1] REMOVING ALL DOCUMENTS FROM INDEX
[junit4:junit4]   2> 1167 T1940 C94 oasc.SolrDeletionPolicy.onInit SolrDeletionPolicy.onInit: commits:num=1
[junit4:junit4]   2> 		commit{dir=MockDirWrapper(org.apache.lucene.store.RAMDirectory@3b78af2c lockFactory=org.apache.lucene.store.SingleInstanceLockFactory@ae77f79),segFN=segments_1,generation=1,filenames=[segments_1]
[junit4:junit4]   2> 1168 T1940 C94 oasc.SolrDeletionPolicy.updateCommits newest commit = 1
[junit4:junit4]   2> 1168 T1940 C94 UPDATE [collection1] webapp=/solr path=/update params={version=2&wt=javabin} {deleteByQuery=*:*} 0 2
[junit4:junit4]   2> ASYNC  NEW_CORE C95 name=collection1 org.apache.solr.core.SolrCore@6532a13a
[junit4:junit4]   2> 1173 T1950 C95 oasu.DirectUpdateHandler2.deleteAll [collection1] REMOVING ALL DOCUMENTS FROM INDEX
[junit4:junit4]   2> 1174 T1950 C95 oasc.SolrDeletionPolicy.onInit SolrDeletionPolicy.onInit: commits:num=1
[junit4:junit4]   2> 		commit{dir=MockDirWrapper(org.apache.lucene.store.RAMDirectory@5ef71abd lockFactory=org.apache.lucene.store.SingleInstanceLockFactory@192ad220),segFN=segments_1,generation=1,filenames=[segments_1]
[junit4:junit4]   2> 1174 T1950 C95 oasc.SolrDeletionPolicy.updateCommits newest commit = 1
[junit4:junit4]   2> 1175 T1950 C95 UPDATE [collection1] webapp=/solr path=/update params={version=2&wt=javabin} {deleteByQuery=*:*} 0 3
[junit4:junit4]   2> ASYNC  NEW_CORE C96 name=collection1 org.apache.solr.core.SolrCore@461cf26e
[junit4:junit4]   2> 1178 T1960 C96 oasu.DirectUpdateHandler2.deleteAll [collection1] REMOVING ALL DOCUMENTS FROM INDEX
[junit4:junit4]   2> 1179 T1960 C96 oasc.SolrDeletionPolicy.onInit SolrDeletionPolicy.onInit: commits:num=1
[junit4:junit4]   2> 		commit{dir=MockDirWrapper(org.apache.lucene.store.RAMDirectory@167037b8 lockFactory=org.apache.lucene.store.SingleInstanceLockFactory@2307b921),segFN=segments_1,generation=1,filenames=[segments_1]
[junit4:junit4]   2> 1180 T1960 C96 oasc.SolrDeletionPolicy.updateCommits newest commit = 1
[junit4:junit4]   2> 1180 T1960 C96 UPDATE [collection1] webapp=/solr path=/update params={version=2&wt=javabin} {deleteByQuery=*:*} 0 2
[junit4:junit4]   2> 1183 T1930 C93 UPDATE [collection1] webapp=/solr path=/update params={version=2&wt=javabin} {add=[1]} 0 1
[junit4:junit4]   2> 1185 T1940 C94 UPDATE [collection1] webapp=/solr path=/update params={version=2&wt=javabin} {add=[1]} 0 0
[junit4:junit4]   2> 1187 T1930 C93 UPDATE [collection1] webapp=/solr path=/update params={version=2&wt=javabin} {add=[2]} 0 0
[junit4:junit4]   2> 1190 T1950 C95 UPDATE [collection1] webapp=/solr path=/update params={version=2&wt=javabin} {add=[2]} 0 1
[junit4:junit4]   2> 1191 T1930 C93 UPDATE [collection1] webapp=/solr path=/update params={version=2&wt=javabin} {add=[3]} 0 0
[junit4:junit4]   2> 1193 T1960 C96 UPDATE [collection1] webapp=/solr path=/update params={version=2&wt=javabin} {add=[3]} 0 0
[junit4:junit4]   2> 1195 T1930 C93 UPDATE [collection1] webapp=/solr path=/update params={version=2&wt=javabin} {add=[4]} 0 0
[junit4:junit4]   2> 1197 T1940 C94 UPDATE [collection1] webapp=/solr path=/update params={version=2&wt=javabin} {add=[4]} 0 0
[junit4:junit4]   2> 1201 T1930 C93 UPDATE [collection1] webapp=/solr path=/update params={version=2&wt=javabin} {add=[5]} 0 0
[junit4:junit4]   2> 1203 T1950 C95 UPDATE [collection1] webapp=/solr path=/update params={version=2&wt=javabin} {add=[5]} 0 0
[junit4:junit4]   2> 1205 T1930 C93 UPDATE [collection1] webapp=/solr path=/update params={version=2&wt=javabin} {add=[6]} 0 0
[junit4:junit4]   2> 1207 T1960 C96 UPDATE [collection1] webapp=/solr path=/update params={version=2&wt=javabin} {add=[6]} 0 0
[junit4:junit4]   2> 1209 T1930 C93 UPDATE [collection1] webapp=/solr path=/update params={version=2&wt=javabin} {add=[7]} 0 0
[junit4:junit4]   2> 1211 T1960 C96 UPDATE [collection1] webapp=/solr path=/update params={version=2&wt=javabin} {add=[7]} 0 0
[junit4:junit4]   2> 1222 T1930 C93 oasu.DirectUpdateHandler2.commit start commit{flags=0,_version_=0,optimize=false,openSearcher=true,waitSearcher=true,expungeDeletes=false,softCommit=false}
[junit4:junit4]   2> 1223 T1930 C93 oasc.SolrDeletionPolicy.onCommit SolrDeletionPolicy.onCommit: commits:num=2
[junit4:junit4]   2> 		commit{dir=MockDirWrapper(org.apache.lucene.store.RAMDirectory@66014ed9 lockFactory=org.apache.lucene.store.SingleInstanceLockFactory@59e9474c),segFN=segments_1,generation=1,filenames=[segments_1]
[junit4:junit4]   2> 		commit{dir=MockDirWrapper(org.apache.lucene.store.RAMDirectory@66014ed9 lockFactory=org.apache.lucene.store.SingleInstanceLockFactory@59e9474c),segFN=segments_2,generation=2,filenames=[_0_nrm.cfe, _0.fdt, _0.prx, _0.si, _0.tim, _0_nrm.cfs, segments_2, _0.frq, _0.fdx, _0.tip, _0.fnm]
[junit4:junit4]   2> 1223 T1930 C93 oasc.SolrDeletionPolicy.updateCommits newest commit = 2
[junit4:junit4]   2> 1229 T1930 C93 oass.SolrIndexSearcher.<init> Opening Searcher@5e1f1a29 main
[junit4:junit4]   2> 1230 T1930 C93 oass.SolrIndexSearcher.getIndexDir WARNING WARNING: Directory impl does not support setting indexDir: org.apache.lucene.store.MockDirectoryWrapper
[junit4:junit4]   2> 1231 T1930 C93 oasu.DirectUpdateHandler2.commit end_commit_flush
[junit4:junit4]   2> 1231 T1937 oasc.SolrCore.registerSearcher [collection1] Registered new searcher Searcher@5e1f1a29 main{StandardDirectoryReader(segments_2:4 _0(5.0):C7)}
[junit4:junit4]   2> 1232 T1930 C93 UPDATE [collection1] webapp=/solr path=/update params={waitSearcher=true&softCommit=false&version=2&commit=true&wt=javabin} {commit=} 0 11
[junit4:junit4]   2> 1234 T1940 C94 oasu.DirectUpdateHandler2.commit start commit{flags=0,_version_=0,optimize=false,openSearcher=true,waitSearcher=true,expungeDeletes=false,softCommit=false}
[junit4:junit4]   2> 1235 T1940 C94 oasc.SolrDeletionPolicy.onCommit SolrDeletionPolicy.onCommit: commits:num=2
[junit4:junit4]   2> 		commit{dir=MockDirWrapper(org.apache.lucene.store.RAMDirectory@3b78af2c lockFactory=org.apache.lucene.store.SingleInstanceLockFactory@ae77f79),segFN=segments_1,generation=1,filenames=[segments_1]
[junit4:junit4]   2> 		commit{dir=MockDirWrapper(org.apache.lucene.store.RAMDirectory@3b78af2c lockFactory=org.apache.lucene.store.SingleInstanceLockFactory@ae77f79),segFN=segments_2,generation=2,filenames=[_0_nrm.cfe, _0.fdt, _0.prx, _0.si, _0.tim, _0_nrm.cfs, segments_2, _0.frq, _0.fdx, _0.tip, _0.fnm]
[junit4:junit4]   2> 1235 T1940 C94 oasc.SolrDeletionPolicy.updateCommits newest commit = 2
[junit4:junit4]   2> 1236 T1940 C94 oass.SolrIndexSearcher.<init> Opening Searcher@454010 main
[junit4:junit4]   2> 1236 T1940 C94 oass.SolrIndexSearcher.getIndexDir WARNING WARNING: Directory impl does not support setting indexDir: org.apache.lucene.store.MockDirectoryWrapper
[junit4:junit4]   2> 1236 T1940 C94 oasu.DirectUpdateHandler2.commit end_commit_flush
[junit4:junit4]   2> 1236 T1947 oasc.SolrCore.registerSearcher [collection1] Registered new searcher Searcher@454010 main{StandardDirectoryReader(segments_2:4 _0(5.0):C2)}
[junit4:junit4]   2> 1237 T1940 C94 UPDATE [collection1] webapp=/solr path=/update params={waitSearcher=true&softCommit=false&version=2&commit=true&wt=javabin} {commit=} 0 3
[junit4:junit4]   2> 1239 T1950 C95 oasu.DirectUpdateHandler2.commit start commit{flags=0,_version_=0,optimize=false,openSearcher=true,waitSearcher=true,expungeDeletes=false,softCommit=false}
[junit4:junit4]   2> 1240 T1950 C95 oasc.SolrDeletionPolicy.onCommit SolrDeletionPolicy.onCommit: commits:num=2
[junit4:junit4]   2> 		commit{dir=MockDirWrapper(org.apache.lucene.store.RAMDirectory@5ef71abd lockFactory=org.apache.lucene.store.SingleInstanceLockFactory@192ad220),segFN=segments_1,generation=1,filenames=[segments_1]
[junit4:junit4]   2> 		commit{dir=MockDirWrapper(org.apache.lucene.store.RAMDirectory@5ef71abd lockFactory=org.apache.lucene.store.SingleInstanceLockFactory@192ad220),segFN=segments_2,generation=2,filenames=[_0_nrm.cfe, _0.fdt, _0.prx, _0.si, _0.tim, _0_nrm.cfs, segments_2, _0.frq, _0.fdx, _0.tip, _0.fnm]
[junit4:junit4]   2> 1240 T1950 C95 oasc.SolrDeletionPolicy.updateCommits newest commit = 2
[junit4:junit4]   2> 1240 T1950 C95 oass.SolrIndexSearcher.<init> Opening Searcher@1f999281 main
[junit4:junit4]   2> 1241 T1950 C95 oass.SolrIndexSearcher.getIndexDir WARNING WARNING: Directory impl does not support setting indexDir: org.apache.lucene.store.MockDirectoryWrapper
[junit4:junit4]   2> 1241 T1950 C95 oasu.DirectUpdateHandler2.commit end_commit_flush
[junit4:junit4]   2> 1241 T1957 oasc.SolrCore.registerSearcher [collection1] Registered new searcher Searcher@1f999281 main{StandardDirectoryReader(segments_2:4 _0(5.0):C2)}
[junit4:junit4]   2> 1242 T1950 C95 UPDATE [collection1] webapp=/solr path=/update params={waitSearcher=true&softCommit=false&version=2&commit=true&wt=javabin} {commit=} 0 3
[junit4:junit4]   2> 1244 T1960 C96 oasu.DirectUpdateHandler2.commit start commit{flags=0,_version_=0,optimize=false,openSearcher=true,waitSearcher=true,expungeDeletes=false,softCommit=false}
[junit4:junit4]   2> 1244 T1960 C96 oasc.SolrDeletionPolicy.onCommit SolrDeletionPolicy.onCommit: commits:num=2
[junit4:junit4]   2> 		commit{dir=MockDirWrapper(org.apache.lucene.store.RAMDirectory@167037b8 lockFactory=org.apache.lucene.store.SingleInstanceLockFactory@2307b921),segFN=segments_1,generation=1,filenames=[segments_1]
[junit4:junit4]   2> 		commit{dir=MockDirWrapper(org.apache.lucene.store.RAMDirectory@167037b8 lockFactory=org.apache.lucene.store.SingleInstanceLockFactory@2307b921),segFN=segments_2,generation=2,filenames=[_0_nrm.cfe, _0.fdt, _0.prx, _0.si, _0.tim, _0_nrm.cfs, segments_2, _0.frq, _0.fdx, _0.tip, _0.fnm]
[junit4:junit4]   2> 1245 T1960 C96 oasc.SolrDeletionPolicy.updateCommits newest commit = 2
[junit4:junit4]   2> 1245 T1960 C96 oass.SolrIndexSearcher.<init> Opening Searcher@3a930d06 main
[junit4:junit4]   2> 1245 T1960 C96 oass.SolrIndexSearcher.getIndexDir WARNING WARNING: Directory impl does not support setting indexDir: org.apache.lucene.store.MockDirectoryWrapper
[junit4:junit4]   2> 1246 T1960 C96 oasu.DirectUpdateHandler2.commit end_commit_flush
[junit4:junit4]   2> 1246 T1967 oasc.SolrCore.registerSearcher [collection1] Registered new searcher Searcher@3a930d06 main{StandardDirectoryReader(segments_2:4 _0(5.0):C3)}
[junit4:junit4]   2> 1246 T1960 C96 UPDATE [collection1] webapp=/solr path=/update params={waitSearcher=true&softCommit=false&version=2&commit=true&wt=javabin} {commit=} 0 2
[junit4:junit4]   2> 1250 T1930 C93 REQ [collection1] webapp=/solr path=/elevate params={distrib=false&version=2&wt=javabin&fl=id,+score,+[elevated]&qt=/elevate&shards.qt=/elevate&q=*:*&rows=500&sort=id+desc} hits=7 status=0 QTime=2 
[junit4:junit4]   2> 1256 T1951 C95 REQ [collection1] webapp=/solr path=/elevate params={fsv=true&version=2&qt=/elevate&start=0&q=*:*&NOW=1344093595092&sort=id+desc&shard.url=localhost:44422/solr&distrib=false&wt=javabin&isShard=true&fl=id,score&shards.qt=/elevate&rows=500} hits=2 status=0 QTime=0 
[junit4:junit4]   2> 1259 T1941 C94 REQ [collection1] webapp=/solr path=/elevate params={fsv=true&version=2&qt=/elevate&start=0&q=*:*&NOW=1344093595092&sort=id+desc&shard.url=localhost:52952/solr|[::1]:33332/solr&distrib=false&wt=javabin&isShard=true&fl=id,score&shards.qt=/elevate&rows=500} hits=2 status=0 QTime=0 
[junit4:junit4]   2> 1259 T1961 C96 REQ [collection1] webapp=/solr path=/elevate params={fsv=true&version=2&qt=/elevate&start=0&q=*:*&NOW=1344093595092&sort=id+desc&shard.url=localhost:54721/solr|[::1]:33332/solr&distrib=false&wt=javabin&isShard=true&fl=id,score&shards.qt=/elevate&rows=500} hits=3 status=0 QTime=0 
[junit4:junit4]   2> 1262 T1941 C94 REQ [collection1] webapp=/solr path=/elevate params={version=2&qt=/elevate&q=*:*&NOW=1344093595092&ids=1.0,4.0&shard.url=localhost:52952/solr|[::1]:33332/solr&distrib=false&wt=javabin&fl=id,+score,+[elevated]&isShard=true&shards.qt=/elevate&rows=500} status=0 QTime=0 
[junit4:junit4]   2> 1262 T1951 C95 REQ [collection1] webapp=/solr path=/elevate params={version=2&qt=/elevate&q=*:*&NOW=1344093595092&ids=2.0,5.0&shard.url=localhost:44422/solr&distrib=false&wt=javabin&fl=id,+score,+[elevated]&isShard=true&shards.qt=/elevate&rows=500} status=0 QTime=0 
[junit4:junit4]   2> 1262 T1961 C96 REQ [collection1] webapp=/solr path=/elevate params={version=2&qt=/elevate&q=*:*&NOW=1344093595092&ids=7.0,3.0,6.0&shard.url=localhost:54721/solr|[::1]:33332/solr&distrib=false&wt=javabin&fl=id,+score,+[elevated]&isShard=true&shards.qt=/elevate&rows=500} status=0 QTime=0 
[junit4:junit4]   2> 1263 T1950 C95 REQ [collection1] webapp=/solr path=/elevate params={version=2&wt=javabin&fl=id,+score,+[elevated]&qt=/elevate&shards.qt=/elevate&q=*:*&rows=500&sort=id+desc&shards=localhost:52952/solr|[::1]:33332/solr,localhost:44422/solr,localhost:54721/solr|[::1]:33332/solr} status=0 QTime=11 
[junit4:junit4]   2> 1264 T1927 oas.BaseDistributedSearchTestCase.compareResponses SEVERE Mismatched responses:
[junit4:junit4]   2> 	{responseHeader={status=0,QTime=11,params={version=2,wt=javabin,fl=id, score, [elevated],qt=/elevate,shards.qt=/elevate,q=*:*,rows=500,sort=id desc,shards=localhost:52952/solr|[::1]:33332/solr,localhost:44422/solr,localhost:54721/solr|[::1]:33332/solr}},response={numFound=7,start=0,maxScore=1.0,docs=[SolrDocument{id=7.0, [elevated]=false, score=1.0}, SolrDocument{id=6.0, [elevated]=false, score=1.0}, SolrDocument{id=5.0, [elevated]=false, score=1.0}, SolrDocument{id=4.0, [elevated]=false, score=1.0}, SolrDocument{id=3.0, [elevated]=false, score=1.0}, SolrDocument{id=2.0, [elevated]=false, score=1.0}, SolrDocument{id=1.0, [elevated]=false, score=1.0}]}}
[junit4:junit4]   2> 	{responseHeader={status=0,QTime=2,params={distrib=false,version=2,wt=javabin,fl=id, score, [elevated],qt=/elevate,shards.qt=/elevate,q=*:*,rows=500,sort=id desc}},response={numFound=7,start=0,maxScore=1.0,docs=[SolrDocument{id=7.0, score=1.0, [elevated]=false}, SolrDocument{id=6.0, score=1.0, [elevated]=false}, SolrDocument{id=5.0, score=1.0, [elevated]=false}, SolrDocument{id=4.0, score=1.0, [elevated]=false}, SolrDocument{id=3.0, score=1.0, [elevated]=false}, SolrDocument{id=2.0, score=1.0, [elevated]=false}, SolrDocument{id=1.0, score=1.0, [elevated]=false}]}}
[junit4:junit4]   2> 1265 T1927 oasc.CoreContainer.shutdown Shutting down CoreContainer instance=1378442337
[junit4:junit4]   2> 1266 T1927 oasc.SolrCore.close [collection1]  CLOSING SolrCore org.apache.solr.core.SolrCore@9271998
[junit4:junit4]   2> 1267 T1927 oasc.SolrCore.closeSearcher [collection1] Closing main searcher on request.
[junit4:junit4]   2> 1267 T1927 oasu.DirectUpdateHandler2.close closing DirectUpdateHandler2{commits=1,autocommits=0,soft autocommits=0,optimizes=0,rollbacks=0,expungeDeletes=0,docsPending=0,adds=0,deletesById=0,deletesByQuery=0,errors=0,cumulative_adds=7,cumulative_deletesById=0,cumulative_deletesByQuery=1,cumulative_errors=0}
[junit4:junit4]   2> 1270 T1927 oejsh.ContextHandler.doStop stopped o.e.j.s.ServletContextHandler{/solr,null}
[junit4:junit4]   2> 1322 T1927 oasc.CoreContainer.shutdown Shutting down CoreContainer instance=519734948
[junit4:junit4]   2> 1323 T1927 oasc.SolrCore.close [collection1]  CLOSING SolrCore org.apache.solr.core.SolrCore@50760291
[junit4:junit4]   2> 1323 T1927 oasc.SolrCore.closeSearcher [collection1] Closing main searcher on request.
[junit4:junit4]   2> 1324 T1927 oasu.DirectUpdateHandler2.close closing DirectUpdateHandler2{commits=1,autocommits=0,soft autocommits=0,optimizes=0,rollbacks=0,expungeDeletes=0,docsPending=0,adds=0,deletesById=0,deletesByQuery=0,errors=0,cumulative_adds=2,cumulative_deletesById=0,cumulative_deletesByQuery=1,cumulative_errors=0}
[junit4:junit4]   2> 1327 T1927 oejsh.ContextHandler.doStop stopped o.e.j.s.ServletContextHandler{/solr,null}
[junit4:junit4]   2> 1380 T1927 oasc.CoreContainer.shutdown Shutting down CoreContainer instance=1510974804
[junit4:junit4]   2> 1381 T1927 oasc.SolrCore.close [collection1]  CLOSING SolrCore org.apache.solr.core.SolrCore@6532a13a
[junit4:junit4]   2> 1382 T1927 oasc.SolrCore.closeSearcher [collection1] Closing main searcher on request.
[junit4:junit4]   2> 1382 T1927 oasu.DirectUpdateHandler2.close closing DirectUpdateHandler2{commits=1,autocommits=0,soft autocommits=0,optimizes=0,rollbacks=0,expungeDeletes=0,docsPending=0,adds=0,deletesById=0,deletesByQuery=0,errors=0,cumulative_adds=2,cumulative_deletesById=0,cumulative_deletesByQuery=1,cumulative_errors=0}
[junit4:junit4]   2> 1384 T1927 oejsh.ContextHandler.doStop stopped o.e.j.s.ServletContextHandler{/solr,null}
[junit4:junit4]   2> 1437 T1927 oasc.CoreContainer.shutdown Shutting down CoreContainer instance=93781858
[junit4:junit4]   2> 1437 T1927 oasc.SolrCore.close [collection1]  CLOSING SolrCore org.apache.solr.core.SolrCore@461cf26e
[junit4:junit4]   2> 1438 T1927 oasc.SolrCore.closeSearcher [collection1] Closing main searcher on request.
[junit4:junit4]   2> 1438 T1927 oasu.DirectUpdateHandler2.close closing DirectUpdateHandler2{commits=1,autocommits=0,soft autocommits=0,optimizes=0,rollbacks=0,expungeDeletes=0,docsPending=0,adds=0,deletesById=0,deletesByQuery=0,errors=0,cumulative_adds=3,cumulative_deletesById=0,cumulative_deletesByQuery=1,cumulative_errors=0}
[junit4:junit4]   2> 1443 T1927 oejsh.ContextHandler.doStop stopped o.e.j.s.ServletContextHandler{/solr,null}
[junit4:junit4]   2> 1494 T1927 oas.SolrTestCaseJ4.tearDown ###Ending testDistribSearch
[junit4:junit4]   2> NOTE: reproduce with: ant test  -Dtestcase=DistributedQueryElevationComponentTest -Dtests.method=testDistribSearch -Dtests.seed=8EAC08EB0DAC5B94 -Dtests.multiplier=3 -Dtests.slow=true -Dtests.locale=it_IT -Dtests.timezone=Europe/Sarajevo -Dtests.file.encoding=US-ASCII
[junit4:junit4]   2>
[junit4:junit4]    > (@AfterClass output)
[junit4:junit4]   2> 1536 T1927 oas.SolrTestCaseJ4.deleteCore ###deleteCore
[junit4:junit4]   2> NOTE: test params are: codec=Asserting, sim=RandomSimilarityProvider(queryNorm=false,coord=false): {}, locale=it_IT, timezone=Europe/Sarajevo
[junit4:junit4]   2> NOTE: Linux 3.2.0-27-generic amd64/Oracle Corporation 1.8.0-ea (64-bit)/cpus=8,threads=1,free=91107032,total=210952192
[junit4:junit4]   2> NOTE: All tests run in this JVM: [CircularListTest, TestTrie, RequiredFieldsTest, TestPropInject, OverseerTest, SampleTest, SpellCheckComponentTest, LeaderElectionTest, DebugComponentTest, XsltUpdateRequestHandlerTest, TestSolrCoreProperties, FieldMutatingUpdateProcessorTest, TestReplicationHandler, SuggesterTest, PrimUtilsTest, TestOmitPositions, TestQueryTypes, TestDocSet, SuggesterTSTTest, ConvertedLegacyTest, LegacyHTMLStripCharFilterTest, FileUtilsTest, TestFaceting, SolrInfoMBeanTest, TestGroupingSearch, TestSolrDeletionPolicy1, DocumentBuilderTest, LukeRequestHandlerTest, BadIndexSchemaTest, BasicZkTest, TestArbitraryIndexDir, TestSolrXMLSerializer, TestLRUCache, TestFiltering, StatsComponentTest, ZkCLITest, IndexSchemaTest, TimeZoneUtilsTest, TestBinaryResponseWriter, CloudStateUpdateTest, URLClassifyProcessorTest, TestFoldingMultitermQuery, TestQuerySenderListener, TestSuggestSpellingConverter, TestQueryUtils, TestJoin, TestCodecSupport, PrimitiveFieldTypeTest, SystemInfoHandlerTest, MultiTermTest, TestDocumentBuilder, TestSolrDeletionPolicy2, TestDFRSimilarityFactory, TestReversedWildcardFilterFactory, FullSolrCloudTest, RecoveryZkTest, ZkControllerTest, TestDistributedSearch, AutoCommitTest, WordBreakSolrSpellCheckerTest, TestHashPartitioner, IndexBasedSpellCheckerTest, DirectUpdateHandlerTest, TestMultiCoreConfBootstrap, TestCoreContainer, TestSort, BasicFunctionalityTest, HighlighterTest, TestFunctionQuery, CacheHeaderTest, TestCSVLoader, TestCSVResponseWriter, DistributedQueryElevationComponentTest]
[junit4:junit4]   2> 
[junit4:junit4] Completed on J1 in 1.54s, 1 test, 1 failure <<< FAILURES!

[...truncated 230 lines...]
BUILD FAILED
/mnt/ssd/jenkins/workspace/Lucene-Solr-trunk-Linux/checkout/build.xml:29: The following error occurred while executing this line:
/mnt/ssd/jenkins/workspace/Lucene-Solr-trunk-Linux/checkout/solr/build.xml:144: The following error occurred while executing this line:
/mnt/ssd/jenkins/workspace/Lucene-Solr-trunk-Linux/checkout/lucene/module-build.xml:62: The following error occurred while executing this line:
/mnt/ssd/jenkins/workspace/Lucene-Solr-trunk-Linux/checkout/lucene/common-build.xml:1095: The following error occurred while executing this line:
/mnt/ssd/jenkins/workspace/Lucene-Solr-trunk-Linux/checkout/lucene/common-build.xml:790: There were test failures: 223 suites, 899 tests, 1 failure, 5 ignored

Total time: 19 minutes 34 seconds
Build step 'Execute shell' marked build as failure
Archiving artifacts
Recording test results
Email was triggered for: Failure
Sending email for trigger: Failure



Mime
View raw message