lucene-dev mailing list archives

Site index · List index
Message view « Date » · « Thread »
Top « Date » · « Thread »
From Apache Jenkins Server <jenk...@builds.apache.org>
Subject [JENKINS-MAVEN] Lucene-Solr-Maven-trunk #577: POMs out of sync
Date Sun, 12 Aug 2012 23:13:23 GMT
Build: https://builds.apache.org/job/Lucene-Solr-Maven-trunk/577/

2 tests failed.
REGRESSION:  org.apache.lucene.analysis.core.TestAllAnalyzersHaveFactories.test

Error Message:
URI is not hierarchical

Stack Trace:
java.lang.IllegalArgumentException: URI is not hierarchical
	at __randomizedtesting.SeedInfo.seed([7F4E423A46F828E9:F71A7DE0E8044511]:0)
	at java.io.File.<init>(File.java:380)
	at org.apache.lucene.analysis.core.TestRandomChains.getClassesForPackage(TestRandomChains.java:243)
	at org.apache.lucene.analysis.core.TestAllAnalyzersHaveFactories.test(TestAllAnalyzersHaveFactories.java:104)
	at sun.reflect.NativeMethodAccessorImpl.invoke0(Native Method)
	at sun.reflect.NativeMethodAccessorImpl.invoke(NativeMethodAccessorImpl.java:57)
	at sun.reflect.DelegatingMethodAccessorImpl.invoke(DelegatingMethodAccessorImpl.java:43)
	at java.lang.reflect.Method.invoke(Method.java:616)
	at com.carrotsearch.randomizedtesting.RandomizedRunner.invoke(RandomizedRunner.java:1559)
	at com.carrotsearch.randomizedtesting.RandomizedRunner.access$600(RandomizedRunner.java:79)
	at com.carrotsearch.randomizedtesting.RandomizedRunner$6.evaluate(RandomizedRunner.java:737)
	at com.carrotsearch.randomizedtesting.RandomizedRunner$7.evaluate(RandomizedRunner.java:773)
	at com.carrotsearch.randomizedtesting.RandomizedRunner$8.evaluate(RandomizedRunner.java:787)
	at org.apache.lucene.util.TestRuleSetupTeardownChained$1.evaluate(TestRuleSetupTeardownChained.java:50)
	at org.apache.lucene.util.TestRuleFieldCacheSanity$1.evaluate(TestRuleFieldCacheSanity.java:32)
	at org.apache.lucene.util.AbstractBeforeAfterRule$1.evaluate(AbstractBeforeAfterRule.java:45)
	at com.carrotsearch.randomizedtesting.rules.SystemPropertiesInvariantRule$1.evaluate(SystemPropertiesInvariantRule.java:55)
	at org.apache.lucene.util.TestRuleThreadAndTestName$1.evaluate(TestRuleThreadAndTestName.java:48)
	at org.apache.lucene.util.TestRuleIgnoreAfterMaxFailures$1.evaluate(TestRuleIgnoreAfterMaxFailures.java:70)
	at org.apache.lucene.util.TestRuleMarkFailure$1.evaluate(TestRuleMarkFailure.java:48)
	at com.carrotsearch.randomizedtesting.rules.StatementAdapter.evaluate(StatementAdapter.java:36)
	at com.carrotsearch.randomizedtesting.ThreadLeakControl$StatementRunner.run(ThreadLeakControl.java:345)
	at com.carrotsearch.randomizedtesting.ThreadLeakControl.forkTimeoutingTask(ThreadLeakControl.java:769)
	at com.carrotsearch.randomizedtesting.ThreadLeakControl$3.evaluate(ThreadLeakControl.java:429)
	at com.carrotsearch.randomizedtesting.RandomizedRunner.runSingleTest(RandomizedRunner.java:746)
	at com.carrotsearch.randomizedtesting.RandomizedRunner$3.evaluate(RandomizedRunner.java:648)
	at com.carrotsearch.randomizedtesting.RandomizedRunner$4.evaluate(RandomizedRunner.java:682)
	at com.carrotsearch.randomizedtesting.RandomizedRunner$5.evaluate(RandomizedRunner.java:693)
	at org.apache.lucene.util.AbstractBeforeAfterRule$1.evaluate(AbstractBeforeAfterRule.java:45)
	at org.apache.lucene.util.TestRuleStoreClassName$1.evaluate(TestRuleStoreClassName.java:38)
	at com.carrotsearch.randomizedtesting.rules.SystemPropertiesInvariantRule$1.evaluate(SystemPropertiesInvariantRule.java:55)
	at com.carrotsearch.randomizedtesting.rules.NoShadowingOrOverridesOnMethodsRule$1.evaluate(NoShadowingOrOverridesOnMethodsRule.java:39)
	at com.carrotsearch.randomizedtesting.rules.NoShadowingOrOverridesOnMethodsRule$1.evaluate(NoShadowingOrOverridesOnMethodsRule.java:39)
	at org.apache.lucene.util.TestRuleAssertionsRequired$1.evaluate(TestRuleAssertionsRequired.java:40)
	at org.apache.lucene.util.TestRuleMarkFailure$1.evaluate(TestRuleMarkFailure.java:48)
	at org.apache.lucene.util.TestRuleIgnoreAfterMaxFailures$1.evaluate(TestRuleIgnoreAfterMaxFailures.java:70)
	at org.apache.lucene.util.TestRuleIgnoreTestSuites$1.evaluate(TestRuleIgnoreTestSuites.java:55)
	at com.carrotsearch.randomizedtesting.rules.StatementAdapter.evaluate(StatementAdapter.java:36)
	at com.carrotsearch.randomizedtesting.ThreadLeakControl$StatementRunner.run(ThreadLeakControl.java:345)
	at java.lang.Thread.run(Thread.java:679)


FAILED:  org.apache.lucene.analysis.core.TestRandomChains.org.apache.lucene.analysis.core.TestRandomChains

Error Message:
URI is not hierarchical

Stack Trace:
java.lang.IllegalArgumentException: URI is not hierarchical
	at __randomizedtesting.SeedInfo.seed([FA87A9B277BAD750]:0)
	at java.io.File.<init>(File.java:380)
	at org.apache.lucene.analysis.core.TestRandomChains.getClassesForPackage(TestRandomChains.java:243)
	at org.apache.lucene.analysis.core.TestRandomChains.beforeClass(TestRandomChains.java:169)
	at sun.reflect.NativeMethodAccessorImpl.invoke0(Native Method)
	at sun.reflect.NativeMethodAccessorImpl.invoke(NativeMethodAccessorImpl.java:57)
	at sun.reflect.DelegatingMethodAccessorImpl.invoke(DelegatingMethodAccessorImpl.java:43)
	at java.lang.reflect.Method.invoke(Method.java:616)
	at com.carrotsearch.randomizedtesting.RandomizedRunner.invoke(RandomizedRunner.java:1559)
	at com.carrotsearch.randomizedtesting.RandomizedRunner.access$600(RandomizedRunner.java:79)
	at com.carrotsearch.randomizedtesting.RandomizedRunner$4.evaluate(RandomizedRunner.java:677)
	at com.carrotsearch.randomizedtesting.RandomizedRunner$5.evaluate(RandomizedRunner.java:693)
	at org.apache.lucene.util.AbstractBeforeAfterRule$1.evaluate(AbstractBeforeAfterRule.java:45)
	at org.apache.lucene.util.TestRuleStoreClassName$1.evaluate(TestRuleStoreClassName.java:38)
	at com.carrotsearch.randomizedtesting.rules.SystemPropertiesInvariantRule$1.evaluate(SystemPropertiesInvariantRule.java:55)
	at com.carrotsearch.randomizedtesting.rules.NoShadowingOrOverridesOnMethodsRule$1.evaluate(NoShadowingOrOverridesOnMethodsRule.java:39)
	at com.carrotsearch.randomizedtesting.rules.NoShadowingOrOverridesOnMethodsRule$1.evaluate(NoShadowingOrOverridesOnMethodsRule.java:39)
	at org.apache.lucene.util.TestRuleAssertionsRequired$1.evaluate(TestRuleAssertionsRequired.java:40)
	at org.apache.lucene.util.TestRuleMarkFailure$1.evaluate(TestRuleMarkFailure.java:48)
	at org.apache.lucene.util.TestRuleIgnoreAfterMaxFailures$1.evaluate(TestRuleIgnoreAfterMaxFailures.java:70)
	at org.apache.lucene.util.TestRuleIgnoreTestSuites$1.evaluate(TestRuleIgnoreTestSuites.java:55)
	at com.carrotsearch.randomizedtesting.rules.StatementAdapter.evaluate(StatementAdapter.java:36)
	at com.carrotsearch.randomizedtesting.ThreadLeakControl$StatementRunner.run(ThreadLeakControl.java:345)
	at java.lang.Thread.run(Thread.java:679)




Build Log:
[...truncated 1103 lines...]
Running org.apache.lucene.analysis.core.TestAllAnalyzersHaveFactories
NOTE: reproduce with: ant test  -Dtestcase=TestAllAnalyzersHaveFactories -Dtests.method=test
-Dtests.seed=7F4E423A46F828E9 -Dtests.locale=es_CR -Dtests.timezone=Africa/Nouakchott -Dtests.file.encoding=ISO8859-1
NOTE: test params are: codec=Lucene40: {}, sim=RandomSimilarityProvider(queryNorm=true,coord=yes):
{}, locale=es_CR, timezone=Africa/Nouakchott
NOTE: FreeBSD 9.0-RELEASE amd64/Sun Microsystems Inc. 1.6.0_32 (64-bit)/cpus=16,threads=1,free=49006600,total=251330560
NOTE: All tests run in this JVM: [TestSnowballPorterFilterFactory, TestShingleFilterFactory,
PositionFilterTest, TestEnglishMinimalStemFilterFactory, TestMappingCharFilterFactory, TestWordDelimiterFilter,
TestPatternReplaceCharFilterFactory, TestNorwegianMinimalStemFilter, TestPorterStemFilter,
TestCharArrayMap, TestPatternReplaceFilterFactory, TestSynonymFilterFactory, TestEnglishAnalyzer,
TestGalicianStemFilterFactory, TestThaiAnalyzer, TestSpanishLightStemFilter, TestRussianAnalyzer,
TestHindiAnalyzer, DateRecognizerSinkTokenizerTest, TestIndonesianStemFilterFactory, TestItalianLightStemFilter,
TestIrishAnalyzer, TestSingleTokenTokenFilter, TestCzechStemFilterFactory, TestFrenchLightStemFilterFactory,
TestRemoveDuplicatesTokenFilterFactory, TestCzechStemmer, TestElisionFilterFactory, TestAnalysisSPILoader,
TestGalicianAnalyzer, TestPortugueseLightStemFilterFactory, TestCharTokenizers, TestEnglishMinimalStemFilter,
TestASCIIFoldingFilter, DelimitedPayloadTokenFilterTest, TestNorwegianAnalyzer, TestIrishLowerCaseFilter,
TestGermanMinimalStemFilterFactory, TestBugInSomething, TestFrenchMinimalStemFilterFactory,
TestStopFilterFactory, TestBulgarianAnalyzer, TestPrefixAwareTokenFilter, TestSynonymMapFilter,
TestBulgarianStemmer, TestLengthFilter, TestFinnishLightStemFilter, TestPatternTokenizer,
TestReverseStringFilter, TestLatvianStemmer, TokenTypeSinkTokenizerTest, TestPortugueseAnalyzer,
TestCJKAnalyzer, TestWordlistLoader, TestNorwegianLightStemFilterFactory, TestPersianNormalizationFilterFactory,
TestKStemmer, TestRussianLightStemFilter, TestGreekStemFilterFactory, TestGermanLightStemFilterFactory,
TestKeepWordFilter, TestPrefixAndSuffixAwareTokenFilter, TestElision, TestArabicFilters, TestGermanAnalyzer,
TestCharArraySet, TestCapitalizationFilterFactory, WikipediaTokenizerTest, TestUAX29URLEmailTokenizerFactory,
TestSwedishLightStemFilter, TestHindiStemmer, TestArmenianAnalyzer, GreekAnalyzerTest, TestSwedishLightStemFilterFactory,
TestSnowballVocab, TestItalianLightStemFilterFactory, TestMappingCharFilter, TestTurkishLowerCaseFilterFactory,
TestPortugueseLightStemFilter, ShingleAnalyzerWrapperTest, TestCharArrayIterator, TestGermanNormalizationFilterFactory,
TestClassicAnalyzer, QueryAutoStopWordAnalyzerTest, TestTrimFilter, TokenRangeSinkTokenizerTest,
TestIndicNormalizer, TestIrishLowerCaseFilterFactory, TestTrimFilterFactory, NumericPayloadTokenFilterTest,
TestSolrSynonymParser, TestLengthFilterFactory, TestGalicianMinimalStemFilter, TestPortugueseStemFilter,
HTMLStripCharFilterTest, TestRomanianAnalyzer, TestHTMLStripCharFilterFactory, TestSpanishAnalyzer,
TestReverseStringFilterFactory, TestGermanStemFilter, TestCharacterUtils, TestKeepFilterFactory,
TestHindiNormalizer, TestHungarianAnalyzer, TestDictionaryCompoundWordTokenFilterFactory,
TestPortugueseMinimalStemFilter, TestTurkishAnalyzer, TestCzechAnalyzer, TestBrazilianStemFilterFactory,
NGramTokenFilterTest, TestGermanStemFilterFactory, TestFinnishLightStemFilterFactory, TestStandardAnalyzer,
TestPersianAnalyzer, TestKeywordMarkerFilterFactory, TestTypeTokenFilter, TestBrazilianStemmer,
TestTeeSinkTokenFilter, TestKeywordMarkerFilter, TestHungarianLightStemFilter, TestDanishAnalyzer,
TestFrenchAnalyzer, TestPersianNormalizationFilter, NGramTokenizerTest, TestCommonGramsFilterFactory,
TestEmptyTokenStream, TestSpanishLightStemFilterFactory, HunspellStemFilterTest, TestNGramFilters,
TestDuelingAnalyzers, TestBulgarianStemFilterFactory, TestGalicianStemFilter, TestUAX29URLEmailTokenizer,
TestPathHierarchyTokenizer, TestHungarianLightStemFilterFactory, TestHyphenatedWordsFilter,
CommonGramsFilterTest, HunspellDictionaryTest, TestGermanNormalizationFilter, TestArabicAnalyzer,
TestGreekStemmer, TestStemmerOverrideFilter, TestPortugueseStemFilterFactory, TestAllAnalyzersHaveFactories]
Tests run: 1, Failures: 0, Errors: 1, Skipped: 0, Time elapsed: 0.186 sec <<< FAILURE!

[...truncated 70 lines...]
Running org.apache.lucene.analysis.core.TestRandomChains
NOTE: test params are: codec=Lucene40: {}, sim=DefaultSimilarity, locale=es_PY, timezone=America/Anchorage
NOTE: FreeBSD 9.0-RELEASE amd64/Sun Microsystems Inc. 1.6.0_32 (64-bit)/cpus=16,threads=1,free=35460968,total=136773632
NOTE: All tests run in this JVM: [TestSnowballPorterFilterFactory, TestShingleFilterFactory,
PositionFilterTest, TestEnglishMinimalStemFilterFactory, TestMappingCharFilterFactory, TestWordDelimiterFilter,
TestPatternReplaceCharFilterFactory, TestNorwegianMinimalStemFilter, TestPorterStemFilter,
TestCharArrayMap, TestPatternReplaceFilterFactory, TestSynonymFilterFactory, TestEnglishAnalyzer,
TestGalicianStemFilterFactory, TestThaiAnalyzer, TestSpanishLightStemFilter, TestRussianAnalyzer,
TestHindiAnalyzer, DateRecognizerSinkTokenizerTest, TestIndonesianStemFilterFactory, TestItalianLightStemFilter,
TestIrishAnalyzer, TestSingleTokenTokenFilter, TestCzechStemFilterFactory, TestFrenchLightStemFilterFactory,
TestRemoveDuplicatesTokenFilterFactory, TestCzechStemmer, TestElisionFilterFactory, TestAnalysisSPILoader,
TestGalicianAnalyzer, TestPortugueseLightStemFilterFactory, TestCharTokenizers, TestEnglishMinimalStemFilter,
TestASCIIFoldingFilter, DelimitedPayloadTokenFilterTest, TestNorwegianAnalyzer, TestIrishLowerCaseFilter,
TestGermanMinimalStemFilterFactory, TestBugInSomething, TestFrenchMinimalStemFilterFactory,
TestStopFilterFactory, TestBulgarianAnalyzer, TestPrefixAwareTokenFilter, TestSynonymMapFilter,
TestBulgarianStemmer, TestLengthFilter, TestFinnishLightStemFilter, TestPatternTokenizer,
TestReverseStringFilter, TestLatvianStemmer, TokenTypeSinkTokenizerTest, TestPortugueseAnalyzer,
TestCJKAnalyzer, TestWordlistLoader, TestNorwegianLightStemFilterFactory, TestPersianNormalizationFilterFactory,
TestKStemmer, TestRussianLightStemFilter, TestGreekStemFilterFactory, TestGermanLightStemFilterFactory,
TestKeepWordFilter, TestPrefixAndSuffixAwareTokenFilter, TestElision, TestArabicFilters, TestGermanAnalyzer,
TestCharArraySet, TestCapitalizationFilterFactory, WikipediaTokenizerTest, TestUAX29URLEmailTokenizerFactory,
TestSwedishLightStemFilter, TestHindiStemmer, TestArmenianAnalyzer, GreekAnalyzerTest, TestSwedishLightStemFilterFactory,
TestSnowballVocab, TestItalianLightStemFilterFactory, TestMappingCharFilter, TestTurkishLowerCaseFilterFactory,
TestPortugueseLightStemFilter, ShingleAnalyzerWrapperTest, TestCharArrayIterator, TestGermanNormalizationFilterFactory,
TestClassicAnalyzer, QueryAutoStopWordAnalyzerTest, TestTrimFilter, TokenRangeSinkTokenizerTest,
TestIndicNormalizer, TestIrishLowerCaseFilterFactory, TestTrimFilterFactory, NumericPayloadTokenFilterTest,
TestSolrSynonymParser, TestLengthFilterFactory, TestGalicianMinimalStemFilter, TestPortugueseStemFilter,
HTMLStripCharFilterTest, TestRomanianAnalyzer, TestHTMLStripCharFilterFactory, TestSpanishAnalyzer,
TestReverseStringFilterFactory, TestGermanStemFilter, TestCharacterUtils, TestKeepFilterFactory,
TestHindiNormalizer, TestHungarianAnalyzer, TestDictionaryCompoundWordTokenFilterFactory,
TestPortugueseMinimalStemFilter, TestTurkishAnalyzer, TestCzechAnalyzer, TestBrazilianStemFilterFactory,
NGramTokenFilterTest, TestGermanStemFilterFactory, TestFinnishLightStemFilterFactory, TestStandardAnalyzer,
TestPersianAnalyzer, TestKeywordMarkerFilterFactory, TestTypeTokenFilter, TestBrazilianStemmer,
TestTeeSinkTokenFilter, TestKeywordMarkerFilter, TestHungarianLightStemFilter, TestDanishAnalyzer,
TestFrenchAnalyzer, TestPersianNormalizationFilter, NGramTokenizerTest, TestCommonGramsFilterFactory,
TestEmptyTokenStream, TestSpanishLightStemFilterFactory, HunspellStemFilterTest, TestNGramFilters,
TestDuelingAnalyzers, TestBulgarianStemFilterFactory, TestGalicianStemFilter, TestUAX29URLEmailTokenizer,
TestPathHierarchyTokenizer, TestHungarianLightStemFilterFactory, TestHyphenatedWordsFilter,
CommonGramsFilterTest, HunspellDictionaryTest, TestGermanNormalizationFilter, TestArabicAnalyzer,
TestGreekStemmer, TestStemmerOverrideFilter, TestPortugueseStemFilterFactory, TestAllAnalyzersHaveFactories,
TestCollationKeyAnalyzer, TestThaiWordFilterFactory, TestWordnetSynonymParser, TestCommonGramsQueryFilterFactory,
TestIndonesianStemmer, TestRussianLightStemFilterFactory, TestGreekLowerCaseFilterFactory,
TestReversePathHierarchyTokenizer, TestPatternReplaceFilter, TestAnalyzers, TestCJKBigramFilter,
TestGalicianMinimalStemFilterFactory, TestCJKWidthFilterFactory, EdgeNGramTokenizerTest, TestArabicStemFilter,
TestHindiFilters, EdgeNGramTokenFilterTest, TestKStemFilterFactory, TestCJKWidthFilter, TestRemoveDuplicatesTokenFilter,
TypeAsPayloadTokenFilterTest, TestStandardFactories, TestCatalanAnalyzer, TestTurkishLowerCaseFilter,
TestFactories, TestUAX29URLEmailAnalyzer, TestGermanMinimalStemFilter, TestSnowball, TestNorwegianMinimalStemFilterFactory,
TestFinnishAnalyzer, TestGermanLightStemFilter, TestFilesystemResourceLoader, TestPatternTokenizerFactory,
TestStopAnalyzer, TestKeywordAnalyzer, TestRandomChains]
NOTE: reproduce with: ant test  -Dtestcase=TestRandomChains -Dtests.seed=FA87A9B277BAD750
-Dtests.locale=es_PY -Dtests.timezone=America/Anchorage -Dtests.file.encoding=ISO8859-1
Tests run: 1, Failures: 0, Errors: 1, Skipped: 0, Time elapsed: 0.14 sec <<< FAILURE!

[...truncated 81 lines...]



Mime
View raw message