lucene-dev mailing list archives

Site index · List index
Message view « Date » · « Thread »
Top « Date » · « Thread »
From Policeman Jenkins Server <jenk...@sd-datasolutions.de>
Subject [JENKINS] Lucene-Solr-4.x-Linux (32bit/jdk1.8.0-ea-b49) - Build # 113 - Still Failing!
Date Thu, 02 Aug 2012 19:34:15 GMT
Build: http://jenkins.sd-datasolutions.de/job/Lucene-Solr-4.x-Linux/113/
Java: 32bit/jdk1.8.0-ea-b49 -client -XX:+UseParallelGC

1 tests failed.
FAILED:  org.apache.solr.handler.component.DistributedQueryElevationComponentTest.testDistribSearch

Error Message:
.responseHeader.params.shards:localhost:43455/solr,localhost:55198/solr,localhost:37845/solr!=false

Stack Trace:
junit.framework.AssertionFailedError: .responseHeader.params.shards:localhost:43455/solr,localhost:55198/solr,localhost:37845/solr!=false
	at __randomizedtesting.SeedInfo.seed([B404022ADB1E941A:35E28C32AC41F426]:0)
	at junit.framework.Assert.fail(Assert.java:50)
	at org.apache.solr.BaseDistributedSearchTestCase.compareResponses(BaseDistributedSearchTestCase.java:670)
	at org.apache.solr.BaseDistributedSearchTestCase.query(BaseDistributedSearchTestCase.java:392)
	at org.apache.solr.handler.component.DistributedQueryElevationComponentTest.doTest(DistributedQueryElevationComponentTest.java:81)
	at org.apache.solr.BaseDistributedSearchTestCase.testDistribSearch(BaseDistributedSearchTestCase.java:679)
	at sun.reflect.NativeMethodAccessorImpl.invoke0(Native Method)
	at sun.reflect.NativeMethodAccessorImpl.invoke(NativeMethodAccessorImpl.java:57)
	at sun.reflect.DelegatingMethodAccessorImpl.invoke(DelegatingMethodAccessorImpl.java:43)
	at java.lang.reflect.Method.invoke(Method.java:474)
	at com.carrotsearch.randomizedtesting.RandomizedRunner.invoke(RandomizedRunner.java:1995)
	at com.carrotsearch.randomizedtesting.RandomizedRunner.access$1100(RandomizedRunner.java:132)
	at com.carrotsearch.randomizedtesting.RandomizedRunner$6.evaluate(RandomizedRunner.java:818)
	at com.carrotsearch.randomizedtesting.RandomizedRunner$7.evaluate(RandomizedRunner.java:877)
	at com.carrotsearch.randomizedtesting.RandomizedRunner$8.evaluate(RandomizedRunner.java:891)
	at com.carrotsearch.randomizedtesting.rules.SystemPropertiesRestoreRule$1.evaluate(SystemPropertiesRestoreRule.java:53)
	at org.apache.lucene.util.TestRuleSetupTeardownChained$1.evaluate(TestRuleSetupTeardownChained.java:50)
	at org.apache.lucene.util.TestRuleFieldCacheSanity$1.evaluate(TestRuleFieldCacheSanity.java:32)
	at org.apache.lucene.util.AbstractBeforeAfterRule$1.evaluate(AbstractBeforeAfterRule.java:45)
	at com.carrotsearch.randomizedtesting.rules.SystemPropertiesInvariantRule$1.evaluate(SystemPropertiesInvariantRule.java:55)
	at org.apache.lucene.util.TestRuleReportUncaughtExceptions$1.evaluate(TestRuleReportUncaughtExceptions.java:68)
	at org.apache.lucene.util.TestRuleThreadAndTestName$1.evaluate(TestRuleThreadAndTestName.java:48)
	at org.apache.lucene.util.TestRuleIgnoreAfterMaxFailures$1.evaluate(TestRuleIgnoreAfterMaxFailures.java:70)
	at org.apache.lucene.util.TestRuleMarkFailure$1.evaluate(TestRuleMarkFailure.java:48)
	at com.carrotsearch.randomizedtesting.RandomizedRunner.runSingleTest(RandomizedRunner.java:825)
	at com.carrotsearch.randomizedtesting.RandomizedRunner.access$700(RandomizedRunner.java:132)
	at com.carrotsearch.randomizedtesting.RandomizedRunner$3$1.run(RandomizedRunner.java:671)
	at com.carrotsearch.randomizedtesting.RandomizedRunner$3.evaluate(RandomizedRunner.java:697)
	at com.carrotsearch.randomizedtesting.RandomizedRunner$4.evaluate(RandomizedRunner.java:736)
	at com.carrotsearch.randomizedtesting.RandomizedRunner$5.evaluate(RandomizedRunner.java:747)
	at com.carrotsearch.randomizedtesting.rules.SystemPropertiesRestoreRule$1.evaluate(SystemPropertiesRestoreRule.java:53)
	at org.apache.lucene.util.AbstractBeforeAfterRule$1.evaluate(AbstractBeforeAfterRule.java:45)
	at org.apache.lucene.util.TestRuleReportUncaughtExceptions$1.evaluate(TestRuleReportUncaughtExceptions.java:68)
	at org.apache.lucene.util.TestRuleStoreClassName$1.evaluate(TestRuleStoreClassName.java:38)
	at com.carrotsearch.randomizedtesting.rules.SystemPropertiesInvariantRule$1.evaluate(SystemPropertiesInvariantRule.java:55)
	at org.apache.lucene.util.TestRuleNoInstanceHooksOverrides$1.evaluate(TestRuleNoInstanceHooksOverrides.java:53)
	at org.apache.lucene.util.TestRuleNoStaticHooksShadowing$1.evaluate(TestRuleNoStaticHooksShadowing.java:52)
	at org.apache.lucene.util.TestRuleAssertionsRequired$1.evaluate(TestRuleAssertionsRequired.java:36)
	at org.apache.lucene.util.TestRuleMarkFailure$1.evaluate(TestRuleMarkFailure.java:48)
	at org.apache.lucene.util.TestRuleIgnoreAfterMaxFailures$1.evaluate(TestRuleIgnoreAfterMaxFailures.java:70)
	at org.apache.lucene.util.TestRuleIgnoreTestSuites$1.evaluate(TestRuleIgnoreTestSuites.java:55)
	at com.carrotsearch.randomizedtesting.RandomizedRunner.runSuite(RandomizedRunner.java:605)
	at com.carrotsearch.randomizedtesting.RandomizedRunner.access$400(RandomizedRunner.java:132)
	at com.carrotsearch.randomizedtesting.RandomizedRunner$2.run(RandomizedRunner.java:551)




Build Log:
[...truncated 7525 lines...]
[junit4:junit4] Suite: org.apache.solr.handler.component.DistributedQueryElevationComponentTest
[junit4:junit4] FAILURE 1.46s J1 | DistributedQueryElevationComponentTest.testDistribSearch
[junit4:junit4]    > Throwable #1: junit.framework.AssertionFailedError: .responseHeader.params.shards:localhost:43455/solr,localhost:55198/solr,localhost:37845/solr!=false
[junit4:junit4]    > 	at __randomizedtesting.SeedInfo.seed([B404022ADB1E941A:35E28C32AC41F426]:0)
[junit4:junit4]    > 	at junit.framework.Assert.fail(Assert.java:50)
[junit4:junit4]    > 	at org.apache.solr.BaseDistributedSearchTestCase.compareResponses(BaseDistributedSearchTestCase.java:670)
[junit4:junit4]    > 	at org.apache.solr.BaseDistributedSearchTestCase.query(BaseDistributedSearchTestCase.java:392)
[junit4:junit4]    > 	at org.apache.solr.handler.component.DistributedQueryElevationComponentTest.doTest(DistributedQueryElevationComponentTest.java:81)
[junit4:junit4]    > 	at org.apache.solr.BaseDistributedSearchTestCase.testDistribSearch(BaseDistributedSearchTestCase.java:679)
[junit4:junit4]    > 	at sun.reflect.NativeMethodAccessorImpl.invoke0(Native Method)
[junit4:junit4]    > 	at sun.reflect.NativeMethodAccessorImpl.invoke(NativeMethodAccessorImpl.java:57)
[junit4:junit4]    > 	at sun.reflect.DelegatingMethodAccessorImpl.invoke(DelegatingMethodAccessorImpl.java:43)
[junit4:junit4]    > 	at java.lang.reflect.Method.invoke(Method.java:474)
[junit4:junit4]    > 	at com.carrotsearch.randomizedtesting.RandomizedRunner.invoke(RandomizedRunner.java:1995)
[junit4:junit4]    > 	at com.carrotsearch.randomizedtesting.RandomizedRunner.access$1100(RandomizedRunner.java:132)
[junit4:junit4]    > 	at com.carrotsearch.randomizedtesting.RandomizedRunner$6.evaluate(RandomizedRunner.java:818)
[junit4:junit4]    > 	at com.carrotsearch.randomizedtesting.RandomizedRunner$7.evaluate(RandomizedRunner.java:877)
[junit4:junit4]    > 	at com.carrotsearch.randomizedtesting.RandomizedRunner$8.evaluate(RandomizedRunner.java:891)
[junit4:junit4]    > 	at com.carrotsearch.randomizedtesting.rules.SystemPropertiesRestoreRule$1.evaluate(SystemPropertiesRestoreRule.java:53)
[junit4:junit4]    > 	at org.apache.lucene.util.TestRuleSetupTeardownChained$1.evaluate(TestRuleSetupTeardownChained.java:50)
[junit4:junit4]    > 	at org.apache.lucene.util.TestRuleFieldCacheSanity$1.evaluate(TestRuleFieldCacheSanity.java:32)
[junit4:junit4]    > 	at org.apache.lucene.util.AbstractBeforeAfterRule$1.evaluate(AbstractBeforeAfterRule.java:45)
[junit4:junit4]    > 	at com.carrotsearch.randomizedtesting.rules.SystemPropertiesInvariantRule$1.evaluate(SystemPropertiesInvariantRule.java:55)
[junit4:junit4]    > 	at org.apache.lucene.util.TestRuleReportUncaughtExceptions$1.evaluate(TestRuleReportUncaughtExceptions.java:68)
[junit4:junit4]    > 	at org.apache.lucene.util.TestRuleThreadAndTestName$1.evaluate(TestRuleThreadAndTestName.java:48)
[junit4:junit4]    > 	at org.apache.lucene.util.TestRuleIgnoreAfterMaxFailures$1.evaluate(TestRuleIgnoreAfterMaxFailures.java:70)
[junit4:junit4]    > 	at org.apache.lucene.util.TestRuleMarkFailure$1.evaluate(TestRuleMarkFailure.java:48)
[junit4:junit4]    > 	at com.carrotsearch.randomizedtesting.RandomizedRunner.runSingleTest(RandomizedRunner.java:825)
[junit4:junit4]    > 	at com.carrotsearch.randomizedtesting.RandomizedRunner.access$700(RandomizedRunner.java:132)
[junit4:junit4]    > 	at com.carrotsearch.randomizedtesting.RandomizedRunner$3$1.run(RandomizedRunner.java:671)
[junit4:junit4]    > 	at com.carrotsearch.randomizedtesting.RandomizedRunner$3.evaluate(RandomizedRunner.java:697)
[junit4:junit4]    > 	at com.carrotsearch.randomizedtesting.RandomizedRunner$4.evaluate(RandomizedRunner.java:736)
[junit4:junit4]    > 	at com.carrotsearch.randomizedtesting.RandomizedRunner$5.evaluate(RandomizedRunner.java:747)
[junit4:junit4]    > 	at com.carrotsearch.randomizedtesting.rules.SystemPropertiesRestoreRule$1.evaluate(SystemPropertiesRestoreRule.java:53)
[junit4:junit4]    > 	at org.apache.lucene.util.AbstractBeforeAfterRule$1.evaluate(AbstractBeforeAfterRule.java:45)
[junit4:junit4]    > 	at org.apache.lucene.util.TestRuleReportUncaughtExceptions$1.evaluate(TestRuleReportUncaughtExceptions.java:68)
[junit4:junit4]    > 	at org.apache.lucene.util.TestRuleStoreClassName$1.evaluate(TestRuleStoreClassName.java:38)
[junit4:junit4]    > 	at com.carrotsearch.randomizedtesting.rules.SystemPropertiesInvariantRule$1.evaluate(SystemPropertiesInvariantRule.java:55)
[junit4:junit4]    > 	at org.apache.lucene.util.TestRuleNoInstanceHooksOverrides$1.evaluate(TestRuleNoInstanceHooksOverrides.java:53)
[junit4:junit4]    > 	at org.apache.lucene.util.TestRuleNoStaticHooksShadowing$1.evaluate(TestRuleNoStaticHooksShadowing.java:52)
[junit4:junit4]    > 	at org.apache.lucene.util.TestRuleAssertionsRequired$1.evaluate(TestRuleAssertionsRequired.java:36)
[junit4:junit4]    > 	at org.apache.lucene.util.TestRuleMarkFailure$1.evaluate(TestRuleMarkFailure.java:48)
[junit4:junit4]    > 	at org.apache.lucene.util.TestRuleIgnoreAfterMaxFailures$1.evaluate(TestRuleIgnoreAfterMaxFailures.java:70)
[junit4:junit4]    > 	at org.apache.lucene.util.TestRuleIgnoreTestSuites$1.evaluate(TestRuleIgnoreTestSuites.java:55)
[junit4:junit4]    > 	at com.carrotsearch.randomizedtesting.RandomizedRunner.runSuite(RandomizedRunner.java:605)
[junit4:junit4]    > 	at com.carrotsearch.randomizedtesting.RandomizedRunner.access$400(RandomizedRunner.java:132)
[junit4:junit4]    > 	at com.carrotsearch.randomizedtesting.RandomizedRunner$2.run(RandomizedRunner.java:551)
[junit4:junit4]    > 
[junit4:junit4]   2> 2 T7808 oas.SolrTestCaseJ4.setUp ###Starting testDistribSearch
[junit4:junit4]   2> 3 T7808 oejs.Server.doStart jetty-8.1.2.v20120308
[junit4:junit4]   2> 5 T7808 oejs.AbstractConnector.doStart Started SocketConnector@0.0.0.0:50029
[junit4:junit4]   2> 5 T7808 oasc.SolrResourceLoader.locateSolrHome JNDI not configured for solr (NoInitialContextEx)
[junit4:junit4]   2> 6 T7808 oasc.SolrResourceLoader.locateSolrHome using system property solr.solr.home: /mnt/ssd/jenkins/workspace/Lucene-Solr-4.x-Linux/checkout/solr/build/solr-core/test-files/solr
[junit4:junit4]   2> 6 T7808 oasc.SolrResourceLoader.<init> new SolrResourceLoader for deduced Solr Home: '/mnt/ssd/jenkins/workspace/Lucene-Solr-4.x-Linux/checkout/solr/build/solr-core/test-files/solr/'
[junit4:junit4]   2> 13 T7808 oass.SolrDispatchFilter.init SolrDispatchFilter.init()
[junit4:junit4]   2> 13 T7808 oasc.SolrResourceLoader.locateSolrHome JNDI not configured for solr (NoInitialContextEx)
[junit4:junit4]   2> 14 T7808 oasc.SolrResourceLoader.locateSolrHome using system property solr.solr.home: /mnt/ssd/jenkins/workspace/Lucene-Solr-4.x-Linux/checkout/solr/build/solr-core/test-files/solr
[junit4:junit4]   2> 14 T7808 oasc.CoreContainer$Initializer.initialize looking for solr.xml: /mnt/ssd/jenkins/workspace/Lucene-Solr-4.x-Linux/checkout/solr/build/solr-core/test-files/solr/solr.xml
[junit4:junit4]   2> 14 T7808 oasc.CoreContainer.<init> New CoreContainer 21597628
[junit4:junit4]   2> 14 T7808 oasc.CoreContainer.load Loading CoreContainer using Solr Home: '/mnt/ssd/jenkins/workspace/Lucene-Solr-4.x-Linux/checkout/solr/build/solr-core/test-files/solr/'
[junit4:junit4]   2> 15 T7808 oasc.SolrResourceLoader.<init> new SolrResourceLoader for directory: '/mnt/ssd/jenkins/workspace/Lucene-Solr-4.x-Linux/checkout/solr/build/solr-core/test-files/solr/'
[junit4:junit4]   2> 24 T7808 oasc.CoreContainer.load Registering Log Listener
[junit4:junit4]   2> 36 T7808 oasc.CoreContainer.create Creating SolrCore 'collection1' using instanceDir: /mnt/ssd/jenkins/workspace/Lucene-Solr-4.x-Linux/checkout/solr/build/solr-core/test-files/solr/collection1
[junit4:junit4]   2> 36 T7808 oasc.SolrResourceLoader.<init> new SolrResourceLoader for directory: '/mnt/ssd/jenkins/workspace/Lucene-Solr-4.x-Linux/checkout/solr/build/solr-core/test-files/solr/collection1/'
[junit4:junit4]   2> 37 T7808 oasc.SolrResourceLoader.replaceClassLoader Adding 'file:/mnt/ssd/jenkins/workspace/Lucene-Solr-4.x-Linux/checkout/solr/build/solr-core/test-files/solr/collection1/lib/README' to classloader
[junit4:junit4]   2> 37 T7808 oasc.SolrResourceLoader.replaceClassLoader Adding 'file:/mnt/ssd/jenkins/workspace/Lucene-Solr-4.x-Linux/checkout/solr/build/solr-core/test-files/solr/collection1/lib/classes/' to classloader
[junit4:junit4]   2> 60 T7808 oasc.SolrConfig.<init> Using Lucene MatchVersion: LUCENE_40
[junit4:junit4]   2> 112 T7808 oasc.SolrConfig.<init> Loaded SolrConfig: solrconfig-elevate.xml
[junit4:junit4]   2> 112 T7808 oass.IndexSchema.readSchema Reading Solr Schema
[junit4:junit4]   2> 115 T7808 oass.IndexSchema.readSchema Schema name=example
[junit4:junit4]   2> 251 T7808 oass.IndexSchema.readSchema default search field in schema is text
[junit4:junit4]   2> 253 T7808 oass.IndexSchema.readSchema unique key field: id
[junit4:junit4]   2> 255 T7808 oasc.SolrCore.<init> [collection1] Opening new SolrCore at /mnt/ssd/jenkins/workspace/Lucene-Solr-4.x-Linux/checkout/solr/build/solr-core/test-files/solr/collection1/, dataDir=./org.apache.solr.handler.component.DistributedQueryElevationComponentTest-1343936005783/control/data/
[junit4:junit4]   2> 256 T7808 oasc.JmxMonitoredMap.<init> JMX monitoring is enabled. Adding Solr mbeans to JMX Server: com.sun.jmx.mbeanserver.JmxMBeanServer@1ce7ceb
[junit4:junit4]   2> 256 T7808 oasc.SolrCore.getNewIndexDir WARNING New index directory detected: old=null new=./org.apache.solr.handler.component.DistributedQueryElevationComponentTest-1343936005783/control/data/index/
[junit4:junit4]   2> 256 T7808 oasc.SolrCore.initIndex WARNING [collection1] Solr index directory './org.apache.solr.handler.component.DistributedQueryElevationComponentTest-1343936005783/control/data/index' doesn't exist. Creating new index...
[junit4:junit4]   2> 258 T7808 oasc.SolrDeletionPolicy.onCommit SolrDeletionPolicy.onCommit: commits:num=1
[junit4:junit4]   2> 		commit{dir=MockDirWrapper(org.apache.lucene.store.NIOFSDirectory@/mnt/ssd/jenkins/workspace/Lucene-Solr-4.x-Linux/checkout/solr/build/solr-core/test/J1/index7229072296tmp lockFactory=org.apache.lucene.store.SingleInstanceLockFactory@5118f0),segFN=segments_1,generation=1,filenames=[segments_1]
[junit4:junit4]   2> 258 T7808 oasc.SolrDeletionPolicy.updateCommits newest commit = 1
[junit4:junit4]   2> 259 T7808 oasc.RequestHandlers.initHandlersFromConfig created /update: solr.UpdateRequestHandler
[junit4:junit4]   2> 259 T7808 oasc.RequestHandlers.initHandlersFromConfig created /elevate: org.apache.solr.handler.component.SearchHandler
[junit4:junit4]   2> 260 T7808 oasc.RequestHandlers.initHandlersFromConfig created /dataElevate: org.apache.solr.handler.component.SearchHandler
[junit4:junit4]   2> 260 T7808 oashl.XMLLoader.init xsltCacheLifetimeSeconds=60
[junit4:junit4]   2> 261 T7808 oasc.RequestHandlers.initHandlersFromConfig WARNING no default request handler is registered (either '/select' or 'standard')
[junit4:junit4]   2> 262 T7808 oasc.SolrCore.initDeprecatedSupport WARNING solrconfig.xml uses deprecated <admin/gettableFiles>, Please update your config to use the ShowFileRequestHandler.
[junit4:junit4]   2> 262 T7808 oasc.SolrCore.initDeprecatedSupport WARNING adding ShowFileRequestHandler with hidden files: [SCHEMA-PHRASESUGGEST.XML, SOLRCONFIG-SOLR-749.XML, SOLRCONFIG-XINCLUDE.XML, STOPWORDS.TXT, COMPOUNDDICTIONARY.TXT, BAD-SCHEMA-DUP-DYNAMICFIELD.XML, SCHEMA-REQUIRED-FIELDS.XML, BAD-SCHEMA-UNIQUEKEY-MULTIVALUED.XML, BAD-SCHEMA-NOT-INDEXED-BUT-TF.XML, STOP-SNOWBALL.TXT, SCHEMA-LMJELINEKMERCER.XML, SOLRCONFIG-MASTER2.XML, BAD-SCHEMA-DUP-FIELD.XML, FRENCHARTICLES.TXT, BAD-SOLRCONFIG-BOGUS-SCRIPTENGINE-NAME.XML, SCHEMA-BM25.XML, SOLRCONFIG-MERGEPOLICY.XML, BAD-SCHEMA-CODEC-GLOBAL-VS-FT-MISMATCH.XML, SOLRCONFIG_CODEC.XML, CONDITIONAL.UPDATEPROCESSOR.JS, BAD-SCHEMA-ANALYZER-CLASS-AND-NESTED.XML, SCHEMASURROUND.XML, SOLRCONFIG-MASTER3.XML, HYPHENATION.DTD, BAD-SCHEMA-UNIQUEKEY-USES-DEFAULT.XML, BAD-SCHEMA-EXTERNAL-FILEFIELD.XML, XSLT, SOLRCONFIG-CACHING.XML, TRIVIAL.UPDATEPROCESSOR0.JS, SCHEMA-REPLICATION1.XML, BAD-MP-SOLRCONFIG.XML, KEEP-1.TXT, SCHEMA-COPYFIELD-TEST.XML, SOLRCONFIG-SPELLCHECKCOMPONENT.XML, MAPPING-ISOLATIN1ACCENT.TXT, SCHEMA11.XML, SCHEMA_CODEC.XML, SOLRCONFIG-DELPOLICY2.XML, SCHEMA-TRIE.XML, SOLRCONFIG-PHRASESUGGEST.XML, STOP-1.TXT, SCHEMA-BINARYFIELD.XML, BAD_SOLRCONFIG.XML, STOPTYPES-2.TXT, PROTWORDS.TXT, SCHEMA-FOLDING.XML, TRIVIAL.UPDATEPROCESSOR1.JS, SOLRCONFIG-QUERYSENDER-NOQUERY.XML, SOLRCONFIG-ALTDIRECTORY.XML, BAD-SOLRCONFIG-MISSING-SCRIPTFILE.XML, BAD-SOLRCONFIG-INVALID-SCRIPTFILE.XML, WDFTYPES.TXT, SOLRCONFIG-UPDATE-PROCESSOR-CHAINS.XML, SOLRCONFIG-MASTER1.XML, SCHEMA-LUCENEMATCHVERSION.XML, BAD-SCHEMA-OMIT-TF-BUT-NOT-POS.XML, SOLRCONFIG-TLOG.XML, STOPWITHBOM.TXT, SCHEMA12.XML, DA_UTF8.XML, ADDFIELDS.UPDATEPROCESSOR.JS, STEMDICT.TXT, THROW.ERROR.ON.ADD.UPDATEPROCESSOR.JS, SCHEMA-COLLATEFILTER.XML, SOLRCONFIG-ELEVATE.XML, SCHEMA-COLLATE.XML, BAD-SCHEMA-NONTEXT-ANALYZER.XML, SCHEMA-TFIDF.XML, MISSING.FUNCTIONS.UPDATEPROCESSOR.JS, SOLRCONFIG-MASTER1-KEEPONEBACKUP.XML, SOLRCONFIG-BASIC-LUCENEVERSION31.XML, SOLRCONFIG-PROPINJECT-INDEXDEFAULT.XML, MISSLEADING.EXTENSION.UPDATEPROCESSOR.JS.TXT, OPEN-EXCHANGE-RATES.JSON, SOLRCONFIG-TRANSFORMERS.XML, BAD-SCHEMA-DUP-FIELDTYPE.XML, SOLRCONFIG-ENABLEPLUGIN.XML, SCHEMA-LMDIRICHLET.XML, HUNSPELL-TEST.DIC, SOLRCONFIG-REQHANDLER.INCL, SOLRCONFIG-SPELLCHECKER.XML, SOLRCONFIG-LAZYWRITER.XML, SOLRCONFIG-FUNCTIONQUERY.XML, SOLRCONFIG-NATIVELOCK.XML, SOLRCONFIG-SOLCOREPROPERTIES.XML, BAD-SCHEMA-UNIQUEKEY-IS-COPYFIELD-DEST.XML, SCHEMA-REPLICATION2.XML, SOLRCONFIG-DELPOLICY1.XML, CURRENCY.XML, KEEP-2.TXT, SCHEMA-MINIMAL.XML, SCHEMA-REVERSED.XML, SCHEMA.XML, SOLRCONFIG-SIMPLELOCK.XML, PHRASESUGGEST.TXT, BAD-SCHEMA-SIM-GLOBAL-VS-FT-MISMATCH.XML, STOP-2.TXT, STOPTYPES-1.TXT, SYNONYMS.TXT, BAD-SCHEMA-NOT-INDEXED-BUT-NORMS.XML, SOLRCONFIG-SCRIPT-UPDATEPROCESSOR.XML, SOLRCONFIG-MASTER.XML, SCHEMA15.XML, SOLRCONFIG-TERMINDEX.XML, SCHEMA-DFR.XML, SCHEMA-CHARFILTERS.XML, BAD-SCHEMA-NOT-INDEXED-BUT-POS.XML, SOLRCONFIG-SLAVE.XML, SCHEMA-NOT-REQUIRED-UNIQUE-KEY.XML, ELEVATE.XML, SCHEMA-SPELLCHECKER.XML, SOLRCONFIG-REPEATER.XML, SOLRCONFIG-HIGHLIGHT.XML, STOPWORDSWRONGENCODING.TXT, SOLRCONFIG_PERF.XML, SCHEMA-SIM.XML, SOLRCONFIG-PROPINJECT.XML, SOLRCONFIG-BASIC.XML, HUNSPELL-TEST.AFF, DA_COMPOUNDDICTIONARY.TXT, SOLRCONFIG-NOCACHE.XML, SOLRCONFIG-QUERYSENDER.XML, SOLRCONFIG-SLAVE1.XML, SCHEMA-NUMERIC.XML, SCHEMA-IB.XML, OLD_SYNONYMS.TXT, SCHEMA-STOP-KEEP.XML]
[junit4:junit4]   2> 265 T7808 oass.SolrIndexSearcher.<init> Opening Searcher@1714317 main
[junit4:junit4]   2> 265 T7808 oass.SolrIndexSearcher.getIndexDir WARNING WARNING: Directory impl does not support setting indexDir: org.apache.lucene.store.MockDirectoryWrapper
[junit4:junit4]   2> 265 T7808 oasu.CommitTracker.<init> Hard AutoCommit: disabled
[junit4:junit4]   2> 265 T7808 oasu.CommitTracker.<init> Soft AutoCommit: disabled
[junit4:junit4]   2> 266 T7808 oashc.QueryElevationComponent.inform Loading QueryElevation from: /mnt/ssd/jenkins/workspace/Lucene-Solr-4.x-Linux/checkout/solr/build/solr-core/test-files/solr/collection1/conf/elevate.xml
[junit4:junit4]   2> 272 T7808 oashc.QueryElevationComponent.inform Loading QueryElevation from: /mnt/ssd/jenkins/workspace/Lucene-Solr-4.x-Linux/checkout/solr/build/solr-core/test-files/solr/collection1/conf/elevate.xml
[junit4:junit4]   2> 279 T7808 oashc.HttpShardHandlerFactory.getParameter Setting socketTimeout to: 0
[junit4:junit4]   2> 279 T7808 oashc.HttpShardHandlerFactory.getParameter Setting urlScheme to: http://
[junit4:junit4]   2> 279 T7808 oashc.HttpShardHandlerFactory.getParameter Setting connTimeout to: 0
[junit4:junit4]   2> 279 T7808 oashc.HttpShardHandlerFactory.getParameter Setting maxConnectionsPerHost to: 20
[junit4:junit4]   2> 280 T7808 oashc.HttpShardHandlerFactory.getParameter Setting corePoolSize to: 0
[junit4:junit4]   2> 280 T7808 oashc.HttpShardHandlerFactory.getParameter Setting maximumPoolSize to: 2147483647
[junit4:junit4]   2> 280 T7808 oashc.HttpShardHandlerFactory.getParameter Setting maxThreadIdleTime to: 5
[junit4:junit4]   2> 280 T7808 oashc.HttpShardHandlerFactory.getParameter Setting sizeOfQueue to: -1
[junit4:junit4]   2> 281 T7808 oashc.HttpShardHandlerFactory.getParameter Setting fairnessPolicy to: false
[junit4:junit4]   2> 281 T7808 oascsi.HttpClientUtil.createClient Creating new http client, config:maxConnectionsPerHost=20&maxConnections=10000&socketTimeout=0&connTimeout=0&retry=false
[junit4:junit4]   2> 283 T7808 oasc.CoreContainer.register registering core: collection1
[junit4:junit4]   2> 283 T7818 oasc.SolrCore.registerSearcher [collection1] Registered new searcher Searcher@1714317 main{StandardDirectoryReader(segments_1:1)}
[junit4:junit4]   2> 283 T7808 oass.SolrDispatchFilter.init user.dir=/mnt/ssd/jenkins/workspace/Lucene-Solr-4.x-Linux/checkout/solr/build/solr-core/test/J1
[junit4:junit4]   2> 284 T7808 oass.SolrDispatchFilter.init SolrDispatchFilter.init() done
[junit4:junit4]   2> 284 T7808 oascsi.HttpClientUtil.createClient Creating new http client, config:maxConnections=128&maxConnectionsPerHost=32&followRedirects=false
[junit4:junit4]   2> 286 T7808 oejs.Server.doStart jetty-8.1.2.v20120308
[junit4:junit4]   2> 288 T7808 oejs.AbstractConnector.doStart Started SocketConnector@0.0.0.0:43455
[junit4:junit4]   2> 288 T7808 oasc.SolrResourceLoader.locateSolrHome JNDI not configured for solr (NoInitialContextEx)
[junit4:junit4]   2> 288 T7808 oasc.SolrResourceLoader.locateSolrHome using system property solr.solr.home: /mnt/ssd/jenkins/workspace/Lucene-Solr-4.x-Linux/checkout/solr/build/solr-core/test-files/solr
[junit4:junit4]   2> 288 T7808 oasc.SolrResourceLoader.<init> new SolrResourceLoader for deduced Solr Home: '/mnt/ssd/jenkins/workspace/Lucene-Solr-4.x-Linux/checkout/solr/build/solr-core/test-files/solr/'
[junit4:junit4]   2> 295 T7808 oass.SolrDispatchFilter.init SolrDispatchFilter.init()
[junit4:junit4]   2> 296 T7808 oasc.SolrResourceLoader.locateSolrHome JNDI not configured for solr (NoInitialContextEx)
[junit4:junit4]   2> 296 T7808 oasc.SolrResourceLoader.locateSolrHome using system property solr.solr.home: /mnt/ssd/jenkins/workspace/Lucene-Solr-4.x-Linux/checkout/solr/build/solr-core/test-files/solr
[junit4:junit4]   2> 296 T7808 oasc.CoreContainer$Initializer.initialize looking for solr.xml: /mnt/ssd/jenkins/workspace/Lucene-Solr-4.x-Linux/checkout/solr/build/solr-core/test-files/solr/solr.xml
[junit4:junit4]   2> 296 T7808 oasc.CoreContainer.<init> New CoreContainer 31813524
[junit4:junit4]   2> 297 T7808 oasc.CoreContainer.load Loading CoreContainer using Solr Home: '/mnt/ssd/jenkins/workspace/Lucene-Solr-4.x-Linux/checkout/solr/build/solr-core/test-files/solr/'
[junit4:junit4]   2> 297 T7808 oasc.SolrResourceLoader.<init> new SolrResourceLoader for directory: '/mnt/ssd/jenkins/workspace/Lucene-Solr-4.x-Linux/checkout/solr/build/solr-core/test-files/solr/'
[junit4:junit4]   2> 306 T7808 oasc.CoreContainer.load Registering Log Listener
[junit4:junit4]   2> 317 T7808 oasc.CoreContainer.create Creating SolrCore 'collection1' using instanceDir: /mnt/ssd/jenkins/workspace/Lucene-Solr-4.x-Linux/checkout/solr/build/solr-core/test-files/solr/collection1
[junit4:junit4]   2> 317 T7808 oasc.SolrResourceLoader.<init> new SolrResourceLoader for directory: '/mnt/ssd/jenkins/workspace/Lucene-Solr-4.x-Linux/checkout/solr/build/solr-core/test-files/solr/collection1/'
[junit4:junit4]   2> 318 T7808 oasc.SolrResourceLoader.replaceClassLoader Adding 'file:/mnt/ssd/jenkins/workspace/Lucene-Solr-4.x-Linux/checkout/solr/build/solr-core/test-files/solr/collection1/lib/README' to classloader
[junit4:junit4]   2> 318 T7808 oasc.SolrResourceLoader.replaceClassLoader Adding 'file:/mnt/ssd/jenkins/workspace/Lucene-Solr-4.x-Linux/checkout/solr/build/solr-core/test-files/solr/collection1/lib/classes/' to classloader
[junit4:junit4]   2> 338 T7808 oasc.SolrConfig.<init> Using Lucene MatchVersion: LUCENE_40
[junit4:junit4]   2> 376 T7808 oasc.SolrConfig.<init> Loaded SolrConfig: solrconfig-elevate.xml
[junit4:junit4]   2> 376 T7808 oass.IndexSchema.readSchema Reading Solr Schema
[junit4:junit4]   2> 379 T7808 oass.IndexSchema.readSchema Schema name=example
[junit4:junit4]   2> 514 T7808 oass.IndexSchema.readSchema default search field in schema is text
[junit4:junit4]   2> 516 T7808 oass.IndexSchema.readSchema unique key field: id
[junit4:junit4]   2> 518 T7808 oasc.SolrCore.<init> [collection1] Opening new SolrCore at /mnt/ssd/jenkins/workspace/Lucene-Solr-4.x-Linux/checkout/solr/build/solr-core/test-files/solr/collection1/, dataDir=./org.apache.solr.handler.component.DistributedQueryElevationComponentTest-1343936005783/shard0/data/
[junit4:junit4]   2> 518 T7808 oasc.JmxMonitoredMap.<init> JMX monitoring is enabled. Adding Solr mbeans to JMX Server: com.sun.jmx.mbeanserver.JmxMBeanServer@1ce7ceb
[junit4:junit4]   2> 519 T7808 oasc.SolrCore.getNewIndexDir WARNING New index directory detected: old=null new=./org.apache.solr.handler.component.DistributedQueryElevationComponentTest-1343936005783/shard0/data/index/
[junit4:junit4]   2> 519 T7808 oasc.SolrCore.initIndex WARNING [collection1] Solr index directory './org.apache.solr.handler.component.DistributedQueryElevationComponentTest-1343936005783/shard0/data/index' doesn't exist. Creating new index...
[junit4:junit4]   2> 520 T7808 oasc.SolrDeletionPolicy.onCommit SolrDeletionPolicy.onCommit: commits:num=1
[junit4:junit4]   2> 		commit{dir=MockDirWrapper(org.apache.lucene.store.SimpleFSDirectory@/mnt/ssd/jenkins/workspace/Lucene-Solr-4.x-Linux/checkout/solr/build/solr-core/test/J1/index7229072297tmp lockFactory=org.apache.lucene.store.SingleInstanceLockFactory@1d9876f),segFN=segments_1,generation=1,filenames=[segments_1]
[junit4:junit4]   2> 521 T7808 oasc.SolrDeletionPolicy.updateCommits newest commit = 1
[junit4:junit4]   2> 522 T7808 oasc.RequestHandlers.initHandlersFromConfig created /update: solr.UpdateRequestHandler
[junit4:junit4]   2> 522 T7808 oasc.RequestHandlers.initHandlersFromConfig created /elevate: org.apache.solr.handler.component.SearchHandler
[junit4:junit4]   2> 522 T7808 oasc.RequestHandlers.initHandlersFromConfig created /dataElevate: org.apache.solr.handler.component.SearchHandler
[junit4:junit4]   2> 523 T7808 oashl.XMLLoader.init xsltCacheLifetimeSeconds=60
[junit4:junit4]   2> 523 T7808 oasc.RequestHandlers.initHandlersFromConfig WARNING no default request handler is registered (either '/select' or 'standard')
[junit4:junit4]   2> 524 T7808 oasc.SolrCore.initDeprecatedSupport WARNING solrconfig.xml uses deprecated <admin/gettableFiles>, Please update your config to use the ShowFileRequestHandler.
[junit4:junit4]   2> 525 T7808 oasc.SolrCore.initDeprecatedSupport WARNING adding ShowFileRequestHandler with hidden files: [SCHEMA-PHRASESUGGEST.XML, SOLRCONFIG-SOLR-749.XML, SOLRCONFIG-XINCLUDE.XML, STOPWORDS.TXT, COMPOUNDDICTIONARY.TXT, BAD-SCHEMA-DUP-DYNAMICFIELD.XML, SCHEMA-REQUIRED-FIELDS.XML, BAD-SCHEMA-UNIQUEKEY-MULTIVALUED.XML, BAD-SCHEMA-NOT-INDEXED-BUT-TF.XML, STOP-SNOWBALL.TXT, SCHEMA-LMJELINEKMERCER.XML, SOLRCONFIG-MASTER2.XML, BAD-SCHEMA-DUP-FIELD.XML, FRENCHARTICLES.TXT, BAD-SOLRCONFIG-BOGUS-SCRIPTENGINE-NAME.XML, SCHEMA-BM25.XML, SOLRCONFIG-MERGEPOLICY.XML, BAD-SCHEMA-CODEC-GLOBAL-VS-FT-MISMATCH.XML, SOLRCONFIG_CODEC.XML, CONDITIONAL.UPDATEPROCESSOR.JS, BAD-SCHEMA-ANALYZER-CLASS-AND-NESTED.XML, SCHEMASURROUND.XML, SOLRCONFIG-MASTER3.XML, HYPHENATION.DTD, BAD-SCHEMA-UNIQUEKEY-USES-DEFAULT.XML, BAD-SCHEMA-EXTERNAL-FILEFIELD.XML, XSLT, SOLRCONFIG-CACHING.XML, TRIVIAL.UPDATEPROCESSOR0.JS, SCHEMA-REPLICATION1.XML, BAD-MP-SOLRCONFIG.XML, KEEP-1.TXT, SCHEMA-COPYFIELD-TEST.XML, SOLRCONFIG-SPELLCHECKCOMPONENT.XML, MAPPING-ISOLATIN1ACCENT.TXT, SCHEMA11.XML, SCHEMA_CODEC.XML, SOLRCONFIG-DELPOLICY2.XML, SCHEMA-TRIE.XML, SOLRCONFIG-PHRASESUGGEST.XML, STOP-1.TXT, SCHEMA-BINARYFIELD.XML, BAD_SOLRCONFIG.XML, STOPTYPES-2.TXT, PROTWORDS.TXT, SCHEMA-FOLDING.XML, TRIVIAL.UPDATEPROCESSOR1.JS, SOLRCONFIG-QUERYSENDER-NOQUERY.XML, SOLRCONFIG-ALTDIRECTORY.XML, BAD-SOLRCONFIG-MISSING-SCRIPTFILE.XML, BAD-SOLRCONFIG-INVALID-SCRIPTFILE.XML, WDFTYPES.TXT, SOLRCONFIG-UPDATE-PROCESSOR-CHAINS.XML, SOLRCONFIG-MASTER1.XML, SCHEMA-LUCENEMATCHVERSION.XML, BAD-SCHEMA-OMIT-TF-BUT-NOT-POS.XML, SOLRCONFIG-TLOG.XML, STOPWITHBOM.TXT, SCHEMA12.XML, DA_UTF8.XML, ADDFIELDS.UPDATEPROCESSOR.JS, STEMDICT.TXT, THROW.ERROR.ON.ADD.UPDATEPROCESSOR.JS, SCHEMA-COLLATEFILTER.XML, SOLRCONFIG-ELEVATE.XML, SCHEMA-COLLATE.XML, BAD-SCHEMA-NONTEXT-ANALYZER.XML, SCHEMA-TFIDF.XML, MISSING.FUNCTIONS.UPDATEPROCESSOR.JS, SOLRCONFIG-MASTER1-KEEPONEBACKUP.XML, SOLRCONFIG-BASIC-LUCENEVERSION31.XML, SOLRCONFIG-PROPINJECT-INDEXDEFAULT.XML, MISSLEADING.EXTENSION.UPDATEPROCESSOR.JS.TXT, OPEN-EXCHANGE-RATES.JSON, SOLRCONFIG-TRANSFORMERS.XML, BAD-SCHEMA-DUP-FIELDTYPE.XML, SOLRCONFIG-ENABLEPLUGIN.XML, SCHEMA-LMDIRICHLET.XML, HUNSPELL-TEST.DIC, SOLRCONFIG-REQHANDLER.INCL, SOLRCONFIG-SPELLCHECKER.XML, SOLRCONFIG-LAZYWRITER.XML, SOLRCONFIG-FUNCTIONQUERY.XML, SOLRCONFIG-NATIVELOCK.XML, SOLRCONFIG-SOLCOREPROPERTIES.XML, BAD-SCHEMA-UNIQUEKEY-IS-COPYFIELD-DEST.XML, SCHEMA-REPLICATION2.XML, SOLRCONFIG-DELPOLICY1.XML, CURRENCY.XML, KEEP-2.TXT, SCHEMA-MINIMAL.XML, SCHEMA-REVERSED.XML, SCHEMA.XML, SOLRCONFIG-SIMPLELOCK.XML, PHRASESUGGEST.TXT, BAD-SCHEMA-SIM-GLOBAL-VS-FT-MISMATCH.XML, STOP-2.TXT, STOPTYPES-1.TXT, SYNONYMS.TXT, BAD-SCHEMA-NOT-INDEXED-BUT-NORMS.XML, SOLRCONFIG-SCRIPT-UPDATEPROCESSOR.XML, SOLRCONFIG-MASTER.XML, SCHEMA15.XML, SOLRCONFIG-TERMINDEX.XML, SCHEMA-DFR.XML, SCHEMA-CHARFILTERS.XML, BAD-SCHEMA-NOT-INDEXED-BUT-POS.XML, SOLRCONFIG-SLAVE.XML, SCHEMA-NOT-REQUIRED-UNIQUE-KEY.XML, ELEVATE.XML, SCHEMA-SPELLCHECKER.XML, SOLRCONFIG-REPEATER.XML, SOLRCONFIG-HIGHLIGHT.XML, STOPWORDSWRONGENCODING.TXT, SOLRCONFIG_PERF.XML, SCHEMA-SIM.XML, SOLRCONFIG-PROPINJECT.XML, SOLRCONFIG-BASIC.XML, HUNSPELL-TEST.AFF, DA_COMPOUNDDICTIONARY.TXT, SOLRCONFIG-NOCACHE.XML, SOLRCONFIG-QUERYSENDER.XML, SOLRCONFIG-SLAVE1.XML, SCHEMA-NUMERIC.XML, SCHEMA-IB.XML, OLD_SYNONYMS.TXT, SCHEMA-STOP-KEEP.XML]
[junit4:junit4]   2> 527 T7808 oass.SolrIndexSearcher.<init> Opening Searcher@9fa0cd main
[junit4:junit4]   2> 527 T7808 oass.SolrIndexSearcher.getIndexDir WARNING WARNING: Directory impl does not support setting indexDir: org.apache.lucene.store.MockDirectoryWrapper
[junit4:junit4]   2> 528 T7808 oasu.CommitTracker.<init> Hard AutoCommit: disabled
[junit4:junit4]   2> 528 T7808 oasu.CommitTracker.<init> Soft AutoCommit: disabled
[junit4:junit4]   2> 528 T7808 oashc.QueryElevationComponent.inform Loading QueryElevation from: /mnt/ssd/jenkins/workspace/Lucene-Solr-4.x-Linux/checkout/solr/build/solr-core/test-files/solr/collection1/conf/elevate.xml
[junit4:junit4]   2> 534 T7808 oashc.QueryElevationComponent.inform Loading QueryElevation from: /mnt/ssd/jenkins/workspace/Lucene-Solr-4.x-Linux/checkout/solr/build/solr-core/test-files/solr/collection1/conf/elevate.xml
[junit4:junit4]   2> 541 T7808 oashc.HttpShardHandlerFactory.getParameter Setting socketTimeout to: 0
[junit4:junit4]   2> 541 T7808 oashc.HttpShardHandlerFactory.getParameter Setting urlScheme to: http://
[junit4:junit4]   2> 542 T7808 oashc.HttpShardHandlerFactory.getParameter Setting connTimeout to: 0
[junit4:junit4]   2> 542 T7808 oashc.HttpShardHandlerFactory.getParameter Setting maxConnectionsPerHost to: 20
[junit4:junit4]   2> 542 T7808 oashc.HttpShardHandlerFactory.getParameter Setting corePoolSize to: 0
[junit4:junit4]   2> 542 T7808 oashc.HttpShardHandlerFactory.getParameter Setting maximumPoolSize to: 2147483647
[junit4:junit4]   2> 542 T7808 oashc.HttpShardHandlerFactory.getParameter Setting maxThreadIdleTime to: 5
[junit4:junit4]   2> 543 T7808 oashc.HttpShardHandlerFactory.getParameter Setting sizeOfQueue to: -1
[junit4:junit4]   2> 543 T7808 oashc.HttpShardHandlerFactory.getParameter Setting fairnessPolicy to: false
[junit4:junit4]   2> 543 T7808 oascsi.HttpClientUtil.createClient Creating new http client, config:maxConnectionsPerHost=20&maxConnections=10000&socketTimeout=0&connTimeout=0&retry=false
[junit4:junit4]   2> 546 T7828 oasc.SolrCore.registerSearcher [collection1] Registered new searcher Searcher@9fa0cd main{StandardDirectoryReader(segments_1:1)}
[junit4:junit4]   2> 546 T7808 oasc.CoreContainer.register registering core: collection1
[junit4:junit4]   2> 546 T7808 oass.SolrDispatchFilter.init user.dir=/mnt/ssd/jenkins/workspace/Lucene-Solr-4.x-Linux/checkout/solr/build/solr-core/test/J1
[junit4:junit4]   2> 546 T7808 oass.SolrDispatchFilter.init SolrDispatchFilter.init() done
[junit4:junit4]   2> 546 T7808 oascsi.HttpClientUtil.createClient Creating new http client, config:maxConnections=128&maxConnectionsPerHost=32&followRedirects=false
[junit4:junit4]   2> 549 T7808 oejs.Server.doStart jetty-8.1.2.v20120308
[junit4:junit4]   2> 550 T7808 oejs.AbstractConnector.doStart Started SocketConnector@0.0.0.0:55198
[junit4:junit4]   2> 550 T7808 oasc.SolrResourceLoader.locateSolrHome JNDI not configured for solr (NoInitialContextEx)
[junit4:junit4]   2> 551 T7808 oasc.SolrResourceLoader.locateSolrHome using system property solr.solr.home: /mnt/ssd/jenkins/workspace/Lucene-Solr-4.x-Linux/checkout/solr/build/solr-core/test-files/solr
[junit4:junit4]   2> 551 T7808 oasc.SolrResourceLoader.<init> new SolrResourceLoader for deduced Solr Home: '/mnt/ssd/jenkins/workspace/Lucene-Solr-4.x-Linux/checkout/solr/build/solr-core/test-files/solr/'
[junit4:junit4]   2> 558 T7808 oass.SolrDispatchFilter.init SolrDispatchFilter.init()
[junit4:junit4]   2> 558 T7808 oasc.SolrResourceLoader.locateSolrHome JNDI not configured for solr (NoInitialContextEx)
[junit4:junit4]   2> 558 T7808 oasc.SolrResourceLoader.locateSolrHome using system property solr.solr.home: /mnt/ssd/jenkins/workspace/Lucene-Solr-4.x-Linux/checkout/solr/build/solr-core/test-files/solr
[junit4:junit4]   2> 559 T7808 oasc.CoreContainer$Initializer.initialize looking for solr.xml: /mnt/ssd/jenkins/workspace/Lucene-Solr-4.x-Linux/checkout/solr/build/solr-core/test-files/solr/solr.xml
[junit4:junit4]   2> 559 T7808 oasc.CoreContainer.<init> New CoreContainer 4157708
[junit4:junit4]   2> 559 T7808 oasc.CoreContainer.load Loading CoreContainer using Solr Home: '/mnt/ssd/jenkins/workspace/Lucene-Solr-4.x-Linux/checkout/solr/build/solr-core/test-files/solr/'
[junit4:junit4]   2> 559 T7808 oasc.SolrResourceLoader.<init> new SolrResourceLoader for directory: '/mnt/ssd/jenkins/workspace/Lucene-Solr-4.x-Linux/checkout/solr/build/solr-core/test-files/solr/'
[junit4:junit4]   2> 568 T7808 oasc.CoreContainer.load Registering Log Listener
[junit4:junit4]   2> 579 T7808 oasc.CoreContainer.create Creating SolrCore 'collection1' using instanceDir: /mnt/ssd/jenkins/workspace/Lucene-Solr-4.x-Linux/checkout/solr/build/solr-core/test-files/solr/collection1
[junit4:junit4]   2> 580 T7808 oasc.SolrResourceLoader.<init> new SolrResourceLoader for directory: '/mnt/ssd/jenkins/workspace/Lucene-Solr-4.x-Linux/checkout/solr/build/solr-core/test-files/solr/collection1/'
[junit4:junit4]   2> 580 T7808 oasc.SolrResourceLoader.replaceClassLoader Adding 'file:/mnt/ssd/jenkins/workspace/Lucene-Solr-4.x-Linux/checkout/solr/build/solr-core/test-files/solr/collection1/lib/README' to classloader
[junit4:junit4]   2> 580 T7808 oasc.SolrResourceLoader.replaceClassLoader Adding 'file:/mnt/ssd/jenkins/workspace/Lucene-Solr-4.x-Linux/checkout/solr/build/solr-core/test-files/solr/collection1/lib/classes/' to classloader
[junit4:junit4]   2> 601 T7808 oasc.SolrConfig.<init> Using Lucene MatchVersion: LUCENE_40
[junit4:junit4]   2> 638 T7808 oasc.SolrConfig.<init> Loaded SolrConfig: solrconfig-elevate.xml
[junit4:junit4]   2> 639 T7808 oass.IndexSchema.readSchema Reading Solr Schema
[junit4:junit4]   2> 641 T7808 oass.IndexSchema.readSchema Schema name=example
[junit4:junit4]   2> 774 T7808 oass.IndexSchema.readSchema default search field in schema is text
[junit4:junit4]   2> 776 T7808 oass.IndexSchema.readSchema unique key field: id
[junit4:junit4]   2> 778 T7808 oasc.SolrCore.<init> [collection1] Opening new SolrCore at /mnt/ssd/jenkins/workspace/Lucene-Solr-4.x-Linux/checkout/solr/build/solr-core/test-files/solr/collection1/, dataDir=./org.apache.solr.handler.component.DistributedQueryElevationComponentTest-1343936005783/shard1/data/
[junit4:junit4]   2> 779 T7808 oasc.JmxMonitoredMap.<init> JMX monitoring is enabled. Adding Solr mbeans to JMX Server: com.sun.jmx.mbeanserver.JmxMBeanServer@1ce7ceb
[junit4:junit4]   2> 779 T7808 oasc.SolrCore.getNewIndexDir WARNING New index directory detected: old=null new=./org.apache.solr.handler.component.DistributedQueryElevationComponentTest-1343936005783/shard1/data/index/
[junit4:junit4]   2> 779 T7808 oasc.SolrCore.initIndex WARNING [collection1] Solr index directory './org.apache.solr.handler.component.DistributedQueryElevationComponentTest-1343936005783/shard1/data/index' doesn't exist. Creating new index...
[junit4:junit4]   2> 780 T7808 oasc.SolrDeletionPolicy.onCommit SolrDeletionPolicy.onCommit: commits:num=1
[junit4:junit4]   2> 		commit{dir=MockDirWrapper(org.apache.lucene.store.RAMDirectory@400326 lockFactory=org.apache.lucene.store.SingleInstanceLockFactory@740e31),segFN=segments_1,generation=1,filenames=[segments_1]
[junit4:junit4]   2> 781 T7808 oasc.SolrDeletionPolicy.updateCommits newest commit = 1
[junit4:junit4]   2> 781 T7808 oasc.RequestHandlers.initHandlersFromConfig created /update: solr.UpdateRequestHandler
[junit4:junit4]   2> 782 T7808 oasc.RequestHandlers.initHandlersFromConfig created /elevate: org.apache.solr.handler.component.SearchHandler
[junit4:junit4]   2> 782 T7808 oasc.RequestHandlers.initHandlersFromConfig created /dataElevate: org.apache.solr.handler.component.SearchHandler
[junit4:junit4]   2> 782 T7808 oashl.XMLLoader.init xsltCacheLifetimeSeconds=60
[junit4:junit4]   2> 783 T7808 oasc.RequestHandlers.initHandlersFromConfig WARNING no default request handler is registered (either '/select' or 'standard')
[junit4:junit4]   2> 784 T7808 oasc.SolrCore.initDeprecatedSupport WARNING solrconfig.xml uses deprecated <admin/gettableFiles>, Please update your config to use the ShowFileRequestHandler.
[junit4:junit4]   2> 785 T7808 oasc.SolrCore.initDeprecatedSupport WARNING adding ShowFileRequestHandler with hidden files: [SCHEMA-PHRASESUGGEST.XML, SOLRCONFIG-SOLR-749.XML, SOLRCONFIG-XINCLUDE.XML, STOPWORDS.TXT, COMPOUNDDICTIONARY.TXT, BAD-SCHEMA-DUP-DYNAMICFIELD.XML, SCHEMA-REQUIRED-FIELDS.XML, BAD-SCHEMA-UNIQUEKEY-MULTIVALUED.XML, BAD-SCHEMA-NOT-INDEXED-BUT-TF.XML, STOP-SNOWBALL.TXT, SCHEMA-LMJELINEKMERCER.XML, SOLRCONFIG-MASTER2.XML, BAD-SCHEMA-DUP-FIELD.XML, FRENCHARTICLES.TXT, BAD-SOLRCONFIG-BOGUS-SCRIPTENGINE-NAME.XML, SCHEMA-BM25.XML, SOLRCONFIG-MERGEPOLICY.XML, BAD-SCHEMA-CODEC-GLOBAL-VS-FT-MISMATCH.XML, SOLRCONFIG_CODEC.XML, CONDITIONAL.UPDATEPROCESSOR.JS, BAD-SCHEMA-ANALYZER-CLASS-AND-NESTED.XML, SCHEMASURROUND.XML, SOLRCONFIG-MASTER3.XML, HYPHENATION.DTD, BAD-SCHEMA-UNIQUEKEY-USES-DEFAULT.XML, BAD-SCHEMA-EXTERNAL-FILEFIELD.XML, XSLT, SOLRCONFIG-CACHING.XML, TRIVIAL.UPDATEPROCESSOR0.JS, SCHEMA-REPLICATION1.XML, BAD-MP-SOLRCONFIG.XML, KEEP-1.TXT, SCHEMA-COPYFIELD-TEST.XML, SOLRCONFIG-SPELLCHECKCOMPONENT.XML, MAPPING-ISOLATIN1ACCENT.TXT, SCHEMA11.XML, SCHEMA_CODEC.XML, SOLRCONFIG-DELPOLICY2.XML, SCHEMA-TRIE.XML, SOLRCONFIG-PHRASESUGGEST.XML, STOP-1.TXT, SCHEMA-BINARYFIELD.XML, BAD_SOLRCONFIG.XML, STOPTYPES-2.TXT, PROTWORDS.TXT, SCHEMA-FOLDING.XML, TRIVIAL.UPDATEPROCESSOR1.JS, SOLRCONFIG-QUERYSENDER-NOQUERY.XML, SOLRCONFIG-ALTDIRECTORY.XML, BAD-SOLRCONFIG-MISSING-SCRIPTFILE.XML, BAD-SOLRCONFIG-INVALID-SCRIPTFILE.XML, WDFTYPES.TXT, SOLRCONFIG-UPDATE-PROCESSOR-CHAINS.XML, SOLRCONFIG-MASTER1.XML, SCHEMA-LUCENEMATCHVERSION.XML, BAD-SCHEMA-OMIT-TF-BUT-NOT-POS.XML, SOLRCONFIG-TLOG.XML, STOPWITHBOM.TXT, SCHEMA12.XML, DA_UTF8.XML, ADDFIELDS.UPDATEPROCESSOR.JS, STEMDICT.TXT, THROW.ERROR.ON.ADD.UPDATEPROCESSOR.JS, SCHEMA-COLLATEFILTER.XML, SOLRCONFIG-ELEVATE.XML, SCHEMA-COLLATE.XML, BAD-SCHEMA-NONTEXT-ANALYZER.XML, SCHEMA-TFIDF.XML, MISSING.FUNCTIONS.UPDATEPROCESSOR.JS, SOLRCONFIG-MASTER1-KEEPONEBACKUP.XML, SOLRCONFIG-BASIC-LUCENEVERSION31.XML, SOLRCONFIG-PROPINJECT-INDEXDEFAULT.XML, MISSLEADING.EXTENSION.UPDATEPROCESSOR.JS.TXT, OPEN-EXCHANGE-RATES.JSON, SOLRCONFIG-TRANSFORMERS.XML, BAD-SCHEMA-DUP-FIELDTYPE.XML, SOLRCONFIG-ENABLEPLUGIN.XML, SCHEMA-LMDIRICHLET.XML, HUNSPELL-TEST.DIC, SOLRCONFIG-REQHANDLER.INCL, SOLRCONFIG-SPELLCHECKER.XML, SOLRCONFIG-LAZYWRITER.XML, SOLRCONFIG-FUNCTIONQUERY.XML, SOLRCONFIG-NATIVELOCK.XML, SOLRCONFIG-SOLCOREPROPERTIES.XML, BAD-SCHEMA-UNIQUEKEY-IS-COPYFIELD-DEST.XML, SCHEMA-REPLICATION2.XML, SOLRCONFIG-DELPOLICY1.XML, CURRENCY.XML, KEEP-2.TXT, SCHEMA-MINIMAL.XML, SCHEMA-REVERSED.XML, SCHEMA.XML, SOLRCONFIG-SIMPLELOCK.XML, PHRASESUGGEST.TXT, BAD-SCHEMA-SIM-GLOBAL-VS-FT-MISMATCH.XML, STOP-2.TXT, STOPTYPES-1.TXT, SYNONYMS.TXT, BAD-SCHEMA-NOT-INDEXED-BUT-NORMS.XML, SOLRCONFIG-SCRIPT-UPDATEPROCESSOR.XML, SOLRCONFIG-MASTER.XML, SCHEMA15.XML, SOLRCONFIG-TERMINDEX.XML, SCHEMA-DFR.XML, SCHEMA-CHARFILTERS.XML, BAD-SCHEMA-NOT-INDEXED-BUT-POS.XML, SOLRCONFIG-SLAVE.XML, SCHEMA-NOT-REQUIRED-UNIQUE-KEY.XML, ELEVATE.XML, SCHEMA-SPELLCHECKER.XML, SOLRCONFIG-REPEATER.XML, SOLRCONFIG-HIGHLIGHT.XML, STOPWORDSWRONGENCODING.TXT, SOLRCONFIG_PERF.XML, SCHEMA-SIM.XML, SOLRCONFIG-PROPINJECT.XML, SOLRCONFIG-BASIC.XML, HUNSPELL-TEST.AFF, DA_COMPOUNDDICTIONARY.TXT, SOLRCONFIG-NOCACHE.XML, SOLRCONFIG-QUERYSENDER.XML, SOLRCONFIG-SLAVE1.XML, SCHEMA-NUMERIC.XML, SCHEMA-IB.XML, OLD_SYNONYMS.TXT, SCHEMA-STOP-KEEP.XML]
[junit4:junit4]   2> 787 T7808 oass.SolrIndexSearcher.<init> Opening Searcher@db6306 main
[junit4:junit4]   2> 787 T7808 oass.SolrIndexSearcher.getIndexDir WARNING WARNING: Directory impl does not support setting indexDir: org.apache.lucene.store.MockDirectoryWrapper
[junit4:junit4]   2> 787 T7808 oasu.CommitTracker.<init> Hard AutoCommit: disabled
[junit4:junit4]   2> 787 T7808 oasu.CommitTracker.<init> Soft AutoCommit: disabled
[junit4:junit4]   2> 788 T7808 oashc.QueryElevationComponent.inform Loading QueryElevation from: /mnt/ssd/jenkins/workspace/Lucene-Solr-4.x-Linux/checkout/solr/build/solr-core/test-files/solr/collection1/conf/elevate.xml
[junit4:junit4]   2> 794 T7808 oashc.QueryElevationComponent.inform Loading QueryElevation from: /mnt/ssd/jenkins/workspace/Lucene-Solr-4.x-Linux/checkout/solr/build/solr-core/test-files/solr/collection1/conf/elevate.xml
[junit4:junit4]   2> 800 T7808 oashc.HttpShardHandlerFactory.getParameter Setting socketTimeout to: 0
[junit4:junit4]   2> 801 T7808 oashc.HttpShardHandlerFactory.getParameter Setting urlScheme to: http://
[junit4:junit4]   2> 801 T7808 oashc.HttpShardHandlerFactory.getParameter Setting connTimeout to: 0
[junit4:junit4]   2> 801 T7808 oashc.HttpShardHandlerFactory.getParameter Setting maxConnectionsPerHost to: 20
[junit4:junit4]   2> 801 T7808 oashc.HttpShardHandlerFactory.getParameter Setting corePoolSize to: 0
[junit4:junit4]   2> 802 T7808 oashc.HttpShardHandlerFactory.getParameter Setting maximumPoolSize to: 2147483647
[junit4:junit4]   2> 802 T7808 oashc.HttpShardHandlerFactory.getParameter Setting maxThreadIdleTime to: 5
[junit4:junit4]   2> 802 T7808 oashc.HttpShardHandlerFactory.getParameter Setting sizeOfQueue to: -1
[junit4:junit4]   2> 802 T7808 oashc.HttpShardHandlerFactory.getParameter Setting fairnessPolicy to: false
[junit4:junit4]   2> 803 T7808 oascsi.HttpClientUtil.createClient Creating new http client, config:maxConnectionsPerHost=20&maxConnections=10000&socketTimeout=0&connTimeout=0&retry=false
[junit4:junit4]   2> 805 T7838 oasc.SolrCore.registerSearcher [collection1] Registered new searcher Searcher@db6306 main{StandardDirectoryReader(segments_1:1)}
[junit4:junit4]   2> 805 T7808 oasc.CoreContainer.register registering core: collection1
[junit4:junit4]   2> 805 T7808 oass.SolrDispatchFilter.init user.dir=/mnt/ssd/jenkins/workspace/Lucene-Solr-4.x-Linux/checkout/solr/build/solr-core/test/J1
[junit4:junit4]   2> 806 T7808 oass.SolrDispatchFilter.init SolrDispatchFilter.init() done
[junit4:junit4]   2> 806 T7808 oascsi.HttpClientUtil.createClient Creating new http client, config:maxConnections=128&maxConnectionsPerHost=32&followRedirects=false
[junit4:junit4]   2> 808 T7808 oejs.Server.doStart jetty-8.1.2.v20120308
[junit4:junit4]   2> 809 T7808 oejs.AbstractConnector.doStart Started SocketConnector@0.0.0.0:37845
[junit4:junit4]   2> 810 T7808 oasc.SolrResourceLoader.locateSolrHome JNDI not configured for solr (NoInitialContextEx)
[junit4:junit4]   2> 810 T7808 oasc.SolrResourceLoader.locateSolrHome using system property solr.solr.home: /mnt/ssd/jenkins/workspace/Lucene-Solr-4.x-Linux/checkout/solr/build/solr-core/test-files/solr
[junit4:junit4]   2> 810 T7808 oasc.SolrResourceLoader.<init> new SolrResourceLoader for deduced Solr Home: '/mnt/ssd/jenkins/workspace/Lucene-Solr-4.x-Linux/checkout/solr/build/solr-core/test-files/solr/'
[junit4:junit4]   2> 817 T7808 oass.SolrDispatchFilter.init SolrDispatchFilter.init()
[junit4:junit4]   2> 817 T7808 oasc.SolrResourceLoader.locateSolrHome JNDI not configured for solr (NoInitialContextEx)
[junit4:junit4]   2> 817 T7808 oasc.SolrResourceLoader.locateSolrHome using system property solr.solr.home: /mnt/ssd/jenkins/workspace/Lucene-Solr-4.x-Linux/checkout/solr/build/solr-core/test-files/solr
[junit4:junit4]   2> 818 T7808 oasc.CoreContainer$Initializer.initialize looking for solr.xml: /mnt/ssd/jenkins/workspace/Lucene-Solr-4.x-Linux/checkout/solr/build/solr-core/test-files/solr/solr.xml
[junit4:junit4]   2> 818 T7808 oasc.CoreContainer.<init> New CoreContainer 28764817
[junit4:junit4]   2> 818 T7808 oasc.CoreContainer.load Loading CoreContainer using Solr Home: '/mnt/ssd/jenkins/workspace/Lucene-Solr-4.x-Linux/checkout/solr/build/solr-core/test-files/solr/'
[junit4:junit4]   2> 818 T7808 oasc.SolrResourceLoader.<init> new SolrResourceLoader for directory: '/mnt/ssd/jenkins/workspace/Lucene-Solr-4.x-Linux/checkout/solr/build/solr-core/test-files/solr/'
[junit4:junit4]   2> 827 T7808 oasc.CoreContainer.load Registering Log Listener
[junit4:junit4]   2> 838 T7808 oasc.CoreContainer.create Creating SolrCore 'collection1' using instanceDir: /mnt/ssd/jenkins/workspace/Lucene-Solr-4.x-Linux/checkout/solr/build/solr-core/test-files/solr/collection1
[junit4:junit4]   2> 839 T7808 oasc.SolrResourceLoader.<init> new SolrResourceLoader for directory: '/mnt/ssd/jenkins/workspace/Lucene-Solr-4.x-Linux/checkout/solr/build/solr-core/test-files/solr/collection1/'
[junit4:junit4]   2> 839 T7808 oasc.SolrResourceLoader.replaceClassLoader Adding 'file:/mnt/ssd/jenkins/workspace/Lucene-Solr-4.x-Linux/checkout/solr/build/solr-core/test-files/solr/collection1/lib/README' to classloader
[junit4:junit4]   2> 839 T7808 oasc.SolrResourceLoader.replaceClassLoader Adding 'file:/mnt/ssd/jenkins/workspace/Lucene-Solr-4.x-Linux/checkout/solr/build/solr-core/test-files/solr/collection1/lib/classes/' to classloader
[junit4:junit4]   2> 860 T7808 oasc.SolrConfig.<init> Using Lucene MatchVersion: LUCENE_40
[junit4:junit4]   2> 897 T7808 oasc.SolrConfig.<init> Loaded SolrConfig: solrconfig-elevate.xml
[junit4:junit4]   2> 898 T7808 oass.IndexSchema.readSchema Reading Solr Schema
[junit4:junit4]   2> 900 T7808 oass.IndexSchema.readSchema Schema name=example
[junit4:junit4]   2> 1035 T7808 oass.IndexSchema.readSchema default search field in schema is text
[junit4:junit4]   2> 1037 T7808 oass.IndexSchema.readSchema unique key field: id
[junit4:junit4]   2> 1039 T7808 oasc.SolrCore.<init> [collection1] Opening new SolrCore at /mnt/ssd/jenkins/workspace/Lucene-Solr-4.x-Linux/checkout/solr/build/solr-core/test-files/solr/collection1/, dataDir=./org.apache.solr.handler.component.DistributedQueryElevationComponentTest-1343936005783/shard2/data/
[junit4:junit4]   2> 1039 T7808 oasc.JmxMonitoredMap.<init> JMX monitoring is enabled. Adding Solr mbeans to JMX Server: com.sun.jmx.mbeanserver.JmxMBeanServer@1ce7ceb
[junit4:junit4]   2> 1040 T7808 oasc.SolrCore.getNewIndexDir WARNING New index directory detected: old=null new=./org.apache.solr.handler.component.DistributedQueryElevationComponentTest-1343936005783/shard2/data/index/
[junit4:junit4]   2> 1040 T7808 oasc.SolrCore.initIndex WARNING [collection1] Solr index directory './org.apache.solr.handler.component.DistributedQueryElevationComponentTest-1343936005783/shard2/data/index' doesn't exist. Creating new index...
[junit4:junit4]   2> 1041 T7808 oasc.SolrDeletionPolicy.onCommit SolrDeletionPolicy.onCommit: commits:num=1
[junit4:junit4]   2> 		commit{dir=MockDirWrapper(org.apache.lucene.store.RAMDirectory@18223a6 lockFactory=org.apache.lucene.store.SingleInstanceLockFactory@802bd0),segFN=segments_1,generation=1,filenames=[segments_1]
[junit4:junit4]   2> 1041 T7808 oasc.SolrDeletionPolicy.updateCommits newest commit = 1
[junit4:junit4]   2> 1042 T7808 oasc.RequestHandlers.initHandlersFromConfig created /update: solr.UpdateRequestHandler
[junit4:junit4]   2> 1042 T7808 oasc.RequestHandlers.initHandlersFromConfig created /elevate: org.apache.solr.handler.component.SearchHandler
[junit4:junit4]   2> 1043 T7808 oasc.RequestHandlers.initHandlersFromConfig created /dataElevate: org.apache.solr.handler.component.SearchHandler
[junit4:junit4]   2> 1043 T7808 oashl.XMLLoader.init xsltCacheLifetimeSeconds=60
[junit4:junit4]   2> 1043 T7808 oasc.RequestHandlers.initHandlersFromConfig WARNING no default request handler is registered (either '/select' or 'standard')
[junit4:junit4]   2> 1044 T7808 oasc.SolrCore.initDeprecatedSupport WARNING solrconfig.xml uses deprecated <admin/gettableFiles>, Please update your config to use the ShowFileRequestHandler.
[junit4:junit4]   2> 1045 T7808 oasc.SolrCore.initDeprecatedSupport WARNING adding ShowFileRequestHandler with hidden files: [SCHEMA-PHRASESUGGEST.XML, SOLRCONFIG-SOLR-749.XML, SOLRCONFIG-XINCLUDE.XML, STOPWORDS.TXT, COMPOUNDDICTIONARY.TXT, BAD-SCHEMA-DUP-DYNAMICFIELD.XML, SCHEMA-REQUIRED-FIELDS.XML, BAD-SCHEMA-UNIQUEKEY-MULTIVALUED.XML, BAD-SCHEMA-NOT-INDEXED-BUT-TF.XML, STOP-SNOWBALL.TXT, SCHEMA-LMJELINEKMERCER.XML, SOLRCONFIG-MASTER2.XML, BAD-SCHEMA-DUP-FIELD.XML, FRENCHARTICLES.TXT, BAD-SOLRCONFIG-BOGUS-SCRIPTENGINE-NAME.XML, SCHEMA-BM25.XML, SOLRCONFIG-MERGEPOLICY.XML, BAD-SCHEMA-CODEC-GLOBAL-VS-FT-MISMATCH.XML, SOLRCONFIG_CODEC.XML, CONDITIONAL.UPDATEPROCESSOR.JS, BAD-SCHEMA-ANALYZER-CLASS-AND-NESTED.XML, SCHEMASURROUND.XML, SOLRCONFIG-MASTER3.XML, HYPHENATION.DTD, BAD-SCHEMA-UNIQUEKEY-USES-DEFAULT.XML, BAD-SCHEMA-EXTERNAL-FILEFIELD.XML, XSLT, SOLRCONFIG-CACHING.XML, TRIVIAL.UPDATEPROCESSOR0.JS, SCHEMA-REPLICATION1.XML, BAD-MP-SOLRCONFIG.XML, KEEP-1.TXT, SCHEMA-COPYFIELD-TEST.XML, SOLRCONFIG-SPELLCHECKCOMPONENT.XML, MAPPING-ISOLATIN1ACCENT.TXT, SCHEMA11.XML, SCHEMA_CODEC.XML, SOLRCONFIG-DELPOLICY2.XML, SCHEMA-TRIE.XML, SOLRCONFIG-PHRASESUGGEST.XML, STOP-1.TXT, SCHEMA-BINARYFIELD.XML, BAD_SOLRCONFIG.XML, STOPTYPES-2.TXT, PROTWORDS.TXT, SCHEMA-FOLDING.XML, TRIVIAL.UPDATEPROCESSOR1.JS, SOLRCONFIG-QUERYSENDER-NOQUERY.XML, SOLRCONFIG-ALTDIRECTORY.XML, BAD-SOLRCONFIG-MISSING-SCRIPTFILE.XML, BAD-SOLRCONFIG-INVALID-SCRIPTFILE.XML, WDFTYPES.TXT, SOLRCONFIG-UPDATE-PROCESSOR-CHAINS.XML, SOLRCONFIG-MASTER1.XML, SCHEMA-LUCENEMATCHVERSION.XML, BAD-SCHEMA-OMIT-TF-BUT-NOT-POS.XML, SOLRCONFIG-TLOG.XML, STOPWITHBOM.TXT, SCHEMA12.XML, DA_UTF8.XML, ADDFIELDS.UPDATEPROCESSOR.JS, STEMDICT.TXT, THROW.ERROR.ON.ADD.UPDATEPROCESSOR.JS, SCHEMA-COLLATEFILTER.XML, SOLRCONFIG-ELEVATE.XML, SCHEMA-COLLATE.XML, BAD-SCHEMA-NONTEXT-ANALYZER.XML, SCHEMA-TFIDF.XML, MISSING.FUNCTIONS.UPDATEPROCESSOR.JS, SOLRCONFIG-MASTER1-KEEPONEBACKUP.XML, SOLRCONFIG-BASIC-LUCENEVERSION31.XML, SOLRCONFIG-PROPINJECT-INDEXDEFAULT.XML, MISSLEADING.EXTENSION.UPDATEPROCESSOR.JS.TXT, OPEN-EXCHANGE-RATES.JSON, SOLRCONFIG-TRANSFORMERS.XML, BAD-SCHEMA-DUP-FIELDTYPE.XML, SOLRCONFIG-ENABLEPLUGIN.XML, SCHEMA-LMDIRICHLET.XML, HUNSPELL-TEST.DIC, SOLRCONFIG-REQHANDLER.INCL, SOLRCONFIG-SPELLCHECKER.XML, SOLRCONFIG-LAZYWRITER.XML, SOLRCONFIG-FUNCTIONQUERY.XML, SOLRCONFIG-NATIVELOCK.XML, SOLRCONFIG-SOLCOREPROPERTIES.XML, BAD-SCHEMA-UNIQUEKEY-IS-COPYFIELD-DEST.XML, SCHEMA-REPLICATION2.XML, SOLRCONFIG-DELPOLICY1.XML, CURRENCY.XML, KEEP-2.TXT, SCHEMA-MINIMAL.XML, SCHEMA-REVERSED.XML, SCHEMA.XML, SOLRCONFIG-SIMPLELOCK.XML, PHRASESUGGEST.TXT, BAD-SCHEMA-SIM-GLOBAL-VS-FT-MISMATCH.XML, STOP-2.TXT, STOPTYPES-1.TXT, SYNONYMS.TXT, BAD-SCHEMA-NOT-INDEXED-BUT-NORMS.XML, SOLRCONFIG-SCRIPT-UPDATEPROCESSOR.XML, SOLRCONFIG-MASTER.XML, SCHEMA15.XML, SOLRCONFIG-TERMINDEX.XML, SCHEMA-DFR.XML, SCHEMA-CHARFILTERS.XML, BAD-SCHEMA-NOT-INDEXED-BUT-POS.XML, SOLRCONFIG-SLAVE.XML, SCHEMA-NOT-REQUIRED-UNIQUE-KEY.XML, ELEVATE.XML, SCHEMA-SPELLCHECKER.XML, SOLRCONFIG-REPEATER.XML, SOLRCONFIG-HIGHLIGHT.XML, STOPWORDSWRONGENCODING.TXT, SOLRCONFIG_PERF.XML, SCHEMA-SIM.XML, SOLRCONFIG-PROPINJECT.XML, SOLRCONFIG-BASIC.XML, HUNSPELL-TEST.AFF, DA_COMPOUNDDICTIONARY.TXT, SOLRCONFIG-NOCACHE.XML, SOLRCONFIG-QUERYSENDER.XML, SOLRCONFIG-SLAVE1.XML, SCHEMA-NUMERIC.XML, SCHEMA-IB.XML, OLD_SYNONYMS.TXT, SCHEMA-STOP-KEEP.XML]
[junit4:junit4]   2> 1047 T7808 oass.SolrIndexSearcher.<init> Opening Searcher@36bf84 main
[junit4:junit4]   2> 1048 T7808 oass.SolrIndexSearcher.getIndexDir WARNING WARNING: Directory impl does not support setting indexDir: org.apache.lucene.store.MockDirectoryWrapper
[junit4:junit4]   2> 1048 T7808 oasu.CommitTracker.<init> Hard AutoCommit: disabled
[junit4:junit4]   2> 1048 T7808 oasu.CommitTracker.<init> Soft AutoCommit: disabled
[junit4:junit4]   2> 1049 T7808 oashc.QueryElevationComponent.inform Loading QueryElevation from: /mnt/ssd/jenkins/workspace/Lucene-Solr-4.x-Linux/checkout/solr/build/solr-core/test-files/solr/collection1/conf/elevate.xml
[junit4:junit4]   2> 1055 T7808 oashc.QueryElevationComponent.inform Loading QueryElevation from: /mnt/ssd/jenkins/workspace/Lucene-Solr-4.x-Linux/checkout/solr/build/solr-core/test-files/solr/collection1/conf/elevate.xml
[junit4:junit4]   2> 1061 T7808 oashc.HttpShardHandlerFactory.getParameter Setting socketTimeout to: 0
[junit4:junit4]   2> 1062 T7808 oashc.HttpShardHandlerFactory.getParameter Setting urlScheme to: http://
[junit4:junit4]   2> 1062 T7808 oashc.HttpShardHandlerFactory.getParameter Setting connTimeout to: 0
[junit4:junit4]   2> 1062 T7808 oashc.HttpShardHandlerFactory.getParameter Setting maxConnectionsPerHost to: 20
[junit4:junit4]   2> 1063 T7808 oashc.HttpShardHandlerFactory.getParameter Setting corePoolSize to: 0
[junit4:junit4]   2> 1063 T7808 oashc.HttpShardHandlerFactory.getParameter Setting maximumPoolSize to: 2147483647
[junit4:junit4]   2> 1063 T7808 oashc.HttpShardHandlerFactory.getParameter Setting maxThreadIdleTime to: 5
[junit4:junit4]   2> 1063 T7808 oashc.HttpShardHandlerFactory.getParameter Setting sizeOfQueue to: -1
[junit4:junit4]   2> 1063 T7808 oashc.HttpShardHandlerFactory.getParameter Setting fairnessPolicy to: false
[junit4:junit4]   2> 1064 T7808 oascsi.HttpClientUtil.createClient Creating new http client, config:maxConnectionsPerHost=20&maxConnections=10000&socketTimeout=0&connTimeout=0&retry=false
[junit4:junit4]   2> 1066 T7848 oasc.SolrCore.registerSearcher [collection1] Registered new searcher Searcher@36bf84 main{StandardDirectoryReader(segments_1:1)}
[junit4:junit4]   2> 1066 T7808 oasc.CoreContainer.register registering core: collection1
[junit4:junit4]   2> 1067 T7808 oass.SolrDispatchFilter.init user.dir=/mnt/ssd/jenkins/workspace/Lucene-Solr-4.x-Linux/checkout/solr/build/solr-core/test/J1
[junit4:junit4]   2> 1067 T7808 oass.SolrDispatchFilter.init SolrDispatchFilter.init() done
[junit4:junit4]   2> 1067 T7808 oascsi.HttpClientUtil.createClient Creating new http client, config:maxConnections=128&maxConnectionsPerHost=32&followRedirects=false
[junit4:junit4]   2> ASYNC  NEW_CORE C102 name=collection1 org.apache.solr.core.SolrCore@190de39
[junit4:junit4]   2> 1073 T7811 C102 oasu.DirectUpdateHandler2.deleteAll [collection1] REMOVING ALL DOCUMENTS FROM INDEX
[junit4:junit4]   2> 1074 T7811 C102 oasc.SolrDeletionPolicy.onInit SolrDeletionPolicy.onInit: commits:num=1
[junit4:junit4]   2> 		commit{dir=MockDirWrapper(org.apache.lucene.store.NIOFSDirectory@/mnt/ssd/jenkins/workspace/Lucene-Solr-4.x-Linux/checkout/solr/build/solr-core/test/J1/index7229072296tmp lockFactory=org.apache.lucene.store.SingleInstanceLockFactory@5118f0),segFN=segments_1,generation=1,filenames=[segments_1]
[junit4:junit4]   2> 1075 T7811 C102 oasc.SolrDeletionPolicy.updateCommits newest commit = 1
[junit4:junit4]   2> 1075 T7811 C102 UPDATE [collection1] webapp=/solr path=/update params={version=2&wt=javabin} {deleteByQuery=*:*} 0 3
[junit4:junit4]   2> ASYNC  NEW_CORE C103 name=collection1 org.apache.solr.core.SolrCore@afe7d4
[junit4:junit4]   2> 1080 T7821 C103 oasu.DirectUpdateHandler2.deleteAll [collection1] REMOVING ALL DOCUMENTS FROM INDEX
[junit4:junit4]   2> 1082 T7821 C103 oasc.SolrDeletionPolicy.onInit SolrDeletionPolicy.onInit: commits:num=1
[junit4:junit4]   2> 		commit{dir=MockDirWrapper(org.apache.lucene.store.SimpleFSDirectory@/mnt/ssd/jenkins/workspace/Lucene-Solr-4.x-Linux/checkout/solr/build/solr-core/test/J1/index7229072297tmp lockFactory=org.apache.lucene.store.SingleInstanceLockFactory@1d9876f),segFN=segments_1,generation=1,filenames=[segments_1]
[junit4:junit4]   2> 1082 T7821 C103 oasc.SolrDeletionPolicy.updateCommits newest commit = 1
[junit4:junit4]   2> 1083 T7821 C103 UPDATE [collection1] webapp=/solr path=/update params={version=2&wt=javabin} {deleteByQuery=*:*} 0 3
[junit4:junit4]   2> ASYNC  NEW_CORE C104 name=collection1 org.apache.solr.core.SolrCore@107d154
[junit4:junit4]   2> 1087 T7831 C104 oasu.DirectUpdateHandler2.deleteAll [collection1] REMOVING ALL DOCUMENTS FROM INDEX
[junit4:junit4]   2> 1089 T7831 C104 oasc.SolrDeletionPolicy.onInit SolrDeletionPolicy.onInit: commits:num=1
[junit4:junit4]   2> 		commit{dir=MockDirWrapper(org.apache.lucene.store.RAMDirectory@400326 lockFactory=org.apache.lucene.store.SingleInstanceLockFactory@740e31),segFN=segments_1,generation=1,filenames=[segments_1]
[junit4:junit4]   2> 1089 T7831 C104 oasc.SolrDeletionPolicy.updateCommits newest commit = 1
[junit4:junit4]   2> 1090 T7831 C104 UPDATE [collection1] webapp=/solr path=/update params={version=2&wt=javabin} {deleteByQuery=*:*} 0 3
[junit4:junit4]   2> ASYNC  NEW_CORE C105 name=collection1 org.apache.solr.core.SolrCore@1eb4ecb
[junit4:junit4]   2> 1093 T7841 C105 oasu.DirectUpdateHandler2.deleteAll [collection1] REMOVING ALL DOCUMENTS FROM INDEX
[junit4:junit4]   2> 1094 T7841 C105 oasc.SolrDeletionPolicy.onInit SolrDeletionPolicy.onInit: commits:num=1
[junit4:junit4]   2> 		commit{dir=MockDirWrapper(org.apache.lucene.store.RAMDirectory@18223a6 lockFactory=org.apache.lucene.store.SingleInstanceLockFactory@802bd0),segFN=segments_1,generation=1,filenames=[segments_1]
[junit4:junit4]   2> 1095 T7841 C105 oasc.SolrDeletionPolicy.updateCommits newest commit = 1
[junit4:junit4]   2> 1095 T7841 C105 UPDATE [collection1] webapp=/solr path=/update params={version=2&wt=javabin} {deleteByQuery=*:*} 0 2
[junit4:junit4]   2> 1097 T7811 C102 UPDATE [collection1] webapp=/solr path=/update params={version=2&wt=javabin} {add=[1]} 0 0
[junit4:junit4]   2> 1100 T7821 C103 UPDATE [collection1] webapp=/solr path=/update params={version=2&wt=javabin} {add=[1]} 0 1
[junit4:junit4]   2> 1102 T7811 C102 UPDATE [collection1] webapp=/solr path=/update params={version=2&wt=javabin} {add=[2]} 0 0
[junit4:junit4]   2> 1104 T7831 C104 UPDATE [collection1] webapp=/solr path=/update params={version=2&wt=javabin} {add=[2]} 0 1
[junit4:junit4]   2> 1106 T7811 C102 UPDATE [collection1] webapp=/solr path=/update params={version=2&wt=javabin} {add=[3]} 0 0
[junit4:junit4]   2> 1108 T7841 C105 UPDATE [collection1] webapp=/solr path=/update params={version=2&wt=javabin} {add=[3]} 0 1
[junit4:junit4]   2> 1109 T7811 C102 UPDATE [collection1] webapp=/solr path=/update params={version=2&wt=javabin} {add=[4]} 0 0
[junit4:junit4]   2> 1111 T7821 C103 UPDATE [collection1] webapp=/solr path=/update params={version=2&wt=javabin} {add=[4]} 0 0
[junit4:junit4]   2> 1113 T7811 C102 UPDATE [collection1] webapp=/solr path=/update params={version=2&wt=javabin} {add=[5]} 0 0
[junit4:junit4]   2> 1115 T7831 C104 UPDATE [collection1] webapp=/solr path=/update params={version=2&wt=javabin} {add=[5]} 0 0
[junit4:junit4]   2> 1117 T7811 C102 UPDATE [collection1] webapp=/solr path=/update params={version=2&wt=javabin} {add=[6]} 0 0
[junit4:junit4]   2> 1118 T7841 C105 UPDATE [collection1] webapp=/solr path=/update params={version=2&wt=javabin} {add=[6]} 0 0
[junit4:junit4]   2> 1120 T7811 C102 UPDATE [collection1] webapp=/solr path=/update params={version=2&wt=javabin} {add=[7]} 0 0
[junit4:junit4]   2> 1122 T7841 C105 UPDATE [collection1] webapp=/solr path=/update params={version=2&wt=javabin} {add=[7]} 0 0
[junit4:junit4]   2> 1123 T7811 C102 oasu.DirectUpdateHandler2.commit start commit{flags=0,_version_=0,optimize=false,openSearcher=true,waitSearcher=true,expungeDeletes=false,softCommit=false}
[junit4:junit4]   2> 1125 T7811 C102 oasc.SolrDeletionPolicy.onCommit SolrDeletionPolicy.onCommit: commits:num=2
[junit4:junit4]   2> 		commit{dir=MockDirWrapper(org.apache.lucene.store.NIOFSDirectory@/mnt/ssd/jenkins/workspace/Lucene-Solr-4.x-Linux/checkout/solr/build/solr-core/test/J1/index7229072296tmp lockFactory=org.apache.lucene.store.SingleInstanceLockFactory@5118f0),segFN=segments_1,generation=1,filenames=[segments_1]
[junit4:junit4]   2> 		commit{dir=MockDirWrapper(org.apache.lucene.store.NIOFSDirectory@/mnt/ssd/jenkins/workspace/Lucene-Solr-4.x-Linux/checkout/solr/build/solr-core/test/J1/index7229072296tmp lockFactory=org.apache.lucene.store.SingleInstanceLockFactory@5118f0),segFN=segments_2,generation=2,filenames=[_0_nrm.cfs, _0.fnm, _0_Pulsing40_0.tim, _0_Pulsing40_0.frq, _0.fdt, _0.fdx, _0_nrm.cfe, _0.si, _0_Pulsing40_0.tip, segments_2, _0_Memory_0.ram, _0_Pulsing40_0.prx]
[junit4:junit4]   2> 1126 T7811 C102 oasc.SolrDeletionPolicy.updateCommits newest commit = 2
[junit4:junit4]   2> 1127 T7811 C102 oass.SolrIndexSearcher.<init> Opening Searcher@2d52f5 main
[junit4:junit4]   2> 1128 T7811 C102 oass.SolrIndexSearcher.getIndexDir WARNING WARNING: Directory impl does not support setting indexDir: org.apache.lucene.store.MockDirectoryWrapper
[junit4:junit4]   2> 1129 T7811 C102 oasu.DirectUpdateHandler2.commit end_commit_flush
[junit4:junit4]   2> 1129 T7818 oasc.SolrCore.registerSearcher [collection1] Registered new searcher Searcher@2d52f5 main{StandardDirectoryReader(segments_2:4 _0(4.0.0.1):C7)}
[junit4:junit4]   2> 1129 T7811 C102 UPDATE [collection1] webapp=/solr path=/update params={waitSearcher=true&version=2&softCommit=false&wt=javabin&commit=true} {commit=} 0 6
[junit4:junit4]   2> 1131 T7821 C103 oasu.DirectUpdateHandler2.commit start commit{flags=0,_version_=0,optimize=false,openSearcher=true,waitSearcher=true,expungeDeletes=false,softCommit=false}
[junit4:junit4]   2> 1133 T7821 C103 oasc.SolrDeletionPolicy.onCommit SolrDeletionPolicy.onCommit: commits:num=2
[junit4:junit4]   2> 		commit{dir=MockDirWrapper(org.apache.lucene.store.SimpleFSDirectory@/mnt/ssd/jenkins/workspace/Lucene-Solr-4.x-Linux/checkout/solr/build/solr-core/test/J1/index7229072297tmp lockFactory=org.apache.lucene.store.SingleInstanceLockFactory@1d9876f),segFN=segments_1,generation=1,filenames=[segments_1]
[junit4:junit4]   2> 		commit{dir=MockDirWrapper(org.apache.lucene.store.SimpleFSDirectory@/mnt/ssd/jenkins/workspace/Lucene-Solr-4.x-Linux/checkout/solr/build/solr-core/test/J1/index7229072297tmp lockFactory=org.apache.lucene.store.SingleInstanceLockFactory@1d9876f),segFN=segments_2,generation=2,filenames=[_0_nrm.cfs, _0.fnm, _0_Pulsing40_0.tim, _0_Pulsing40_0.frq, _0.fdt, _0.fdx, _0_nrm.cfe, _0.si, _0_Pulsing40_0.tip, segments_2, _0_Memory_0.ram, _0_Pulsing40_0.prx]
[junit4:junit4]   2> 1133 T7821 C103 oasc.SolrDeletionPolicy.updateCommits newest commit = 2
[junit4:junit4]   2> 1135 T7821 C103 oass.SolrIndexSearcher.<init> Opening Searcher@c00ed1 main
[junit4:junit4]   2> 1135 T7821 C103 oass.SolrIndexSearcher.getIndexDir WARNING WARNING: Directory impl does not support setting indexDir: org.apache.lucene.store.MockDirectoryWrapper
[junit4:junit4]   2> 1136 T7821 C103 oasu.DirectUpdateHandler2.commit end_commit_flush
[junit4:junit4]   2> 1136 T7828 oasc.SolrCore.registerSearcher [collection1] Registered new searcher Searcher@c00ed1 main{StandardDirectoryReader(segments_2:4 _0(4.0.0.1):C2)}
[junit4:junit4]   2> 1136 T7821 C103 UPDATE [collection1] webapp=/solr path=/update params={waitSearcher=true&version=2&softCommit=false&wt=javabin&commit=true} {commit=} 0 5
[junit4:junit4]   2> 1138 T7831 C104 oasu.DirectUpdateHandler2.commit start commit{flags=0,_version_=0,optimize=false,openSearcher=true,waitSearcher=true,expungeDeletes=false,softCommit=false}
[junit4:junit4]   2> 1140 T7831 C104 oasc.SolrDeletionPolicy.onCommit SolrDeletionPolicy.onCommit: commits:num=2
[junit4:junit4]   2> 		commit{dir=MockDirWrapper(org.apache.lucene.store.RAMDirectory@400326 lockFactory=org.apache.lucene.store.SingleInstanceLockFactory@740e31),segFN=segments_1,generation=1,filenames=[segments_1]
[junit4:junit4]   2> 		commit{dir=MockDirWrapper(org.apache.lucene.store.RAMDirectory@400326 lockFactory=org.apache.lucene.store.SingleInstanceLockFactory@740e31),segFN=segments_2,generation=2,filenames=[_0_nrm.cfs, _0.fnm, _0_Pulsing40_0.tim, _0_Pulsing40_0.frq, _0.fdt, _0.fdx, _0_nrm.cfe, _0.si, _0_Pulsing40_0.tip, segments_2, _0_Memory_0.ram, _0_Pulsing40_0.prx]
[junit4:junit4]   2> 1141 T7831 C104 oasc.SolrDeletionPolicy.updateCommits newest commit = 2
[junit4:junit4]   2> 1142 T7831 C104 oass.SolrIndexSearcher.<init> Opening Searcher@13b4f06 main
[junit4:junit4]   2> 1142 T7831 C104 oass.SolrIndexSearcher.getIndexDir WARNING WARNING: Directory impl does not support setting indexDir: org.apache.lucene.store.MockDirectoryWrapper
[junit4:junit4]   2> 1142 T7831 C104 oasu.DirectUpdateHandler2.commit end_commit_flush
[junit4:junit4]   2> 1143 T7838 oasc.SolrCore.registerSearcher [collection1] Registered new searcher Searcher@13b4f06 main{StandardDirectoryReader(segments_2:4 _0(4.0.0.1):C2)}
[junit4:junit4]   2> 1143 T7831 C104 UPDATE [collection1] webapp=/solr path=/update params={waitSearcher=true&version=2&softCommit=false&wt=javabin&commit=true} {commit=} 0 5
[junit4:junit4]   2> 1145 T7841 C105 oasu.DirectUpdateHandler2.commit start commit{flags=0,_version_=0,optimize=false,openSearcher=true,waitSearcher=true,expungeDeletes=false,softCommit=false}
[junit4:junit4]   2> 1146 T7841 C105 oasc.SolrDeletionPolicy.onCommit SolrDeletionPolicy.onCommit: commits:num=2
[junit4:junit4]   2> 		commit{dir=MockDirWrapper(org.apache.lucene.store.RAMDirectory@18223a6 lockFactory=org.apache.lucene.store.SingleInstanceLockFactory@802bd0),segFN=segments_1,generation=1,filenames=[segments_1]
[junit4:junit4]   2> 		commit{dir=MockDirWrapper(org.apache.lucene.store.RAMDirectory@18223a6 lockFactory=org.apache.lucene.store.SingleInstanceLockFactory@802bd0),segFN=segments_2,generation=2,filenames=[_0_nrm.cfs, _0.fnm, _0_Pulsing40_0.tim, _0_Pulsing40_0.frq, _0.fdt, _0.fdx, _0_nrm.cfe, _0.si, _0_Pulsing40_0.tip, segments_2, _0_Memory_0.ram, _0_Pulsing40_0.prx]
[junit4:junit4]   2> 1146 T7841 C105 oasc.SolrDeletionPolicy.updateCommits newest commit = 2
[junit4:junit4]   2> 1147 T7841 C105 oass.SolrIndexSearcher.<init> Opening Searcher@a92ddd main
[junit4:junit4]   2> 1147 T7841 C105 oass.SolrIndexSearcher.getIndexDir WARNING WARNING: Directory impl does not support setting indexDir: org.apache.lucene.store.MockDirectoryWrapper
[junit4:junit4]   2> 1147 T7841 C105 oasu.DirectUpdateHandler2.commit end_commit_flush
[junit4:junit4]   2> 1148 T7848 oasc.SolrCore.registerSearcher [collection1] Registered new searcher Searcher@a92ddd main{StandardDirectoryReader(segments_2:4 _0(4.0.0.1):C3)}
[junit4:junit4]   2> 1148 T7841 C105 UPDATE [collection1] webapp=/solr path=/update params={waitSearcher=true&version=2&softCommit=false&wt=javabin&commit=true} {commit=} 0 3
[junit4:junit4]   2> 1151 T7811 C102 REQ [collection1] webapp=/solr path=/elevate params={sort=id+desc&rows=500&qt=/elevate&shards.qt=/elevate&version=2&fl=id,+score,+[elevated]&q=*:*&wt=javabin&distrib=false} hits=7 status=0 QTime=1 
[junit4:junit4]   2> 1155 T7832 C104 REQ [collection1] webapp=/solr path=/elevate params={sort=id+desc&qt=/elevate&isShard=true&fl=id,score&q=*:*&fsv=true&start=0&NOW=1343936006934&rows=500&shards.qt=/elevate&version=2&shard.url=localhost:55198/solr&wt=javabin&distrib=false} hits=2 status=0 QTime=0 
[junit4:junit4]   2> 1155 T7842 C105 REQ [collection1] webapp=/solr path=/elevate params={sort=id+desc&qt=/elevate&isShard=true&fl=id,score&q=*:*&fsv=true&start=0&NOW=1343936006934&rows=500&shards.qt=/elevate&version=2&shard.url=localhost:37845/solr&wt=javabin&distrib=false} hits=3 status=0 QTime=0 
[junit4:junit4]   2> 1155 T7822 C103 REQ [collection1] webapp=/solr path=/elevate params={sort=id+desc&qt=/elevate&isShard=true&fl=id,score&q=*:*&fsv=true&start=0&NOW=1343936006934&rows=500&shards.qt=/elevate&version=2&shard.url=localhost:43455/solr&wt=javabin&distrib=false} hits=2 status=0 QTime=0 
[junit4:junit4]   2> 1158 T7822 C103 REQ [collection1] webapp=/solr path=/elevate params={qt=/elevate&ids=1.0,4.0&fl=id,+score,+[elevated]&isShard=true&q=*:*&rows=500&NOW=1343936006934&shards.qt=/elevate&version=2&shard.url=localhost:43455/solr&wt=javabin&distrib=false} status=0 QTime=0 
[junit4:junit4]   2> 1158 T7842 C105 REQ [collection1] webapp=/solr path=/elevate params={qt=/elevate&ids=7.0,6.0,3.0&fl=id,+score,+[elevated]&isShard=true&q=*:*&rows=500&NOW=1343936006934&shards.qt=/elevate&version=2&shard.url=localhost:37845/solr&wt=javabin&distrib=false} status=0 QTime=0 
[junit4:junit4]   2> 1158 T7832 C104 REQ [collection1] webapp=/solr path=/elevate params={qt=/elevate&ids=5.0,2.0&fl=id,+score,+[elevated]&isShard=true&q=*:*&rows=500&NOW=1343936006934&shards.qt=/elevate&version=2&shard.url=localhost:55198/solr&wt=javabin&distrib=false} status=0 QTime=0 
[junit4:junit4]   2> 1158 T7831 C104 REQ [collection1] webapp=/solr path=/elevate params={sort=id+desc&rows=500&qt=/elevate&shards.qt=/elevate&version=2&fl=id,+score,+[elevated]&q=*:*&wt=javabin&shards=localhost:43455/solr,localhost:55198/solr,localhost:37845/solr} status=0 QTime=5 
[junit4:junit4]   2> 1159 T7808 oas.BaseDistributedSearchTestCase.compareResponses SEVERE Mismatched responses:
[junit4:junit4]   2> 	{responseHeader={status=0,QTime=5,params={sort=id desc,rows=500,qt=/elevate,shards.qt=/elevate,version=2,fl=id, score, [elevated],q=*:*,wt=javabin,shards=localhost:43455/solr,localhost:55198/solr,localhost:37845/solr}},response={numFound=7,start=0,maxScore=1.0,docs=[SolrDocument{id=7.0, [elevated]=false, score=1.0}, SolrDocument{id=6.0, [elevated]=false, score=1.0}, SolrDocument{id=5.0, [elevated]=false, score=1.0}, SolrDocument{id=4.0, [elevated]=false, score=1.0}, SolrDocument{id=3.0, [elevated]=false, score=1.0}, SolrDocument{id=2.0, [elevated]=false, score=1.0}, SolrDocument{id=1.0, [elevated]=false, score=1.0}]}}
[junit4:junit4]   2> 	{responseHeader={status=0,QTime=1,params={sort=id desc,rows=500,qt=/elevate,shards.qt=/elevate,version=2,fl=id, score, [elevated],q=*:*,wt=javabin,distrib=false}},response={numFound=7,start=0,maxScore=1.0,docs=[SolrDocument{id=7.0, score=1.0, [elevated]=false}, SolrDocument{id=6.0, score=1.0, [elevated]=false}, SolrDocument{id=5.0, score=1.0, [elevated]=false}, SolrDocument{id=4.0, score=1.0, [elevated]=false}, SolrDocument{id=3.0, score=1.0, [elevated]=false}, SolrDocument{id=2.0, score=1.0, [elevated]=false}, SolrDocument{id=1.0, score=1.0, [elevated]=false}]}}
[junit4:junit4]   2> 1161 T7808 oasc.CoreContainer.shutdown Shutting down CoreContainer instance=21597628
[junit4:junit4]   2> 1162 T7808 oasc.SolrCore.close [collection1]  CLOSING SolrCore org.apache.solr.core.SolrCore@190de39
[junit4:junit4]   2> 1163 T7808 oasc.SolrCore.closeSearcher [collection1] Closing main searcher on request.
[junit4:junit4]   2> 1163 T7808 oasu.DirectUpdateHandler2.close closing DirectUpdateHandler2{commits=1,autocommits=0,soft autocommits=0,optimizes=0,rollbacks=0,expungeDeletes=0,docsPending=0,adds=0,deletesById=0,deletesByQuery=0,errors=0,cumulative_adds=7,cumulative_deletesById=0,cumulative_deletesByQuery=1,cumulative_errors=0}
[junit4:junit4]   2> 1166 T7808 oejsh.ContextHandler.doStop stopped o.e.j.s.ServletContextHandler{/solr,null}
[junit4:junit4]   2> 1217 T7808 oasc.CoreContainer.shutdown Shutting down CoreContainer instance=31813524
[junit4:junit4]   2> 1218 T7808 oasc.SolrCore.close [collection1]  CLOSING SolrCore org.apache.solr.core.SolrCore@afe7d4
[junit4:junit4]   2> 1218 T7808 oasc.SolrCore.closeSearcher [collection1] Closing main searcher on request.
[junit4:junit4]   2> 1219 T7808 oasu.DirectUpdateHandler2.close closing DirectUpdateHandler2{commits=1,autocommits=0,soft autocommits=0,optimizes=0,rollbacks=0,expungeDeletes=0,docsPending=0,adds=0,deletesById=0,deletesByQuery=0,errors=0,cumulative_adds=2,cumulative_deletesById=0,cumulative_deletesByQuery=1,cumulative_errors=0}
[junit4:junit4]   2> 1222 T7808 oejsh.ContextHandler.doStop stopped o.e.j.s.ServletContextHandler{/solr,null}
[junit4:junit4]   2> 1273 T7808 oasc.CoreContainer.shutdown Shutting down CoreContainer instance=4157708
[junit4:junit4]   2> 1274 T7808 oasc.SolrCore.close [collection1]  CLOSING SolrCore org.apache.solr.core.SolrCore@107d154
[junit4:junit4]   2> 1275 T7808 oasc.SolrCore.closeSearcher [collection1] Closing main searcher on request.
[junit4:junit4]   2> 1275 T7808 oasu.DirectUpdateHandler2.close closing DirectUpdateHandler2{commits=1,autocommits=0,soft autocommits=0,optimizes=0,rollbacks=0,expungeDeletes=0,docsPending=0,adds=0,deletesById=0,deletesByQuery=0,errors=0,cumulative_adds=2,cumulative_deletesById=0,cumulative_deletesByQuery=1,cumulative_errors=0}
[junit4:junit4]   2> 1277 T7808 oejsh.ContextHandler.doStop stopped o.e.j.s.ServletContextHandler{/solr,null}
[junit4:junit4]   2> 1330 T7808 oasc.CoreContainer.shutdown Shutting down CoreContainer instance=28764817
[junit4:junit4]   2> 1330 T7808 oasc.SolrCore.close [collection1]  CLOSING SolrCore org.apache.solr.core.SolrCore@1eb4ecb
[junit4:junit4]   2> 1331 T7808 oasc.SolrCore.closeSearcher [collection1] Closing main searcher on request.
[junit4:junit4]   2> 1331 T7808 oasu.DirectUpdateHandler2.close closing DirectUpdateHandler2{commits=1,autocommits=0,soft autocommits=0,optimizes=0,rollbacks=0,expungeDeletes=0,docsPending=0,adds=0,deletesById=0,deletesByQuery=0,errors=0,cumulative_adds=3,cumulative_deletesById=0,cumulative_deletesByQuery=1,cumulative_errors=0}
[junit4:junit4]   2> 1334 T7808 oejsh.ContextHandler.doStop stopped o.e.j.s.ServletContextHandler{/solr,null}
[junit4:junit4]   2> 1385 T7808 oas.SolrTestCaseJ4.tearDown ###Ending testDistribSearch
[junit4:junit4]   2> NOTE: reproduce with: ant test  -Dtestcase=DistributedQueryElevationComponentTest -Dtests.method=testDistribSearch -Dtests.seed=B404022ADB1E941A -Dtests.multiplier=3 -Dtests.slow=true -Dtests.locale=ko -Dtests.timezone=Asia/Ujung_Pandang -Dtests.file.encoding=US-ASCII
[junit4:junit4]   2>
[junit4:junit4]    > (@AfterClass output)
[junit4:junit4]   2> 1463 T7808 oas.SolrTestCaseJ4.deleteCore ###deleteCore
[junit4:junit4]   2> NOTE: test params are: codec=Lucene40: {text=Pulsing40(freqCutoff=19 minBlockSize=95 maxBlockSize=253), id=PostingsFormat(name=Memory doPackFST= true), field_t=PostingsFormat(name=Memory doPackFST= true), int_i=Pulsing40(freqCutoff=19 minBlockSize=95 maxBlockSize=253), plow_t=Pulsing40(freqCutoff=19 minBlockSize=95 maxBlockSize=253)}, sim=DefaultSimilarity, locale=ko, timezone=Asia/Ujung_Pandang
[junit4:junit4]   2> NOTE: Linux 3.2.0-27-generic i386/Oracle Corporation 1.8.0-ea (32-bit)/cpus=8,threads=1,free=39004696,total=264503296
[junit4:junit4]   2> NOTE: All tests run in this JVM: [TestQueryTypes, TestGroupingSearch, TestSolrDeletionPolicy2, QueryParsingTest, TestDocSet, TestTrie, RequiredFieldsTest, CoreContainerCoreInitFailuresTest, SuggesterTest, CloudStateUpdateTest, QueryElevationComponentTest, CircularListTest, TestPhraseSuggestions, DebugComponentTest, TestFoldingMultitermQuery, TestArbitraryIndexDir, DocumentBuilderTest, TestMergePolicyConfig, PrimitiveFieldTypeTest, TestDFRSimilarityFactory, TestCodecSupport, SolrIndexConfigTest, TestRealTimeGet, FieldMutatingUpdateProcessorTest, TestSolrDeletionPolicy1, LukeRequestHandlerTest, TestPropInjectDefaults, SyncSliceTest, TestSolrQueryParser, TimeZoneUtilsTest, UUIDFieldTest, SuggesterWFSTTest, SpellCheckComponentTest, OutputWriterTest, FileUtilsTest, URLClassifyProcessorTest, TestOmitPositions, HighlighterTest, TestFunctionQuery, TestCSVResponseWriter, BasicZkTest, DirectUpdateHandlerTest, SuggesterTSTTest, StatsComponentTest, ZkNodePropsTest, EchoParamsTest, SpellCheckCollatorTest, TestCSVLoader, ShowFileRequestHandlerTest, FullSolrCloudTest, TestReversedWildcardFilterFactory, SoftAutoCommitTest, TestUpdate, TestSuggestSpellingConverter, MultiTermTest, OverseerTest, RecoveryZkTest, TestReplicationHandler, ZkControllerTest, TestDistributedGrouping, TestHashPartitioner, TestJoin, DistributedQueryElevationComponentTest]
[junit4:junit4]   2> 
[junit4:junit4] Completed on J1 in 1.48s, 1 test, 1 failure <<< FAILURES!

[...truncated 238 lines...]
BUILD FAILED
/mnt/ssd/jenkins/workspace/Lucene-Solr-4.x-Linux/checkout/build.xml:29: The following error occurred while executing this line:
/mnt/ssd/jenkins/workspace/Lucene-Solr-4.x-Linux/checkout/solr/build.xml:144: The following error occurred while executing this line:
/mnt/ssd/jenkins/workspace/Lucene-Solr-4.x-Linux/checkout/lucene/module-build.xml:62: The following error occurred while executing this line:
/mnt/ssd/jenkins/workspace/Lucene-Solr-4.x-Linux/checkout/lucene/common-build.xml:1095: The following error occurred while executing this line:
/mnt/ssd/jenkins/workspace/Lucene-Solr-4.x-Linux/checkout/lucene/common-build.xml:790: There were test failures: 224 suites, 903 tests, 1 failure, 5 ignored

Total time: 20 minutes 18 seconds
Build step 'Execute shell' marked build as failure
Archiving artifacts
Recording test results
Email was triggered for: Failure
Sending email for trigger: Failure



Mime
View raw message