lucene-dev mailing list archives

Site index · List index
Message view « Date » · « Thread »
Top « Date » · « Thread »
From Policeman Jenkins Server <jenk...@sd-datasolutions.de>
Subject [JENKINS] Lucene-Solr-trunk-Linux (32bit/jdk1.8.0-ea-b49) - Build # 127 - Failure!
Date Fri, 03 Aug 2012 03:03:20 GMT
Build: http://jenkins.sd-datasolutions.de/job/Lucene-Solr-trunk-Linux/127/
Java: 32bit/jdk1.8.0-ea-b49 -server -XX:+UseSerialGC

1 tests failed.
REGRESSION:  org.apache.solr.handler.component.DistributedQueryElevationComponentTest.testDistribSearch

Error Message:
.responseHeader.params.size()==9,9skipped=5,4

Stack Trace:
junit.framework.AssertionFailedError: .responseHeader.params.size()==9,9skipped=5,4
	at __randomizedtesting.SeedInfo.seed([5F02A6BB63B4316E:DEE428A314EB5152]:0)
	at junit.framework.Assert.fail(Assert.java:50)
	at org.apache.solr.BaseDistributedSearchTestCase.compareResponses(BaseDistributedSearchTestCase.java:670)
	at org.apache.solr.BaseDistributedSearchTestCase.query(BaseDistributedSearchTestCase.java:392)
	at org.apache.solr.handler.component.DistributedQueryElevationComponentTest.doTest(DistributedQueryElevationComponentTest.java:81)
	at org.apache.solr.BaseDistributedSearchTestCase.testDistribSearch(BaseDistributedSearchTestCase.java:679)
	at sun.reflect.NativeMethodAccessorImpl.invoke0(Native Method)
	at sun.reflect.NativeMethodAccessorImpl.invoke(NativeMethodAccessorImpl.java:57)
	at sun.reflect.DelegatingMethodAccessorImpl.invoke(DelegatingMethodAccessorImpl.java:43)
	at java.lang.reflect.Method.invoke(Method.java:474)
	at com.carrotsearch.randomizedtesting.RandomizedRunner.invoke(RandomizedRunner.java:1995)
	at com.carrotsearch.randomizedtesting.RandomizedRunner.access$1100(RandomizedRunner.java:132)
	at com.carrotsearch.randomizedtesting.RandomizedRunner$6.evaluate(RandomizedRunner.java:818)
	at com.carrotsearch.randomizedtesting.RandomizedRunner$7.evaluate(RandomizedRunner.java:877)
	at com.carrotsearch.randomizedtesting.RandomizedRunner$8.evaluate(RandomizedRunner.java:891)
	at com.carrotsearch.randomizedtesting.rules.SystemPropertiesRestoreRule$1.evaluate(SystemPropertiesRestoreRule.java:53)
	at org.apache.lucene.util.TestRuleSetupTeardownChained$1.evaluate(TestRuleSetupTeardownChained.java:50)
	at org.apache.lucene.util.TestRuleFieldCacheSanity$1.evaluate(TestRuleFieldCacheSanity.java:32)
	at org.apache.lucene.util.AbstractBeforeAfterRule$1.evaluate(AbstractBeforeAfterRule.java:45)
	at com.carrotsearch.randomizedtesting.rules.SystemPropertiesInvariantRule$1.evaluate(SystemPropertiesInvariantRule.java:55)
	at org.apache.lucene.util.TestRuleReportUncaughtExceptions$1.evaluate(TestRuleReportUncaughtExceptions.java:68)
	at org.apache.lucene.util.TestRuleThreadAndTestName$1.evaluate(TestRuleThreadAndTestName.java:48)
	at org.apache.lucene.util.TestRuleIgnoreAfterMaxFailures$1.evaluate(TestRuleIgnoreAfterMaxFailures.java:70)
	at org.apache.lucene.util.TestRuleMarkFailure$1.evaluate(TestRuleMarkFailure.java:48)
	at com.carrotsearch.randomizedtesting.RandomizedRunner.runSingleTest(RandomizedRunner.java:825)
	at com.carrotsearch.randomizedtesting.RandomizedRunner.access$700(RandomizedRunner.java:132)
	at com.carrotsearch.randomizedtesting.RandomizedRunner$3$1.run(RandomizedRunner.java:671)
	at com.carrotsearch.randomizedtesting.RandomizedRunner$3.evaluate(RandomizedRunner.java:697)
	at com.carrotsearch.randomizedtesting.RandomizedRunner$4.evaluate(RandomizedRunner.java:736)
	at com.carrotsearch.randomizedtesting.RandomizedRunner$5.evaluate(RandomizedRunner.java:747)
	at com.carrotsearch.randomizedtesting.rules.SystemPropertiesRestoreRule$1.evaluate(SystemPropertiesRestoreRule.java:53)
	at org.apache.lucene.util.AbstractBeforeAfterRule$1.evaluate(AbstractBeforeAfterRule.java:45)
	at org.apache.lucene.util.TestRuleReportUncaughtExceptions$1.evaluate(TestRuleReportUncaughtExceptions.java:68)
	at org.apache.lucene.util.TestRuleStoreClassName$1.evaluate(TestRuleStoreClassName.java:38)
	at com.carrotsearch.randomizedtesting.rules.SystemPropertiesInvariantRule$1.evaluate(SystemPropertiesInvariantRule.java:55)
	at org.apache.lucene.util.TestRuleNoInstanceHooksOverrides$1.evaluate(TestRuleNoInstanceHooksOverrides.java:53)
	at org.apache.lucene.util.TestRuleNoStaticHooksShadowing$1.evaluate(TestRuleNoStaticHooksShadowing.java:52)
	at org.apache.lucene.util.TestRuleAssertionsRequired$1.evaluate(TestRuleAssertionsRequired.java:36)
	at org.apache.lucene.util.TestRuleMarkFailure$1.evaluate(TestRuleMarkFailure.java:48)
	at org.apache.lucene.util.TestRuleIgnoreAfterMaxFailures$1.evaluate(TestRuleIgnoreAfterMaxFailures.java:70)
	at org.apache.lucene.util.TestRuleIgnoreTestSuites$1.evaluate(TestRuleIgnoreTestSuites.java:55)
	at com.carrotsearch.randomizedtesting.RandomizedRunner.runSuite(RandomizedRunner.java:605)
	at com.carrotsearch.randomizedtesting.RandomizedRunner.access$400(RandomizedRunner.java:132)
	at com.carrotsearch.randomizedtesting.RandomizedRunner$2.run(RandomizedRunner.java:551)




Build Log:
[...truncated 7361 lines...]
[junit4:junit4] Suite: org.apache.solr.handler.component.DistributedQueryElevationComponentTest
[junit4:junit4] FAILURE 2.43s J1 | DistributedQueryElevationComponentTest.testDistribSearch
[junit4:junit4]    > Throwable #1: junit.framework.AssertionFailedError: .responseHeader.params.size()==9,9skipped=5,4
[junit4:junit4]    > 	at __randomizedtesting.SeedInfo.seed([5F02A6BB63B4316E:DEE428A314EB5152]:0)
[junit4:junit4]    > 	at junit.framework.Assert.fail(Assert.java:50)
[junit4:junit4]    > 	at org.apache.solr.BaseDistributedSearchTestCase.compareResponses(BaseDistributedSearchTestCase.java:670)
[junit4:junit4]    > 	at org.apache.solr.BaseDistributedSearchTestCase.query(BaseDistributedSearchTestCase.java:392)
[junit4:junit4]    > 	at org.apache.solr.handler.component.DistributedQueryElevationComponentTest.doTest(DistributedQueryElevationComponentTest.java:81)
[junit4:junit4]    > 	at org.apache.solr.BaseDistributedSearchTestCase.testDistribSearch(BaseDistributedSearchTestCase.java:679)
[junit4:junit4]    > 	at sun.reflect.NativeMethodAccessorImpl.invoke0(Native Method)
[junit4:junit4]    > 	at sun.reflect.NativeMethodAccessorImpl.invoke(NativeMethodAccessorImpl.java:57)
[junit4:junit4]    > 	at sun.reflect.DelegatingMethodAccessorImpl.invoke(DelegatingMethodAccessorImpl.java:43)
[junit4:junit4]    > 	at java.lang.reflect.Method.invoke(Method.java:474)
[junit4:junit4]    > 	at com.carrotsearch.randomizedtesting.RandomizedRunner.invoke(RandomizedRunner.java:1995)
[junit4:junit4]    > 	at com.carrotsearch.randomizedtesting.RandomizedRunner.access$1100(RandomizedRunner.java:132)
[junit4:junit4]    > 	at com.carrotsearch.randomizedtesting.RandomizedRunner$6.evaluate(RandomizedRunner.java:818)
[junit4:junit4]    > 	at com.carrotsearch.randomizedtesting.RandomizedRunner$7.evaluate(RandomizedRunner.java:877)
[junit4:junit4]    > 	at com.carrotsearch.randomizedtesting.RandomizedRunner$8.evaluate(RandomizedRunner.java:891)
[junit4:junit4]    > 	at com.carrotsearch.randomizedtesting.rules.SystemPropertiesRestoreRule$1.evaluate(SystemPropertiesRestoreRule.java:53)
[junit4:junit4]    > 	at org.apache.lucene.util.TestRuleSetupTeardownChained$1.evaluate(TestRuleSetupTeardownChained.java:50)
[junit4:junit4]    > 	at org.apache.lucene.util.TestRuleFieldCacheSanity$1.evaluate(TestRuleFieldCacheSanity.java:32)
[junit4:junit4]    > 	at org.apache.lucene.util.AbstractBeforeAfterRule$1.evaluate(AbstractBeforeAfterRule.java:45)
[junit4:junit4]    > 	at com.carrotsearch.randomizedtesting.rules.SystemPropertiesInvariantRule$1.evaluate(SystemPropertiesInvariantRule.java:55)
[junit4:junit4]    > 	at org.apache.lucene.util.TestRuleReportUncaughtExceptions$1.evaluate(TestRuleReportUncaughtExceptions.java:68)
[junit4:junit4]    > 	at org.apache.lucene.util.TestRuleThreadAndTestName$1.evaluate(TestRuleThreadAndTestName.java:48)
[junit4:junit4]    > 	at org.apache.lucene.util.TestRuleIgnoreAfterMaxFailures$1.evaluate(TestRuleIgnoreAfterMaxFailures.java:70)
[junit4:junit4]    > 	at org.apache.lucene.util.TestRuleMarkFailure$1.evaluate(TestRuleMarkFailure.java:48)
[junit4:junit4]    > 	at com.carrotsearch.randomizedtesting.RandomizedRunner.runSingleTest(RandomizedRunner.java:825)
[junit4:junit4]    > 	at com.carrotsearch.randomizedtesting.RandomizedRunner.access$700(RandomizedRunner.java:132)
[junit4:junit4]    > 	at com.carrotsearch.randomizedtesting.RandomizedRunner$3$1.run(RandomizedRunner.java:671)
[junit4:junit4]    > 	at com.carrotsearch.randomizedtesting.RandomizedRunner$3.evaluate(RandomizedRunner.java:697)
[junit4:junit4]    > 	at com.carrotsearch.randomizedtesting.RandomizedRunner$4.evaluate(RandomizedRunner.java:736)
[junit4:junit4]    > 	at com.carrotsearch.randomizedtesting.RandomizedRunner$5.evaluate(RandomizedRunner.java:747)
[junit4:junit4]    > 	at com.carrotsearch.randomizedtesting.rules.SystemPropertiesRestoreRule$1.evaluate(SystemPropertiesRestoreRule.java:53)
[junit4:junit4]    > 	at org.apache.lucene.util.AbstractBeforeAfterRule$1.evaluate(AbstractBeforeAfterRule.java:45)
[junit4:junit4]    > 	at org.apache.lucene.util.TestRuleReportUncaughtExceptions$1.evaluate(TestRuleReportUncaughtExceptions.java:68)
[junit4:junit4]    > 	at org.apache.lucene.util.TestRuleStoreClassName$1.evaluate(TestRuleStoreClassName.java:38)
[junit4:junit4]    > 	at com.carrotsearch.randomizedtesting.rules.SystemPropertiesInvariantRule$1.evaluate(SystemPropertiesInvariantRule.java:55)
[junit4:junit4]    > 	at org.apache.lucene.util.TestRuleNoInstanceHooksOverrides$1.evaluate(TestRuleNoInstanceHooksOverrides.java:53)
[junit4:junit4]    > 	at org.apache.lucene.util.TestRuleNoStaticHooksShadowing$1.evaluate(TestRuleNoStaticHooksShadowing.java:52)
[junit4:junit4]    > 	at org.apache.lucene.util.TestRuleAssertionsRequired$1.evaluate(TestRuleAssertionsRequired.java:36)
[junit4:junit4]    > 	at org.apache.lucene.util.TestRuleMarkFailure$1.evaluate(TestRuleMarkFailure.java:48)
[junit4:junit4]    > 	at org.apache.lucene.util.TestRuleIgnoreAfterMaxFailures$1.evaluate(TestRuleIgnoreAfterMaxFailures.java:70)
[junit4:junit4]    > 	at org.apache.lucene.util.TestRuleIgnoreTestSuites$1.evaluate(TestRuleIgnoreTestSuites.java:55)
[junit4:junit4]    > 	at com.carrotsearch.randomizedtesting.RandomizedRunner.runSuite(RandomizedRunner.java:605)
[junit4:junit4]    > 	at com.carrotsearch.randomizedtesting.RandomizedRunner.access$400(RandomizedRunner.java:132)
[junit4:junit4]    > 	at com.carrotsearch.randomizedtesting.RandomizedRunner$2.run(RandomizedRunner.java:551)
[junit4:junit4]    > 
[junit4:junit4]   2> 2 T839 oas.SolrTestCaseJ4.setUp ###Starting testDistribSearch
[junit4:junit4]   2> 70 T839 oejs.Server.doStart jetty-8.1.2.v20120308
[junit4:junit4]   2> 124 T839 oejs.AbstractConnector.doStart Started SocketConnector@0.0.0.0:33845
[junit4:junit4]   2> 135 T839 oasc.SolrResourceLoader.locateSolrHome JNDI not configured for solr (NoInitialContextEx)
[junit4:junit4]   2> 135 T839 oasc.SolrResourceLoader.locateSolrHome using system property solr.solr.home: /mnt/ssd/jenkins/workspace/Lucene-Solr-trunk-Linux/checkout/solr/build/solr-core/test-files/solr
[junit4:junit4]   2> 136 T839 oasc.SolrResourceLoader.<init> new SolrResourceLoader for deduced Solr Home: '/mnt/ssd/jenkins/workspace/Lucene-Solr-trunk-Linux/checkout/solr/build/solr-core/test-files/solr/'
[junit4:junit4]   2> 145 T839 oass.SolrDispatchFilter.init SolrDispatchFilter.init()
[junit4:junit4]   2> 145 T839 oasc.SolrResourceLoader.locateSolrHome JNDI not configured for solr (NoInitialContextEx)
[junit4:junit4]   2> 146 T839 oasc.SolrResourceLoader.locateSolrHome using system property solr.solr.home: /mnt/ssd/jenkins/workspace/Lucene-Solr-trunk-Linux/checkout/solr/build/solr-core/test-files/solr
[junit4:junit4]   2> 146 T839 oasc.CoreContainer$Initializer.initialize looking for solr.xml: /mnt/ssd/jenkins/workspace/Lucene-Solr-trunk-Linux/checkout/solr/build/solr-core/test-files/solr/solr.xml
[junit4:junit4]   2> 146 T839 oasc.CoreContainer.<init> New CoreContainer 28141543
[junit4:junit4]   2> 146 T839 oasc.CoreContainer.load Loading CoreContainer using Solr Home: '/mnt/ssd/jenkins/workspace/Lucene-Solr-trunk-Linux/checkout/solr/build/solr-core/test-files/solr/'
[junit4:junit4]   2> 147 T839 oasc.SolrResourceLoader.<init> new SolrResourceLoader for directory: '/mnt/ssd/jenkins/workspace/Lucene-Solr-trunk-Linux/checkout/solr/build/solr-core/test-files/solr/'
[junit4:junit4]   2> 165 T839 oasc.CoreContainer.load Registering Log Listener
[junit4:junit4]   2> 189 T839 oasc.CoreContainer.create Creating SolrCore 'collection1' using instanceDir: /mnt/ssd/jenkins/workspace/Lucene-Solr-trunk-Linux/checkout/solr/build/solr-core/test-files/solr/collection1
[junit4:junit4]   2> 189 T839 oasc.SolrResourceLoader.<init> new SolrResourceLoader for directory: '/mnt/ssd/jenkins/workspace/Lucene-Solr-trunk-Linux/checkout/solr/build/solr-core/test-files/solr/collection1/'
[junit4:junit4]   2> 190 T839 oasc.SolrResourceLoader.replaceClassLoader Adding 'file:/mnt/ssd/jenkins/workspace/Lucene-Solr-trunk-Linux/checkout/solr/build/solr-core/test-files/solr/collection1/lib/README' to classloader
[junit4:junit4]   2> 190 T839 oasc.SolrResourceLoader.replaceClassLoader Adding 'file:/mnt/ssd/jenkins/workspace/Lucene-Solr-trunk-Linux/checkout/solr/build/solr-core/test-files/solr/collection1/lib/classes/' to classloader
[junit4:junit4]   2> 215 T839 oasc.SolrConfig.<init> Using Lucene MatchVersion: LUCENE_50
[junit4:junit4]   2> 262 T839 oasc.SolrConfig.<init> Loaded SolrConfig: solrconfig-elevate.xml
[junit4:junit4]   2> 262 T839 oass.IndexSchema.readSchema Reading Solr Schema
[junit4:junit4]   2> 265 T839 oass.IndexSchema.readSchema Schema name=example
[junit4:junit4]   2> 455 T839 oass.IndexSchema.readSchema default search field in schema is text
[junit4:junit4]   2> 458 T839 oass.IndexSchema.readSchema unique key field: id
[junit4:junit4]   2> 463 T839 oasc.SolrCore.<init> [collection1] Opening new SolrCore at /mnt/ssd/jenkins/workspace/Lucene-Solr-trunk-Linux/checkout/solr/build/solr-core/test-files/solr/collection1/, dataDir=./org.apache.solr.handler.component.DistributedQueryElevationComponentTest-1343962722180/control/data/
[junit4:junit4]   2> 464 T839 oasc.JmxMonitoredMap.<init> JMX monitoring is enabled. Adding Solr mbeans to JMX Server: com.sun.jmx.mbeanserver.JmxMBeanServer@12437f7
[junit4:junit4]   2> 464 T839 oasc.SolrCore.getNewIndexDir WARNING New index directory detected: old=null new=./org.apache.solr.handler.component.DistributedQueryElevationComponentTest-1343962722180/control/data/index/
[junit4:junit4]   2> 465 T839 oasc.SolrCore.initIndex WARNING [collection1] Solr index directory './org.apache.solr.handler.component.DistributedQueryElevationComponentTest-1343962722180/control/data/index' doesn't exist. Creating new index...
[junit4:junit4]   2> 466 T839 oasc.SolrDeletionPolicy.onCommit SolrDeletionPolicy.onCommit: commits:num=1
[junit4:junit4]   2> 		commit{dir=MockDirWrapper(org.apache.lucene.store.RAMDirectory@e70a60 lockFactory=org.apache.lucene.store.SingleInstanceLockFactory@2b1e2c),segFN=segments_1,generation=1,filenames=[segments_1]
[junit4:junit4]   2> 467 T839 oasc.SolrDeletionPolicy.updateCommits newest commit = 1
[junit4:junit4]   2> 468 T839 oasc.RequestHandlers.initHandlersFromConfig created /update: solr.UpdateRequestHandler
[junit4:junit4]   2> 468 T839 oasc.RequestHandlers.initHandlersFromConfig created /elevate: org.apache.solr.handler.component.SearchHandler
[junit4:junit4]   2> 469 T839 oasc.RequestHandlers.initHandlersFromConfig created /dataElevate: org.apache.solr.handler.component.SearchHandler
[junit4:junit4]   2> 469 T839 oashl.XMLLoader.init xsltCacheLifetimeSeconds=60
[junit4:junit4]   2> 469 T839 oasc.RequestHandlers.initHandlersFromConfig WARNING no default request handler is registered (either '/select' or 'standard')
[junit4:junit4]   2> 475 T839 oasc.SolrCore.initDeprecatedSupport WARNING solrconfig.xml uses deprecated <admin/gettableFiles>, Please update your config to use the ShowFileRequestHandler.
[junit4:junit4]   2> 480 T839 oasc.SolrCore.initDeprecatedSupport WARNING adding ShowFileRequestHandler with hidden files: [SOLRCONFIG-SOLR-749.XML, BAD-SCHEMA-SIM-GLOBAL-VS-FT-MISMATCH.XML, SCHEMA11.XML, OPEN-EXCHANGE-RATES.JSON, SCHEMA-SIM.XML, SOLRCONFIG-MASTER1-KEEPONEBACKUP.XML, SOLRCONFIG-NOCACHE.XML, ELEVATE.XML, SOLRCONFIG-PROPINJECT.XML, SOLRCONFIG-DELPOLICY2.XML, SOLRCONFIG-FUNCTIONQUERY.XML, SCHEMA-LUCENEMATCHVERSION.XML, SOLRCONFIG-UPDATE-PROCESSOR-CHAINS.XML, SOLRCONFIG-SLAVE.XML, SOLRCONFIG-ENABLEPLUGIN.XML, SCHEMA-REPLICATION1.XML, SOLRCONFIG-MASTER2.XML, SOLRCONFIG-TLOG.XML, STOPWORDS.TXT, DA_COMPOUNDDICTIONARY.TXT, BAD-SCHEMA-UNIQUEKEY-IS-COPYFIELD-DEST.XML, SCHEMA-COLLATE.XML, SOLRCONFIG-SPELLCHECKER.XML, SCHEMA-BM25.XML, MISSING.FUNCTIONS.UPDATEPROCESSOR.JS, BAD-SCHEMA-NOT-INDEXED-BUT-TF.XML, SOLRCONFIG-HIGHLIGHT.XML, OLD_SYNONYMS.TXT, SOLRCONFIG-TERMINDEX.XML, SCHEMA-COPYFIELD-TEST.XML, BAD-SCHEMA-UNIQUEKEY-MULTIVALUED.XML, STOPWITHBOM.TXT, BAD-SCHEMA-NOT-INDEXED-BUT-NORMS.XML, HUNSPELL-TEST.AFF, SCHEMA-LMJELINEKMERCER.XML, PHRASESUGGEST.TXT, SOLRCONFIG-SCRIPT-UPDATEPROCESSOR.XML, BAD-SOLRCONFIG-MISSING-SCRIPTFILE.XML, SOLRCONFIG-PHRASESUGGEST.XML, SCHEMASURROUND.XML, BAD-SCHEMA-DUP-FIELD.XML, SOLRCONFIG-PROPINJECT-INDEXDEFAULT.XML, STOPWORDSWRONGENCODING.TXT, BAD-SCHEMA-UNIQUEKEY-USES-DEFAULT.XML, STOP-1.TXT, SOLRCONFIG-SPELLCHECKCOMPONENT.XML, SCHEMA-DFR.XML, SCHEMA-SPELLCHECKER.XML, BAD-SCHEMA-DUP-DYNAMICFIELD.XML, SOLRCONFIG-SLAVE1.XML, BAD_SOLRCONFIG.XML, SOLRCONFIG-DELPOLICY1.XML, SCHEMA-PHRASESUGGEST.XML, SOLRCONFIG-QUERYSENDER.XML, SOLRCONFIG-ELEVATE.XML, DA_UTF8.XML, SCHEMA-BINARYFIELD.XML, SOLRCONFIG-MASTER1.XML, SCHEMA-STOP-KEEP.XML, MISSLEADING.EXTENSION.UPDATEPROCESSOR.JS.TXT, TRIVIAL.UPDATEPROCESSOR0.JS, FRENCHARTICLES.TXT, SOLRCONFIG-SIMPLELOCK.XML, SCHEMA-NOT-REQUIRED-UNIQUE-KEY.XML, STOPTYPES-1.TXT, BAD-SCHEMA-OMIT-TF-BUT-NOT-POS.XML, SOLRCONFIG-MASTER3.XML, CONDITIONAL.UPDATEPROCESSOR.JS, SCHEMA-REPLICATION2.XML, SOLRCONFIG-LAZYWRITER.XML, KEEP-2.TXT, BAD-SCHEMA-DUP-FIELDTYPE.XML, SOLRCONFIG-QUERYSENDER-NOQUERY.XML, XSLT, SOLRCONFIG-NATIVELOCK.XML, SOLRCONFIG-TRANSFORMERS.XML, BAD-SOLRCONFIG-BOGUS-SCRIPTENGINE-NAME.XML, SCHEMA-REVERSED.XML, SCHEMA_CODEC.XML, STOPTYPES-2.TXT, BAD-SCHEMA-NOT-INDEXED-BUT-POS.XML, COMPOUNDDICTIONARY.TXT, SOLRCONFIG-ALTDIRECTORY.XML, BAD-SCHEMA-CODEC-GLOBAL-VS-FT-MISMATCH.XML, SOLRCONFIG-REPEATER.XML, SCHEMA-LMDIRICHLET.XML, STOP-SNOWBALL.TXT, SOLRCONFIG_CODEC.XML, BAD-MP-SOLRCONFIG.XML, SCHEMA-IB.XML, KEEP-1.TXT, SCHEMA-TRIE.XML, SCHEMA-MINIMAL.XML, SOLRCONFIG-MERGEPOLICY.XML, SYNONYMS.TXT, HYPHENATION.DTD, SCHEMA-FOLDING.XML, SCHEMA-NUMERIC.XML, THROW.ERROR.ON.ADD.UPDATEPROCESSOR.JS, BAD-SCHEMA-ANALYZER-CLASS-AND-NESTED.XML, SOLRCONFIG-XINCLUDE.XML, SCHEMA-REQUIRED-FIELDS.XML, BAD-SCHEMA-EXTERNAL-FILEFIELD.XML, ADDFIELDS.UPDATEPROCESSOR.JS, SCHEMA15.XML, CURRENCY.XML, PROTWORDS.TXT, WDFTYPES.TXT, SOLRCONFIG-MASTER.XML, SOLRCONFIG-SOLCOREPROPERTIES.XML, STEMDICT.TXT, SCHEMA.XML, TRIVIAL.UPDATEPROCESSOR1.JS, BAD-SCHEMA-NONTEXT-ANALYZER.XML, HUNSPELL-TEST.DIC, BAD-SOLRCONFIG-INVALID-SCRIPTFILE.XML, SOLRCONFIG-BASIC.XML, STOP-2.TXT, SCHEMA-CHARFILTERS.XML, SOLRCONFIG-CACHING.XML, MAPPING-ISOLATIN1ACCENT.TXT, SOLRCONFIG-REQHANDLER.INCL, SOLRCONFIG_PERF.XML, SCHEMA12.XML, SCHEMA-TFIDF.XML]
[junit4:junit4]   2> 505 T839 oass.SolrIndexSearcher.<init> Opening Searcher@1b6f6f1 main
[junit4:junit4]   2> 505 T839 oass.SolrIndexSearcher.getIndexDir WARNING WARNING: Directory impl does not support setting indexDir: org.apache.lucene.store.MockDirectoryWrapper
[junit4:junit4]   2> 506 T839 oasu.CommitTracker.<init> Hard AutoCommit: disabled
[junit4:junit4]   2> 506 T839 oasu.CommitTracker.<init> Soft AutoCommit: disabled
[junit4:junit4]   2> 507 T839 oashc.QueryElevationComponent.inform Loading QueryElevation from: /mnt/ssd/jenkins/workspace/Lucene-Solr-trunk-Linux/checkout/solr/build/solr-core/test-files/solr/collection1/conf/elevate.xml
[junit4:junit4]   2> 516 T839 oashc.QueryElevationComponent.inform Loading QueryElevation from: /mnt/ssd/jenkins/workspace/Lucene-Solr-trunk-Linux/checkout/solr/build/solr-core/test-files/solr/collection1/conf/elevate.xml
[junit4:junit4]   2> 529 T839 oashc.HttpShardHandlerFactory.getParameter Setting socketTimeout to: 0
[junit4:junit4]   2> 530 T839 oashc.HttpShardHandlerFactory.getParameter Setting urlScheme to: http://
[junit4:junit4]   2> 535 T839 oashc.HttpShardHandlerFactory.getParameter Setting connTimeout to: 0
[junit4:junit4]   2> 538 T839 oashc.HttpShardHandlerFactory.getParameter Setting maxConnectionsPerHost to: 20
[junit4:junit4]   2> 539 T839 oashc.HttpShardHandlerFactory.getParameter Setting corePoolSize to: 0
[junit4:junit4]   2> 539 T839 oashc.HttpShardHandlerFactory.getParameter Setting maximumPoolSize to: 2147483647
[junit4:junit4]   2> 539 T839 oashc.HttpShardHandlerFactory.getParameter Setting maxThreadIdleTime to: 5
[junit4:junit4]   2> 540 T839 oashc.HttpShardHandlerFactory.getParameter Setting sizeOfQueue to: -1
[junit4:junit4]   2> 540 T839 oashc.HttpShardHandlerFactory.getParameter Setting fairnessPolicy to: false
[junit4:junit4]   2> 541 T839 oascsi.HttpClientUtil.createClient Creating new http client, config:maxConnectionsPerHost=20&maxConnections=10000&socketTimeout=0&connTimeout=0&retry=false
[junit4:junit4]   2> 544 T850 oasc.SolrCore.registerSearcher [collection1] Registered new searcher Searcher@1b6f6f1 main{StandardDirectoryReader(segments_1:1)}
[junit4:junit4]   2> 551 T839 oasc.CoreContainer.register registering core: collection1
[junit4:junit4]   2> 551 T839 oass.SolrDispatchFilter.init user.dir=/mnt/ssd/jenkins/workspace/Lucene-Solr-trunk-Linux/checkout/solr/build/solr-core/test/J1
[junit4:junit4]   2> 552 T839 oass.SolrDispatchFilter.init SolrDispatchFilter.init() done
[junit4:junit4]   2> 567 T839 oascsi.HttpClientUtil.createClient Creating new http client, config:maxConnections=128&maxConnectionsPerHost=32&followRedirects=false
[junit4:junit4]   2> 585 T839 oejs.Server.doStart jetty-8.1.2.v20120308
[junit4:junit4]   2> 637 T839 oejs.AbstractConnector.doStart Started SocketConnector@0.0.0.0:32882
[junit4:junit4]   2> 638 T839 oasc.SolrResourceLoader.locateSolrHome JNDI not configured for solr (NoInitialContextEx)
[junit4:junit4]   2> 638 T839 oasc.SolrResourceLoader.locateSolrHome using system property solr.solr.home: /mnt/ssd/jenkins/workspace/Lucene-Solr-trunk-Linux/checkout/solr/build/solr-core/test-files/solr
[junit4:junit4]   2> 638 T839 oasc.SolrResourceLoader.<init> new SolrResourceLoader for deduced Solr Home: '/mnt/ssd/jenkins/workspace/Lucene-Solr-trunk-Linux/checkout/solr/build/solr-core/test-files/solr/'
[junit4:junit4]   2> 646 T839 oass.SolrDispatchFilter.init SolrDispatchFilter.init()
[junit4:junit4]   2> 647 T839 oasc.SolrResourceLoader.locateSolrHome JNDI not configured for solr (NoInitialContextEx)
[junit4:junit4]   2> 647 T839 oasc.SolrResourceLoader.locateSolrHome using system property solr.solr.home: /mnt/ssd/jenkins/workspace/Lucene-Solr-trunk-Linux/checkout/solr/build/solr-core/test-files/solr
[junit4:junit4]   2> 647 T839 oasc.CoreContainer$Initializer.initialize looking for solr.xml: /mnt/ssd/jenkins/workspace/Lucene-Solr-trunk-Linux/checkout/solr/build/solr-core/test-files/solr/solr.xml
[junit4:junit4]   2> 648 T839 oasc.CoreContainer.<init> New CoreContainer 1358408
[junit4:junit4]   2> 648 T839 oasc.CoreContainer.load Loading CoreContainer using Solr Home: '/mnt/ssd/jenkins/workspace/Lucene-Solr-trunk-Linux/checkout/solr/build/solr-core/test-files/solr/'
[junit4:junit4]   2> 648 T839 oasc.SolrResourceLoader.<init> new SolrResourceLoader for directory: '/mnt/ssd/jenkins/workspace/Lucene-Solr-trunk-Linux/checkout/solr/build/solr-core/test-files/solr/'
[junit4:junit4]   2> 667 T839 oasc.CoreContainer.load Registering Log Listener
[junit4:junit4]   2> 679 T839 oasc.CoreContainer.create Creating SolrCore 'collection1' using instanceDir: /mnt/ssd/jenkins/workspace/Lucene-Solr-trunk-Linux/checkout/solr/build/solr-core/test-files/solr/collection1
[junit4:junit4]   2> 679 T839 oasc.SolrResourceLoader.<init> new SolrResourceLoader for directory: '/mnt/ssd/jenkins/workspace/Lucene-Solr-trunk-Linux/checkout/solr/build/solr-core/test-files/solr/collection1/'
[junit4:junit4]   2> 680 T839 oasc.SolrResourceLoader.replaceClassLoader Adding 'file:/mnt/ssd/jenkins/workspace/Lucene-Solr-trunk-Linux/checkout/solr/build/solr-core/test-files/solr/collection1/lib/README' to classloader
[junit4:junit4]   2> 680 T839 oasc.SolrResourceLoader.replaceClassLoader Adding 'file:/mnt/ssd/jenkins/workspace/Lucene-Solr-trunk-Linux/checkout/solr/build/solr-core/test-files/solr/collection1/lib/classes/' to classloader
[junit4:junit4]   2> 708 T839 oasc.SolrConfig.<init> Using Lucene MatchVersion: LUCENE_50
[junit4:junit4]   2> 745 T839 oasc.SolrConfig.<init> Loaded SolrConfig: solrconfig-elevate.xml
[junit4:junit4]   2> 745 T839 oass.IndexSchema.readSchema Reading Solr Schema
[junit4:junit4]   2> 748 T839 oass.IndexSchema.readSchema Schema name=example
[junit4:junit4]   2> 926 T839 oass.IndexSchema.readSchema default search field in schema is text
[junit4:junit4]   2> 928 T839 oass.IndexSchema.readSchema unique key field: id
[junit4:junit4]   2> 935 T839 oasc.SolrCore.<init> [collection1] Opening new SolrCore at /mnt/ssd/jenkins/workspace/Lucene-Solr-trunk-Linux/checkout/solr/build/solr-core/test-files/solr/collection1/, dataDir=./org.apache.solr.handler.component.DistributedQueryElevationComponentTest-1343962722180/shard0/data/
[junit4:junit4]   2> 936 T839 oasc.JmxMonitoredMap.<init> JMX monitoring is enabled. Adding Solr mbeans to JMX Server: com.sun.jmx.mbeanserver.JmxMBeanServer@12437f7
[junit4:junit4]   2> 936 T839 oasc.SolrCore.getNewIndexDir WARNING New index directory detected: old=null new=./org.apache.solr.handler.component.DistributedQueryElevationComponentTest-1343962722180/shard0/data/index/
[junit4:junit4]   2> 937 T839 oasc.SolrCore.initIndex WARNING [collection1] Solr index directory './org.apache.solr.handler.component.DistributedQueryElevationComponentTest-1343962722180/shard0/data/index' doesn't exist. Creating new index...
[junit4:junit4]   2> 938 T839 oasc.SolrDeletionPolicy.onCommit SolrDeletionPolicy.onCommit: commits:num=1
[junit4:junit4]   2> 		commit{dir=MockDirWrapper(org.apache.lucene.store.RAMDirectory@1bcd0e6 lockFactory=org.apache.lucene.store.SingleInstanceLockFactory@c8d5d9),segFN=segments_1,generation=1,filenames=[segments_1]
[junit4:junit4]   2> 938 T839 oasc.SolrDeletionPolicy.updateCommits newest commit = 1
[junit4:junit4]   2> 939 T839 oasc.RequestHandlers.initHandlersFromConfig created /update: solr.UpdateRequestHandler
[junit4:junit4]   2> 940 T839 oasc.RequestHandlers.initHandlersFromConfig created /elevate: org.apache.solr.handler.component.SearchHandler
[junit4:junit4]   2> 940 T839 oasc.RequestHandlers.initHandlersFromConfig created /dataElevate: org.apache.solr.handler.component.SearchHandler
[junit4:junit4]   2> 940 T839 oashl.XMLLoader.init xsltCacheLifetimeSeconds=60
[junit4:junit4]   2> 941 T839 oasc.RequestHandlers.initHandlersFromConfig WARNING no default request handler is registered (either '/select' or 'standard')
[junit4:junit4]   2> 942 T839 oasc.SolrCore.initDeprecatedSupport WARNING solrconfig.xml uses deprecated <admin/gettableFiles>, Please update your config to use the ShowFileRequestHandler.
[junit4:junit4]   2> 943 T839 oasc.SolrCore.initDeprecatedSupport WARNING adding ShowFileRequestHandler with hidden files: [SOLRCONFIG-SOLR-749.XML, BAD-SCHEMA-SIM-GLOBAL-VS-FT-MISMATCH.XML, SCHEMA11.XML, OPEN-EXCHANGE-RATES.JSON, SCHEMA-SIM.XML, SOLRCONFIG-MASTER1-KEEPONEBACKUP.XML, SOLRCONFIG-NOCACHE.XML, ELEVATE.XML, SOLRCONFIG-PROPINJECT.XML, SOLRCONFIG-DELPOLICY2.XML, SOLRCONFIG-FUNCTIONQUERY.XML, SCHEMA-LUCENEMATCHVERSION.XML, SOLRCONFIG-UPDATE-PROCESSOR-CHAINS.XML, SOLRCONFIG-SLAVE.XML, SOLRCONFIG-ENABLEPLUGIN.XML, SCHEMA-REPLICATION1.XML, SOLRCONFIG-MASTER2.XML, SOLRCONFIG-TLOG.XML, STOPWORDS.TXT, DA_COMPOUNDDICTIONARY.TXT, BAD-SCHEMA-UNIQUEKEY-IS-COPYFIELD-DEST.XML, SCHEMA-COLLATE.XML, SOLRCONFIG-SPELLCHECKER.XML, SCHEMA-BM25.XML, MISSING.FUNCTIONS.UPDATEPROCESSOR.JS, BAD-SCHEMA-NOT-INDEXED-BUT-TF.XML, SOLRCONFIG-HIGHLIGHT.XML, OLD_SYNONYMS.TXT, SOLRCONFIG-TERMINDEX.XML, SCHEMA-COPYFIELD-TEST.XML, BAD-SCHEMA-UNIQUEKEY-MULTIVALUED.XML, STOPWITHBOM.TXT, BAD-SCHEMA-NOT-INDEXED-BUT-NORMS.XML, HUNSPELL-TEST.AFF, SCHEMA-LMJELINEKMERCER.XML, PHRASESUGGEST.TXT, SOLRCONFIG-SCRIPT-UPDATEPROCESSOR.XML, BAD-SOLRCONFIG-MISSING-SCRIPTFILE.XML, SOLRCONFIG-PHRASESUGGEST.XML, SCHEMASURROUND.XML, BAD-SCHEMA-DUP-FIELD.XML, SOLRCONFIG-PROPINJECT-INDEXDEFAULT.XML, STOPWORDSWRONGENCODING.TXT, BAD-SCHEMA-UNIQUEKEY-USES-DEFAULT.XML, STOP-1.TXT, SOLRCONFIG-SPELLCHECKCOMPONENT.XML, SCHEMA-DFR.XML, SCHEMA-SPELLCHECKER.XML, BAD-SCHEMA-DUP-DYNAMICFIELD.XML, SOLRCONFIG-SLAVE1.XML, BAD_SOLRCONFIG.XML, SOLRCONFIG-DELPOLICY1.XML, SCHEMA-PHRASESUGGEST.XML, SOLRCONFIG-QUERYSENDER.XML, SOLRCONFIG-ELEVATE.XML, DA_UTF8.XML, SCHEMA-BINARYFIELD.XML, SOLRCONFIG-MASTER1.XML, SCHEMA-STOP-KEEP.XML, MISSLEADING.EXTENSION.UPDATEPROCESSOR.JS.TXT, TRIVIAL.UPDATEPROCESSOR0.JS, FRENCHARTICLES.TXT, SOLRCONFIG-SIMPLELOCK.XML, SCHEMA-NOT-REQUIRED-UNIQUE-KEY.XML, STOPTYPES-1.TXT, BAD-SCHEMA-OMIT-TF-BUT-NOT-POS.XML, SOLRCONFIG-MASTER3.XML, CONDITIONAL.UPDATEPROCESSOR.JS, SCHEMA-REPLICATION2.XML, SOLRCONFIG-LAZYWRITER.XML, KEEP-2.TXT, BAD-SCHEMA-DUP-FIELDTYPE.XML, SOLRCONFIG-QUERYSENDER-NOQUERY.XML, XSLT, SOLRCONFIG-NATIVELOCK.XML, SOLRCONFIG-TRANSFORMERS.XML, BAD-SOLRCONFIG-BOGUS-SCRIPTENGINE-NAME.XML, SCHEMA-REVERSED.XML, SCHEMA_CODEC.XML, STOPTYPES-2.TXT, BAD-SCHEMA-NOT-INDEXED-BUT-POS.XML, COMPOUNDDICTIONARY.TXT, SOLRCONFIG-ALTDIRECTORY.XML, BAD-SCHEMA-CODEC-GLOBAL-VS-FT-MISMATCH.XML, SOLRCONFIG-REPEATER.XML, SCHEMA-LMDIRICHLET.XML, STOP-SNOWBALL.TXT, SOLRCONFIG_CODEC.XML, BAD-MP-SOLRCONFIG.XML, SCHEMA-IB.XML, KEEP-1.TXT, SCHEMA-TRIE.XML, SCHEMA-MINIMAL.XML, SOLRCONFIG-MERGEPOLICY.XML, SYNONYMS.TXT, HYPHENATION.DTD, SCHEMA-FOLDING.XML, SCHEMA-NUMERIC.XML, THROW.ERROR.ON.ADD.UPDATEPROCESSOR.JS, BAD-SCHEMA-ANALYZER-CLASS-AND-NESTED.XML, SOLRCONFIG-XINCLUDE.XML, SCHEMA-REQUIRED-FIELDS.XML, BAD-SCHEMA-EXTERNAL-FILEFIELD.XML, ADDFIELDS.UPDATEPROCESSOR.JS, SCHEMA15.XML, CURRENCY.XML, PROTWORDS.TXT, WDFTYPES.TXT, SOLRCONFIG-MASTER.XML, SOLRCONFIG-SOLCOREPROPERTIES.XML, STEMDICT.TXT, SCHEMA.XML, TRIVIAL.UPDATEPROCESSOR1.JS, BAD-SCHEMA-NONTEXT-ANALYZER.XML, HUNSPELL-TEST.DIC, BAD-SOLRCONFIG-INVALID-SCRIPTFILE.XML, SOLRCONFIG-BASIC.XML, STOP-2.TXT, SCHEMA-CHARFILTERS.XML, SOLRCONFIG-CACHING.XML, MAPPING-ISOLATIN1ACCENT.TXT, SOLRCONFIG-REQHANDLER.INCL, SOLRCONFIG_PERF.XML, SCHEMA12.XML, SCHEMA-TFIDF.XML]
[junit4:junit4]   2> 945 T839 oass.SolrIndexSearcher.<init> Opening Searcher@18e92a9 main
[junit4:junit4]   2> 946 T839 oass.SolrIndexSearcher.getIndexDir WARNING WARNING: Directory impl does not support setting indexDir: org.apache.lucene.store.MockDirectoryWrapper
[junit4:junit4]   2> 946 T839 oasu.CommitTracker.<init> Hard AutoCommit: disabled
[junit4:junit4]   2> 946 T839 oasu.CommitTracker.<init> Soft AutoCommit: disabled
[junit4:junit4]   2> 947 T839 oashc.QueryElevationComponent.inform Loading QueryElevation from: /mnt/ssd/jenkins/workspace/Lucene-Solr-trunk-Linux/checkout/solr/build/solr-core/test-files/solr/collection1/conf/elevate.xml
[junit4:junit4]   2> 954 T839 oashc.QueryElevationComponent.inform Loading QueryElevation from: /mnt/ssd/jenkins/workspace/Lucene-Solr-trunk-Linux/checkout/solr/build/solr-core/test-files/solr/collection1/conf/elevate.xml
[junit4:junit4]   2> 966 T839 oashc.HttpShardHandlerFactory.getParameter Setting socketTimeout to: 0
[junit4:junit4]   2> 966 T839 oashc.HttpShardHandlerFactory.getParameter Setting urlScheme to: http://
[junit4:junit4]   2> 967 T839 oashc.HttpShardHandlerFactory.getParameter Setting connTimeout to: 0
[junit4:junit4]   2> 967 T839 oashc.HttpShardHandlerFactory.getParameter Setting maxConnectionsPerHost to: 20
[junit4:junit4]   2> 967 T839 oashc.HttpShardHandlerFactory.getParameter Setting corePoolSize to: 0
[junit4:junit4]   2> 967 T839 oashc.HttpShardHandlerFactory.getParameter Setting maximumPoolSize to: 2147483647
[junit4:junit4]   2> 968 T839 oashc.HttpShardHandlerFactory.getParameter Setting maxThreadIdleTime to: 5
[junit4:junit4]   2> 968 T839 oashc.HttpShardHandlerFactory.getParameter Setting sizeOfQueue to: -1
[junit4:junit4]   2> 968 T839 oashc.HttpShardHandlerFactory.getParameter Setting fairnessPolicy to: false
[junit4:junit4]   2> 969 T839 oascsi.HttpClientUtil.createClient Creating new http client, config:maxConnectionsPerHost=20&maxConnections=10000&socketTimeout=0&connTimeout=0&retry=false
[junit4:junit4]   2> 971 T860 oasc.SolrCore.registerSearcher [collection1] Registered new searcher Searcher@18e92a9 main{StandardDirectoryReader(segments_1:1)}
[junit4:junit4]   2> 971 T839 oasc.CoreContainer.register registering core: collection1
[junit4:junit4]   2> 972 T839 oass.SolrDispatchFilter.init user.dir=/mnt/ssd/jenkins/workspace/Lucene-Solr-trunk-Linux/checkout/solr/build/solr-core/test/J1
[junit4:junit4]   2> 972 T839 oass.SolrDispatchFilter.init SolrDispatchFilter.init() done
[junit4:junit4]   2> 973 T839 oascsi.HttpClientUtil.createClient Creating new http client, config:maxConnections=128&maxConnectionsPerHost=32&followRedirects=false
[junit4:junit4]   2> 982 T839 oejs.Server.doStart jetty-8.1.2.v20120308
[junit4:junit4]   2> 990 T839 oejs.AbstractConnector.doStart Started SocketConnector@0.0.0.0:53194
[junit4:junit4]   2> 990 T839 oasc.SolrResourceLoader.locateSolrHome JNDI not configured for solr (NoInitialContextEx)
[junit4:junit4]   2> 998 T839 oasc.SolrResourceLoader.locateSolrHome using system property solr.solr.home: /mnt/ssd/jenkins/workspace/Lucene-Solr-trunk-Linux/checkout/solr/build/solr-core/test-files/solr
[junit4:junit4]   2> 998 T839 oasc.SolrResourceLoader.<init> new SolrResourceLoader for deduced Solr Home: '/mnt/ssd/jenkins/workspace/Lucene-Solr-trunk-Linux/checkout/solr/build/solr-core/test-files/solr/'
[junit4:junit4]   2> 1006 T839 oass.SolrDispatchFilter.init SolrDispatchFilter.init()
[junit4:junit4]   2> 1006 T839 oasc.SolrResourceLoader.locateSolrHome JNDI not configured for solr (NoInitialContextEx)
[junit4:junit4]   2> 1006 T839 oasc.SolrResourceLoader.locateSolrHome using system property solr.solr.home: /mnt/ssd/jenkins/workspace/Lucene-Solr-trunk-Linux/checkout/solr/build/solr-core/test-files/solr
[junit4:junit4]   2> 1007 T839 oasc.CoreContainer$Initializer.initialize looking for solr.xml: /mnt/ssd/jenkins/workspace/Lucene-Solr-trunk-Linux/checkout/solr/build/solr-core/test-files/solr/solr.xml
[junit4:junit4]   2> 1007 T839 oasc.CoreContainer.<init> New CoreContainer 13785718
[junit4:junit4]   2> 1007 T839 oasc.CoreContainer.load Loading CoreContainer using Solr Home: '/mnt/ssd/jenkins/workspace/Lucene-Solr-trunk-Linux/checkout/solr/build/solr-core/test-files/solr/'
[junit4:junit4]   2> 1007 T839 oasc.SolrResourceLoader.<init> new SolrResourceLoader for directory: '/mnt/ssd/jenkins/workspace/Lucene-Solr-trunk-Linux/checkout/solr/build/solr-core/test-files/solr/'
[junit4:junit4]   2> 1023 T839 oasc.CoreContainer.load Registering Log Listener
[junit4:junit4]   2> 1055 T839 oasc.CoreContainer.create Creating SolrCore 'collection1' using instanceDir: /mnt/ssd/jenkins/workspace/Lucene-Solr-trunk-Linux/checkout/solr/build/solr-core/test-files/solr/collection1
[junit4:junit4]   2> 1056 T839 oasc.SolrResourceLoader.<init> new SolrResourceLoader for directory: '/mnt/ssd/jenkins/workspace/Lucene-Solr-trunk-Linux/checkout/solr/build/solr-core/test-files/solr/collection1/'
[junit4:junit4]   2> 1056 T839 oasc.SolrResourceLoader.replaceClassLoader Adding 'file:/mnt/ssd/jenkins/workspace/Lucene-Solr-trunk-Linux/checkout/solr/build/solr-core/test-files/solr/collection1/lib/README' to classloader
[junit4:junit4]   2> 1057 T839 oasc.SolrResourceLoader.replaceClassLoader Adding 'file:/mnt/ssd/jenkins/workspace/Lucene-Solr-trunk-Linux/checkout/solr/build/solr-core/test-files/solr/collection1/lib/classes/' to classloader
[junit4:junit4]   2> 1081 T839 oasc.SolrConfig.<init> Using Lucene MatchVersion: LUCENE_50
[junit4:junit4]   2> 1126 T839 oasc.SolrConfig.<init> Loaded SolrConfig: solrconfig-elevate.xml
[junit4:junit4]   2> 1127 T839 oass.IndexSchema.readSchema Reading Solr Schema
[junit4:junit4]   2> 1130 T839 oass.IndexSchema.readSchema Schema name=example
[junit4:junit4]   2> 1357 T839 oass.IndexSchema.readSchema default search field in schema is text
[junit4:junit4]   2> 1359 T839 oass.IndexSchema.readSchema unique key field: id
[junit4:junit4]   2> 1362 T839 oasc.SolrCore.<init> [collection1] Opening new SolrCore at /mnt/ssd/jenkins/workspace/Lucene-Solr-trunk-Linux/checkout/solr/build/solr-core/test-files/solr/collection1/, dataDir=./org.apache.solr.handler.component.DistributedQueryElevationComponentTest-1343962722180/shard1/data/
[junit4:junit4]   2> 1362 T839 oasc.JmxMonitoredMap.<init> JMX monitoring is enabled. Adding Solr mbeans to JMX Server: com.sun.jmx.mbeanserver.JmxMBeanServer@12437f7
[junit4:junit4]   2> 1363 T839 oasc.SolrCore.getNewIndexDir WARNING New index directory detected: old=null new=./org.apache.solr.handler.component.DistributedQueryElevationComponentTest-1343962722180/shard1/data/index/
[junit4:junit4]   2> 1363 T839 oasc.SolrCore.initIndex WARNING [collection1] Solr index directory './org.apache.solr.handler.component.DistributedQueryElevationComponentTest-1343962722180/shard1/data/index' doesn't exist. Creating new index...
[junit4:junit4]   2> 1365 T839 oasc.SolrDeletionPolicy.onCommit SolrDeletionPolicy.onCommit: commits:num=1
[junit4:junit4]   2> 		commit{dir=MockDirWrapper(NRTCachingDirectory(org.apache.lucene.store.RAMDirectory@17c08ce lockFactory=org.apache.lucene.store.SingleInstanceLockFactory@145a380; maxCacheMB=0.4736328125 maxMergeSizeMB=0.828125)),segFN=segments_1,generation=1,filenames=[segments_1]
[junit4:junit4]   2> 1365 T839 oasc.SolrDeletionPolicy.updateCommits newest commit = 1
[junit4:junit4]   2> 1366 T839 oasc.RequestHandlers.initHandlersFromConfig created /update: solr.UpdateRequestHandler
[junit4:junit4]   2> 1366 T839 oasc.RequestHandlers.initHandlersFromConfig created /elevate: org.apache.solr.handler.component.SearchHandler
[junit4:junit4]   2> 1367 T839 oasc.RequestHandlers.initHandlersFromConfig created /dataElevate: org.apache.solr.handler.component.SearchHandler
[junit4:junit4]   2> 1367 T839 oashl.XMLLoader.init xsltCacheLifetimeSeconds=60
[junit4:junit4]   2> 1368 T839 oasc.RequestHandlers.initHandlersFromConfig WARNING no default request handler is registered (either '/select' or 'standard')
[junit4:junit4]   2> 1373 T839 oasc.SolrCore.initDeprecatedSupport WARNING solrconfig.xml uses deprecated <admin/gettableFiles>, Please update your config to use the ShowFileRequestHandler.
[junit4:junit4]   2> 1374 T839 oasc.SolrCore.initDeprecatedSupport WARNING adding ShowFileRequestHandler with hidden files: [SOLRCONFIG-SOLR-749.XML, BAD-SCHEMA-SIM-GLOBAL-VS-FT-MISMATCH.XML, SCHEMA11.XML, OPEN-EXCHANGE-RATES.JSON, SCHEMA-SIM.XML, SOLRCONFIG-MASTER1-KEEPONEBACKUP.XML, SOLRCONFIG-NOCACHE.XML, ELEVATE.XML, SOLRCONFIG-PROPINJECT.XML, SOLRCONFIG-DELPOLICY2.XML, SOLRCONFIG-FUNCTIONQUERY.XML, SCHEMA-LUCENEMATCHVERSION.XML, SOLRCONFIG-UPDATE-PROCESSOR-CHAINS.XML, SOLRCONFIG-SLAVE.XML, SOLRCONFIG-ENABLEPLUGIN.XML, SCHEMA-REPLICATION1.XML, SOLRCONFIG-MASTER2.XML, SOLRCONFIG-TLOG.XML, STOPWORDS.TXT, DA_COMPOUNDDICTIONARY.TXT, BAD-SCHEMA-UNIQUEKEY-IS-COPYFIELD-DEST.XML, SCHEMA-COLLATE.XML, SOLRCONFIG-SPELLCHECKER.XML, SCHEMA-BM25.XML, MISSING.FUNCTIONS.UPDATEPROCESSOR.JS, BAD-SCHEMA-NOT-INDEXED-BUT-TF.XML, SOLRCONFIG-HIGHLIGHT.XML, OLD_SYNONYMS.TXT, SOLRCONFIG-TERMINDEX.XML, SCHEMA-COPYFIELD-TEST.XML, BAD-SCHEMA-UNIQUEKEY-MULTIVALUED.XML, STOPWITHBOM.TXT, BAD-SCHEMA-NOT-INDEXED-BUT-NORMS.XML, HUNSPELL-TEST.AFF, SCHEMA-LMJELINEKMERCER.XML, PHRASESUGGEST.TXT, SOLRCONFIG-SCRIPT-UPDATEPROCESSOR.XML, BAD-SOLRCONFIG-MISSING-SCRIPTFILE.XML, SOLRCONFIG-PHRASESUGGEST.XML, SCHEMASURROUND.XML, BAD-SCHEMA-DUP-FIELD.XML, SOLRCONFIG-PROPINJECT-INDEXDEFAULT.XML, STOPWORDSWRONGENCODING.TXT, BAD-SCHEMA-UNIQUEKEY-USES-DEFAULT.XML, STOP-1.TXT, SOLRCONFIG-SPELLCHECKCOMPONENT.XML, SCHEMA-DFR.XML, SCHEMA-SPELLCHECKER.XML, BAD-SCHEMA-DUP-DYNAMICFIELD.XML, SOLRCONFIG-SLAVE1.XML, BAD_SOLRCONFIG.XML, SOLRCONFIG-DELPOLICY1.XML, SCHEMA-PHRASESUGGEST.XML, SOLRCONFIG-QUERYSENDER.XML, SOLRCONFIG-ELEVATE.XML, DA_UTF8.XML, SCHEMA-BINARYFIELD.XML, SOLRCONFIG-MASTER1.XML, SCHEMA-STOP-KEEP.XML, MISSLEADING.EXTENSION.UPDATEPROCESSOR.JS.TXT, TRIVIAL.UPDATEPROCESSOR0.JS, FRENCHARTICLES.TXT, SOLRCONFIG-SIMPLELOCK.XML, SCHEMA-NOT-REQUIRED-UNIQUE-KEY.XML, STOPTYPES-1.TXT, BAD-SCHEMA-OMIT-TF-BUT-NOT-POS.XML, SOLRCONFIG-MASTER3.XML, CONDITIONAL.UPDATEPROCESSOR.JS, SCHEMA-REPLICATION2.XML, SOLRCONFIG-LAZYWRITER.XML, KEEP-2.TXT, BAD-SCHEMA-DUP-FIELDTYPE.XML, SOLRCONFIG-QUERYSENDER-NOQUERY.XML, XSLT, SOLRCONFIG-NATIVELOCK.XML, SOLRCONFIG-TRANSFORMERS.XML, BAD-SOLRCONFIG-BOGUS-SCRIPTENGINE-NAME.XML, SCHEMA-REVERSED.XML, SCHEMA_CODEC.XML, STOPTYPES-2.TXT, BAD-SCHEMA-NOT-INDEXED-BUT-POS.XML, COMPOUNDDICTIONARY.TXT, SOLRCONFIG-ALTDIRECTORY.XML, BAD-SCHEMA-CODEC-GLOBAL-VS-FT-MISMATCH.XML, SOLRCONFIG-REPEATER.XML, SCHEMA-LMDIRICHLET.XML, STOP-SNOWBALL.TXT, SOLRCONFIG_CODEC.XML, BAD-MP-SOLRCONFIG.XML, SCHEMA-IB.XML, KEEP-1.TXT, SCHEMA-TRIE.XML, SCHEMA-MINIMAL.XML, SOLRCONFIG-MERGEPOLICY.XML, SYNONYMS.TXT, HYPHENATION.DTD, SCHEMA-FOLDING.XML, SCHEMA-NUMERIC.XML, THROW.ERROR.ON.ADD.UPDATEPROCESSOR.JS, BAD-SCHEMA-ANALYZER-CLASS-AND-NESTED.XML, SOLRCONFIG-XINCLUDE.XML, SCHEMA-REQUIRED-FIELDS.XML, BAD-SCHEMA-EXTERNAL-FILEFIELD.XML, ADDFIELDS.UPDATEPROCESSOR.JS, SCHEMA15.XML, CURRENCY.XML, PROTWORDS.TXT, WDFTYPES.TXT, SOLRCONFIG-MASTER.XML, SOLRCONFIG-SOLCOREPROPERTIES.XML, STEMDICT.TXT, SCHEMA.XML, TRIVIAL.UPDATEPROCESSOR1.JS, BAD-SCHEMA-NONTEXT-ANALYZER.XML, HUNSPELL-TEST.DIC, BAD-SOLRCONFIG-INVALID-SCRIPTFILE.XML, SOLRCONFIG-BASIC.XML, STOP-2.TXT, SCHEMA-CHARFILTERS.XML, SOLRCONFIG-CACHING.XML, MAPPING-ISOLATIN1ACCENT.TXT, SOLRCONFIG-REQHANDLER.INCL, SOLRCONFIG_PERF.XML, SCHEMA12.XML, SCHEMA-TFIDF.XML]
[junit4:junit4]   2> 1376 T839 oass.SolrIndexSearcher.<init> Opening Searcher@83f1cd main
[junit4:junit4]   2> 1377 T839 oass.SolrIndexSearcher.getIndexDir WARNING WARNING: Directory impl does not support setting indexDir: org.apache.lucene.store.MockDirectoryWrapper
[junit4:junit4]   2> 1377 T839 oasu.CommitTracker.<init> Hard AutoCommit: disabled
[junit4:junit4]   2> 1377 T839 oasu.CommitTracker.<init> Soft AutoCommit: disabled
[junit4:junit4]   2> 1378 T839 oashc.QueryElevationComponent.inform Loading QueryElevation from: /mnt/ssd/jenkins/workspace/Lucene-Solr-trunk-Linux/checkout/solr/build/solr-core/test-files/solr/collection1/conf/elevate.xml
[junit4:junit4]   2> 1385 T839 oashc.QueryElevationComponent.inform Loading QueryElevation from: /mnt/ssd/jenkins/workspace/Lucene-Solr-trunk-Linux/checkout/solr/build/solr-core/test-files/solr/collection1/conf/elevate.xml
[junit4:junit4]   2> 1393 T839 oashc.HttpShardHandlerFactory.getParameter Setting socketTimeout to: 0
[junit4:junit4]   2> 1393 T839 oashc.HttpShardHandlerFactory.getParameter Setting urlScheme to: http://
[junit4:junit4]   2> 1393 T839 oashc.HttpShardHandlerFactory.getParameter Setting connTimeout to: 0
[junit4:junit4]   2> 1394 T839 oashc.HttpShardHandlerFactory.getParameter Setting maxConnectionsPerHost to: 20
[junit4:junit4]   2> 1394 T839 oashc.HttpShardHandlerFactory.getParameter Setting corePoolSize to: 0
[junit4:junit4]   2> 1394 T839 oashc.HttpShardHandlerFactory.getParameter Setting maximumPoolSize to: 2147483647
[junit4:junit4]   2> 1395 T839 oashc.HttpShardHandlerFactory.getParameter Setting maxThreadIdleTime to: 5
[junit4:junit4]   2> 1395 T839 oashc.HttpShardHandlerFactory.getParameter Setting sizeOfQueue to: -1
[junit4:junit4]   2> 1395 T839 oashc.HttpShardHandlerFactory.getParameter Setting fairnessPolicy to: false
[junit4:junit4]   2> 1395 T839 oascsi.HttpClientUtil.createClient Creating new http client, config:maxConnectionsPerHost=20&maxConnections=10000&socketTimeout=0&connTimeout=0&retry=false
[junit4:junit4]   2> 1399 T870 oasc.SolrCore.registerSearcher [collection1] Registered new searcher Searcher@83f1cd main{StandardDirectoryReader(segments_1:1)}
[junit4:junit4]   2> 1402 T839 oasc.CoreContainer.register registering core: collection1
[junit4:junit4]   2> 1404 T839 oass.SolrDispatchFilter.init user.dir=/mnt/ssd/jenkins/workspace/Lucene-Solr-trunk-Linux/checkout/solr/build/solr-core/test/J1
[junit4:junit4]   2> 1404 T839 oass.SolrDispatchFilter.init SolrDispatchFilter.init() done
[junit4:junit4]   2> 1405 T839 oascsi.HttpClientUtil.createClient Creating new http client, config:maxConnections=128&maxConnectionsPerHost=32&followRedirects=false
[junit4:junit4]   2> 1411 T839 oejs.Server.doStart jetty-8.1.2.v20120308
[junit4:junit4]   2> 1421 T839 oejs.AbstractConnector.doStart Started SocketConnector@0.0.0.0:32952
[junit4:junit4]   2> 1422 T839 oasc.SolrResourceLoader.locateSolrHome JNDI not configured for solr (NoInitialContextEx)
[junit4:junit4]   2> 1422 T839 oasc.SolrResourceLoader.locateSolrHome using system property solr.solr.home: /mnt/ssd/jenkins/workspace/Lucene-Solr-trunk-Linux/checkout/solr/build/solr-core/test-files/solr
[junit4:junit4]   2> 1422 T839 oasc.SolrResourceLoader.<init> new SolrResourceLoader for deduced Solr Home: '/mnt/ssd/jenkins/workspace/Lucene-Solr-trunk-Linux/checkout/solr/build/solr-core/test-files/solr/'
[junit4:junit4]   2> 1431 T839 oass.SolrDispatchFilter.init SolrDispatchFilter.init()
[junit4:junit4]   2> 1431 T839 oasc.SolrResourceLoader.locateSolrHome JNDI not configured for solr (NoInitialContextEx)
[junit4:junit4]   2> 1432 T839 oasc.SolrResourceLoader.locateSolrHome using system property solr.solr.home: /mnt/ssd/jenkins/workspace/Lucene-Solr-trunk-Linux/checkout/solr/build/solr-core/test-files/solr
[junit4:junit4]   2> 1432 T839 oasc.CoreContainer$Initializer.initialize looking for solr.xml: /mnt/ssd/jenkins/workspace/Lucene-Solr-trunk-Linux/checkout/solr/build/solr-core/test-files/solr/solr.xml
[junit4:junit4]   2> 1432 T839 oasc.CoreContainer.<init> New CoreContainer 18311216
[junit4:junit4]   2> 1433 T839 oasc.CoreContainer.load Loading CoreContainer using Solr Home: '/mnt/ssd/jenkins/workspace/Lucene-Solr-trunk-Linux/checkout/solr/build/solr-core/test-files/solr/'
[junit4:junit4]   2> 1433 T839 oasc.SolrResourceLoader.<init> new SolrResourceLoader for directory: '/mnt/ssd/jenkins/workspace/Lucene-Solr-trunk-Linux/checkout/solr/build/solr-core/test-files/solr/'
[junit4:junit4]   2> 1458 T839 oasc.CoreContainer.load Registering Log Listener
[junit4:junit4]   2> 1471 T839 oasc.CoreContainer.create Creating SolrCore 'collection1' using instanceDir: /mnt/ssd/jenkins/workspace/Lucene-Solr-trunk-Linux/checkout/solr/build/solr-core/test-files/solr/collection1
[junit4:junit4]   2> 1471 T839 oasc.SolrResourceLoader.<init> new SolrResourceLoader for directory: '/mnt/ssd/jenkins/workspace/Lucene-Solr-trunk-Linux/checkout/solr/build/solr-core/test-files/solr/collection1/'
[junit4:junit4]   2> 1472 T839 oasc.SolrResourceLoader.replaceClassLoader Adding 'file:/mnt/ssd/jenkins/workspace/Lucene-Solr-trunk-Linux/checkout/solr/build/solr-core/test-files/solr/collection1/lib/README' to classloader
[junit4:junit4]   2> 1472 T839 oasc.SolrResourceLoader.replaceClassLoader Adding 'file:/mnt/ssd/jenkins/workspace/Lucene-Solr-trunk-Linux/checkout/solr/build/solr-core/test-files/solr/collection1/lib/classes/' to classloader
[junit4:junit4]   2> 1497 T839 oasc.SolrConfig.<init> Using Lucene MatchVersion: LUCENE_50
[junit4:junit4]   2> 1526 T839 oasc.SolrConfig.<init> Loaded SolrConfig: solrconfig-elevate.xml
[junit4:junit4]   2> 1526 T839 oass.IndexSchema.readSchema Reading Solr Schema
[junit4:junit4]   2> 1528 T839 oass.IndexSchema.readSchema Schema name=example
[junit4:junit4]   2> 1689 T839 oass.IndexSchema.readSchema default search field in schema is text
[junit4:junit4]   2> 1692 T839 oass.IndexSchema.readSchema unique key field: id
[junit4:junit4]   2> 1695 T839 oasc.SolrCore.<init> [collection1] Opening new SolrCore at /mnt/ssd/jenkins/workspace/Lucene-Solr-trunk-Linux/checkout/solr/build/solr-core/test-files/solr/collection1/, dataDir=./org.apache.solr.handler.component.DistributedQueryElevationComponentTest-1343962722180/shard2/data/
[junit4:junit4]   2> 1695 T839 oasc.JmxMonitoredMap.<init> JMX monitoring is enabled. Adding Solr mbeans to JMX Server: com.sun.jmx.mbeanserver.JmxMBeanServer@12437f7
[junit4:junit4]   2> 1695 T839 oasc.SolrCore.getNewIndexDir WARNING New index directory detected: old=null new=./org.apache.solr.handler.component.DistributedQueryElevationComponentTest-1343962722180/shard2/data/index/
[junit4:junit4]   2> 1696 T839 oasc.SolrCore.initIndex WARNING [collection1] Solr index directory './org.apache.solr.handler.component.DistributedQueryElevationComponentTest-1343962722180/shard2/data/index' doesn't exist. Creating new index...
[junit4:junit4]   2> 1697 T839 oasc.SolrDeletionPolicy.onCommit SolrDeletionPolicy.onCommit: commits:num=1
[junit4:junit4]   2> 		commit{dir=MockDirWrapper(org.apache.lucene.store.RAMDirectory@1ce2e6b lockFactory=org.apache.lucene.store.SingleInstanceLockFactory@174809f),segFN=segments_1,generation=1,filenames=[segments_1]
[junit4:junit4]   2> 1697 T839 oasc.SolrDeletionPolicy.updateCommits newest commit = 1
[junit4:junit4]   2> 1698 T839 oasc.RequestHandlers.initHandlersFromConfig created /update: solr.UpdateRequestHandler
[junit4:junit4]   2> 1699 T839 oasc.RequestHandlers.initHandlersFromConfig created /elevate: org.apache.solr.handler.component.SearchHandler
[junit4:junit4]   2> 1699 T839 oasc.RequestHandlers.initHandlersFromConfig created /dataElevate: org.apache.solr.handler.component.SearchHandler
[junit4:junit4]   2> 1700 T839 oashl.XMLLoader.init xsltCacheLifetimeSeconds=60
[junit4:junit4]   2> 1700 T839 oasc.RequestHandlers.initHandlersFromConfig WARNING no default request handler is registered (either '/select' or 'standard')
[junit4:junit4]   2> 1701 T839 oasc.SolrCore.initDeprecatedSupport WARNING solrconfig.xml uses deprecated <admin/gettableFiles>, Please update your config to use the ShowFileRequestHandler.
[junit4:junit4]   2> 1702 T839 oasc.SolrCore.initDeprecatedSupport WARNING adding ShowFileRequestHandler with hidden files: [SOLRCONFIG-SOLR-749.XML, BAD-SCHEMA-SIM-GLOBAL-VS-FT-MISMATCH.XML, SCHEMA11.XML, OPEN-EXCHANGE-RATES.JSON, SCHEMA-SIM.XML, SOLRCONFIG-MASTER1-KEEPONEBACKUP.XML, SOLRCONFIG-NOCACHE.XML, ELEVATE.XML, SOLRCONFIG-PROPINJECT.XML, SOLRCONFIG-DELPOLICY2.XML, SOLRCONFIG-FUNCTIONQUERY.XML, SCHEMA-LUCENEMATCHVERSION.XML, SOLRCONFIG-UPDATE-PROCESSOR-CHAINS.XML, SOLRCONFIG-SLAVE.XML, SOLRCONFIG-ENABLEPLUGIN.XML, SCHEMA-REPLICATION1.XML, SOLRCONFIG-MASTER2.XML, SOLRCONFIG-TLOG.XML, STOPWORDS.TXT, DA_COMPOUNDDICTIONARY.TXT, BAD-SCHEMA-UNIQUEKEY-IS-COPYFIELD-DEST.XML, SCHEMA-COLLATE.XML, SOLRCONFIG-SPELLCHECKER.XML, SCHEMA-BM25.XML, MISSING.FUNCTIONS.UPDATEPROCESSOR.JS, BAD-SCHEMA-NOT-INDEXED-BUT-TF.XML, SOLRCONFIG-HIGHLIGHT.XML, OLD_SYNONYMS.TXT, SOLRCONFIG-TERMINDEX.XML, SCHEMA-COPYFIELD-TEST.XML, BAD-SCHEMA-UNIQUEKEY-MULTIVALUED.XML, STOPWITHBOM.TXT, BAD-SCHEMA-NOT-INDEXED-BUT-NORMS.XML, HUNSPELL-TEST.AFF, SCHEMA-LMJELINEKMERCER.XML, PHRASESUGGEST.TXT, SOLRCONFIG-SCRIPT-UPDATEPROCESSOR.XML, BAD-SOLRCONFIG-MISSING-SCRIPTFILE.XML, SOLRCONFIG-PHRASESUGGEST.XML, SCHEMASURROUND.XML, BAD-SCHEMA-DUP-FIELD.XML, SOLRCONFIG-PROPINJECT-INDEXDEFAULT.XML, STOPWORDSWRONGENCODING.TXT, BAD-SCHEMA-UNIQUEKEY-USES-DEFAULT.XML, STOP-1.TXT, SOLRCONFIG-SPELLCHECKCOMPONENT.XML, SCHEMA-DFR.XML, SCHEMA-SPELLCHECKER.XML, BAD-SCHEMA-DUP-DYNAMICFIELD.XML, SOLRCONFIG-SLAVE1.XML, BAD_SOLRCONFIG.XML, SOLRCONFIG-DELPOLICY1.XML, SCHEMA-PHRASESUGGEST.XML, SOLRCONFIG-QUERYSENDER.XML, SOLRCONFIG-ELEVATE.XML, DA_UTF8.XML, SCHEMA-BINARYFIELD.XML, SOLRCONFIG-MASTER1.XML, SCHEMA-STOP-KEEP.XML, MISSLEADING.EXTENSION.UPDATEPROCESSOR.JS.TXT, TRIVIAL.UPDATEPROCESSOR0.JS, FRENCHARTICLES.TXT, SOLRCONFIG-SIMPLELOCK.XML, SCHEMA-NOT-REQUIRED-UNIQUE-KEY.XML, STOPTYPES-1.TXT, BAD-SCHEMA-OMIT-TF-BUT-NOT-POS.XML, SOLRCONFIG-MASTER3.XML, CONDITIONAL.UPDATEPROCESSOR.JS, SCHEMA-REPLICATION2.XML, SOLRCONFIG-LAZYWRITER.XML, KEEP-2.TXT, BAD-SCHEMA-DUP-FIELDTYPE.XML, SOLRCONFIG-QUERYSENDER-NOQUERY.XML, XSLT, SOLRCONFIG-NATIVELOCK.XML, SOLRCONFIG-TRANSFORMERS.XML, BAD-SOLRCONFIG-BOGUS-SCRIPTENGINE-NAME.XML, SCHEMA-REVERSED.XML, SCHEMA_CODEC.XML, STOPTYPES-2.TXT, BAD-SCHEMA-NOT-INDEXED-BUT-POS.XML, COMPOUNDDICTIONARY.TXT, SOLRCONFIG-ALTDIRECTORY.XML, BAD-SCHEMA-CODEC-GLOBAL-VS-FT-MISMATCH.XML, SOLRCONFIG-REPEATER.XML, SCHEMA-LMDIRICHLET.XML, STOP-SNOWBALL.TXT, SOLRCONFIG_CODEC.XML, BAD-MP-SOLRCONFIG.XML, SCHEMA-IB.XML, KEEP-1.TXT, SCHEMA-TRIE.XML, SCHEMA-MINIMAL.XML, SOLRCONFIG-MERGEPOLICY.XML, SYNONYMS.TXT, HYPHENATION.DTD, SCHEMA-FOLDING.XML, SCHEMA-NUMERIC.XML, THROW.ERROR.ON.ADD.UPDATEPROCESSOR.JS, BAD-SCHEMA-ANALYZER-CLASS-AND-NESTED.XML, SOLRCONFIG-XINCLUDE.XML, SCHEMA-REQUIRED-FIELDS.XML, BAD-SCHEMA-EXTERNAL-FILEFIELD.XML, ADDFIELDS.UPDATEPROCESSOR.JS, SCHEMA15.XML, CURRENCY.XML, PROTWORDS.TXT, WDFTYPES.TXT, SOLRCONFIG-MASTER.XML, SOLRCONFIG-SOLCOREPROPERTIES.XML, STEMDICT.TXT, SCHEMA.XML, TRIVIAL.UPDATEPROCESSOR1.JS, BAD-SCHEMA-NONTEXT-ANALYZER.XML, HUNSPELL-TEST.DIC, BAD-SOLRCONFIG-INVALID-SCRIPTFILE.XML, SOLRCONFIG-BASIC.XML, STOP-2.TXT, SCHEMA-CHARFILTERS.XML, SOLRCONFIG-CACHING.XML, MAPPING-ISOLATIN1ACCENT.TXT, SOLRCONFIG-REQHANDLER.INCL, SOLRCONFIG_PERF.XML, SCHEMA12.XML, SCHEMA-TFIDF.XML]
[junit4:junit4]   2> 1705 T839 oass.SolrIndexSearcher.<init> Opening Searcher@a6ab99 main
[junit4:junit4]   2> 1705 T839 oass.SolrIndexSearcher.getIndexDir WARNING WARNING: Directory impl does not support setting indexDir: org.apache.lucene.store.MockDirectoryWrapper
[junit4:junit4]   2> 1705 T839 oasu.CommitTracker.<init> Hard AutoCommit: disabled
[junit4:junit4]   2> 1706 T839 oasu.CommitTracker.<init> Soft AutoCommit: disabled
[junit4:junit4]   2> 1706 T839 oashc.QueryElevationComponent.inform Loading QueryElevation from: /mnt/ssd/jenkins/workspace/Lucene-Solr-trunk-Linux/checkout/solr/build/solr-core/test-files/solr/collection1/conf/elevate.xml
[junit4:junit4]   2> 1714 T839 oashc.QueryElevationComponent.inform Loading QueryElevation from: /mnt/ssd/jenkins/workspace/Lucene-Solr-trunk-Linux/checkout/solr/build/solr-core/test-files/solr/collection1/conf/elevate.xml
[junit4:junit4]   2> 1721 T839 oashc.HttpShardHandlerFactory.getParameter Setting socketTimeout to: 0
[junit4:junit4]   2> 1722 T839 oashc.HttpShardHandlerFactory.getParameter Setting urlScheme to: http://
[junit4:junit4]   2> 1722 T839 oashc.HttpShardHandlerFactory.getParameter Setting connTimeout to: 0
[junit4:junit4]   2> 1722 T839 oashc.HttpShardHandlerFactory.getParameter Setting maxConnectionsPerHost to: 20
[junit4:junit4]   2> 1727 T839 oashc.HttpShardHandlerFactory.getParameter Setting corePoolSize to: 0
[junit4:junit4]   2> 1727 T839 oashc.HttpShardHandlerFactory.getParameter Setting maximumPoolSize to: 2147483647
[junit4:junit4]   2> 1727 T839 oashc.HttpShardHandlerFactory.getParameter Setting maxThreadIdleTime to: 5
[junit4:junit4]   2> 1728 T839 oashc.HttpShardHandlerFactory.getParameter Setting sizeOfQueue to: -1
[junit4:junit4]   2> 1728 T839 oashc.HttpShardHandlerFactory.getParameter Setting fairnessPolicy to: false
[junit4:junit4]   2> 1728 T839 oascsi.HttpClientUtil.createClient Creating new http client, config:maxConnectionsPerHost=20&maxConnections=10000&socketTimeout=0&connTimeout=0&retry=false
[junit4:junit4]   2> 1737 T880 oasc.SolrCore.registerSearcher [collection1] Registered new searcher Searcher@a6ab99 main{StandardDirectoryReader(segments_1:1)}
[junit4:junit4]   2> 1738 T839 oasc.CoreContainer.register registering core: collection1
[junit4:junit4]   2> 1738 T839 oass.SolrDispatchFilter.init user.dir=/mnt/ssd/jenkins/workspace/Lucene-Solr-trunk-Linux/checkout/solr/build/solr-core/test/J1
[junit4:junit4]   2> 1738 T839 oass.SolrDispatchFilter.init SolrDispatchFilter.init() done
[junit4:junit4]   2> 1739 T839 oascsi.HttpClientUtil.createClient Creating new http client, config:maxConnections=128&maxConnectionsPerHost=32&followRedirects=false
[junit4:junit4]   2> ASYNC  NEW_CORE C25 name=collection1 org.apache.solr.core.SolrCore@dd14b8
[junit4:junit4]   2> 1883 T844 C25 oasu.DirectUpdateHandler2.deleteAll [collection1] REMOVING ALL DOCUMENTS FROM INDEX
[junit4:junit4]   2> 1884 T844 C25 oasc.SolrDeletionPolicy.onInit SolrDeletionPolicy.onInit: commits:num=1
[junit4:junit4]   2> 		commit{dir=MockDirWrapper(org.apache.lucene.store.RAMDirectory@e70a60 lockFactory=org.apache.lucene.store.SingleInstanceLockFactory@2b1e2c),segFN=segments_1,generation=1,filenames=[segments_1]
[junit4:junit4]   2> 1885 T844 C25 oasc.SolrDeletionPolicy.updateCommits newest commit = 1
[junit4:junit4]   2> 1885 T844 C25 UPDATE [collection1] webapp=/solr path=/update params={version=2&wt=javabin} {deleteByQuery=*:*} 0 8
[junit4:junit4]   2> ASYNC  NEW_CORE C26 name=collection1 org.apache.solr.core.SolrCore@1c89d05
[junit4:junit4]   2> 1905 T854 C26 oasu.DirectUpdateHandler2.deleteAll [collection1] REMOVING ALL DOCUMENTS FROM INDEX
[junit4:junit4]   2> 1906 T854 C26 oasc.SolrDeletionPolicy.onInit SolrDeletionPolicy.onInit: commits:num=1
[junit4:junit4]   2> 		commit{dir=MockDirWrapper(org.apache.lucene.store.RAMDirectory@1bcd0e6 lockFactory=org.apache.lucene.store.SingleInstanceLockFactory@c8d5d9),segFN=segments_1,generation=1,filenames=[segments_1]
[junit4:junit4]   2> 1907 T854 C26 oasc.SolrDeletionPolicy.updateCommits newest commit = 1
[junit4:junit4]   2> 1907 T854 C26 UPDATE [collection1] webapp=/solr path=/update params={version=2&wt=javabin} {deleteByQuery=*:*} 0 2
[junit4:junit4]   2> ASYNC  NEW_CORE C27 name=collection1 org.apache.solr.core.SolrCore@80e219
[junit4:junit4]   2> 1925 T863 C27 oasu.DirectUpdateHandler2.deleteAll [collection1] REMOVING ALL DOCUMENTS FROM INDEX
[junit4:junit4]   2> 1927 T863 C27 oasc.SolrDeletionPolicy.onInit SolrDeletionPolicy.onInit: commits:num=1
[junit4:junit4]   2> 		commit{dir=MockDirWrapper(NRTCachingDirectory(org.apache.lucene.store.RAMDirectory@17c08ce lockFactory=org.apache.lucene.store.SingleInstanceLockFactory@145a380; maxCacheMB=0.4736328125 maxMergeSizeMB=0.828125)),segFN=segments_1,generation=1,filenames=[segments_1]
[junit4:junit4]   2> 1928 T863 C27 oasc.SolrDeletionPolicy.updateCommits newest commit = 1
[junit4:junit4]   2> 1928 T863 C27 UPDATE [collection1] webapp=/solr path=/update params={version=2&wt=javabin} {deleteByQuery=*:*} 0 3
[junit4:junit4]   2> ASYNC  NEW_CORE C28 name=collection1 org.apache.solr.core.SolrCore@8c541
[junit4:junit4]   2> 1933 T873 C28 oasu.DirectUpdateHandler2.deleteAll [collection1] REMOVING ALL DOCUMENTS FROM INDEX
[junit4:junit4]   2> 1935 T873 C28 oasc.SolrDeletionPolicy.onInit SolrDeletionPolicy.onInit: commits:num=1
[junit4:junit4]   2> 		commit{dir=MockDirWrapper(org.apache.lucene.store.RAMDirectory@1ce2e6b lockFactory=org.apache.lucene.store.SingleInstanceLockFactory@174809f),segFN=segments_1,generation=1,filenames=[segments_1]
[junit4:junit4]   2> 1935 T873 C28 oasc.SolrDeletionPolicy.updateCommits newest commit = 1
[junit4:junit4]   2> 1935 T873 C28 UPDATE [collection1] webapp=/solr path=/update params={version=2&wt=javabin} {deleteByQuery=*:*} 0 2
[junit4:junit4]   2> 1941 T844 C25 UPDATE [collection1] webapp=/solr path=/update params={version=2&wt=javabin} {add=[1]} 0 2
[junit4:junit4]   2> 1944 T854 C26 UPDATE [collection1] webapp=/solr path=/update params={version=2&wt=javabin} {add=[1]} 0 0
[junit4:junit4]   2> 1947 T844 C25 UPDATE [collection1] webapp=/solr path=/update params={version=2&wt=javabin} {add=[2]} 0 0
[junit4:junit4]   2> 1950 T863 C27 UPDATE [collection1] webapp=/solr path=/update params={version=2&wt=javabin} {add=[2]} 0 0
[junit4:junit4]   2> 1953 T844 C25 UPDATE [collection1] webapp=/solr path=/update params={version=2&wt=javabin} {add=[3]} 0 0
[junit4:junit4]   2> 1956 T873 C28 UPDATE [collection1] webapp=/solr path=/update params={version=2&wt=javabin} {add=[3]} 0 1
[junit4:junit4]   2> 1959 T844 C25 UPDATE [collection1] webapp=/solr path=/update params={version=2&wt=javabin} {add=[4]} 0 1
[junit4:junit4]   2> 1962 T854 C26 UPDATE [collection1] webapp=/solr path=/update params={version=2&wt=javabin} {add=[4]} 0 0
[junit4:junit4]   2> 1971 T844 C25 UPDATE [collection1] webapp=/solr path=/update params={version=2&wt=javabin} {add=[5]} 0 1
[junit4:junit4]   2> 1974 T863 C27 UPDATE [collection1] webapp=/solr path=/update params={version=2&wt=javabin} {add=[5]} 0 0
[junit4:junit4]   2> 1977 T844 C25 UPDATE [collection1] webapp=/solr path=/update params={version=2&wt=javabin} {add=[6]} 0 1
[junit4:junit4]   2> 1979 T873 C28 UPDATE [collection1] webapp=/solr path=/update params={version=2&wt=javabin} {add=[6]} 0 0
[junit4:junit4]   2> 1983 T844 C25 UPDATE [collection1] webapp=/solr path=/update params={version=2&wt=javabin} {add=[7]} 0 0
[junit4:junit4]   2> 1985 T873 C28 UPDATE [collection1] webapp=/solr path=/update params={version=2&wt=javabin} {add=[7]} 0 0
[junit4:junit4]   2> 1993 T844 C25 oasu.DirectUpdateHandler2.commit start commit{flags=0,_version_=0,optimize=false,openSearcher=true,waitSearcher=true,expungeDeletes=false,softCommit=false}
[junit4:junit4]   2> 1994 T844 C25 oasc.SolrDeletionPolicy.onCommit SolrDeletionPolicy.onCommit: commits:num=2
[junit4:junit4]   2> 		commit{dir=MockDirWrapper(org.apache.lucene.store.RAMDirectory@e70a60 lockFactory=org.apache.lucene.store.SingleInstanceLockFactory@2b1e2c),segFN=segments_1,generation=1,filenames=[segments_1]
[junit4:junit4]   2> 		commit{dir=MockDirWrapper(org.apache.lucene.store.RAMDirectory@e70a60 lockFactory=org.apache.lucene.store.SingleInstanceLockFactory@2b1e2c),segFN=segments_2,generation=2,filenames=[_0_MockFixedIntBlock_0.doc, _0_MockFixedIntBlock_0.skp, _0_nrm.cfs, _0_nrm.cfe, _0_Asserting_0.prx, _0_Asserting_0.tip, _0_MockFixedIntBlock_0.pos, _0.fnm, _0_MockFixedIntBlock_0.frq, _0.fdt, segments_2, _0_MockFixedIntBlock_0.pyl, _0_MockFixedIntBlock_0.tib, _0_Asserting_0.frq, _0.fdx, _0.si, _0_MockFixedIntBlock_0.tii, _0_Asserting_0.tim]
[junit4:junit4]   2> 1995 T844 C25 oasc.SolrDeletionPolicy.updateCommits newest commit = 2
[junit4:junit4]   2> 1996 T844 C25 oass.SolrIndexSearcher.<init> Opening Searcher@16dc776 main
[junit4:junit4]   2> 1996 T844 C25 oass.SolrIndexSearcher.getIndexDir WARNING WARNING: Directory impl does not support setting indexDir: org.apache.lucene.store.MockDirectoryWrapper
[junit4:junit4]   2> 1998 T844 C25 oasu.DirectUpdateHandler2.commit end_commit_flush
[junit4:junit4]   2> 1998 T850 oasc.SolrCore.registerSearcher [collection1] Registered new searcher Searcher@16dc776 main{StandardDirectoryReader(segments_2:4 _0(5.0):C7)}
[junit4:junit4]   2> 1999 T844 C25 UPDATE [collection1] webapp=/solr path=/update params={wt=javabin&version=2&waitSearcher=true&commit=true&softCommit=false} {commit=} 0 6
[junit4:junit4]   2> 2002 T854 C26 oasu.DirectUpdateHandler2.commit start commit{flags=0,_version_=0,optimize=false,openSearcher=true,waitSearcher=true,expungeDeletes=false,softCommit=false}
[junit4:junit4]   2> 2004 T854 C26 oasc.SolrDeletionPolicy.onCommit SolrDeletionPolicy.onCommit: commits:num=2
[junit4:junit4]   2> 		commit{dir=MockDirWrapper(org.apache.lucene.store.RAMDirectory@1bcd0e6 lockFactory=org.apache.lucene.store.SingleInstanceLockFactory@c8d5d9),segFN=segments_1,generation=1,filenames=[segments_1]
[junit4:junit4]   2> 		commit{dir=MockDirWrapper(org.apache.lucene.store.RAMDirectory@1bcd0e6 lockFactory=org.apache.lucene.store.SingleInstanceLockFactory@c8d5d9),segFN=segments_2,generation=2,filenames=[_0_MockFixedIntBlock_0.doc, _0_MockFixedIntBlock_0.skp, _0_nrm.cfs, _0_nrm.cfe, _0_Asserting_0.prx, _0_Asserting_0.tip, _0_MockFixedIntBlock_0.pos, _0.fnm, _0_MockFixedIntBlock_0.frq, _0.fdt, segments_2, _0_MockFixedIntBlock_0.pyl, _0_MockFixedIntBlock_0.tib, _0_Asserting_0.frq, _0.fdx, _0.si, _0_MockFixedIntBlock_0.tii, _0_Asserting_0.tim]
[junit4:junit4]   2> 2004 T854 C26 oasc.SolrDeletionPolicy.updateCommits newest commit = 2
[junit4:junit4]   2> 2005 T854 C26 oass.SolrIndexSearcher.<init> Opening Searcher@dd1801 main
[junit4:junit4]   2> 2006 T854 C26 oass.SolrIndexSearcher.getIndexDir WARNING WARNING: Directory impl does not support setting indexDir: org.apache.lucene.store.MockDirectoryWrapper
[junit4:junit4]   2> 2006 T854 C26 oasu.DirectUpdateHandler2.commit end_commit_flush
[junit4:junit4]   2> 2006 T860 oasc.SolrCore.registerSearcher [collection1] Registered new searcher Searcher@dd1801 main{StandardDirectoryReader(segments_2:4 _0(5.0):C2)}
[junit4:junit4]   2> 2008 T854 C26 UPDATE [collection1] webapp=/solr path=/update params={wt=javabin&version=2&waitSearcher=true&commit=true&softCommit=false} {commit=} 0 6
[junit4:junit4]   2> 2017 T863 C27 oasu.DirectUpdateHandler2.commit start commit{flags=0,_version_=0,optimize=false,openSearcher=true,waitSearcher=true,expungeDeletes=false,softCommit=false}
[junit4:junit4]   2> 2020 T863 C27 oasc.SolrDeletionPolicy.onCommit SolrDeletionPolicy.onCommit: commits:num=2
[junit4:junit4]   2> 		commit{dir=MockDirWrapper(NRTCachingDirectory(org.apache.lucene.store.RAMDirectory@17c08ce lockFactory=org.apache.lucene.store.SingleInstanceLockFactory@145a380; maxCacheMB=0.4736328125 maxMergeSizeMB=0.828125)),segFN=segments_1,generation=1,filenames=[segments_1]
[junit4:junit4]   2> 		commit{dir=MockDirWrapper(NRTCachingDirectory(org.apache.lucene.store.RAMDirectory@17c08ce lockFactory=org.apache.lucene.store.SingleInstanceLockFactory@145a380; maxCacheMB=0.4736328125 maxMergeSizeMB=0.828125)),segFN=segments_2,generation=2,filenames=[_0_MockFixedIntBlock_0.doc, _0_MockFixedIntBlock_0.skp, _0_nrm.cfs, _0_nrm.cfe, _0_Asserting_0.prx, _0_Asserting_0.tip, _0_MockFixedIntBlock_0.pos, _0.fnm, _0_MockFixedIntBlock_0.frq, _0.fdt, segments_2, _0_MockFixedIntBlock_0.pyl, _0_MockFixedIntBlock_0.tib, _0_Asserting_0.frq, _0.fdx, _0.si, _0_MockFixedIntBlock_0.tii, _0_Asserting_0.tim]
[junit4:junit4]   2> 2021 T863 C27 oasc.SolrDeletionPolicy.updateCommits newest commit = 2
[junit4:junit4]   2> 2022 T863 C27 oass.SolrIndexSearcher.<init> Opening Searcher@7ecd45 main
[junit4:junit4]   2> 2022 T863 C27 oass.SolrIndexSearcher.getIndexDir WARNING WARNING: Directory impl does not support setting indexDir: org.apache.lucene.store.MockDirectoryWrapper
[junit4:junit4]   2> 2023 T870 oasc.SolrCore.registerSearcher [collection1] Registered new searcher Searcher@7ecd45 main{StandardDirectoryReader(segments_2:4 _0(5.0):C2)}
[junit4:junit4]   2> 2023 T863 C27 oasu.DirectUpdateHandler2.commit end_commit_flush
[junit4:junit4]   2> 2024 T863 C27 UPDATE [collection1] webapp=/solr path=/update params={wt=javabin&version=2&waitSearcher=true&commit=true&softCommit=false} {commit=} 0 7
[junit4:junit4]   2> 2027 T873 C28 oasu.DirectUpdateHandler2.commit start commit{flags=0,_version_=0,optimize=false,openSearcher=true,waitSearcher=true,expungeDeletes=false,softCommit=false}
[junit4:junit4]   2> 2029 T873 C28 oasc.SolrDeletionPolicy.onCommit SolrDeletionPolicy.onCommit: commits:num=2
[junit4:junit4]   2> 		commit{dir=MockDirWrapper(org.apache.lucene.store.RAMDirectory@1ce2e6b lockFactory=org.apache.lucene.store.SingleInstanceLockFactory@174809f),segFN=segments_1,generation=1,filenames=[segments_1]
[junit4:junit4]   2> 		commit{dir=MockDirWrapper(org.apache.lucene.store.RAMDirectory@1ce2e6b lockFactory=org.apache.lucene.store.SingleInstanceLockFactory@174809f),segFN=segments_2,generation=2,filenames=[_0_MockFixedIntBlock_0.doc, _0_MockFixedIntBlock_0.skp, _0_nrm.cfs, _0_nrm.cfe, _0_Asserting_0.prx, _0_Asserting_0.tip, _0_MockFixedIntBlock_0.pos, _0.fnm, _0_MockFixedIntBlock_0.frq, _0.fdt, segments_2, _0_MockFixedIntBlock_0.pyl, _0_MockFixedIntBlock_0.tib, _0_Asserting_0.frq, _0.fdx, _0.si, _0_MockFixedIntBlock_0.tii, _0_Asserting_0.tim]
[junit4:junit4]   2> 2029 T873 C28 oasc.SolrDeletionPolicy.updateCommits newest commit = 2
[junit4:junit4]   2> 2030 T873 C28 oass.SolrIndexSearcher.<init> Opening Searcher@1b539f6 main
[junit4:junit4]   2> 2030 T873 C28 oass.SolrIndexSearcher.getIndexDir WARNING WARNING: Directory impl does not support setting indexDir: org.apache.lucene.store.MockDirectoryWrapper
[junit4:junit4]   2> 2031 T873 C28 oasu.DirectUpdateHandler2.commit end_commit_flush
[junit4:junit4]   2> 2031 T880 oasc.SolrCore.registerSearcher [collection1] Registered new searcher Searcher@1b539f6 main{StandardDirectoryReader(segments_2:4 _0(5.0):C3)}
[junit4:junit4]   2> 2031 T873 C28 UPDATE [collection1] webapp=/solr path=/update params={wt=javabin&version=2&waitSearcher=true&commit=true&softCommit=false} {commit=} 0 4
[junit4:junit4]   2> 2051 T844 C25 REQ [collection1] webapp=/solr path=/elevate params={rows=500&qt=/elevate&q=*:*&shards.qt=/elevate&wt=javabin&version=2&fl=id,+score,+[elevated]&sort=id+desc&distrib=false} hits=7 status=0 QTime=12 
[junit4:junit4]   2> 2108 T874 C28 REQ [collection1] webapp=/solr path=/elevate params={shard.url=localhost:32952/solr&isShard=true&fsv=true&q=*:*&wt=javabin&version=2&fl=id,score&sort=id+desc&NOW=1343962724233&rows=500&start=0&qt=/elevate&shards.qt=/elevate&distrib=false} hits=3 status=0 QTime=2 
[junit4:junit4]   2> 2108 T855 C26 REQ [collection1] webapp=/solr path=/elevate params={shard.url=localhost:32882/solr|[::1]:33332/solr&isShard=true&fsv=true&q=*:*&wt=javabin&version=2&fl=id,score&sort=id+desc&NOW=1343962724233&rows=500&start=0&qt=/elevate&shards.qt=/elevate&distrib=false} hits=2 status=0 QTime=1 
[junit4:junit4]   2> 2108 T864 C27 REQ [collection1] webapp=/solr path=/elevate params={shard.url=localhost:53194/solr|[::1]:33332/solr&isShard=true&fsv=true&q=*:*&wt=javabin&version=2&fl=id,score&sort=id+desc&NOW=1343962724233&rows=500&start=0&qt=/elevate&shards.qt=/elevate&distrib=false} hits=2 status=0 QTime=1 
[junit4:junit4]   2> 2115 T855 C26 REQ [collection1] webapp=/solr path=/elevate params={shard.url=localhost:32882/solr|[::1]:33332/solr&isShard=true&ids=4.0,1.0&q=*:*&wt=javabin&version=2&fl=id,+score,+[elevated]&NOW=1343962724233&rows=500&qt=/elevate&shards.qt=/elevate&distrib=false} status=0 QTime=1 
[junit4:junit4]   2> 2115 T874 C28 REQ [collection1] webapp=/solr path=/elevate params={shard.url=localhost:32952/solr&isShard=true&ids=7.0,6.0,3.0&q=*:*&wt=javabin&version=2&fl=id,+score,+[elevated]&NOW=1343962724233&rows=500&qt=/elevate&shards.qt=/elevate&distrib=false} status=0 QTime=1 
[junit4:junit4]   2> 2116 T864 C27 REQ [collection1] webapp=/solr path=/elevate params={shard.url=localhost:53194/solr|[::1]:33332/solr&isShard=true&ids=2.0,5.0&q=*:*&wt=javabin&version=2&fl=id,+score,+[elevated]&NOW=1343962724233&rows=500&qt=/elevate&shards.qt=/elevate&distrib=false} status=0 QTime=3 
[junit4:junit4]   2> 2117 T854 C26 REQ [collection1] webapp=/solr path=/elevate params={rows=500&shards=localhost:32882/solr|[::1]:33332/solr,localhost:53194/solr|[::1]:33332/solr,localhost:32952/solr&qt=/elevate&q=*:*&shards.qt=/elevate&wt=javabin&version=2&fl=id,+score,+[elevated]&sort=id+desc} status=0 QTime=62 
[junit4:junit4]   2> 2118 T839 oas.BaseDistributedSearchTestCase.compareResponses SEVERE Mismatched responses:
[junit4:junit4]   2> 	{responseHeader={status=0,QTime=62,params={rows=500,shards=localhost:32882/solr|[::1]:33332/solr,localhost:53194/solr|[::1]:33332/solr,localhost:32952/solr,qt=/elevate,q=*:*,shards.qt=/elevate,wt=javabin,version=2,fl=id, score, [elevated],sort=id desc}},response={numFound=7,start=0,maxScore=1.0,docs=[SolrDocument{id=7.0, [elevated]=false, score=1.0}, SolrDocument{id=6.0, [elevated]=false, score=1.0}, SolrDocument{id=5.0, [elevated]=false, score=1.0}, SolrDocument{id=4.0, [elevated]=false, score=1.0}, SolrDocument{id=3.0, [elevated]=false, score=1.0}, SolrDocument{id=2.0, [elevated]=false, score=1.0}, SolrDocument{id=1.0, [elevated]=false, score=1.0}]}}
[junit4:junit4]   2> 	{responseHeader={status=0,QTime=12,params={rows=500,qt=/elevate,q=*:*,shards.qt=/elevate,wt=javabin,version=2,fl=id, score, [elevated],sort=id desc,distrib=false}},response={numFound=7,start=0,maxScore=1.0,docs=[SolrDocument{id=7.0, score=1.0, [elevated]=false}, SolrDocument{id=6.0, score=1.0, [elevated]=false}, SolrDocument{id=5.0, score=1.0, [elevated]=false}, SolrDocument{id=4.0, score=1.0, [elevated]=false}, SolrDocument{id=3.0, score=1.0, [elevated]=false}, SolrDocument{id=2.0, score=1.0, [elevated]=false}, SolrDocument{id=1.0, score=1.0, [elevated]=false}]}}
[junit4:junit4]   2> 2120 T839 oasc.CoreContainer.shutdown Shutting down CoreContainer instance=28141543
[junit4:junit4]   2> 2120 T839 oasc.SolrCore.close [collection1]  CLOSING SolrCore org.apache.solr.core.SolrCore@dd14b8
[junit4:junit4]   2> 2121 T839 oasc.SolrCore.closeSearcher [collection1] Closing main searcher on request.
[junit4:junit4]   2> 2121 T839 oasu.DirectUpdateHandler2.close closing DirectUpdateHandler2{commits=1,autocommits=0,soft autocommits=0,optimizes=0,rollbacks=0,expungeDeletes=0,docsPending=0,adds=0,deletesById=0,deletesByQuery=0,errors=0,cumulative_adds=7,cumulative_deletesById=0,cumulative_deletesByQuery=1,cumulative_errors=0}
[junit4:junit4]   2> 2125 T839 oejsh.ContextHandler.doStop stopped o.e.j.s.ServletContextHandler{/solr,null}
[junit4:junit4]   2> 2178 T839 oasc.CoreContainer.shutdown Shutting down CoreContainer instance=1358408
[junit4:junit4]   2> 2179 T839 oasc.SolrCore.close [collection1]  CLOSING SolrCore org.apache.solr.core.SolrCore@1c89d05
[junit4:junit4]   2> 2179 T839 oasc.SolrCore.closeSearcher [collection1] Closing main searcher on request.
[junit4:junit4]   2> 2180 T839 oasu.DirectUpdateHandler2.close closing DirectUpdateHandler2{commits=1,autocommits=0,soft autocommits=0,optimizes=0,rollbacks=0,expungeDeletes=0,docsPending=0,adds=0,deletesById=0,deletesByQuery=0,errors=0,cumulative_adds=2,cumulative_deletesById=0,cumulative_deletesByQuery=1,cumulative_errors=0}
[junit4:junit4]   2> 2204 T839 oejsh.ContextHandler.doStop stopped o.e.j.s.ServletContextHandler{/solr,null}
[junit4:junit4]   2> 2256 T839 oasc.CoreContainer.shutdown Shutting down CoreContainer instance=13785718
[junit4:junit4]   2> 2257 T839 oasc.SolrCore.close [collection1]  CLOSING SolrCore org.apache.solr.core.SolrCore@80e219
[junit4:junit4]   2> 2257 T839 oasc.SolrCore.closeSearcher [collection1] Closing main searcher on request.
[junit4:junit4]   2> 2258 T839 oasu.DirectUpdateHandler2.close closing DirectUpdateHandler2{commits=1,autocommits=0,soft autocommits=0,optimizes=0,rollbacks=0,expungeDeletes=0,docsPending=0,adds=0,deletesById=0,deletesByQuery=0,errors=0,cumulative_adds=2,cumulative_deletesById=0,cumulative_deletesByQuery=1,cumulative_errors=0}
[junit4:junit4]   2> 2261 T839 oejsh.ContextHandler.doStop stopped o.e.j.s.ServletContextHandler{/solr,null}
[junit4:junit4]   2> 2312 T839 oasc.CoreContainer.shutdown Shutting down CoreContainer instance=18311216
[junit4:junit4]   2> 2313 T839 oasc.SolrCore.close [collection1]  CLOSING SolrCore org.apache.solr.core.SolrCore@8c541
[junit4:junit4]   2> 2314 T839 oasc.SolrCore.closeSearcher [collection1] Closing main searcher on request.
[junit4:junit4]   2> 2314 T839 oasu.DirectUpdateHandler2.close closing DirectUpdateHandler2{commits=1,autocommits=0,soft autocommits=0,optimizes=0,rollbacks=0,expungeDeletes=0,docsPending=0,adds=0,deletesById=0,deletesByQuery=0,errors=0,cumulative_adds=3,cumulative_deletesById=0,cumulative_deletesByQuery=1,cumulative_errors=0}
[junit4:junit4]   2> 2318 T839 oejsh.ContextHandler.doStop stopped o.e.j.s.ServletContextHandler{/solr,null}
[junit4:junit4]   2> 2370 T839 oas.SolrTestCaseJ4.tearDown ###Ending testDistribSearch
[junit4:junit4]   2> NOTE: reproduce with: ant test  -Dtestcase=DistributedQueryElevationComponentTest -Dtests.method=testDistribSearch -Dtests.seed=5F02A6BB63B4316E -Dtests.multiplier=3 -Dtests.slow=true -Dtests.locale=be_BY -Dtests.timezone=Atlantic/Faeroe -Dtests.file.encoding=US-ASCII
[junit4:junit4]   2>
[junit4:junit4]    > (@AfterClass output)
[junit4:junit4]   2> 2426 T839 oas.SolrTestCaseJ4.deleteCore ###deleteCore
[junit4:junit4]   2> NOTE: test params are: codec=Lucene40: {int_i=PostingsFormat(name=Asserting), text=PostingsFormat(name=Asserting), field_t=MockFixedIntBlock(blockSize=28), id=MockFixedIntBlock(blockSize=28), plow_t=PostingsFormat(name=Asserting)}, sim=RandomSimilarityProvider(queryNorm=false,coord=false): {}, locale=be_BY, timezone=Atlantic/Faeroe
[junit4:junit4]   2> NOTE: Linux 3.2.0-27-generic i386/Oracle Corporation 1.8.0-ea (32-bit)/cpus=8,threads=1,free=22447616,total=72089600
[junit4:junit4]   2> NOTE: All tests run in this JVM: [SolrInfoMBeanTest, TestQuerySenderListener, PrimUtilsTest, TestFunctionQuery, TestPHPSerializedResponseWriter, DebugComponentTest, TestCharFilters, FileUtilsTest, TestFoldingMultitermQuery, TestFiltering, ZkNodePropsTest, OutputWriterTest, URLClassifyProcessorTest, TimeZoneUtilsTest, QueryEqualityTest, TestSolrDeletionPolicy1, OverseerTest, QueryElevationComponentTest, TestQueryTypes, SpellCheckComponentTest, SpellingQueryConverterTest, ZkControllerTest, SystemInfoHandlerTest, DocumentBuilderTest, SolrIndexConfigTest, TestJoin, TestFaceting, CircularListTest, IndexReaderFactoryTest, IndexBasedSpellCheckerTest, TestUpdate, TestStressVersions, RequiredFieldsTest, SolrPluginUtilsTest, DistributedQueryElevationComponentTest]
[junit4:junit4]   2> 
[junit4:junit4] Completed on J1 in 2.43s, 1 test, 1 failure <<< FAILURES!

[...truncated 392 lines...]
BUILD FAILED
/mnt/ssd/jenkins/workspace/Lucene-Solr-trunk-Linux/checkout/build.xml:29: The following error occurred while executing this line:
/mnt/ssd/jenkins/workspace/Lucene-Solr-trunk-Linux/checkout/solr/build.xml:144: The following error occurred while executing this line:
/mnt/ssd/jenkins/workspace/Lucene-Solr-trunk-Linux/checkout/lucene/module-build.xml:62: The following error occurred while executing this line:
/mnt/ssd/jenkins/workspace/Lucene-Solr-trunk-Linux/checkout/lucene/common-build.xml:1095: The following error occurred while executing this line:
/mnt/ssd/jenkins/workspace/Lucene-Solr-trunk-Linux/checkout/lucene/common-build.xml:790: There were test failures: 223 suites, 899 tests, 1 failure, 5 ignored

Total time: 20 minutes 40 seconds
Build step 'Execute shell' marked build as failure
Archiving artifacts
Recording test results
Email was triggered for: Failure
Sending email for trigger: Failure



Mime
View raw message