lucene-dev mailing list archives

Site index · List index
Message view « Date » · « Thread »
Top « Date » · « Thread »
From Apache Jenkins Server <jenk...@builds.apache.org>
Subject [JENKINS-MAVEN] Lucene-Solr-Maven-4.x #60: POMs out of sync
Date Mon, 13 Aug 2012 12:49:53 GMT
Build: https://builds.apache.org/job/Lucene-Solr-Maven-4.x/60/

1 tests failed.
FAILED:  org.apache.solr.cloud.BasicDistributedZkTest.testDistribSearch

Error Message:
ERROR: [doc=1000] multiple values encountered for non multiValued field val_i: [10, 20]

Stack Trace:
org.apache.solr.common.SolrException: ERROR: [doc=1000] multiple values encountered for non multiValued field val_i: [10, 20]
	at __randomizedtesting.SeedInfo.seed([55D7FA3E0AFC2961:D43174267DA3495D]:0)
	at org.apache.solr.client.solrj.impl.HttpSolrServer.request(HttpSolrServer.java:402)
	at org.apache.solr.client.solrj.impl.HttpSolrServer.request(HttpSolrServer.java:182)
	at org.apache.solr.client.solrj.request.AbstractUpdateRequest.process(AbstractUpdateRequest.java:117)
	at org.apache.solr.client.solrj.SolrServer.add(SolrServer.java:122)
	at org.apache.solr.client.solrj.SolrServer.add(SolrServer.java:107)
	at org.apache.solr.cloud.BasicDistributedZkTest.doOptimisticLockingAndUpdating(BasicDistributedZkTest.java:673)
	at org.apache.solr.cloud.BasicDistributedZkTest.doTest(BasicDistributedZkTest.java:300)
	at org.apache.solr.BaseDistributedSearchTestCase.testDistribSearch(BaseDistributedSearchTestCase.java:691)
	at sun.reflect.NativeMethodAccessorImpl.invoke0(Native Method)
	at sun.reflect.NativeMethodAccessorImpl.invoke(NativeMethodAccessorImpl.java:57)
	at sun.reflect.DelegatingMethodAccessorImpl.invoke(DelegatingMethodAccessorImpl.java:43)
	at java.lang.reflect.Method.invoke(Method.java:616)
	at com.carrotsearch.randomizedtesting.RandomizedRunner.invoke(RandomizedRunner.java:1559)
	at com.carrotsearch.randomizedtesting.RandomizedRunner.access$600(RandomizedRunner.java:79)
	at com.carrotsearch.randomizedtesting.RandomizedRunner$6.evaluate(RandomizedRunner.java:737)
	at com.carrotsearch.randomizedtesting.RandomizedRunner$7.evaluate(RandomizedRunner.java:773)
	at com.carrotsearch.randomizedtesting.RandomizedRunner$8.evaluate(RandomizedRunner.java:787)
	at com.carrotsearch.randomizedtesting.rules.SystemPropertiesRestoreRule$1.evaluate(SystemPropertiesRestoreRule.java:53)
	at org.apache.lucene.util.TestRuleSetupTeardownChained$1.evaluate(TestRuleSetupTeardownChained.java:50)
	at org.apache.lucene.util.TestRuleFieldCacheSanity$1.evaluate(TestRuleFieldCacheSanity.java:32)
	at org.apache.lucene.util.AbstractBeforeAfterRule$1.evaluate(AbstractBeforeAfterRule.java:45)
	at com.carrotsearch.randomizedtesting.rules.SystemPropertiesInvariantRule$1.evaluate(SystemPropertiesInvariantRule.java:55)
	at org.apache.lucene.util.TestRuleThreadAndTestName$1.evaluate(TestRuleThreadAndTestName.java:48)
	at org.apache.lucene.util.TestRuleIgnoreAfterMaxFailures$1.evaluate(TestRuleIgnoreAfterMaxFailures.java:70)
	at org.apache.lucene.util.TestRuleMarkFailure$1.evaluate(TestRuleMarkFailure.java:48)
	at com.carrotsearch.randomizedtesting.rules.StatementAdapter.evaluate(StatementAdapter.java:36)
	at com.carrotsearch.randomizedtesting.ThreadLeakControl$StatementRunner.run(ThreadLeakControl.java:345)
	at com.carrotsearch.randomizedtesting.ThreadLeakControl.forkTimeoutingTask(ThreadLeakControl.java:769)
	at com.carrotsearch.randomizedtesting.ThreadLeakControl$3.evaluate(ThreadLeakControl.java:429)
	at com.carrotsearch.randomizedtesting.RandomizedRunner.runSingleTest(RandomizedRunner.java:746)
	at com.carrotsearch.randomizedtesting.RandomizedRunner$3.evaluate(RandomizedRunner.java:648)
	at com.carrotsearch.randomizedtesting.RandomizedRunner$4.evaluate(RandomizedRunner.java:682)
	at com.carrotsearch.randomizedtesting.RandomizedRunner$5.evaluate(RandomizedRunner.java:693)
	at com.carrotsearch.randomizedtesting.rules.StatementAdapter.evaluate(StatementAdapter.java:36)
	at com.carrotsearch.randomizedtesting.rules.SystemPropertiesRestoreRule$1.evaluate(SystemPropertiesRestoreRule.java:53)
	at org.apache.lucene.util.AbstractBeforeAfterRule$1.evaluate(AbstractBeforeAfterRule.java:45)
	at org.apache.lucene.util.TestRuleStoreClassName$1.evaluate(TestRuleStoreClassName.java:38)
	at com.carrotsearch.randomizedtesting.rules.SystemPropertiesInvariantRule$1.evaluate(SystemPropertiesInvariantRule.java:55)
	at com.carrotsearch.randomizedtesting.rules.NoShadowingOrOverridesOnMethodsRule$1.evaluate(NoShadowingOrOverridesOnMethodsRule.java:39)
	at com.carrotsearch.randomizedtesting.rules.NoShadowingOrOverridesOnMethodsRule$1.evaluate(NoShadowingOrOverridesOnMethodsRule.java:39)
	at org.apache.lucene.util.TestRuleAssertionsRequired$1.evaluate(TestRuleAssertionsRequired.java:40)
	at org.apache.lucene.util.TestRuleMarkFailure$1.evaluate(TestRuleMarkFailure.java:48)
	at org.apache.lucene.util.TestRuleIgnoreAfterMaxFailures$1.evaluate(TestRuleIgnoreAfterMaxFailures.java:70)
	at org.apache.lucene.util.TestRuleIgnoreTestSuites$1.evaluate(TestRuleIgnoreTestSuites.java:55)
	at com.carrotsearch.randomizedtesting.rules.StatementAdapter.evaluate(StatementAdapter.java:36)
	at com.carrotsearch.randomizedtesting.ThreadLeakControl$StatementRunner.run(ThreadLeakControl.java:345)
	at java.lang.Thread.run(Thread.java:679)




Build Log:
[...truncated 2915 lines...]
Running org.apache.solr.cloud.BasicDistributedZkTest
Creating dataDir: /usr/home/hudson/hudson-slave/workspace/Lucene-Solr-Maven-4.x/maven-build/solr/core/target/test/./solrtest-BasicDistributedZkTest-1344861631772
ASYNC  NEW_CORE C0 name=collection1 org.apache.solr.core.SolrCore@68a750a url=http://127.0.0.1:42771/solr/collection1 node=127.0.0.1:42771_solr
6003 T185 C0 P42771 oasc.SolrException.log SEVERE org.apache.solr.common.SolrException: ERROR: [doc=1000] multiple values encountered for non multiValued field val_i: [10, 20]
		at org.apache.solr.update.DocumentBuilder.toDocument(DocumentBuilder.java:242)
		at org.apache.solr.update.AddUpdateCommand.getLuceneDocument(AddUpdateCommand.java:76)
		at org.apache.solr.update.DirectUpdateHandler2.addDoc(DirectUpdateHandler2.java:208)
		at org.apache.solr.update.processor.RunUpdateProcessor.processAdd(RunUpdateProcessorFactory.java:61)
		at org.apache.solr.update.processor.UpdateRequestProcessor.processAdd(UpdateRequestProcessor.java:51)
		at org.apache.solr.update.processor.DistributedUpdateProcessor.doLocalAdd(DistributedUpdateProcessor.java:414)
		at org.apache.solr.update.processor.DistributedUpdateProcessor.versionAdd(DistributedUpdateProcessor.java:535)
		at org.apache.solr.update.processor.DistributedUpdateProcessor.processAdd(DistributedUpdateProcessor.java:315)
		at org.apache.solr.handler.loader.XMLLoader.processUpdate(XMLLoader.java:230)
		at org.apache.solr.handler.loader.XMLLoader.load(XMLLoader.java:157)
		at org.apache.solr.handler.UpdateRequestHandler$1.load(UpdateRequestHandler.java:92)
		at org.apache.solr.handler.ContentStreamHandlerBase.handleRequestBody(ContentStreamHandlerBase.java:74)
		at org.apache.solr.handler.RequestHandlerBase.handleRequest(RequestHandlerBase.java:129)
		at org.apache.solr.core.SolrCore.execute(SolrCore.java:1658)
		at org.apache.solr.servlet.SolrDispatchFilter.execute(SolrDispatchFilter.java:454)
		at org.apache.solr.servlet.SolrDispatchFilter.doFilter(SolrDispatchFilter.java:275)
		at org.eclipse.jetty.servlet.ServletHandler$CachedChain.doFilter(ServletHandler.java:1337)
		at org.eclipse.jetty.servlet.ServletHandler.doHandle(ServletHandler.java:484)
		at org.eclipse.jetty.server.session.SessionHandler.doHandle(SessionHandler.java:231)
		at org.eclipse.jetty.server.handler.ScopedHandler.handle(ScopedHandler.java:119)
		at org.eclipse.jetty.server.handler.GzipHandler.handle(GzipHandler.java:267)
		at org.eclipse.jetty.server.handler.ContextHandler.doHandle(ContextHandler.java:1067)
		at org.eclipse.jetty.servlet.ServletHandler.doScope(ServletHandler.java:413)
		at org.eclipse.jetty.server.session.SessionHandler.doScope(SessionHandler.java:192)
		at org.eclipse.jetty.server.handler.ContextHandler.doScope(ContextHandler.java:999)
		at org.eclipse.jetty.server.handler.ScopedHandler.handle(ScopedHandler.java:117)
		at org.eclipse.jetty.server.handler.HandlerWrapper.handle(HandlerWrapper.java:111)
		at org.eclipse.jetty.server.Server.handle(Server.java:351)
		at org.eclipse.jetty.server.AbstractHttpConnection.handleRequest(AbstractHttpConnection.java:454)
		at org.eclipse.jetty.server.BlockingHttpConnection.handleRequest(BlockingHttpConnection.java:47)
		at org.eclipse.jetty.server.AbstractHttpConnection.content(AbstractHttpConnection.java:900)
		at org.eclipse.jetty.server.AbstractHttpConnection$RequestHandler.content(AbstractHttpConnection.java:954)
		at org.eclipse.jetty.http.HttpParser.parseNext(HttpParser.java:952)
		at org.eclipse.jetty.http.HttpParser.parseAvailable(HttpParser.java:235)
		at org.eclipse.jetty.server.BlockingHttpConnection.handle(BlockingHttpConnection.java:66)
		at org.eclipse.jetty.server.bio.SocketConnector$ConnectorEndPoint.run(SocketConnector.java:254)
		at org.eclipse.jetty.util.thread.QueuedThreadPool.runJob(QueuedThreadPool.java:599)
		at org.eclipse.jetty.util.thread.QueuedThreadPool$3.run(QueuedThreadPool.java:534)
		at java.lang.Thread.run(Thread.java:679)
	
NOTE: reproduce with: ant test  -Dtestcase=BasicDistributedZkTest -Dtests.method=testDistribSearch -Dtests.seed=55D7FA3E0AFC2961 -Dtests.locale=iw_IL -Dtests.timezone=SystemV/YST9 -Dtests.file.encoding=ISO8859-1
NOTE: test params are: codec=SimpleText, sim=DefaultSimilarity, locale=iw_IL, timezone=SystemV/YST9
NOTE: FreeBSD 9.0-RELEASE amd64/Sun Microsystems Inc. 1.6.0_32 (64-bit)/cpus=16,threads=1,free=118958736,total=188874752
NOTE: All tests run in this JVM: [TestLMJelinekMercerSimilarityFactory, TestRecovery, MBeansHandlerTest, LegacyHTMLStripCharFilterTest, UpdateParamsTest, MultiCoreEmbeddedTest, BasicZkTest, NotRequiredUniqueKeyTest, PolyFieldTest, RAMDirectoryFactoryTest, TestPropInject, EchoParamsTest, TestJavaBinCodec, CSVRequestHandlerTest, SolrExampleXMLTest, BasicHttpSolrServerTest, TestUpdate, CloudSolrServerTest, TestSolrDeletionPolicy2, DefaultValueUpdateProcessorTest, UUIDFieldTest, CoreAdminHandlerTest, TermsResponseTest, TestDFRSimilarityFactory, BasicDistributedZkTest]
Tests run: 1, Failures: 0, Errors: 1, Skipped: 0, Time elapsed: 36.508 sec <<< FAILURE!

[...truncated 68 lines...]
388 T3 oasc.SolrCore.finalize SEVERE REFCOUNT ERROR: unreferenced org.apache.solr.core.SolrCore@4738fec2 (collection1) has a reference count of 1
791 T493 oasc.SolrCore.initIndex SEVERE [collection1] Solr index directory '/usr/home/hudson/hudson-slave/workspace/Lucene-Solr-Maven-4.x/maven-build/solr/core/target/test/./solrtest-SolrCoreCheckLockOnStartupTest-1344861696495/index/' is locked.  Throwing exception
Tests run: 2, Failures: 0, Errors: 0, Skipped: 0, Time elapsed: 0.824 sec
Running org.apache.solr.handler.admin.LoggingHandlerTest
Creating dataDir: /usr/home/hudson/hudson-slave/workspace/Lucene-Solr-Maven-4.x/maven-build/solr/core/target/test/./solrtest-LoggingHandlerTest-1344861696981
208 T3 oasc.SolrCore.finalize SEVERE REFCOUNT ERROR: unreferenced org.apache.solr.core.SolrCore@6a3801ec (collection1) has a reference count of 1
208 T3 oasc.CoreContainer.finalize SEVERE CoreContainer was not shutdown prior to finalize(), indicates a bug -- POSSIBLE RESOURCE LEAK!!!  instance=1445987208
Tests run: 1, Failures: 0, Errors: 0, Skipped: 0, Time elapsed: 0.59 sec
Running org.apache.solr.cloud.BasicDistributedZk2Test
Tests run: 2, Failures: 0, Errors: 0, Skipped: 2, Time elapsed: 0.029 sec
Running org.apache.solr.client.solrj.request.TestUpdateRequestCodec
Tests run: 2, Failures: 0, Errors: 0, Skipped: 0, Time elapsed: 0.028 sec
Running org.apache.solr.analysis.TestLuceneMatchVersion
Creating dataDir: /usr/home/hudson/hudson-slave/workspace/Lucene-Solr-Maven-4.x/maven-build/solr/core/target/test/./solrtest-TestLuceneMatchVersion-1344861697631
Tests run: 1, Failures: 0, Errors: 0, Skipped: 0, Time elapsed: 0.194 sec
Running org.apache.solr.search.function.TestFunctionQuery
Creating dataDir: /usr/home/hudson/hudson-slave/workspace/Lucene-Solr-Maven-4.x/maven-build/solr/core/target/test/./solrtest-TestFunctionQuery-1344861697831
ASYNC  NEW_CORE C1 name=collection1 org.apache.solr.core.SolrCore@1a3d2ff1
1141 T505 C1 oassf.FileFloatSource.getFloats SEVERE Error loading external value source + fileName + java.lang.NumberFormatException: For input string: ""
Tests run: 14, Failures: 0, Errors: 0, Skipped: 0, Time elapsed: 1.642 sec
Running org.apache.solr.handler.admin.ShowFileRequestHandlerTest
Creating dataDir: /usr/home/hudson/hudson-slave/workspace/Lucene-Solr-Maven-4.x/maven-build/solr/core/target/test/./solrtest-ShowFileRequestHandlerTest-1344861699461
Tests run: 2, Failures: 0, Errors: 0, Skipped: 0, Time elapsed: 0.549 sec
Running org.apache.solr.common.SolrDocumentTest
Tests run: 5, Failures: 0, Errors: 0, Skipped: 0, Time elapsed: 0.02 sec
Running org.apache.solr.schema.TestBinaryField
Tests run: 1, Failures: 0, Errors: 0, Skipped: 0, Time elapsed: 0.198 sec
Running org.apache.solr.common.util.TestFastInputStream
Tests run: 1, Failures: 0, Errors: 0, Skipped: 0, Time elapsed: 0.011 sec
Running org.apache.solr.cloud.ZkCLITest
Creating dataDir: /usr/home/hudson/hudson-slave/workspace/Lucene-Solr-Maven-4.x/maven-build/solr/core/target/test/./solrtest-ZkCLITest-1344861700246
Creating dataDir: /usr/home/hudson/hudson-slave/workspace/Lucene-Solr-Maven-4.x/maven-build/solr/core/target/test/./solrtest-ZkCLITest-1344861701362
Creating dataDir: /usr/home/hudson/hudson-slave/workspace/Lucene-Solr-Maven-4.x/maven-build/solr/core/target/test/./solrtest-ZkCLITest-1344861701558
Tests run: 3, Failures: 0, Errors: 0, Skipped: 0, Time elapsed: 4.819 sec
Running org.apache.solr.response.TestCSVResponseWriter
Creating dataDir: /usr/home/hudson/hudson-slave/workspace/Lucene-Solr-Maven-4.x/maven-build/solr/core/target/test/./solrtest-TestCSVResponseWriter-1344861705067
Tests run: 1, Failures: 0, Errors: 0, Skipped: 0, Time elapsed: 0.812 sec
Running org.apache.solr.search.similarities.TestIBSimilarityFactory
Creating dataDir: /usr/home/hudson/hudson-slave/workspace/Lucene-Solr-Maven-4.x/maven-build/solr/core/target/test/./solrtest-TestIBSimilarityFactory-1344861705886
Tests run: 2, Failures: 0, Errors: 0, Skipped: 0, Time elapsed: 0.111 sec
Running org.apache.solr.client.solrj.response.AnlysisResponseBaseTest
Tests run: 2, Failures: 0, Errors: 0, Skipped: 0, Time elapsed: 0.021 sec
Running org.apache.solr.analysis.TestWordDelimiterFilterFactory
Creating dataDir: /usr/home/hudson/hudson-slave/workspace/Lucene-Solr-Maven-4.x/maven-build/solr/core/target/test/./solrtest-TestWordDelimiterFilterFactory-1344861706016
Tests run: 7, Failures: 0, Errors: 0, Skipped: 0, Time elapsed: 0.769 sec
Running org.apache.solr.analysis.TestCharFilters
Creating dataDir: /usr/home/hudson/hudson-slave/workspace/Lucene-Solr-Maven-4.x/maven-build/solr/core/target/test/./solrtest-TestCharFilters-1344861706782
Tests run: 2, Failures: 0, Errors: 0, Skipped: 0, Time elapsed: 0.128 sec
Running org.apache.solr.TestRandomFaceting
Creating dataDir: /usr/home/hudson/hudson-slave/workspace/Lucene-Solr-Maven-4.x/maven-build/solr/core/target/test/./solrtest-TestRandomFaceting-1344861706912
Tests run: 1, Failures: 0, Errors: 0, Skipped: 0, Time elapsed: 16.87 sec
Running org.apache.solr.schema.IndexSchemaTest
Creating dataDir: /usr/home/hudson/hudson-slave/workspace/Lucene-Solr-Maven-4.x/maven-build/solr/core/target/test/./solrtest-IndexSchemaTest-1344861723779
Tests run: 3, Failures: 0, Errors: 0, Skipped: 0, Time elapsed: 0.348 sec
Running org.apache.solr.schema.PrimitiveFieldTypeTest
Tests run: 1, Failures: 0, Errors: 0, Skipped: 0, Time elapsed: 0.481 sec
Running org.apache.solr.core.TestQuerySenderNoQuery
Creating dataDir: /usr/home/hudson/hudson-slave/workspace/Lucene-Solr-Maven-4.x/maven-build/solr/core/target/test/./solrtest-TestQuerySenderNoQuery-1344861724610
Tests run: 3, Failures: 0, Errors: 0, Skipped: 0, Time elapsed: 0.267 sec
Running org.apache.solr.handler.JsonLoaderTest
Creating dataDir: /usr/home/hudson/hudson-slave/workspace/Lucene-Solr-Maven-4.x/maven-build/solr/core/target/test/./solrtest-JsonLoaderTest-1344861724878
Tests run: 6, Failures: 0, Errors: 0, Skipped: 0, Time elapsed: 0.348 sec
Running org.apache.solr.handler.TestCSVLoader
Creating dataDir: /usr/home/hudson/hudson-slave/workspace/Lucene-Solr-Maven-4.x/maven-build/solr/core/target/test/./solrtest-TestCSVLoader-1344861725227
Tests run: 5, Failures: 0, Errors: 0, Skipped: 0, Time elapsed: 0.693 sec
Running org.apache.solr.OutputWriterTest
Creating dataDir: /usr/home/hudson/hudson-slave/workspace/Lucene-Solr-Maven-4.x/maven-build/solr/core/target/test/./solrtest-OutputWriterTest-1344861725921
Tests run: 5, Failures: 0, Errors: 0, Skipped: 0, Time elapsed: 0.19 sec
Running org.apache.solr.spelling.WordBreakSolrSpellCheckerTest
Creating dataDir: /usr/home/hudson/hudson-slave/workspace/Lucene-Solr-Maven-4.x/maven-build/solr/core/target/test/./solrtest-WordBreakSolrSpellCheckerTest-1344861726113
Tests run: 3, Failures: 0, Errors: 0, Skipped: 0, Time elapsed: 1.502 sec
Running org.apache.solr.internal.csv.CSVParserTest
Tests run: 23, Failures: 0, Errors: 0, Skipped: 0, Time elapsed: 0.006 sec
Running org.apache.solr.client.solrj.SolrExampleBinaryTest
Creating dataDir: /usr/home/hudson/hudson-slave/workspace/Lucene-Solr-Maven-4.x/maven-build/solr/core/target/test/./solrtest-SolrExampleBinaryTest-1344861727625
ASYNC  NEW_CORE C2 name=collection1 org.apache.solr.core.SolrCore@75151a72
2664 T704 C2 oasc.SolrException.log SEVERE org.apache.solr.common.SolrException: Document contains multiple values for uniqueKey field: id=[DOCID, DOCID2]
		at org.apache.solr.update.AddUpdateCommand.getIndexedId(AddUpdateCommand.java:94)
		at org.apache.solr.update.processor.DistributedUpdateProcessor.versionAdd(DistributedUpdateProcessor.java:429)
		at org.apache.solr.update.processor.DistributedUpdateProcessor.processAdd(DistributedUpdateProcessor.java:315)
		at org.apache.solr.handler.loader.JavabinLoader$1.update(JavabinLoader.java:86)
		at org.apache.solr.client.solrj.request.JavaBinUpdateRequestCodec$1.readOuterMostDocIterator(JavaBinUpdateRequestCodec.java:140)
		at org.apache.solr.client.solrj.request.JavaBinUpdateRequestCodec$1.readIterator(JavaBinUpdateRequestCodec.java:120)
		at org.apache.solr.common.util.JavaBinCodec.readVal(JavaBinCodec.java:221)
		at org.apache.solr.client.solrj.request.JavaBinUpdateRequestCodec$1.readNamedList(JavaBinUpdateRequestCodec.java:105)
		at org.apache.solr.common.util.JavaBinCodec.readVal(JavaBinCodec.java:186)
		at org.apache.solr.common.util.JavaBinCodec.unmarshal(JavaBinCodec.java:112)
		at org.apache.solr.client.solrj.request.JavaBinUpdateRequestCodec.unmarshal(JavaBinUpdateRequestCodec.java:147)
		at org.apache.solr.handler.loader.JavabinLoader.parseAndLoadDocs(JavabinLoader.java:96)
		at org.apache.solr.handler.loader.JavabinLoader.load(JavabinLoader.java:55)
		at org.apache.solr.handler.UpdateRequestHandler$1.load(UpdateRequestHandler.java:92)
		at org.apache.solr.handler.ContentStreamHandlerBase.handleRequestBody(ContentStreamHandlerBase.java:74)
		at org.apache.solr.handler.RequestHandlerBase.handleRequest(RequestHandlerBase.java:129)
		at org.apache.solr.core.SolrCore.execute(SolrCore.java:1658)
		at org.apache.solr.servlet.SolrDispatchFilter.execute(SolrDispatchFilter.java:454)
		at org.apache.solr.servlet.SolrDispatchFilter.doFilter(SolrDispatchFilter.java:275)
		at org.eclipse.jetty.servlet.ServletHandler$CachedChain.doFilter(ServletHandler.java:1337)
		at org.eclipse.jetty.servlet.ServletHandler.doHandle(ServletHandler.java:484)
		at org.eclipse.jetty.server.session.SessionHandler.doHandle(SessionHandler.java:231)
		at org.eclipse.jetty.server.handler.ScopedHandler.handle(ScopedHandler.java:119)
		at org.eclipse.jetty.server.handler.GzipHandler.handle(GzipHandler.java:267)
		at org.eclipse.jetty.server.handler.ContextHandler.doHandle(ContextHandler.java:1067)
		at org.eclipse.jetty.servlet.ServletHandler.doScope(ServletHandler.java:413)
		at org.eclipse.jetty.server.session.SessionHandler.doScope(SessionHandler.java:192)
		at org.eclipse.jetty.server.handler.ContextHandler.doScope(ContextHandler.java:999)
		at org.eclipse.jetty.server.handler.ScopedHandler.handle(ScopedHandler.java:117)
		at org.eclipse.jetty.server.handler.HandlerWrapper.handle(HandlerWrapper.java:111)
		at org.eclipse.jetty.server.Server.handle(Server.java:351)
		at org.eclipse.jetty.server.AbstractHttpConnection.handleRequest(AbstractHttpConnection.java:454)
		at org.eclipse.jetty.server.BlockingHttpConnection.handleRequest(BlockingHttpConnection.java:47)
		at org.eclipse.jetty.server.AbstractHttpConnection.content(AbstractHttpConnection.java:900)
		at org.eclipse.jetty.server.AbstractHttpConnection$RequestHandler.content(AbstractHttpConnection.java:954)
		at org.eclipse.jetty.http.HttpParser.parseNext(HttpParser.java:952)
		at org.eclipse.jetty.http.HttpParser.parseAvailable(HttpParser.java:235)
		at org.eclipse.jetty.server.BlockingHttpConnection.handle(BlockingHttpConnection.java:66)
		at org.eclipse.jetty.server.bio.SocketConnector$ConnectorEndPoint.run(SocketConnector.java:254)
		at org.eclipse.jetty.util.thread.QueuedThreadPool.runJob(QueuedThreadPool.java:599)
		at org.eclipse.jetty.util.thread.QueuedThreadPool$3.run(QueuedThreadPool.java:534)
		at java.lang.Thread.run(Thread.java:679)
	
Tests run: 22, Failures: 0, Errors: 0, Skipped: 0, Time elapsed: 4.459 sec
Running org.apache.solr.update.SolrIndexConfigTest
Tests run: 2, Failures: 0, Errors: 0, Skipped: 0, Time elapsed: 0.388 sec
Running org.apache.solr.update.SoftAutoCommitTest
Tests run: 3, Failures: 0, Errors: 0, Skipped: 0, Time elapsed: 8.753 sec
Running org.apache.solr.handler.FieldAnalysisRequestHandlerTest
Creating dataDir: /usr/home/hudson/hudson-slave/workspace/Lucene-Solr-Maven-4.x/maven-build/solr/core/target/test/./solrtest-FieldAnalysisRequestHandlerTest-1344861741229
Tests run: 4, Failures: 0, Errors: 0, Skipped: 0, Time elapsed: 0.532 sec
Running org.apache.solr.client.solrj.SolrQueryTest
Tests run: 9, Failures: 0, Errors: 0, Skipped: 0, Time elapsed: 0.03 sec
Running org.apache.solr.ConvertedLegacyTest
Creating dataDir: /usr/home/hudson/hudson-slave/workspace/Lucene-Solr-Maven-4.x/maven-build/solr/core/target/test/./solrtest-ConvertedLegacyTest-1344861741790
Tests run: 1, Failures: 0, Errors: 0, Skipped: 0, Time elapsed: 2.084 sec
Running org.apache.solr.common.params.ModifiableSolrParamsTest
Tests run: 5, Failures: 0, Errors: 0, Skipped: 0, Time elapsed: 0.014 sec
Running org.apache.solr.handler.XsltUpdateRequestHandlerTest
Creating dataDir: /usr/home/hudson/hudson-slave/workspace/Lucene-Solr-Maven-4.x/maven-build/solr/core/target/test/./solrtest-XsltUpdateRequestHandlerTest-1344861743887
Tests run: 1, Failures: 0, Errors: 0, Skipped: 0, Time elapsed: 0.403 sec
Running org.apache.solr.SolrInfoMBeanTest
Creating dataDir: /usr/home/hudson/hudson-slave/workspace/Lucene-Solr-Maven-4.x/maven-build/solr/core/target/test/./solrtest-SolrInfoMBeanTest-1344861744291
Tests run: 1, Failures: 0, Errors: 0, Skipped: 0, Time elapsed: 0.417 sec
Running org.apache.solr.handler.admin.LukeRequestHandlerTest
Tests run: 3, Failures: 0, Errors: 0, Skipped: 0, Time elapsed: 1.28 sec
Running org.apache.solr.common.util.TestNamedListCodec
Tests run: 4, Failures: 0, Errors: 0, Skipped: 0, Time elapsed: 0.286 sec
Running org.apache.solr.util.CircularListTest
Tests run: 1, Failures: 0, Errors: 0, Skipped: 0, Time elapsed: 0.018 sec
Running org.apache.solr.core.TestBadConfig
Creating dataDir: /usr/home/hudson/hudson-slave/workspace/Lucene-Solr-Maven-4.x/maven-build/solr/core/target/test/./solrtest-TestBadConfig-1344861746416
518 T754 oasup.StatelessScriptUpdateProcessorFactory.inform SEVERE Unable to initialize scripts: Unable to evaluate script: a-file-name-that-does-not-exist.js Ignoring exception matching \Qa-file-name-that-does-not-exist.js\E
Creating dataDir: /usr/home/hudson/hudson-slave/workspace/Lucene-Solr-Maven-4.x/maven-build/solr/core/target/test/./solrtest-TestBadConfig-1344861746825
Creating dataDir: /usr/home/hudson/hudson-slave/workspace/Lucene-Solr-Maven-4.x/maven-build/solr/core/target/test/./solrtest-TestBadConfig-1344861746839
682 T3 oasc.CoreContainer.finalize SEVERE CoreContainer was not shutdown prior to finalize(), indicates a bug -- POSSIBLE RESOURCE LEAK!!!  instance=1903353682
969 T754 oasup.StatelessScriptUpdateProcessorFactory.inform SEVERE Unable to initialize scripts: No ScriptEngine found by name: giberish -- supported names: js, rhino, JavaScript, javascript, ECMAScript, ecmascript Ignoring exception matching \Qgiberish\E
Creating dataDir: /usr/home/hudson/hudson-slave/workspace/Lucene-Solr-Maven-4.x/maven-build/solr/core/target/test/./solrtest-TestBadConfig-1344861747283
1155 T3 oasc.CoreContainer.finalize SEVERE CoreContainer was not shutdown prior to finalize(), indicates a bug -- POSSIBLE RESOURCE LEAK!!!  instance=1778308435
1428 T754 oasup.StatelessScriptUpdateProcessorFactory.inform SEVERE Unable to initialize scripts: Unable to evaluate script: currency.xml Ignoring exception matching \Qcurrency.xml\E
Tests run: 4, Failures: 0, Errors: 0, Skipped: 0, Time elapsed: 1.448 sec
Running org.apache.solr.TestJoin
Creating dataDir: /usr/home/hudson/hudson-slave/workspace/Lucene-Solr-Maven-4.x/maven-build/solr/core/target/test/./solrtest-TestJoin-1344861747750
145 T3 oasc.CoreContainer.finalize SEVERE CoreContainer was not shutdown prior to finalize(), indicates a bug -- POSSIBLE RESOURCE LEAK!!!  instance=82445671
Tests run: 2, Failures: 0, Errors: 0, Skipped: 0, Time elapsed: 4.569 sec
Running org.apache.solr.handler.component.DebugComponentTest
Creating dataDir: /usr/home/hudson/hudson-slave/workspace/Lucene-Solr-Maven-4.x/maven-build/solr/core/target/test/./solrtest-DebugComponentTest-1344861752315
Tests run: 2, Failures: 0, Errors: 0, Skipped: 0, Time elapsed: 0.403 sec
Running org.apache.solr.core.TestCoreContainer
Creating dataDir: /usr/home/hudson/hudson-slave/workspace/Lucene-Solr-Maven-4.x/maven-build/solr/core/target/test/./solrtest-TestCoreContainer-1344861752723
Tests run: 2, Failures: 0, Errors: 0, Skipped: 0, Time elapsed: 1.908 sec
Running org.apache.solr.analysis.PathHierarchyTokenizerFactoryTest
Creating dataDir: /usr/home/hudson/hudson-slave/workspace/Lucene-Solr-Maven-4.x/maven-build/solr/core/target/test/./solrtest-PathHierarchyTokenizerFactoryTest-1344861754632
Tests run: 2, Failures: 0, Errors: 0, Skipped: 0, Time elapsed: 0.57 sec
Running org.apache.solr.search.TestStressVersions
Creating dataDir: /usr/home/hudson/hudson-slave/workspace/Lucene-Solr-Maven-4.x/maven-build/solr/core/target/test/./solrtest-TestStressVersions-1344861755205
Tests run: 1, Failures: 0, Errors: 0, Skipped: 0, Time elapsed: 2.797 sec
Running org.apache.solr.common.util.ContentStreamTest
Tests run: 3, Failures: 0, Errors: 0, Skipped: 0, Time elapsed: 0.066 sec
Running org.apache.solr.internal.csv.CSVUtilsTest
Tests run: 14, Failures: 0, Errors: 0, Skipped: 0, Time elapsed: 0.006 sec
Running org.apache.solr.search.TestPseudoReturnFields
Creating dataDir: /usr/home/hudson/hudson-slave/workspace/Lucene-Solr-Maven-4.x/maven-build/solr/core/target/test/./solrtest-TestPseudoReturnFields-1344861758083
Tests run: 13, Failures: 0, Errors: 0, Skipped: 0, Time elapsed: 0.786 sec
Running org.apache.solr.client.solrj.beans.TestDocumentObjectBinder
Tests run: 5, Failures: 0, Errors: 0, Skipped: 0, Time elapsed: 0.045 sec
Running org.apache.solr.internal.csv.writer.CSVFieldTest
Tests run: 2, Failures: 0, Errors: 0, Skipped: 0, Time elapsed: 0.001 sec
Running org.apache.solr.client.solrj.response.QueryResponseTest
Tests run: 3, Failures: 0, Errors: 0, Skipped: 0, Time elapsed: 0.046 sec
Running org.apache.solr.servlet.NoCacheHeaderTest
Creating dataDir: /usr/home/hudson/hudson-slave/workspace/Lucene-Solr-Maven-4.x/maven-build/solr/core/target/test/./solrtest-NoCacheHeaderTest-1344861758954
Tests run: 3, Failures: 0, Errors: 0, Skipped: 0, Time elapsed: 0.402 sec
Running org.apache.solr.internal.csv.writer.CSVWriterTest
Tests run: 2, Failures: 0, Errors: 0, Skipped: 0, Time elapsed: 0.002 sec
Running org.apache.solr.cloud.FullSolrCloudDistribCmdsTest
Tests run: 2, Failures: 0, Errors: 0, Skipped: 2, Time elapsed: 0.018 sec
Running org.apache.solr.search.TestSolrQueryParser
Creating dataDir: /usr/home/hudson/hudson-slave/workspace/Lucene-Solr-Maven-4.x/maven-build/solr/core/target/test/./solrtest-TestSolrQueryParser-1344861759376
Tests run: 1, Failures: 0, Errors: 0, Skipped: 0, Time elapsed: 0.332 sec
Running org.apache.solr.handler.component.DistributedTermsComponentTest
Tests run: 1, Failures: 0, Errors: 0, Skipped: 0, Time elapsed: 4.114 sec
Running org.apache.solr.request.TestBinaryResponseWriter
Tests run: 2, Failures: 0, Errors: 0, Skipped: 0, Time elapsed: 0.653 sec
Running org.apache.solr.TestTrie
Creating dataDir: /usr/home/hudson/hudson-slave/workspace/Lucene-Solr-Maven-4.x/maven-build/solr/core/target/test/./solrtest-TestTrie-1344861764479
Tests run: 8, Failures: 0, Errors: 0, Skipped: 0, Time elapsed: 0.593 sec
Running org.apache.solr.client.solrj.TestLBHttpSolrServer
Tests run: 3, Failures: 0, Errors: 0, Skipped: 0, Time elapsed: 36.623 sec
Running org.apache.solr.cloud.ClusterStateUpdateTest
Creating dataDir: /usr/home/hudson/hudson-slave/workspace/Lucene-Solr-Maven-4.x/maven-build/solr/core/target/test/./solrtest-ClusterStateUpdateTest-1344861801703
Tests run: 1, Failures: 0, Errors: 0, Skipped: 0, Time elapsed: 8.508 sec
Running org.apache.solr.update.processor.UniqFieldsUpdateProcessorFactoryTest
Creating dataDir: /usr/home/hudson/hudson-slave/workspace/Lucene-Solr-Maven-4.x/maven-build/solr/core/target/test/./solrtest-UniqFieldsUpdateProcessorFactoryTest-1344861810208
Tests run: 1, Failures: 0, Errors: 0, Skipped: 0, Time elapsed: 0.696 sec
Running org.apache.solr.servlet.CacheHeaderTest
Creating dataDir: /usr/home/hudson/hudson-slave/workspace/Lucene-Solr-Maven-4.x/maven-build/solr/core/target/test/./solrtest-CacheHeaderTest-1344861810907
Tests run: 5, Failures: 0, Errors: 0, Skipped: 0, Time elapsed: 0.754 sec
Running org.apache.solr.client.solrj.response.FieldAnalysisResponseTest
Tests run: 1, Failures: 0, Errors: 0, Skipped: 0, Time elapsed: 0.014 sec
Running org.apache.solr.handler.component.QueryElevationComponentTest
Creating dataDir: /usr/home/hudson/hudson-slave/workspace/Lucene-Solr-Maven-4.x/maven-build/solr/core/target/test/./solrtest-QueryElevationComponentTest-1344861811678
Creating dataDir: /usr/home/hudson/hudson-slave/workspace/Lucene-Solr-Maven-4.x/maven-build/solr/core/target/test/./solrtest-QueryElevationComponentTest-1344861812032
Creating dataDir: /usr/home/hudson/hudson-slave/workspace/Lucene-Solr-Maven-4.x/maven-build/solr/core/target/test/./solrtest-QueryElevationComponentTest-1344861812444
Creating dataDir: /usr/home/hudson/hudson-slave/workspace/Lucene-Solr-Maven-4.x/maven-build/solr/core/target/test/./solrtest-QueryElevationComponentTest-1344861812749
Creating dataDir: /usr/home/hudson/hudson-slave/workspace/Lucene-Solr-Maven-4.x/maven-build/solr/core/target/test/./solrtest-QueryElevationComponentTest-1344861813026
Creating dataDir: /usr/home/hudson/hudson-slave/workspace/Lucene-Solr-Maven-4.x/maven-build/solr/core/target/test/./solrtest-QueryElevationComponentTest-1344861813285
Creating dataDir: /usr/home/hudson/hudson-slave/workspace/Lucene-Solr-Maven-4.x/maven-build/solr/core/target/test/./solrtest-QueryElevationComponentTest-1344861813565
Tests run: 7, Failures: 0, Errors: 0, Skipped: 0, Time elapsed: 2.066 sec
Running org.apache.solr.handler.MoreLikeThisHandlerTest
Creating dataDir: /usr/home/hudson/hudson-slave/workspace/Lucene-Solr-Maven-4.x/maven-build/solr/core/target/test/./solrtest-MoreLikeThisHandlerTest-1344861813739
Tests run: 1, Failures: 0, Errors: 0, Skipped: 0, Time elapsed: 0.411 sec
Running org.apache.solr.util.DOMUtilTest
Tests run: 1, Failures: 0, Errors: 0, Skipped: 0, Time elapsed: 0.016 sec
Running org.apache.solr.core.RequestHandlersTest
Creating dataDir: /usr/home/hudson/hudson-slave/workspace/Lucene-Solr-Maven-4.x/maven-build/solr/core/target/test/./solrtest-RequestHandlersTest-1344861814166
Tests run: 3, Failures: 0, Errors: 0, Skipped: 0, Time elapsed: 0.384 sec
Running org.apache.solr.common.util.TestXMLEscaping
Tests run: 7, Failures: 0, Errors: 0, Skipped: 0, Time elapsed: 0.018 sec
Running org.apache.solr.search.TestSearchPerf
Tests run: 1, Failures: 0, Errors: 0, Skipped: 0, Time elapsed: 0.209 sec
Running org.apache.solr.core.TestXIncludeConfig
Tests run: 1, Failures: 0, Errors: 0, Skipped: 0, Time elapsed: 0.368 sec
Running org.apache.solr.handler.component.BadComponentTest
Creating dataDir: /usr/home/hudson/hudson-slave/workspace/Lucene-Solr-Maven-4.x/maven-build/solr/core/target/test/./solrtest-BadComponentTest-1344861815153
Tests run: 1, Failures: 0, Errors: 0, Skipped: 0, Time elapsed: 0.465 sec
Running org.apache.solr.search.QueryParsingTest
Creating dataDir: /usr/home/hudson/hudson-slave/workspace/Lucene-Solr-Maven-4.x/maven-build/solr/core/target/test/./solrtest-QueryParsingTest-1344861815622
Tests run: 4, Failures: 0, Errors: 0, Skipped: 0, Time elapsed: 0.514 sec
Running org.apache.solr.search.TestExtendedDismaxParser
Tests run: 10, Failures: 0, Errors: 0, Skipped: 0, Time elapsed: 5.244 sec
Running org.apache.solr.handler.StandardRequestHandlerTest
Tests run: 1, Failures: 0, Errors: 0, Skipped: 0, Time elapsed: 0.518 sec
Running org.apache.solr.client.solrj.embedded.SolrExampleStreamingBinaryTest
Creating dataDir: /usr/home/hudson/hudson-slave/workspace/Lucene-Solr-Maven-4.x/maven-build/solr/core/target/test/./solrtest-SolrExampleStreamingBinaryTest-1344861821900
ASYNC  NEW_CORE C3 name=collection1 org.apache.solr.core.SolrCore@16fbce75
4946 T1188 C3 oasc.SolrException.log SEVERE org.apache.solr.common.SolrException: Document contains multiple values for uniqueKey field: id=[DOCID, DOCID2]
		at org.apache.solr.update.AddUpdateCommand.getIndexedId(AddUpdateCommand.java:94)
		at org.apache.solr.update.processor.DistributedUpdateProcessor.versionAdd(DistributedUpdateProcessor.java:429)
		at org.apache.solr.update.processor.DistributedUpdateProcessor.processAdd(DistributedUpdateProcessor.java:315)
		at org.apache.solr.handler.loader.JavabinLoader$1.update(JavabinLoader.java:86)
		at org.apache.solr.client.solrj.request.JavaBinUpdateRequestCodec$1.readOuterMostDocIterator(JavaBinUpdateRequestCodec.java:140)
		at org.apache.solr.client.solrj.request.JavaBinUpdateRequestCodec$1.readIterator(JavaBinUpdateRequestCodec.java:120)
		at org.apache.solr.common.util.JavaBinCodec.readVal(JavaBinCodec.java:221)
		at org.apache.solr.client.solrj.request.JavaBinUpdateRequestCodec$1.readNamedList(JavaBinUpdateRequestCodec.java:105)
		at org.apache.solr.common.util.JavaBinCodec.readVal(JavaBinCodec.java:186)
		at org.apache.solr.common.util.JavaBinCodec.unmarshal(JavaBinCodec.java:112)
		at org.apache.solr.client.solrj.request.JavaBinUpdateRequestCodec.unmarshal(JavaBinUpdateRequestCodec.java:147)
		at org.apache.solr.handler.loader.JavabinLoader.parseAndLoadDocs(JavabinLoader.java:96)
		at org.apache.solr.handler.loader.JavabinLoader.load(JavabinLoader.java:55)
		at org.apache.solr.handler.UpdateRequestHandler$1.load(UpdateRequestHandler.java:92)
		at org.apache.solr.handler.ContentStreamHandlerBase.handleRequestBody(ContentStreamHandlerBase.java:74)
		at org.apache.solr.handler.RequestHandlerBase.handleRequest(RequestHandlerBase.java:129)
		at org.apache.solr.core.SolrCore.execute(SolrCore.java:1658)
		at org.apache.solr.servlet.SolrDispatchFilter.execute(SolrDispatchFilter.java:454)
		at org.apache.solr.servlet.SolrDispatchFilter.doFilter(SolrDispatchFilter.java:275)
		at org.eclipse.jetty.servlet.ServletHandler$CachedChain.doFilter(ServletHandler.java:1337)
		at org.eclipse.jetty.servlet.ServletHandler.doHandle(ServletHandler.java:484)
		at org.eclipse.jetty.server.session.SessionHandler.doHandle(SessionHandler.java:231)
		at org.eclipse.jetty.server.handler.ScopedHandler.handle(ScopedHandler.java:119)
		at org.eclipse.jetty.server.handler.GzipHandler.handle(GzipHandler.java:267)
		at org.eclipse.jetty.server.handler.ContextHandler.doHandle(ContextHandler.java:1067)
		at org.eclipse.jetty.servlet.ServletHandler.doScope(ServletHandler.java:413)
		at org.eclipse.jetty.server.session.SessionHandler.doScope(SessionHandler.java:192)
		at org.eclipse.jetty.server.handler.ContextHandler.doScope(ContextHandler.java:999)
		at org.eclipse.jetty.server.handler.ScopedHandler.handle(ScopedHandler.java:117)
		at org.eclipse.jetty.server.handler.HandlerWrapper.handle(HandlerWrapper.java:111)
		at org.eclipse.jetty.server.Server.handle(Server.java:351)
		at org.eclipse.jetty.server.AbstractHttpConnection.handleRequest(AbstractHttpConnection.java:454)
		at org.eclipse.jetty.server.BlockingHttpConnection.handleRequest(BlockingHttpConnection.java:47)
		at org.eclipse.jetty.server.AbstractHttpConnection.content(AbstractHttpConnection.java:900)
		at org.eclipse.jetty.server.AbstractHttpConnection$RequestHandler.content(AbstractHttpConnection.java:954)
		at org.eclipse.jetty.http.HttpParser.parseNext(HttpParser.java:952)
		at org.eclipse.jetty.http.HttpParser.parseAvailable(HttpParser.java:235)
		at org.eclipse.jetty.server.BlockingHttpConnection.handle(BlockingHttpConnection.java:66)
		at org.eclipse.jetty.server.bio.SocketConnector$ConnectorEndPoint.run(SocketConnector.java:254)
		at org.eclipse.jetty.util.thread.QueuedThreadPool.runJob(QueuedThreadPool.java:599)
		at org.eclipse.jetty.util.thread.QueuedThreadPool$3.run(QueuedThreadPool.java:534)
		at java.lang.Thread.run(Thread.java:679)
	
Tests run: 22, Failures: 0, Errors: 0, Skipped: 0, Time elapsed: 11.99 sec
Running org.apache.solr.search.TestDocSet
Tests run: 2, Failures: 0, Errors: 0, Skipped: 0, Time elapsed: 0.54 sec
Running org.apache.solr.search.ReturnFieldsTest
Creating dataDir: /usr/home/hudson/hudson-slave/workspace/Lucene-Solr-Maven-4.x/maven-build/solr/core/target/test/./solrtest-ReturnFieldsTest-1344861834426
Tests run: 10, Failures: 0, Errors: 0, Skipped: 0, Time elapsed: 0.396 sec
Running org.apache.solr.update.DocumentBuilderTest
Creating dataDir: /usr/home/hudson/hudson-slave/workspace/Lucene-Solr-Maven-4.x/maven-build/solr/core/target/test/./solrtest-DocumentBuilderTest-1344861834822
Tests run: 11, Failures: 0, Errors: 0, Skipped: 0, Time elapsed: 0.411 sec
Running org.apache.solr.spelling.DirectSolrSpellCheckerTest
Creating dataDir: /usr/home/hudson/hudson-slave/workspace/Lucene-Solr-Maven-4.x/maven-build/solr/core/target/test/./solrtest-DirectSolrSpellCheckerTest-1344861835237
Tests run: 2, Failures: 0, Errors: 0, Skipped: 0, Time elapsed: 0.798 sec
Running org.apache.solr.schema.NumericFieldsTest
Creating dataDir: /usr/home/hudson/hudson-slave/workspace/Lucene-Solr-Maven-4.x/maven-build/solr/core/target/test/./solrtest-NumericFieldsTest-1344861836030
Tests run: 1, Failures: 0, Errors: 0, Skipped: 0, Time elapsed: 0.192 sec
Running org.apache.solr.cloud.RecoveryZkTest
Tests run: 2, Failures: 0, Errors: 0, Skipped: 2, Time elapsed: 0.022 sec
Running org.apache.solr.handler.admin.SystemInfoHandlerTest
Tests run: 1, Failures: 0, Errors: 0, Skipped: 0, Time elapsed: 0.013 sec
Running org.apache.solr.cloud.ChaosMonkeySafeLeaderTest
Tests run: 1, Failures: 0, Errors: 0, Skipped: 1, Time elapsed: 0 sec
Running org.apache.solr.core.IndexReaderFactoryTest
Tests run: 1, Failures: 0, Errors: 0, Skipped: 0, Time elapsed: 0.398 sec
Running org.apache.solr.search.TestStressLucene
Tests run: 1, Failures: 0, Errors: 0, Skipped: 0, Time elapsed: 1.742 sec
Running org.apache.solr.core.SOLR749Test
Creating dataDir: /usr/home/hudson/hudson-slave/workspace/Lucene-Solr-Maven-4.x/maven-build/solr/core/target/test/./solrtest-SOLR749Test-1344861838410
Tests run: 1, Failures: 0, Errors: 0, Skipped: 0, Time elapsed: 0.4 sec
Running org.apache.solr.client.solrj.embedded.SolrExampleJettyTest
Creating dataDir: /usr/home/hudson/hudson-slave/workspace/Lucene-Solr-Maven-4.x/maven-build/solr/core/target/test/./solrtest-SolrExampleJettyTest-1344861838817
ASYNC  NEW_CORE C4 name=collection1 org.apache.solr.core.SolrCore@221fb9be
579 T1274 C4 oasc.SolrException.log SEVERE org.apache.solr.common.SolrException: Document contains multiple values for uniqueKey field: id=[DOCID, DOCID2]
		at org.apache.solr.update.AddUpdateCommand.getIndexedId(AddUpdateCommand.java:94)
		at org.apache.solr.update.processor.DistributedUpdateProcessor.versionAdd(DistributedUpdateProcessor.java:429)
		at org.apache.solr.update.processor.DistributedUpdateProcessor.processAdd(DistributedUpdateProcessor.java:315)
		at org.apache.solr.handler.loader.XMLLoader.processUpdate(XMLLoader.java:230)
		at org.apache.solr.handler.loader.XMLLoader.load(XMLLoader.java:157)
		at org.apache.solr.handler.UpdateRequestHandler$1.load(UpdateRequestHandler.java:92)
		at org.apache.solr.handler.ContentStreamHandlerBase.handleRequestBody(ContentStreamHandlerBase.java:74)
		at org.apache.solr.handler.RequestHandlerBase.handleRequest(RequestHandlerBase.java:129)
		at org.apache.solr.core.SolrCore.execute(SolrCore.java:1658)
		at org.apache.solr.servlet.SolrDispatchFilter.execute(SolrDispatchFilter.java:454)
		at org.apache.solr.servlet.SolrDispatchFilter.doFilter(SolrDispatchFilter.java:275)
		at org.eclipse.jetty.servlet.ServletHandler$CachedChain.doFilter(ServletHandler.java:1337)
		at org.eclipse.jetty.servlet.ServletHandler.doHandle(ServletHandler.java:484)
		at org.eclipse.jetty.server.session.SessionHandler.doHandle(SessionHandler.java:231)
		at org.eclipse.jetty.server.handler.ScopedHandler.handle(ScopedHandler.java:119)
		at org.eclipse.jetty.server.handler.GzipHandler.handle(GzipHandler.java:267)
		at org.eclipse.jetty.server.handler.ContextHandler.doHandle(ContextHandler.java:1067)
		at org.eclipse.jetty.servlet.ServletHandler.doScope(ServletHandler.java:413)
		at org.eclipse.jetty.server.session.SessionHandler.doScope(SessionHandler.java:192)
		at org.eclipse.jetty.server.handler.ContextHandler.doScope(ContextHandler.java:999)
		at org.eclipse.jetty.server.handler.ScopedHandler.handle(ScopedHandler.java:117)
		at org.eclipse.jetty.server.handler.HandlerWrapper.handle(HandlerWrapper.java:111)
		at org.eclipse.jetty.server.Server.handle(Server.java:351)
		at org.eclipse.jetty.server.AbstractHttpConnection.handleRequest(AbstractHttpConnection.java:454)
		at org.eclipse.jetty.server.BlockingHttpConnection.handleRequest(BlockingHttpConnection.java:47)
		at org.eclipse.jetty.server.AbstractHttpConnection.content(AbstractHttpConnection.java:900)
		at org.eclipse.jetty.server.AbstractHttpConnection$RequestHandler.content(AbstractHttpConnection.java:954)
		at org.eclipse.jetty.http.HttpParser.parseNext(HttpParser.java:952)
		at org.eclipse.jetty.http.HttpParser.parseAvailable(HttpParser.java:235)
		at org.eclipse.jetty.server.BlockingHttpConnection.handle(BlockingHttpConnection.java:66)
		at org.eclipse.jetty.server.bio.SocketConnector$ConnectorEndPoint.run(SocketConnector.java:254)
		at org.eclipse.jetty.util.thread.QueuedThreadPool.runJob(QueuedThreadPool.java:599)
		at org.eclipse.jetty.util.thread.QueuedThreadPool$3.run(QueuedThreadPool.java:534)
		at java.lang.Thread.run(Thread.java:679)
	
Tests run: 23, Failures: 0, Errors: 0, Skipped: 0, Time elapsed: 4.282 sec
Running org.apache.solr.highlight.HighlighterConfigTest
Tests run: 1, Failures: 0, Errors: 0, Skipped: 0, Time elapsed: 0.29 sec
Running org.apache.solr.update.processor.FieldMutatingUpdateProcessorTest
Creating dataDir: /usr/home/hudson/hudson-slave/workspace/Lucene-Solr-Maven-4.x/maven-build/solr/core/target/test/./solrtest-FieldMutatingUpdateProcessorTest-1344861843380
Tests run: 25, Failures: 0, Errors: 0, Skipped: 0, Time elapsed: 0.32 sec
Running org.apache.solr.spelling.IndexBasedSpellCheckerTest
Creating dataDir: /usr/home/hudson/hudson-slave/workspace/Lucene-Solr-Maven-4.x/maven-build/solr/core/target/test/./solrtest-IndexBasedSpellCheckerTest-1344861843699
Tests run: 5, Failures: 0, Errors: 0, Skipped: 0, Time elapsed: 0.671 sec
Running org.apache.solr.search.TestStressReorder
Creating dataDir: /usr/home/hudson/hudson-slave/workspace/Lucene-Solr-Maven-4.x/maven-build/solr/core/target/test/./solrtest-TestStressReorder-1344861844374
Tests run: 1, Failures: 0, Errors: 0, Skipped: 0, Time elapsed: 4.361 sec
Running org.apache.solr.SampleTest
Creating dataDir: /usr/home/hudson/hudson-slave/workspace/Lucene-Solr-Maven-4.x/maven-build/solr/core/target/test/./solrtest-SampleTest-1344861848735
Tests run: 2, Failures: 0, Errors: 0, Skipped: 0, Time elapsed: 0.312 sec
Running org.apache.solr.client.solrj.response.FacetFieldTest
Tests run: 1, Failures: 0, Errors: 0, Skipped: 0, Time elapsed: 0.016 sec
Running org.apache.solr.TestGroupingSearch
Creating dataDir: /usr/home/hudson/hudson-slave/workspace/Lucene-Solr-Maven-4.x/maven-build/solr/core/target/test/./solrtest-TestGroupingSearch-1344861849065
Tests run: 12, Failures: 0, Errors: 0, Skipped: 0, Time elapsed: 2.69 sec
Running org.apache.solr.common.util.IteratorChainTest
Tests run: 7, Failures: 0, Errors: 0, Skipped: 0, Time elapsed: 0.031 sec
Running org.apache.solr.util.TestNumberUtils
Tests run: 1, Failures: 0, Errors: 0, Skipped: 0, Time elapsed: 0.171 sec
Running org.apache.solr.update.PeerSyncTest
Tests run: 1, Failures: 0, Errors: 0, Skipped: 0, Time elapsed: 2.648 sec
Running org.apache.solr.spelling.TestSuggestSpellingConverter
Tests run: 2, Failures: 0, Errors: 0, Skipped: 0, Time elapsed: 0.034 sec
Running org.apache.solr.request.SimpleFacetsTest
Creating dataDir: /usr/home/hudson/hudson-slave/workspace/Lucene-Solr-Maven-4.x/maven-build/solr/core/target/test/./solrtest-SimpleFacetsTest-1344861854652
ASYNC  NEW_CORE C5 name=collection1 org.apache.solr.core.SolrCore@2dcc674e
1389 T1424 C5 oasc.SolrException.log SEVERE org.apache.solr.common.SolrException: Specify the group.field as parameter or local parameter
		at org.apache.solr.request.SimpleFacets.getGroupedCounts(SimpleFacets.java:360)
		at org.apache.solr.request.SimpleFacets.getTermCounts(SimpleFacets.java:319)
		at org.apache.solr.request.SimpleFacets.getFacetFieldCounts(SimpleFacets.java:423)
		at org.apache.solr.request.SimpleFacets.getFacetCounts(SimpleFacets.java:206)
		at org.apache.solr.handler.component.FacetComponent.process(FacetComponent.java:87)
		at org.apache.solr.handler.component.SearchHandler.handleRequestBody(SearchHandler.java:206)
		at org.apache.solr.handler.RequestHandlerBase.handleRequest(RequestHandlerBase.java:129)
		at org.apache.solr.core.SolrCore.execute(SolrCore.java:1658)
		at org.apache.solr.util.TestHarness.query(TestHarness.java:351)
		at org.apache.solr.util.TestHarness.query(TestHarness.java:333)
		at org.apache.solr.request.SimpleFacetsTest.testSimpleGroupedFacets(SimpleFacetsTest.java:211)
		at sun.reflect.NativeMethodAccessorImpl.invoke0(Native Method)
		at sun.reflect.NativeMethodAccessorImpl.invoke(NativeMethodAccessorImpl.java:57)
		at sun.reflect.DelegatingMethodAccessorImpl.invoke(DelegatingMethodAccessorImpl.java:43)
		at java.lang.reflect.Method.invoke(Method.java:616)
		at com.carrotsearch.randomizedtesting.RandomizedRunner.invoke(RandomizedRunner.java:1559)
		at com.carrotsearch.randomizedtesting.RandomizedRunner.access$600(RandomizedRunner.java:79)
		at com.carrotsearch.randomizedtesting.RandomizedRunner$6.evaluate(RandomizedRunner.java:737)
		at com.carrotsearch.randomizedtesting.RandomizedRunner$7.evaluate(RandomizedRunner.java:773)
		at com.carrotsearch.randomizedtesting.RandomizedRunner$8.evaluate(RandomizedRunner.java:787)
		at com.carrotsearch.randomizedtesting.rules.SystemPropertiesRestoreRule$1.evaluate(SystemPropertiesRestoreRule.java:53)
		at org.apache.lucene.util.TestRuleSetupTeardownChained$1.evaluate(TestRuleSetupTeardownChained.java:50)
		at org.apache.lucene.util.TestRuleFieldCacheSanity$1.evaluate(TestRuleFieldCacheSanity.java:32)
		at org.apache.lucene.util.AbstractBeforeAfterRule$1.evaluate(AbstractBeforeAfterRule.java:45)
		at com.carrotsearch.randomizedtesting.rules.SystemPropertiesInvariantRule$1.evaluate(SystemPropertiesInvariantRule.java:55)
		at org.apache.lucene.util.TestRuleThreadAndTestName$1.evaluate(TestRuleThreadAndTestName.java:48)
		at org.apache.lucene.util.TestRuleIgnoreAfterMaxFailures$1.evaluate(TestRuleIgnoreAfterMaxFailures.java:70)
		at org.apache.lucene.util.TestRuleMarkFailure$1.evaluate(TestRuleMarkFailure.java:48)
		at com.carrotsearch.randomizedtesting.rules.StatementAdapter.evaluate(StatementAdapter.java:36)
		at com.carrotsearch.randomizedtesting.ThreadLeakControl$StatementRunner.run(ThreadLeakControl.java:345)
		at com.carrotsearch.randomizedtesting.ThreadLeakControl.forkTimeoutingTask(ThreadLeakControl.java:769)
		at com.carrotsearch.randomizedtesting.ThreadLeakControl$3.evaluate(ThreadLeakControl.java:429)
		at com.carrotsearch.randomizedtesting.RandomizedRunner.runSingleTest(RandomizedRunner.java:746)
		at com.carrotsearch.randomizedtesting.RandomizedRunner$3.evaluate(RandomizedRunner.java:648)
		at com.carrotsearch.randomizedtesting.RandomizedRunner$4.evaluate(RandomizedRunner.java:682)
		at com.carrotsearch.randomizedtesting.RandomizedRunner$5.evaluate(RandomizedRunner.java:693)
		at com.carrotsearch.randomizedtesting.rules.StatementAdapter.evaluate(StatementAdapter.java:36)
		at com.carrotsearch.randomizedtesting.rules.SystemPropertiesRestoreRule$1.evaluate(SystemPropertiesRestoreRule.java:53)
		at org.apache.lucene.util.AbstractBeforeAfterRule$1.evaluate(AbstractBeforeAfterRule.java:45)
		at org.apache.lucene.util.TestRuleStoreClassName$1.evaluate(TestRuleStoreClassName.java:38)
		at com.carrotsearch.randomizedtesting.rules.SystemPropertiesInvariantRule$1.evaluate(SystemPropertiesInvariantRule.java:55)
		at com.carrotsearch.randomizedtesting.rules.NoShadowingOrOverridesOnMethodsRule$1.evaluate(NoShadowingOrOverridesOnMethodsRule.java:39)
		at com.carrotsearch.randomizedtesting.rules.NoShadowingOrOverridesOnMethodsRule$1.evaluate(NoShadowingOrOverridesOnMethodsRule.java:39)
		at org.apache.lucene.util.TestRuleAssertionsRequired$1.evaluate(TestRuleAssertionsRequired.java:40)
		at org.apache.lucene.util.TestRuleMarkFailure$1.evaluate(TestRuleMarkFailure.java:48)
		at org.apache.lucene.util.TestRuleIgnoreAfterMaxFailures$1.evaluate(TestRuleIgnoreAfterMaxFailures.java:70)
		at org.apache.lucene.util.TestRuleIgnoreTestSuites$1.evaluate(TestRuleIgnoreTestSuites.java:55)
		at com.carrotsearch.randomizedtesting.rules.StatementAdapter.evaluate(StatementAdapter.java:36)
		at com.carrotsearch.randomizedtesting.ThreadLeakControl$StatementRunner.run(ThreadLeakControl.java:345)
		at java.lang.Thread.run(Thread.java:679)
	
1810 T1424 C5 oasc.SolrException.log SEVERE org.apache.solr.common.SolrException: range facet infinite loop: gap is either zero, or too small relative start/end and caused underflow: 23.0 + 0 = 23.0
		at org.apache.solr.request.SimpleFacets.getFacetRangeCounts(SimpleFacets.java:1122)
		at org.apache.solr.request.SimpleFacets.getFacetRangeCounts(SimpleFacets.java:1074)
		at org.apache.solr.request.SimpleFacets.getFacetRangeCounts(SimpleFacets.java:1018)
		at org.apache.solr.request.SimpleFacets.getFacetCounts(SimpleFacets.java:208)
		at org.apache.solr.handler.component.FacetComponent.process(FacetComponent.java:87)
		at org.apache.solr.handler.component.SearchHandler.handleRequestBody(SearchHandler.java:206)
		at org.apache.solr.handler.RequestHandlerBase.handleRequest(RequestHandlerBase.java:129)
		at org.apache.solr.core.SolrCore.execute(SolrCore.java:1658)
		at org.apache.solr.util.TestHarness.query(TestHarness.java:351)
		at org.apache.solr.util.TestHarness.query(TestHarness.java:333)
		at org.apache.solr.SolrTestCaseJ4.assertQEx(SolrTestCaseJ4.java:601)
		at org.apache.solr.request.SimpleFacetsTest.testRangeFacetInfiniteLoopDetection(SimpleFacetsTest.java:2018)
		at sun.reflect.NativeMethodAccessorImpl.invoke0(Native Method)
		at sun.reflect.NativeMethodAccessorImpl.invoke(NativeMethodAccessorImpl.java:57)
		at sun.reflect.DelegatingMethodAccessorImpl.invoke(DelegatingMethodAccessorImpl.java:43)
		at java.lang.reflect.Method.invoke(Method.java:616)
		at com.carrotsearch.randomizedtesting.RandomizedRunner.invoke(RandomizedRunner.java:1559)
		at com.carrotsearch.randomizedtesting.RandomizedRunner.access$600(RandomizedRunner.java:79)
		at com.carrotsearch.randomizedtesting.RandomizedRunner$6.evaluate(RandomizedRunner.java:737)
		at com.carrotsearch.randomizedtesting.RandomizedRunner$7.evaluate(RandomizedRunner.java:773)
		at com.carrotsearch.randomizedtesting.RandomizedRunner$8.evaluate(RandomizedRunner.java:787)
		at com.carrotsearch.randomizedtesting.rules.SystemPropertiesRestoreRule$1.evaluate(SystemPropertiesRestoreRule.java:53)
		at org.apache.lucene.util.TestRuleSetupTeardownChained$1.evaluate(TestRuleSetupTeardownChained.java:50)
		at org.apache.lucene.util.TestRuleFieldCacheSanity$1.evaluate(TestRuleFieldCacheSanity.java:32)
		at org.apache.lucene.util.AbstractBeforeAfterRule$1.evaluate(AbstractBeforeAfterRule.java:45)
		at com.carrotsearch.randomizedtesting.rules.SystemPropertiesInvariantRule$1.evaluate(SystemPropertiesInvariantRule.java:55)
		at org.apache.lucene.util.TestRuleThreadAndTestName$1.evaluate(TestRuleThreadAndTestName.java:48)
		at org.apache.lucene.util.TestRuleIgnoreAfterMaxFailures$1.evaluate(TestRuleIgnoreAfterMaxFailures.java:70)
		at org.apache.lucene.util.TestRuleMarkFailure$1.evaluate(TestRuleMarkFailure.java:48)
		at com.carrotsearch.randomizedtesting.rules.StatementAdapter.evaluate(StatementAdapter.java:36)
		at com.carrotsearch.randomizedtesting.ThreadLeakControl$StatementRunner.run(ThreadLeakControl.java:345)
		at com.carrotsearch.randomizedtesting.ThreadLeakControl.forkTimeoutingTask(ThreadLeakControl.java:769)
		at com.carrotsearch.randomizedtesting.ThreadLeakControl$3.evaluate(ThreadLeakControl.java:429)
		at com.carrotsearch.randomizedtesting.RandomizedRunner.runSingleTest(RandomizedRunner.java:746)
		at com.carrotsearch.randomizedtesting.RandomizedRunner$3.evaluate(RandomizedRunner.java:648)
		at com.carrotsearch.randomizedtesting.RandomizedRunner$4.evaluate(RandomizedRunner.java:682)
		at com.carrotsearch.randomizedtesting.RandomizedRunner$5.evaluate(RandomizedRunner.java:693)
		at com.carrotsearch.randomizedtesting.rules.StatementAdapter.evaluate(StatementAdapter.java:36)
		at com.carrotsearch.randomizedtesting.rules.SystemPropertiesRestoreRule$1.evaluate(SystemPropertiesRestoreRule.java:53)
		at org.apache.lucene.util.AbstractBeforeAfterRule$1.evaluate(AbstractBeforeAfterRule.java:45)
		at org.apache.lucene.util.TestRuleStoreClassName$1.evaluate(TestRuleStoreClassName.java:38)
		at com.carrotsearch.randomizedtesting.rules.SystemPropertiesInvariantRule$1.evaluate(SystemPropertiesInvariantRule.java:55)
		at com.carrotsearch.randomizedtesting.rules.NoShadowingOrOverridesOnMethodsRule$1.evaluate(NoShadowingOrOverridesOnMethodsRule.java:39)
		at com.carrotsearch.randomizedtesting.rules.NoShadowingOrOverridesOnMethodsRule$1.evaluate(NoShadowingOrOverridesOnMethodsRule.java:39)
		at org.apache.lucene.util.TestRuleAssertionsRequired$1.evaluate(TestRuleAssertionsRequired.java:40)
		at org.apache.lucene.util.TestRuleMarkFailure$1.evaluate(TestRuleMarkFailure.java:48)
		at org.apache.lucene.util.TestRuleIgnoreAfterMaxFailures$1.evaluate(TestRuleIgnoreAfterMaxFailures.java:70)
		at org.apache.lucene.util.TestRuleIgnoreTestSuites$1.evaluate(TestRuleIgnoreTestSuites.java:55)
		at com.carrotsearch.randomizedtesting.rules.StatementAdapter.evaluate(StatementAdapter.java:36)
		at com.carrotsearch.randomizedtesting.ThreadLeakControl$StatementRunner.run(ThreadLeakControl.java:345)
		at java.lang.Thread.run(Thread.java:679)
	
1812 T1424 C5 oasc.SolrException.log SEVERE org.apache.solr.common.SolrException: range facet infinite loop: gap is either zero, or too small relative start/end and caused underflow: 23.0 + 0 = 23.0
		at org.apache.solr.request.SimpleFacets.getFacetRangeCounts(SimpleFacets.java:1122)
		at org.apache.solr.request.SimpleFacets.getFacetRangeCounts(SimpleFacets.java:1074)
		at org.apache.solr.request.SimpleFacets.getFacetRangeCounts(SimpleFacets.java:1018)
		at org.apache.solr.request.SimpleFacets.getFacetCounts(SimpleFacets.java:208)
		at org.apache.solr.handler.component.FacetComponent.process(FacetComponent.java:87)
		at org.apache.solr.handler.component.SearchHandler.handleRequestBody(SearchHandler.java:206)
		at org.apache.solr.handler.RequestHandlerBase.handleRequest(RequestHandlerBase.java:129)
		at org.apache.solr.core.SolrCore.execute(SolrCore.java:1658)
		at org.apache.solr.util.TestHarness.query(TestHarness.java:351)
		at org.apache.solr.util.TestHarness.query(TestHarness.java:333)
		at org.apache.solr.SolrTestCaseJ4.assertQEx(SolrTestCaseJ4.java:601)
		at org.apache.solr.request.SimpleFacetsTest.testRangeFacetInfiniteLoopDetection(SimpleFacetsTest.java:2018)
		at sun.reflect.NativeMethodAccessorImpl.invoke0(Native Method)
		at sun.reflect.NativeMethodAccessorImpl.invoke(NativeMethodAccessorImpl.java:57)
		at sun.reflect.DelegatingMethodAccessorImpl.invoke(DelegatingMethodAccessorImpl.java:43)
		at java.lang.reflect.Method.invoke(Method.java:616)
		at com.carrotsearch.randomizedtesting.RandomizedRunner.invoke(RandomizedRunner.java:1559)
		at com.carrotsearch.randomizedtesting.RandomizedRunner.access$600(RandomizedRunner.java:79)
		at com.carrotsearch.randomizedtesting.RandomizedRunner$6.evaluate(RandomizedRunner.java:737)
		at com.carrotsearch.randomizedtesting.RandomizedRunner$7.evaluate(RandomizedRunner.java:773)
		at com.carrotsearch.randomizedtesting.RandomizedRunner$8.evaluate(RandomizedRunner.java:787)
		at com.carrotsearch.randomizedtesting.rules.SystemPropertiesRestoreRule$1.evaluate(SystemPropertiesRestoreRule.java:53)
		at org.apache.lucene.util.TestRuleSetupTeardownChained$1.evaluate(TestRuleSetupTeardownChained.java:50)
		at org.apache.lucene.util.TestRuleFieldCacheSanity$1.evaluate(TestRuleFieldCacheSanity.java:32)
		at org.apache.lucene.util.AbstractBeforeAfterRule$1.evaluate(AbstractBeforeAfterRule.java:45)
		at com.carrotsearch.randomizedtesting.rules.SystemPropertiesInvariantRule$1.evaluate(SystemPropertiesInvariantRule.java:55)
		at org.apache.lucene.util.TestRuleThreadAndTestName$1.evaluate(TestRuleThreadAndTestName.java:48)
		at org.apache.lucene.util.TestRuleIgnoreAfterMaxFailures$1.evaluate(TestRuleIgnoreAfterMaxFailures.java:70)
		at org.apache.lucene.util.TestRuleMarkFailure$1.evaluate(TestRuleMarkFailure.java:48)
		at com.carrotsearch.randomizedtesting.rules.StatementAdapter.evaluate(StatementAdapter.java:36)
		at com.carrotsearch.randomizedtesting.ThreadLeakControl$StatementRunner.run(ThreadLeakControl.java:345)
		at com.carrotsearch.randomizedtesting.ThreadLeakControl.forkTimeoutingTask(ThreadLeakControl.java:769)
		at com.carrotsearch.randomizedtesting.ThreadLeakControl$3.evaluate(ThreadLeakControl.java:429)
		at com.carrotsearch.randomizedtesting.RandomizedRunner.runSingleTest(RandomizedRunner.java:746)
		at com.carrotsearch.randomizedtesting.RandomizedRunner$3.evaluate(RandomizedRunner.java:648)
		at com.carrotsearch.randomizedtesting.RandomizedRunner$4.evaluate(RandomizedRunner.java:682)
		at com.carrotsearch.randomizedtesting.RandomizedRunner$5.evaluate(RandomizedRunner.java:693)
		at com.carrotsearch.randomizedtesting.rules.StatementAdapter.evaluate(StatementAdapter.java:36)
		at com.carrotsearch.randomizedtesting.rules.SystemPropertiesRestoreRule$1.evaluate(SystemPropertiesRestoreRule.java:53)
		at org.apache.lucene.util.AbstractBeforeAfterRule$1.evaluate(AbstractBeforeAfterRule.java:45)
		at org.apache.lucene.util.TestRuleStoreClassName$1.evaluate(TestRuleStoreClassName.java:38)
		at com.carrotsearch.randomizedtesting.rules.SystemPropertiesInvariantRule$1.evaluate(SystemPropertiesInvariantRule.java:55)
		at com.carrotsearch.randomizedtesting.rules.NoShadowingOrOverridesOnMethodsRule$1.evaluate(NoShadowingOrOverridesOnMethodsRule.java:39)
		at com.carrotsearch.randomizedtesting.rules.NoShadowingOrOverridesOnMethodsRule$1.evaluate(NoShadowingOrOverridesOnMethodsRule.java:39)
		at org.apache.lucene.util.TestRuleAssertionsRequired$1.evaluate(TestRuleAssertionsRequired.java:40)
		at org.apache.lucene.util.TestRuleMarkFailure$1.evaluate(TestRuleMarkFailure.java:48)
		at org.apache.lucene.util.TestRuleIgnoreAfterMaxFailures$1.evaluate(TestRuleIgnoreAfterMaxFailures.java:70)
		at org.apache.lucene.util.TestRuleIgnoreTestSuites$1.evaluate(TestRuleIgnoreTestSuites.java:55)
		at com.carrotsearch.randomizedtesting.rules.StatementAdapter.evaluate(StatementAdapter.java:36)
		at com.carrotsearch.randomizedtesting.ThreadLeakControl$StatementRunner.run(ThreadLeakControl.java:345)
		at java.lang.Thread.run(Thread.java:679)
	
1813 T1424 C5 oasc.SolrException.log SEVERE org.apache.solr.common.SolrException: range facet infinite loop: gap is either zero, or too small relative start/end and caused underflow: 23.0 + 0 = 23.0
		at org.apache.solr.request.SimpleFacets.getFacetRangeCounts(SimpleFacets.java:1122)
		at org.apache.solr.request.SimpleFacets.getFacetRangeCounts(SimpleFacets.java:1074)
		at org.apache.solr.request.SimpleFacets.getFacetRangeCounts(SimpleFacets.java:1018)
		at org.apache.solr.request.SimpleFacets.getFacetCounts(SimpleFacets.java:208)
		at org.apache.solr.handler.component.FacetComponent.process(FacetComponent.java:87)
		at org.apache.solr.handler.component.SearchHandler.handleRequestBody(SearchHandler.java:206)
		at org.apache.solr.handler.RequestHandlerBase.handleRequest(RequestHandlerBase.java:129)
		at org.apache.solr.core.SolrCore.execute(SolrCore.java:1658)
		at org.apache.solr.util.TestHarness.query(TestHarness.java:351)
		at org.apache.solr.util.TestHarness.query(TestHarness.java:333)
		at org.apache.solr.SolrTestCaseJ4.assertQEx(SolrTestCaseJ4.java:601)
		at org.apache.solr.request.SimpleFacetsTest.testRangeFacetInfiniteLoopDetection(SimpleFacetsTest.java:2018)
		at sun.reflect.NativeMethodAccessorImpl.invoke0(Native Method)
		at sun.reflect.NativeMethodAccessorImpl.invoke(NativeMethodAccessorImpl.java:57)
		at sun.reflect.DelegatingMethodAccessorImpl.invoke(DelegatingMethodAccessorImpl.java:43)
		at java.lang.reflect.Method.invoke(Method.java:616)
		at com.carrotsearch.randomizedtesting.RandomizedRunner.invoke(RandomizedRunner.java:1559)
		at com.carrotsearch.randomizedtesting.RandomizedRunner.access$600(RandomizedRunner.java:79)
		at com.carrotsearch.randomizedtesting.RandomizedRunner$6.evaluate(RandomizedRunner.java:737)
		at com.carrotsearch.randomizedtesting.RandomizedRunner$7.evaluate(RandomizedRunner.java:773)
		at com.carrotsearch.randomizedtesting.RandomizedRunner$8.evaluate(RandomizedRunner.java:787)
		at com.carrotsearch.randomizedtesting.rules.SystemPropertiesRestoreRule$1.evaluate(SystemPropertiesRestoreRule.java:53)
		at org.apache.lucene.util.TestRuleSetupTeardownChained$1.evaluate(TestRuleSetupTeardownChained.java:50)
		at org.apache.lucene.util.TestRuleFieldCacheSanity$1.evaluate(TestRuleFieldCacheSanity.java:32)
		at org.apache.lucene.util.AbstractBeforeAfterRule$1.evaluate(AbstractBeforeAfterRule.java:45)
		at com.carrotsearch.randomizedtesting.rules.SystemPropertiesInvariantRule$1.evaluate(SystemPropertiesInvariantRule.java:55)
		at org.apache.lucene.util.TestRuleThreadAndTestName$1.evaluate(TestRuleThreadAndTestName.java:48)
		at org.apache.lucene.util.TestRuleIgnoreAfterMaxFailures$1.evaluate(TestRuleIgnoreAfterMaxFailures.java:70)
		at org.apache.lucene.util.TestRuleMarkFailure$1.evaluate(TestRuleMarkFailure.java:48)
		at com.carrotsearch.randomizedtesting.rules.StatementAdapter.evaluate(StatementAdapter.java:36)
		at com.carrotsearch.randomizedtesting.ThreadLeakControl$StatementRunner.run(ThreadLeakControl.java:345)
		at com.carrotsearch.randomizedtesting.ThreadLeakControl.forkTimeoutingTask(ThreadLeakControl.java:769)
		at com.carrotsearch.randomizedtesting.ThreadLeakControl$3.evaluate(ThreadLeakControl.java:429)
		at com.carrotsearch.randomizedtesting.RandomizedRunner.runSingleTest(RandomizedRunner.java:746)
		at com.carrotsearch.randomizedtesting.RandomizedRunner$3.evaluate(RandomizedRunner.java:648)
		at com.carrotsearch.randomizedtesting.RandomizedRunner$4.evaluate(RandomizedRunner.java:682)
		at com.carrotsearch.randomizedtesting.RandomizedRunner$5.evaluate(RandomizedRunner.java:693)
		at com.carrotsearch.randomizedtesting.rules.StatementAdapter.evaluate(StatementAdapter.java:36)
		at com.carrotsearch.randomizedtesting.rules.SystemPropertiesRestoreRule$1.evaluate(SystemPropertiesRestoreRule.java:53)
		at org.apache.lucene.util.AbstractBeforeAfterRule$1.evaluate(AbstractBeforeAfterRule.java:45)
		at org.apache.lucene.util.TestRuleStoreClassName$1.evaluate(TestRuleStoreClassName.java:38)
		at com.carrotsearch.randomizedtesting.rules.SystemPropertiesInvariantRule$1.evaluate(SystemPropertiesInvariantRule.java:55)
		at com.carrotsearch.randomizedtesting.rules.NoShadowingOrOverridesOnMethodsRule$1.evaluate(NoShadowingOrOverridesOnMethodsRule.java:39)
		at com.carrotsearch.randomizedtesting.rules.NoShadowingOrOverridesOnMethodsRule$1.evaluate(NoShadowingOrOverridesOnMethodsRule.java:39)
		at org.apache.lucene.util.TestRuleAssertionsRequired$1.evaluate(TestRuleAssertionsRequired.java:40)
		at org.apache.lucene.util.TestRuleMarkFailure$1.evaluate(TestRuleMarkFailure.java:48)
		at org.apache.lucene.util.TestRuleIgnoreAfterMaxFailures$1.evaluate(TestRuleIgnoreAfterMaxFailures.java:70)
		at org.apache.lucene.util.TestRuleIgnoreTestSuites$1.evaluate(TestRuleIgnoreTestSuites.java:55)
		at com.carrotsearch.randomizedtesting.rules.StatementAdapter.evaluate(StatementAdapter.java:36)
		at com.carrotsearch.randomizedtesting.ThreadLeakControl$StatementRunner.run(ThreadLeakControl.java:345)
		at java.lang.Thread.run(Thread.java:679)
	
1814 T1424 C5 oasc.SolrException.log SEVERE org.apache.solr.common.SolrException: range facet infinite loop: gap is either zero, or too small relative start/end and caused underflow: 23.0 + 0 = 23.0
		at org.apache.solr.request.SimpleFacets.getFacetRangeCounts(SimpleFacets.java:1122)
		at org.apache.solr.request.SimpleFacets.getFacetRangeCounts(SimpleFacets.java:1074)
		at org.apache.solr.request.SimpleFacets.getFacetRangeCounts(SimpleFacets.java:1018)
		at org.apache.solr.request.SimpleFacets.getFacetCounts(SimpleFacets.java:208)
		at org.apache.solr.handler.component.FacetComponent.process(FacetComponent.java:87)
		at org.apache.solr.handler.component.SearchHandler.handleRequestBody(SearchHandler.java:206)
		at org.apache.solr.handler.RequestHandlerBase.handleRequest(RequestHandlerBase.java:129)
		at org.apache.solr.core.SolrCore.execute(SolrCore.java:1658)
		at org.apache.solr.util.TestHarness.query(TestHarness.java:351)
		at org.apache.solr.util.TestHarness.query(TestHarness.java:333)
		at org.apache.solr.SolrTestCaseJ4.assertQEx(SolrTestCaseJ4.java:601)
		at org.apache.solr.request.SimpleFacetsTest.testRangeFacetInfiniteLoopDetection(SimpleFacetsTest.java:2018)
		at sun.reflect.NativeMethodAccessorImpl.invoke0(Native Method)
		at sun.reflect.NativeMethodAccessorImpl.invoke(NativeMethodAccessorImpl.java:57)
		at sun.reflect.DelegatingMethodAccessorImpl.invoke(DelegatingMethodAccessorImpl.java:43)
		at java.lang.reflect.Method.invoke(Method.java:616)
		at com.carrotsearch.randomizedtesting.RandomizedRunner.invoke(RandomizedRunner.java:1559)
		at com.carrotsearch.randomizedtesting.RandomizedRunner.access$600(RandomizedRunner.java:79)
		at com.carrotsearch.randomizedtesting.RandomizedRunner$6.evaluate(RandomizedRunner.java:737)
		at com.carrotsearch.randomizedtesting.RandomizedRunner$7.evaluate(RandomizedRunner.java:773)
		at com.carrotsearch.randomizedtesting.RandomizedRunner$8.evaluate(RandomizedRunner.java:787)
		at com.carrotsearch.randomizedtesting.rules.SystemPropertiesRestoreRule$1.evaluate(SystemPropertiesRestoreRule.java:53)
		at org.apache.lucene.util.TestRuleSetupTeardownChained$1.evaluate(TestRuleSetupTeardownChained.java:50)
		at org.apache.lucene.util.TestRuleFieldCacheSanity$1.evaluate(TestRuleFieldCacheSanity.java:32)
		at org.apache.lucene.util.AbstractBeforeAfterRule$1.evaluate(AbstractBeforeAfterRule.java:45)
		at com.carrotsearch.randomizedtesting.rules.SystemPropertiesInvariantRule$1.evaluate(SystemPropertiesInvariantRule.java:55)
		at org.apache.lucene.util.TestRuleThreadAndTestName$1.evaluate(TestRuleThreadAndTestName.java:48)
		at org.apache.lucene.util.TestRuleIgnoreAfterMaxFailures$1.evaluate(TestRuleIgnoreAfterMaxFailures.java:70)
		at org.apache.lucene.util.TestRuleMarkFailure$1.evaluate(TestRuleMarkFailure.java:48)
		at com.carrotsearch.randomizedtesting.rules.StatementAdapter.evaluate(StatementAdapter.java:36)
		at com.carrotsearch.randomizedtesting.ThreadLeakControl$StatementRunner.run(ThreadLeakControl.java:345)
		at com.carrotsearch.randomizedtesting.ThreadLeakControl.forkTimeoutingTask(ThreadLeakControl.java:769)
		at com.carrotsearch.randomizedtesting.ThreadLeakControl$3.evaluate(ThreadLeakControl.java:429)
		at com.carrotsearch.randomizedtesting.RandomizedRunner.runSingleTest(RandomizedRunner.java:746)
		at com.carrotsearch.randomizedtesting.RandomizedRunner$3.evaluate(RandomizedRunner.java:648)
		at com.carrotsearch.randomizedtesting.RandomizedRunner$4.evaluate(RandomizedRunner.java:682)
		at com.carrotsearch.randomizedtesting.RandomizedRunner$5.evaluate(RandomizedRunner.java:693)
		at com.carrotsearch.randomizedtesting.rules.StatementAdapter.evaluate(StatementAdapter.java:36)
		at com.carrotsearch.randomizedtesting.rules.SystemPropertiesRestoreRule$1.evaluate(SystemPropertiesRestoreRule.java:53)
		at org.apache.lucene.util.AbstractBeforeAfterRule$1.evaluate(AbstractBeforeAfterRule.java:45)
		at org.apache.lucene.util.TestRuleStoreClassName$1.evaluate(TestRuleStoreClassName.java:38)
		at com.carrotsearch.randomizedtesting.rules.SystemPropertiesInvariantRule$1.evaluate(SystemPropertiesInvariantRule.java:55)
		at com.carrotsearch.randomizedtesting.rules.NoShadowingOrOverridesOnMethodsRule$1.evaluate(NoShadowingOrOverridesOnMethodsRule.java:39)
		at com.carrotsearch.randomizedtesting.rules.NoShadowingOrOverridesOnMethodsRule$1.evaluate(NoShadowingOrOverridesOnMethodsRule.java:39)
		at org.apache.lucene.util.TestRuleAssertionsRequired$1.evaluate(TestRuleAssertionsRequired.java:40)
		at org.apache.lucene.util.TestRuleMarkFailure$1.evaluate(TestRuleMarkFailure.java:48)
		at org.apache.lucene.util.TestRuleIgnoreAfterMaxFailures$1.evaluate(TestRuleIgnoreAfterMaxFailures.java:70)
		at org.apache.lucene.util.TestRuleIgnoreTestSuites$1.evaluate(TestRuleIgnoreTestSuites.java:55)
		at com.carrotsearch.randomizedtesting.rules.StatementAdapter.evaluate(StatementAdapter.java:36)
		at com.carrotsearch.randomizedtesting.ThreadLeakControl$StatementRunner.run(ThreadLeakControl.java:345)
		at java.lang.Thread.run(Thread.java:679)
	
1815 T1424 C5 oasc.SolrException.log SEVERE org.apache.solr.common.SolrException: range facet infinite loop: gap is either zero, or too small relative start/end and caused underflow: 23 + 0 = 23
		at org.apache.solr.request.SimpleFacets.getFacetRangeCounts(SimpleFacets.java:1122)
		at org.apache.solr.request.SimpleFacets.getFacetRangeCounts(SimpleFacets.java:1074)
		at org.apache.solr.request.SimpleFacets.getFacetRangeCounts(SimpleFacets.java:1018)
		at org.apache.solr.request.SimpleFacets.getFacetCounts(SimpleFacets.java:208)
		at org.apache.solr.handler.component.FacetComponent.process(FacetComponent.java:87)
		at org.apache.solr.handler.component.SearchHandler.handleRequestBody(SearchHandler.java:206)
		at org.apache.solr.handler.RequestHandlerBase.handleRequest(RequestHandlerBase.java:129)
		at org.apache.solr.core.SolrCore.execute(SolrCore.java:1658)
		at org.apache.solr.util.TestHarness.query(TestHarness.java:351)
		at org.apache.solr.util.TestHarness.query(TestHarness.java:333)
		at org.apache.solr.SolrTestCaseJ4.assertQEx(SolrTestCaseJ4.java:601)
		at org.apache.solr.request.SimpleFacetsTest.testRangeFacetInfiniteLoopDetection(SimpleFacetsTest.java:2018)
		at sun.reflect.NativeMethodAccessorImpl.invoke0(Native Method)
		at sun.reflect.NativeMethodAccessorImpl.invoke(NativeMethodAccessorImpl.java:57)
		at sun.reflect.DelegatingMethodAccessorImpl.invoke(DelegatingMethodAccessorImpl.java:43)
		at java.lang.reflect.Method.invoke(Method.java:616)
		at com.carrotsearch.randomizedtesting.RandomizedRunner.invoke(RandomizedRunner.java:1559)
		at com.carrotsearch.randomizedtesting.RandomizedRunner.access$600(RandomizedRunner.java:79)
		at com.carrotsearch.randomizedtesting.RandomizedRunner$6.evaluate(RandomizedRunner.java:737)
		at com.carrotsearch.randomizedtesting.RandomizedRunner$7.evaluate(RandomizedRunner.java:773)
		at com.carrotsearch.randomizedtesting.RandomizedRunner$8.evaluate(RandomizedRunner.java:787)
		at com.carrotsearch.randomizedtesting.rules.SystemPropertiesRestoreRule$1.evaluate(SystemPropertiesRestoreRule.java:53)
		at org.apache.lucene.util.TestRuleSetupTeardownChained$1.evaluate(TestRuleSetupTeardownChained.java:50)
		at org.apache.lucene.util.TestRuleFieldCacheSanity$1.evaluate(TestRuleFieldCacheSanity.java:32)
		at org.apache.lucene.util.AbstractBeforeAfterRule$1.evaluate(AbstractBeforeAfterRule.java:45)
		at com.carrotsearch.randomizedtesting.rules.SystemPropertiesInvariantRule$1.evaluate(SystemPropertiesInvariantRule.java:55)
		at org.apache.lucene.util.TestRuleThreadAndTestName$1.evaluate(TestRuleThreadAndTestName.java:48)
		at org.apache.lucene.util.TestRuleIgnoreAfterMaxFailures$1.evaluate(TestRuleIgnoreAfterMaxFailures.java:70)
		at org.apache.lucene.util.TestRuleMarkFailure$1.evaluate(TestRuleMarkFailure.java:48)
		at com.carrotsearch.randomizedtesting.rules.StatementAdapter.evaluate(StatementAdapter.java:36)
		at com.carrotsearch.randomizedtesting.ThreadLeakControl$StatementRunner.run(ThreadLeakControl.java:345)
		at com.carrotsearch.randomizedtesting.ThreadLeakControl.forkTimeoutingTask(ThreadLeakControl.java:769)
		at com.carrotsearch.randomizedtesting.ThreadLeakControl$3.evaluate(ThreadLeakControl.java:429)
		at com.carrotsearch.randomizedtesting.RandomizedRunner.runSingleTest(RandomizedRunner.java:746)
		at com.carrotsearch.randomizedtesting.RandomizedRunner$3.evaluate(RandomizedRunner.java:648)
		at com.carrotsearch.randomizedtesting.RandomizedRunner$4.evaluate(RandomizedRunner.java:682)
		at com.carrotsearch.randomizedtesting.RandomizedRunner$5.evaluate(RandomizedRunner.java:693)
		at com.carrotsearch.randomizedtesting.rules.StatementAdapter.evaluate(StatementAdapter.java:36)
		at com.carrotsearch.randomizedtesting.rules.SystemPropertiesRestoreRule$1.evaluate(SystemPropertiesRestoreRule.java:53)
		at org.apache.lucene.util.AbstractBeforeAfterRule$1.evaluate(AbstractBeforeAfterRule.java:45)
		at org.apache.lucene.util.TestRuleStoreClassName$1.evaluate(TestRuleStoreClassName.java:38)
		at com.carrotsearch.randomizedtesting.rules.SystemPropertiesInvariantRule$1.evaluate(SystemPropertiesInvariantRule.java:55)
		at com.carrotsearch.randomizedtesting.rules.NoShadowingOrOverridesOnMethodsRule$1.evaluate(NoShadowingOrOverridesOnMethodsRule.java:39)
		at com.carrotsearch.randomizedtesting.rules.NoShadowingOrOverridesOnMethodsRule$1.evaluate(NoShadowingOrOverridesOnMethodsRule.java:39)
		at org.apache.lucene.util.TestRuleAssertionsRequired$1.evaluate(TestRuleAssertionsRequired.java:40)
		at org.apache.lucene.util.TestRuleMarkFailure$1.evaluate(TestRuleMarkFailure.java:48)
		at org.apache.lucene.util.TestRuleIgnoreAfterMaxFailures$1.evaluate(TestRuleIgnoreAfterMaxFailures.java:70)
		at org.apache.lucene.util.TestRuleIgnoreTestSuites$1.evaluate(TestRuleIgnoreTestSuites.java:55)
		at com.carrotsearch.randomizedtesting.rules.StatementAdapter.evaluate(StatementAdapter.java:36)
		at com.carrotsearch.randomizedtesting.ThreadLeakControl$StatementRunner.run(ThreadLeakControl.java:345)
		at java.lang.Thread.run(Thread.java:679)
	
1816 T1424 C5 oasc.SolrException.log SEVERE org.apache.solr.common.SolrException: range facet infinite loop: gap is either zero, or too small relative start/end and caused underflow: 23 + 0 = 23
		at org.apache.solr.request.SimpleFacets.getFacetRangeCounts(SimpleFacets.java:1122)
		at org.apache.solr.request.SimpleFacets.getFacetRangeCounts(SimpleFacets.java:1074)
		at org.apache.solr.request.SimpleFacets.getFacetRangeCounts(SimpleFacets.java:1018)
		at org.apache.solr.request.SimpleFacets.getFacetCounts(SimpleFacets.java:208)
		at org.apache.solr.handler.component.FacetComponent.process(FacetComponent.java:87)
		at org.apache.solr.handler.component.SearchHandler.handleRequestBody(SearchHandler.java:206)
		at org.apache.solr.handler.RequestHandlerBase.handleRequest(RequestHandlerBase.java:129)
		at org.apache.solr.core.SolrCore.execute(SolrCore.java:1658)
		at org.apache.solr.util.TestHarness.query(TestHarness.java:351)
		at org.apache.solr.util.TestHarness.query(TestHarness.java:333)
		at org.apache.solr.SolrTestCaseJ4.assertQEx(SolrTestCaseJ4.java:601)
		at org.apache.solr.request.SimpleFacetsTest.testRangeFacetInfiniteLoopDetection(SimpleFacetsTest.java:2018)
		at sun.reflect.NativeMethodAccessorImpl.invoke0(Native Method)
		at sun.reflect.NativeMethodAccessorImpl.invoke(NativeMethodAccessorImpl.java:57)
		at sun.reflect.DelegatingMethodAccessorImpl.invoke(DelegatingMethodAccessorImpl.java:43)
		at java.lang.reflect.Method.invoke(Method.java:616)
		at com.carrotsearch.randomizedtesting.RandomizedRunner.invoke(RandomizedRunner.java:1559)
		at com.carrotsearch.randomizedtesting.RandomizedRunner.access$600(RandomizedRunner.java:79)
		at com.carrotsearch.randomizedtesting.RandomizedRunner$6.evaluate(RandomizedRunner.java:737)
		at com.carrotsearch.randomizedtesting.RandomizedRunner$7.evaluate(RandomizedRunner.java:773)
		at com.carrotsearch.randomizedtesting.RandomizedRunner$8.evaluate(RandomizedRunner.java:787)
		at com.carrotsearch.randomizedtesting.rules.SystemPropertiesRestoreRule$1.evaluate(SystemPropertiesRestoreRule.java:53)
		at org.apache.lucene.util.TestRuleSetupTeardownChained$1.evaluate(TestRuleSetupTeardownChained.java:50)
		at org.apache.lucene.util.TestRuleFieldCacheSanity$1.evaluate(TestRuleFieldCacheSanity.java:32)
		at org.apache.lucene.util.AbstractBeforeAfterRule$1.evaluate(AbstractBeforeAfterRule.java:45)
		at com.carrotsearch.randomizedtesting.rules.SystemPropertiesInvariantRule$1.evaluate(SystemPropertiesInvariantRule.java:55)
		at org.apache.lucene.util.TestRuleThreadAndTestName$1.evaluate(TestRuleThreadAndTestName.java:48)
		at org.apache.lucene.util.TestRuleIgnoreAfterMaxFailures$1.evaluate(TestRuleIgnoreAfterMaxFailures.java:70)
		at org.apache.lucene.util.TestRuleMarkFailure$1.evaluate(TestRuleMarkFailure.java:48)
		at com.carrotsearch.randomizedtesting.rules.StatementAdapter.evaluate(StatementAdapter.java:36)
		at com.carrotsearch.randomizedtesting.ThreadLeakControl$StatementRunner.run(ThreadLeakControl.java:345)
		at com.carrotsearch.randomizedtesting.ThreadLeakControl.forkTimeoutingTask(ThreadLeakControl.java:769)
		at com.carrotsearch.randomizedtesting.ThreadLeakControl$3.evaluate(ThreadLeakControl.java:429)
		at com.carrotsearch.randomizedtesting.RandomizedRunner.runSingleTest(RandomizedRunner.java:746)
		at com.carrotsearch.randomizedtesting.RandomizedRunner$3.evaluate(RandomizedRunner.java:648)
		at com.carrotsearch.randomizedtesting.RandomizedRunner$4.evaluate(RandomizedRunner.java:682)
		at com.carrotsearch.randomizedtesting.RandomizedRunner$5.evaluate(RandomizedRunner.java:693)
		at com.carrotsearch.randomizedtesting.rules.StatementAdapter.evaluate(StatementAdapter.java:36)
		at com.carrotsearch.randomizedtesting.rules.SystemPropertiesRestoreRule$1.evaluate(SystemPropertiesRestoreRule.java:53)
		at org.apache.lucene.util.AbstractBeforeAfterRule$1.evaluate(AbstractBeforeAfterRule.java:45)
		at org.apache.lucene.util.TestRuleStoreClassName$1.evaluate(TestRuleStoreClassName.java:38)
		at com.carrotsearch.randomizedtesting.rules.SystemPropertiesInvariantRule$1.evaluate(SystemPropertiesInvariantRule.java:55)
		at com.carrotsearch.randomizedtesting.rules.NoShadowingOrOverridesOnMethodsRule$1.evaluate(NoShadowingOrOverridesOnMethodsRule.java:39)
		at com.carrotsearch.randomizedtesting.rules.NoShadowingOrOverridesOnMethodsRule$1.evaluate(NoShadowingOrOverridesOnMethodsRule.java:39)
		at org.apache.lucene.util.TestRuleAssertionsRequired$1.evaluate(TestRuleAssertionsRequired.java:40)
		at org.apache.lucene.util.TestRuleMarkFailure$1.evaluate(TestRuleMarkFailure.java:48)
		at org.apache.lucene.util.TestRuleIgnoreAfterMaxFailures$1.evaluate(TestRuleIgnoreAfterMaxFailures.java:70)
		at org.apache.lucene.util.TestRuleIgnoreTestSuites$1.evaluate(TestRuleIgnoreTestSuites.java:55)
		at com.carrotsearch.randomizedtesting.rules.StatementAdapter.evaluate(StatementAdapter.java:36)
		at com.carrotsearch.randomizedtesting.ThreadLeakControl$StatementRunner.run(ThreadLeakControl.java:345)
		at java.lang.Thread.run(Thread.java:679)
	
1817 T1424 C5 oasc.SolrException.log SEVERE org.apache.solr.common.SolrException: date facet infinite loop: gap is effectively zero
		at org.apache.solr.request.SimpleFacets.getFacetDateCounts(SimpleFacets.java:928)
		at org.apache.solr.request.SimpleFacets.getFacetDateCounts(SimpleFacets.java:837)
		at org.apache.solr.request.SimpleFacets.getFacetCounts(SimpleFacets.java:207)
		at org.apache.solr.handler.component.FacetComponent.process(FacetComponent.java:87)
		at org.apache.solr.handler.component.SearchHandler.handleRequestBody(SearchHandler.java:206)
		at org.apache.solr.handler.RequestHandlerBase.handleRequest(RequestHandlerBase.java:129)
		at org.apache.solr.core.SolrCore.execute(SolrCore.java:1658)
		at org.apache.solr.util.TestHarness.query(TestHarness.java:351)
		at org.apache.solr.util.TestHarness.query(TestHarness.java:333)
		at org.apache.solr.SolrTestCaseJ4.assertQEx(SolrTestCaseJ4.java:601)
		at org.apache.solr.request.SimpleFacetsTest.testRangeFacetInfiniteLoopDetection(SimpleFacetsTest.java:2029)
		at sun.reflect.NativeMethodAccessorImpl.invoke0(Native Method)
		at sun.reflect.NativeMethodAccessorImpl.invoke(NativeMethodAccessorImpl.java:57)
		at sun.reflect.DelegatingMethodAccessorImpl.invoke(DelegatingMethodAccessorImpl.java:43)
		at java.lang.reflect.Method.invoke(Method.java:616)
		at com.carrotsearch.randomizedtesting.RandomizedRunner.invoke(RandomizedRunner.java:1559)
		at com.carrotsearch.randomizedtesting.RandomizedRunner.access$600(RandomizedRunner.java:79)
		at com.carrotsearch.randomizedtesting.RandomizedRunner$6.evaluate(RandomizedRunner.java:737)
		at com.carrotsearch.randomizedtesting.RandomizedRunner$7.evaluate(RandomizedRunner.java:773)
		at com.carrotsearch.randomizedtesting.RandomizedRunner$8.evaluate(RandomizedRunner.java:787)
		at com.carrotsearch.randomizedtesting.rules.SystemPropertiesRestoreRule$1.evaluate(SystemPropertiesRestoreRule.java:53)
		at org.apache.lucene.util.TestRuleSetupTeardownChained$1.evaluate(TestRuleSetupTeardownChained.java:50)
		at org.apache.lucene.util.TestRuleFieldCacheSanity$1.evaluate(TestRuleFieldCacheSanity.java:32)
		at org.apache.lucene.util.AbstractBeforeAfterRule$1.evaluate(AbstractBeforeAfterRule.java:45)
		at com.carrotsearch.randomizedtesting.rules.SystemPropertiesInvariantRule$1.evaluate(SystemPropertiesInvariantRule.java:55)
		at org.apache.lucene.util.TestRuleThreadAndTestName$1.evaluate(TestRuleThreadAndTestName.java:48)
		at org.apache.lucene.util.TestRuleIgnoreAfterMaxFailures$1.evaluate(TestRuleIgnoreAfterMaxFailures.java:70)
		at org.apache.lucene.util.TestRuleMarkFailure$1.evaluate(TestRuleMarkFailure.java:48)
		at com.carrotsearch.randomizedtesting.rules.StatementAdapter.evaluate(StatementAdapter.java:36)
		at com.carrotsearch.randomizedtesting.ThreadLeakControl$StatementRunner.run(ThreadLeakControl.java:345)
		at com.carrotsearch.randomizedtesting.ThreadLeakControl.forkTimeoutingTask(ThreadLeakControl.java:769)
		at com.carrotsearch.randomizedtesting.ThreadLeakControl$3.evaluate(ThreadLeakControl.java:429)
		at com.carrotsearch.randomizedtesting.RandomizedRunner.runSingleTest(RandomizedRunner.java:746)
		at com.carrotsearch.randomizedtesting.RandomizedRunner$3.evaluate(RandomizedRunner.java:648)
		at com.carrotsearch.randomizedtesting.RandomizedRunner$4.evaluate(RandomizedRunner.java:682)
		at com.carrotsearch.randomizedtesting.RandomizedRunner$5.evaluate(RandomizedRunner.java:693)
		at com.carrotsearch.randomizedtesting.rules.StatementAdapter.evaluate(StatementAdapter.java:36)
		at com.carrotsearch.randomizedtesting.rules.SystemPropertiesRestoreRule$1.evaluate(SystemPropertiesRestoreRule.java:53)
		at org.apache.lucene.util.AbstractBeforeAfterRule$1.evaluate(AbstractBeforeAfterRule.java:45)
		at org.apache.lucene.util.TestRuleStoreClassName$1.evaluate(TestRuleStoreClassName.java:38)
		at com.carrotsearch.randomizedtesting.rules.SystemPropertiesInvariantRule$1.evaluate(SystemPropertiesInvariantRule.java:55)
		at com.carrotsearch.randomizedtesting.rules.NoShadowingOrOverridesOnMethodsRule$1.evaluate(NoShadowingOrOverridesOnMethodsRule.java:39)
		at com.carrotsearch.randomizedtesting.rules.NoShadowingOrOverridesOnMethodsRule$1.evaluate(NoShadowingOrOverridesOnMethodsRule.java:39)
		at org.apache.lucene.util.TestRuleAssertionsRequired$1.evaluate(TestRuleAssertionsRequired.java:40)
		at org.apache.lucene.util.TestRuleMarkFailure$1.evaluate(TestRuleMarkFailure.java:48)
		at org.apache.lucene.util.TestRuleIgnoreAfterMaxFailures$1.evaluate(TestRuleIgnoreAfterMaxFailures.java:70)
		at org.apache.lucene.util.TestRuleIgnoreTestSuites$1.evaluate(TestRuleIgnoreTestSuites.java:55)
		at com.carrotsearch.randomizedtesting.rules.StatementAdapter.evaluate(StatementAdapter.java:36)
		at com.carrotsearch.randomizedtesting.ThreadLeakControl$StatementRunner.run(ThreadLeakControl.java:345)
		at java.lang.Thread.run(Thread.java:679)
	
1819 T1424 C5 oasc.SolrException.log SEVERE org.apache.solr.common.SolrException: range facet infinite loop: gap is either zero, or too small relative start/end and caused underflow: Mon Aug 13 22:44:16 EST 2012 + +0DAYS = Mon Aug 13 22:44:16 EST 2012
		at org.apache.solr.request.SimpleFacets.getFacetRangeCounts(SimpleFacets.java:1122)
		at org.apache.solr.request.SimpleFacets.getFacetRangeCounts(SimpleFacets.java:1074)
		at org.apache.solr.request.SimpleFacets.getFacetRangeCounts(SimpleFacets.java:1018)
		at org.apache.solr.request.SimpleFacets.getFacetCounts(SimpleFacets.java:208)
		at org.apache.solr.handler.component.FacetComponent.process(FacetComponent.java:87)
		at org.apache.solr.handler.component.SearchHandler.handleRequestBody(SearchHandler.java:206)
		at org.apache.solr.handler.RequestHandlerBase.handleRequest(RequestHandlerBase.java:129)
		at org.apache.solr.core.SolrCore.execute(SolrCore.java:1658)
		at org.apache.solr.util.TestHarness.query(TestHarness.java:351)
		at org.apache.solr.util.TestHarness.query(TestHarness.java:333)
		at org.apache.solr.SolrTestCaseJ4.assertQEx(SolrTestCaseJ4.java:601)
		at org.apache.solr.request.SimpleFacetsTest.testRangeFacetInfiniteLoopDetection(SimpleFacetsTest.java:2029)
		at sun.reflect.NativeMethodAccessorImpl.invoke0(Native Method)
		at sun.reflect.NativeMethodAccessorImpl.invoke(NativeMethodAccessorImpl.java:57)
		at sun.reflect.DelegatingMethodAccessorImpl.invoke(DelegatingMethodAccessorImpl.java:43)
		at java.lang.reflect.Method.invoke(Method.java:616)
		at com.carrotsearch.randomizedtesting.RandomizedRunner.invoke(RandomizedRunner.java:1559)
		at com.carrotsearch.randomizedtesting.RandomizedRunner.access$600(RandomizedRunner.java:79)
		at com.carrotsearch.randomizedtesting.RandomizedRunner$6.evaluate(RandomizedRunner.java:737)
		at com.carrotsearch.randomizedtesting.RandomizedRunner$7.evaluate(RandomizedRunner.java:773)
		at com.carrotsearch.randomizedtesting.RandomizedRunner$8.evaluate(RandomizedRunner.java:787)
		at com.carrotsearch.randomizedtesting.rules.SystemPropertiesRestoreRule$1.evaluate(SystemPropertiesRestoreRule.java:53)
		at org.apache.lucene.util.TestRuleSetupTeardownChained$1.evaluate(TestRuleSetupTeardownChained.java:50)
		at org.apache.lucene.util.TestRuleFieldCacheSanity$1.evaluate(TestRuleFieldCacheSanity.java:32)
		at org.apache.lucene.util.AbstractBeforeAfterRule$1.evaluate(AbstractBeforeAfterRule.java:45)
		at com.carrotsearch.randomizedtesting.rules.SystemPropertiesInvariantRule$1.evaluate(SystemPropertiesInvariantRule.java:55)
		at org.apache.lucene.util.TestRuleThreadAndTestName$1.evaluate(TestRuleThreadAndTestName.java:48)
		at org.apache.lucene.util.TestRuleIgnoreAfterMaxFailures$1.evaluate(TestRuleIgnoreAfterMaxFailures.java:70)
		at org.apache.lucene.util.TestRuleMarkFailure$1.evaluate(TestRuleMarkFailure.java:48)
		at com.carrotsearch.randomizedtesting.rules.StatementAdapter.evaluate(StatementAdapter.java:36)
		at com.carrotsearch.randomizedtesting.ThreadLeakControl$StatementRunner.run(ThreadLeakControl.java:345)
		at com.carrotsearch.randomizedtesting.ThreadLeakControl.forkTimeoutingTask(ThreadLeakControl.java:769)
		at com.carrotsearch.randomizedtesting.ThreadLeakControl$3.evaluate(ThreadLeakControl.java:429)
		at com.carrotsearch.randomizedtesting.RandomizedRunner.runSingleTest(RandomizedRunner.java:746)
		at com.carrotsearch.randomizedtesting.RandomizedRunner$3.evaluate(RandomizedRunner.java:648)
		at com.carrotsearch.randomizedtesting.RandomizedRunner$4.evaluate(RandomizedRunner.java:682)
		at com.carrotsearch.randomizedtesting.RandomizedRunner$5.evaluate(RandomizedRunner.java:693)
		at com.carrotsearch.randomizedtesting.rules.StatementAdapter.evaluate(StatementAdapter.java:36)
		at com.carrotsearch.randomizedtesting.rules.SystemPropertiesRestoreRule$1.evaluate(SystemPropertiesRestoreRule.java:53)
		at org.apache.lucene.util.AbstractBeforeAfterRule$1.evaluate(AbstractBeforeAfterRule.java:45)
		at org.apache.lucene.util.TestRuleStoreClassName$1.evaluate(TestRuleStoreClassName.java:38)
		at com.carrotsearch.randomizedtesting.rules.SystemPropertiesInvariantRule$1.evaluate(SystemPropertiesInvariantRule.java:55)
		at com.carrotsearch.randomizedtesting.rules.NoShadowingOrOverridesOnMethodsRule$1.evaluate(NoShadowingOrOverridesOnMethodsRule.java:39)
		at com.carrotsearch.randomizedtesting.rules.NoShadowingOrOverridesOnMethodsRule$1.evaluate(NoShadowingOrOverridesOnMethodsRule.java:39)
		at org.apache.lucene.util.TestRuleAssertionsRequired$1.evaluate(TestRuleAssertionsRequired.java:40)
		at org.apache.lucene.util.TestRuleMarkFailure$1.evaluate(TestRuleMarkFailure.java:48)
		at org.apache.lucene.util.TestRuleIgnoreAfterMaxFailures$1.evaluate(TestRuleIgnoreAfterMaxFailures.java:70)
		at org.apache.lucene.util.TestRuleIgnoreTestSuites$1.evaluate(TestRuleIgnoreTestSuites.java:55)
		at com.carrotsearch.randomizedtesting.rules.StatementAdapter.evaluate(StatementAdapter.java:36)
		at com.carrotsearch.randomizedtesting.ThreadLeakControl$StatementRunner.run(ThreadLeakControl.java:345)
		at java.lang.Thread.run(Thread.java:679)
	
1820 T1424 C5 oasc.SolrException.log SEVERE org.apache.solr.common.SolrException: date facet infinite loop: gap is effectively zero
		at org.apache.solr.request.SimpleFacets.getFacetDateCounts(SimpleFacets.java:928)
		at org.apache.solr.request.SimpleFacets.getFacetDateCounts(SimpleFacets.java:837)
		at org.apache.solr.request.SimpleFacets.getFacetCounts(SimpleFacets.java:207)
		at org.apache.solr.handler.component.FacetComponent.process(FacetComponent.java:87)
		at org.apache.solr.handler.component.SearchHandler.handleRequestBody(SearchHandler.java:206)
		at org.apache.solr.handler.RequestHandlerBase.handleRequest(RequestHandlerBase.java:129)
		at org.apache.solr.core.SolrCore.execute(SolrCore.java:1658)
		at org.apache.solr.util.TestHarness.query(TestHarness.java:351)
		at org.apache.solr.util.TestHarness.query(TestHarness.java:333)
		at org.apache.solr.SolrTestCaseJ4.assertQEx(SolrTestCaseJ4.java:601)
		at org.apache.solr.request.SimpleFacetsTest.testRangeFacetInfiniteLoopDetection(SimpleFacetsTest.java:2029)
		at sun.reflect.NativeMethodAccessorImpl.invoke0(Native Method)
		at sun.reflect.NativeMethodAccessorImpl.invoke(NativeMethodAccessorImpl.java:57)
		at sun.reflect.DelegatingMethodAccessorImpl.invoke(DelegatingMethodAccessorImpl.java:43)
		at java.lang.reflect.Method.invoke(Method.java:616)
		at com.carrotsearch.randomizedtesting.RandomizedRunner.invoke(RandomizedRunner.java:1559)
		at com.carrotsearch.randomizedtesting.RandomizedRunner.access$600(RandomizedRunner.java:79)
		at com.carrotsearch.randomizedtesting.RandomizedRunner$6.evaluate(RandomizedRunner.java:737)
		at com.carrotsearch.randomizedtesting.RandomizedRunner$7.evaluate(RandomizedRunner.java:773)
		at com.carrotsearch.randomizedtesting.RandomizedRunner$8.evaluate(RandomizedRunner.java:787)
		at com.carrotsearch.randomizedtesting.rules.SystemPropertiesRestoreRule$1.evaluate(SystemPropertiesRestoreRule.java:53)
		at org.apache.lucene.util.TestRuleSetupTeardownChained$1.evaluate(TestRuleSetupTeardownChained.java:50)
		at org.apache.lucene.util.TestRuleFieldCacheSanity$1.evaluate(TestRuleFieldCacheSanity.java:32)
		at org.apache.lucene.util.AbstractBeforeAfterRule$1.evaluate(AbstractBeforeAfterRule.java:45)
		at com.carrotsearch.randomizedtesting.rules.SystemPropertiesInvariantRule$1.evaluate(SystemPropertiesInvariantRule.java:55)
		at org.apache.lucene.util.TestRuleThreadAndTestName$1.evaluate(TestRuleThreadAndTestName.java:48)
		at org.apache.lucene.util.TestRuleIgnoreAfterMaxFailures$1.evaluate(TestRuleIgnoreAfterMaxFailures.java:70)
		at org.apache.lucene.util.TestRuleMarkFailure$1.evaluate(TestRuleMarkFailure.java:48)
		at com.carrotsearch.randomizedtesting.rules.StatementAdapter.evaluate(StatementAdapter.java:36)
		at com.carrotsearch.randomizedtesting.ThreadLeakControl$StatementRunner.run(ThreadLeakControl.java:345)
		at com.carrotsearch.randomizedtesting.ThreadLeakControl.forkTimeoutingTask(ThreadLeakControl.java:769)
		at com.carrotsearch.randomizedtesting.ThreadLeakControl$3.evaluate(ThreadLeakControl.java:429)
		at com.carrotsearch.randomizedtesting.RandomizedRunner.runSingleTest(RandomizedRunner.java:746)
		at com.carrotsearch.randomizedtesting.RandomizedRunner$3.evaluate(RandomizedRunner.java:648)
		at com.carrotsearch.randomizedtesting.RandomizedRunner$4.evaluate(RandomizedRunner.java:682)
		at com.carrotsearch.randomizedtesting.RandomizedRunner$5.evaluate(RandomizedRunner.java:693)
		at com.carrotsearch.randomizedtesting.rules.StatementAdapter.evaluate(StatementAdapter.java:36)
		at com.carrotsearch.randomizedtesting.rules.SystemPropertiesRestoreRule$1.evaluate(SystemPropertiesRestoreRule.java:53)
		at org.apache.lucene.util.AbstractBeforeAfterRule$1.evaluate(AbstractBeforeAfterRule.java:45)
		at org.apache.lucene.util.TestRuleStoreClassName$1.evaluate(TestRuleStoreClassName.java:38)
		at com.carrotsearch.randomizedtesting.rules.SystemPropertiesInvariantRule$1.evaluate(SystemPropertiesInvariantRule.java:55)
		at com.carrotsearch.randomizedtesting.rules.NoShadowingOrOverridesOnMethodsRule$1.evaluate(NoShadowingOrOverridesOnMethodsRule.java:39)
		at com.carrotsearch.randomizedtesting.rules.NoShadowingOrOverridesOnMethodsRule$1.evaluate(NoShadowingOrOverridesOnMethodsRule.java:39)
		at org.apache.lucene.util.TestRuleAssertionsRequired$1.evaluate(TestRuleAssertionsRequired.java:40)
		at org.apache.lucene.util.TestRuleMarkFailure$1.evaluate(TestRuleMarkFailure.java:48)
		at org.apache.lucene.util.TestRuleIgnoreAfterMaxFailures$1.evaluate(TestRuleIgnoreAfterMaxFailures.java:70)
		at org.apache.lucene.util.TestRuleIgnoreTestSuites$1.evaluate(TestRuleIgnoreTestSuites.java:55)
		at com.carrotsearch.randomizedtesting.rules.StatementAdapter.evaluate(StatementAdapter.java:36)
		at com.carrotsearch.randomizedtesting.ThreadLeakControl$StatementRunner.run(ThreadLeakControl.java:345)
		at java.lang.Thread.run(Thread.java:679)
	
1821 T1424 C5 oasc.SolrException.log SEVERE org.apache.solr.common.SolrException: range facet infinite loop: gap is either zero, or too small relative start/end and caused underflow: Mon Aug 13 22:44:16 EST 2012 + +0DAYS = Mon Aug 13 22:44:16 EST 2012
		at org.apache.solr.request.SimpleFacets.getFacetRangeCounts(SimpleFacets.java:1122)
		at org.apache.solr.request.SimpleFacets.getFacetRangeCounts(SimpleFacets.java:1074)
		at org.apache.solr.request.SimpleFacets.getFacetRangeCounts(SimpleFacets.java:1018)
		at org.apache.solr.request.SimpleFacets.getFacetCounts(SimpleFacets.java:208)
		at org.apache.solr.handler.component.FacetComponent.process(FacetComponent.java:87)
		at org.apache.solr.handler.component.SearchHandler.handleRequestBody(SearchHandler.java:206)
		at org.apache.solr.handler.RequestHandlerBase.handleRequest(RequestHandlerBase.java:129)
		at org.apache.solr.core.SolrCore.execute(SolrCore.java:1658)
		at org.apache.solr.util.TestHarness.query(TestHarness.java:351)
		at org.apache.solr.util.TestHarness.query(TestHarness.java:333)
		at org.apache.solr.SolrTestCaseJ4.assertQEx(SolrTestCaseJ4.java:601)
		at org.apache.solr.request.SimpleFacetsTest.testRangeFacetInfiniteLoopDetection(SimpleFacetsTest.java:2029)
		at sun.reflect.NativeMethodAccessorImpl.invoke0(Native Method)
		at sun.reflect.NativeMethodAccessorImpl.invoke(NativeMethodAccessorImpl.java:57)
		at sun.reflect.DelegatingMethodAccessorImpl.invoke(DelegatingMethodAccessorImpl.java:43)
		at java.lang.reflect.Method.invoke(Method.java:616)
		at com.carrotsearch.randomizedtesting.RandomizedRunner.invoke(RandomizedRunner.java:1559)
		at com.carrotsearch.randomizedtesting.RandomizedRunner.access$600(RandomizedRunner.java:79)
		at com.carrotsearch.randomizedtesting.RandomizedRunner$6.evaluate(RandomizedRunner.java:737)
		at com.carrotsearch.randomizedtesting.RandomizedRunner$7.evaluate(RandomizedRunner.java:773)
		at com.carrotsearch.randomizedtesting.RandomizedRunner$8.evaluate(RandomizedRunner.java:787)
		at com.carrotsearch.randomizedtesting.rules.SystemPropertiesRestoreRule$1.evaluate(SystemPropertiesRestoreRule.java:53)
		at org.apache.lucene.util.TestRuleSetupTeardownChained$1.evaluate(TestRuleSetupTeardownChained.java:50)
		at org.apache.lucene.util.TestRuleFieldCacheSanity$1.evaluate(TestRuleFieldCacheSanity.java:32)
		at org.apache.lucene.util.AbstractBeforeAfterRule$1.evaluate(AbstractBeforeAfterRule.java:45)
		at com.carrotsearch.randomizedtesting.rules.SystemPropertiesInvariantRule$1.evaluate(SystemPropertiesInvariantRule.java:55)
		at org.apache.lucene.util.TestRuleThreadAndTestName$1.evaluate(TestRuleThreadAndTestName.java:48)
		at org.apache.lucene.util.TestRuleIgnoreAfterMaxFailures$1.evaluate(TestRuleIgnoreAfterMaxFailures.java:70)
		at org.apache.lucene.util.TestRuleMarkFailure$1.evaluate(TestRuleMarkFailure.java:48)
		at com.carrotsearch.randomizedtesting.rules.StatementAdapter.evaluate(StatementAdapter.java:36)
		at com.carrotsearch.randomizedtesting.ThreadLeakControl$StatementRunner.run(ThreadLeakControl.java:345)
		at com.carrotsearch.randomizedtesting.ThreadLeakControl.forkTimeoutingTask(ThreadLeakControl.java:769)
		at com.carrotsearch.randomizedtesting.ThreadLeakControl$3.evaluate(ThreadLeakControl.java:429)
		at com.carrotsearch.randomizedtesting.RandomizedRunner.runSingleTest(RandomizedRunner.java:746)
		at com.carrotsearch.randomizedtesting.RandomizedRunner$3.evaluate(RandomizedRunner.java:648)
		at com.carrotsearch.randomizedtesting.RandomizedRunner$4.evaluate(RandomizedRunner.java:682)
		at com.carrotsearch.randomizedtesting.RandomizedRunner$5.evaluate(RandomizedRunner.java:693)
		at com.carrotsearch.randomizedtesting.rules.StatementAdapter.evaluate(StatementAdapter.java:36)
		at com.carrotsearch.randomizedtesting.rules.SystemPropertiesRestoreRule$1.evaluate(SystemPropertiesRestoreRule.java:53)
		at org.apache.lucene.util.AbstractBeforeAfterRule$1.evaluate(AbstractBeforeAfterRule.java:45)
		at org.apache.lucene.util.TestRuleStoreClassName$1.evaluate(TestRuleStoreClassName.java:38)
		at com.carrotsearch.randomizedtesting.rules.SystemPropertiesInvariantRule$1.evaluate(SystemPropertiesInvariantRule.java:55)
		at com.carrotsearch.randomizedtesting.rules.NoShadowingOrOverridesOnMethodsRule$1.evaluate(NoShadowingOrOverridesOnMethodsRule.java:39)
		at com.carrotsearch.randomizedtesting.rules.NoShadowingOrOverridesOnMethodsRule$1.evaluate(NoShadowingOrOverridesOnMethodsRule.java:39)
		at org.apache.lucene.util.TestRuleAssertionsRequired$1.evaluate(TestRuleAssertionsRequired.java:40)
		at org.apache.lucene.util.TestRuleMarkFailure$1.evaluate(TestRuleMarkFailure.java:48)
		at org.apache.lucene.util.TestRuleIgnoreAfterMaxFailures$1.evaluate(TestRuleIgnoreAfterMaxFailures.java:70)
		at org.apache.lucene.util.TestRuleIgnoreTestSuites$1.evaluate(TestRuleIgnoreTestSuites.java:55)
		at com.carrotsearch.randomizedtesting.rules.StatementAdapter.evaluate(StatementAdapter.java:36)
		at com.carrotsearch.randomizedtesting.ThreadLeakControl$StatementRunner.run(ThreadLeakControl.java:345)
		at java.lang.Thread.run(Thread.java:679)
	
1822 T1424 C5 oasc.SolrException.log SEVERE org.apache.solr.common.SolrException: range facet infinite loop: gap is either zero, or too small relative start/end and caused underflow: 9.9999998E10 + 2160 = 9.9999998E10
		at org.apache.solr.request.SimpleFacets.getFacetRangeCounts(SimpleFacets.java:1122)
		at org.apache.solr.request.SimpleFacets.getFacetRangeCounts(SimpleFacets.java:1074)
		at org.apache.solr.request.SimpleFacets.getFacetRangeCounts(SimpleFacets.java:1018)
		at org.apache.solr.request.SimpleFacets.getFacetCounts(SimpleFacets.java:208)
		at org.apache.solr.handler.component.FacetComponent.process(FacetComponent.java:87)
		at org.apache.solr.handler.component.SearchHandler.handleRequestBody(SearchHandler.java:206)
		at org.apache.solr.handler.RequestHandlerBase.handleRequest(RequestHandlerBase.java:129)
		at org.apache.solr.core.SolrCore.execute(SolrCore.java:1658)
		at org.apache.solr.util.TestHarness.query(TestHarness.java:351)
		at org.apache.solr.util.TestHarness.query(TestHarness.java:333)
		at org.apache.solr.SolrTestCaseJ4.assertQEx(SolrTestCaseJ4.java:601)
		at org.apache.solr.request.SimpleFacetsTest.testRangeFacetInfiniteLoopDetection(SimpleFacetsTest.java:2041)
		at sun.reflect.NativeMethodAccessorImpl.invoke0(Native Method)
		at sun.reflect.NativeMethodAccessorImpl.invoke(NativeMethodAccessorImpl.java:57)
		at sun.reflect.DelegatingMethodAccessorImpl.invoke(DelegatingMethodAccessorImpl.java:43)
		at java.lang.reflect.Method.invoke(Method.java:616)
		at com.carrotsearch.randomizedtesting.RandomizedRunner.invoke(RandomizedRunner.java:1559)
		at com.carrotsearch.randomizedtesting.RandomizedRunner.access$600(RandomizedRunner.java:79)
		at com.carrotsearch.randomizedtesting.RandomizedRunner$6.evaluate(RandomizedRunner.java:737)
		at com.carrotsearch.randomizedtesting.RandomizedRunner$7.evaluate(RandomizedRunner.java:773)
		at com.carrotsearch.randomizedtesting.RandomizedRunner$8.evaluate(RandomizedRunner.java:787)
		at com.carrotsearch.randomizedtesting.rules.SystemPropertiesRestoreRule$1.evaluate(SystemPropertiesRestoreRule.java:53)
		at org.apache.lucene.util.TestRuleSetupTeardownChained$1.evaluate(TestRuleSetupTeardownChained.java:50)
		at org.apache.lucene.util.TestRuleFieldCacheSanity$1.evaluate(TestRuleFieldCacheSanity.java:32)
		at org.apache.lucene.util.AbstractBeforeAfterRule$1.evaluate(AbstractBeforeAfterRule.java:45)
		at com.carrotsearch.randomizedtesting.rules.SystemPropertiesInvariantRule$1.evaluate(SystemPropertiesInvariantRule.java:55)
		at org.apache.lucene.util.TestRuleThreadAndTestName$1.evaluate(TestRuleThreadAndTestName.java:48)
		at org.apache.lucene.util.TestRuleIgnoreAfterMaxFailures$1.evaluate(TestRuleIgnoreAfterMaxFailures.java:70)
		at org.apache.lucene.util.TestRuleMarkFailure$1.evaluate(TestRuleMarkFailure.java:48)
		at com.carrotsearch.randomizedtesting.rules.StatementAdapter.evaluate(StatementAdapter.java:36)
		at com.carrotsearch.randomizedtesting.ThreadLeakControl$StatementRunner.run(ThreadLeakControl.java:345)
		at com.carrotsearch.randomizedtesting.ThreadLeakControl.forkTimeoutingTask(ThreadLeakControl.java:769)
		at com.carrotsearch.randomizedtesting.ThreadLeakControl$3.evaluate(ThreadLeakControl.java:429)
		at com.carrotsearch.randomizedtesting.RandomizedRunner.runSingleTest(RandomizedRunner.java:746)
		at com.carrotsearch.randomizedtesting.RandomizedRunner$3.evaluate(RandomizedRunner.java:648)
		at com.carrotsearch.randomizedtesting.RandomizedRunner$4.evaluate(RandomizedRunner.java:682)
		at com.carrotsearch.randomizedtesting.RandomizedRunner$5.evaluate(RandomizedRunner.java:693)
		at com.carrotsearch.randomizedtesting.rules.StatementAdapter.evaluate(StatementAdapter.java:36)
		at com.carrotsearch.randomizedtesting.rules.SystemPropertiesRestoreRule$1.evaluate(SystemPropertiesRestoreRule.java:53)
		at org.apache.lucene.util.AbstractBeforeAfterRule$1.evaluate(AbstractBeforeAfterRule.java:45)
		at org.apache.lucene.util.TestRuleStoreClassName$1.evaluate(TestRuleStoreClassName.java:38)
		at com.carrotsearch.randomizedtesting.rules.SystemPropertiesInvariantRule$1.evaluate(SystemPropertiesInvariantRule.java:55)
		at com.carrotsearch.randomizedtesting.rules.NoShadowingOrOverridesOnMethodsRule$1.evaluate(NoShadowingOrOverridesOnMethodsRule.java:39)
		at com.carrotsearch.randomizedtesting.rules.NoShadowingOrOverridesOnMethodsRule$1.evaluate(NoShadowingOrOverridesOnMethodsRule.java:39)
		at org.apache.lucene.util.TestRuleAssertionsRequired$1.evaluate(TestRuleAssertionsRequired.java:40)
		at org.apache.lucene.util.TestRuleMarkFailure$1.evaluate(TestRuleMarkFailure.java:48)
		at org.apache.lucene.util.TestRuleIgnoreAfterMaxFailures$1.evaluate(TestRuleIgnoreAfterMaxFailures.java:70)
		at org.apache.lucene.util.TestRuleIgnoreTestSuites$1.evaluate(TestRuleIgnoreTestSuites.java:55)
		at com.carrotsearch.randomizedtesting.rules.StatementAdapter.evaluate(StatementAdapter.java:36)
		at com.carrotsearch.randomizedtesting.ThreadLeakControl$StatementRunner.run(ThreadLeakControl.java:345)
		at java.lang.Thread.run(Thread.java:679)
	
1823 T1424 C5 oasc.SolrException.log SEVERE org.apache.solr.common.SolrException: range facet infinite loop: gap is either zero, or too small relative start/end and caused underflow: 9.9999998E10 + 2160 = 9.9999998E10
		at org.apache.solr.request.SimpleFacets.getFacetRangeCounts(SimpleFacets.java:1122)
		at org.apache.solr.request.SimpleFacets.getFacetRangeCounts(SimpleFacets.java:1074)
		at org.apache.solr.request.SimpleFacets.getFacetRangeCounts(SimpleFacets.java:1018)
		at org.apache.solr.request.SimpleFacets.getFacetCounts(SimpleFacets.java:208)
		at org.apache.solr.handler.component.FacetComponent.process(FacetComponent.java:87)
		at org.apache.solr.handler.component.SearchHandler.handleRequestBody(SearchHandler.java:206)
		at org.apache.solr.handler.RequestHandlerBase.handleRequest(RequestHandlerBase.java:129)
		at org.apache.solr.core.SolrCore.execute(SolrCore.java:1658)
		at org.apache.solr.util.TestHarness.query(TestHarness.java:351)
		at org.apache.solr.util.TestHarness.query(TestHarness.java:333)
		at org.apache.solr.SolrTestCaseJ4.assertQEx(SolrTestCaseJ4.java:601)
		at org.apache.solr.request.SimpleFacetsTest.testRangeFacetInfiniteLoopDetection(SimpleFacetsTest.java:2041)
		at sun.reflect.NativeMethodAccessorImpl.invoke0(Native Method)
		at sun.reflect.NativeMethodAccessorImpl.invoke(NativeMethodAccessorImpl.java:57)
		at sun.reflect.DelegatingMethodAccessorImpl.invoke(DelegatingMethodAccessorImpl.java:43)
		at java.lang.reflect.Method.invoke(Method.java:616)
		at com.carrotsearch.randomizedtesting.RandomizedRunner.invoke(RandomizedRunner.java:1559)
		at com.carrotsearch.randomizedtesting.RandomizedRunner.access$600(RandomizedRunner.java:79)
		at com.carrotsearch.randomizedtesting.RandomizedRunner$6.evaluate(RandomizedRunner.java:737)
		at com.carrotsearch.randomizedtesting.RandomizedRunner$7.evaluate(RandomizedRunner.java:773)
		at com.carrotsearch.randomizedtesting.RandomizedRunner$8.evaluate(RandomizedRunner.java:787)
		at com.carrotsearch.randomizedtesting.rules.SystemPropertiesRestoreRule$1.evaluate(SystemPropertiesRestoreRule.java:53)
		at org.apache.lucene.util.TestRuleSetupTeardownChained$1.evaluate(TestRuleSetupTeardownChained.java:50)
		at org.apache.lucene.util.TestRuleFieldCacheSanity$1.evaluate(TestRuleFieldCacheSanity.java:32)
		at org.apache.lucene.util.AbstractBeforeAfterRule$1.evaluate(AbstractBeforeAfterRule.java:45)
		at com.carrotsearch.randomizedtesting.rules.SystemPropertiesInvariantRule$1.evaluate(SystemPropertiesInvariantRule.java:55)
		at org.apache.lucene.util.TestRuleThreadAndTestName$1.evaluate(TestRuleThreadAndTestName.java:48)
		at org.apache.lucene.util.TestRuleIgnoreAfterMaxFailures$1.evaluate(TestRuleIgnoreAfterMaxFailures.java:70)
		at org.apache.lucene.util.TestRuleMarkFailure$1.evaluate(TestRuleMarkFailure.java:48)
		at com.carrotsearch.randomizedtesting.rules.StatementAdapter.evaluate(StatementAdapter.java:36)
		at com.carrotsearch.randomizedtesting.ThreadLeakControl$StatementRunner.run(ThreadLeakControl.java:345)
		at com.carrotsearch.randomizedtesting.ThreadLeakControl.forkTimeoutingTask(ThreadLeakControl.java:769)
		at com.carrotsearch.randomizedtesting.ThreadLeakControl$3.evaluate(ThreadLeakControl.java:429)
		at com.carrotsearch.randomizedtesting.RandomizedRunner.runSingleTest(RandomizedRunner.java:746)
		at com.carrotsearch.randomizedtesting.RandomizedRunner$3.evaluate(RandomizedRunner.java:648)
		at com.carrotsearch.randomizedtesting.RandomizedRunner$4.evaluate(RandomizedRunner.java:682)
		at com.carrotsearch.randomizedtesting.RandomizedRunner$5.evaluate(RandomizedRunner.java:693)
		at com.carrotsearch.randomizedtesting.rules.StatementAdapter.evaluate(StatementAdapter.java:36)
		at com.carrotsearch.randomizedtesting.rules.SystemPropertiesRestoreRule$1.evaluate(SystemPropertiesRestoreRule.java:53)
		at org.apache.lucene.util.AbstractBeforeAfterRule$1.evaluate(AbstractBeforeAfterRule.java:45)
		at org.apache.lucene.util.TestRuleStoreClassName$1.evaluate(TestRuleStoreClassName.java:38)
		at com.carrotsearch.randomizedtesting.rules.SystemPropertiesInvariantRule$1.evaluate(SystemPropertiesInvariantRule.java:55)
		at com.carrotsearch.randomizedtesting.rules.NoShadowingOrOverridesOnMethodsRule$1.evaluate(NoShadowingOrOverridesOnMethodsRule.java:39)
		at com.carrotsearch.randomizedtesting.rules.NoShadowingOrOverridesOnMethodsRule$1.evaluate(NoShadowingOrOverridesOnMethodsRule.java:39)
		at org.apache.lucene.util.TestRuleAssertionsRequired$1.evaluate(TestRuleAssertionsRequired.java:40)
		at org.apache.lucene.util.TestRuleMarkFailure$1.evaluate(TestRuleMarkFailure.java:48)
		at org.apache.lucene.util.TestRuleIgnoreAfterMaxFailures$1.evaluate(TestRuleIgnoreAfterMaxFailures.java:70)
		at org.apache.lucene.util.TestRuleIgnoreTestSuites$1.evaluate(TestRuleIgnoreTestSuites.java:55)
		at com.carrotsearch.randomizedtesting.rules.StatementAdapter.evaluate(StatementAdapter.java:36)
		at com.carrotsearch.randomizedtesting.ThreadLeakControl$StatementRunner.run(ThreadLeakControl.java:345)
		at java.lang.Thread.run(Thread.java:679)
	
1824 T1424 C5 oasc.SolrException.log SEVERE org.apache.solr.common.SolrException: range facet infinite loop: gap is either zero, or too small relative start/end and caused underflow: 9.9E12 + 0.0003 = 9.9E12
		at org.apache.solr.request.SimpleFacets.getFacetRangeCounts(SimpleFacets.java:1122)
		at org.apache.solr.request.SimpleFacets.getFacetRangeCounts(SimpleFacets.java:1074)
		at org.apache.solr.request.SimpleFacets.getFacetRangeCounts(SimpleFacets.java:1018)
		at org.apache.solr.request.SimpleFacets.getFacetCounts(SimpleFacets.java:208)
		at org.apache.solr.handler.component.FacetComponent.process(FacetComponent.java:87)
		at org.apache.solr.handler.component.SearchHandler.handleRequestBody(SearchHandler.java:206)
		at org.apache.solr.handler.RequestHandlerBase.handleRequest(RequestHandlerBase.java:129)
		at org.apache.solr.core.SolrCore.execute(SolrCore.java:1658)
		at org.apache.solr.util.TestHarness.query(TestHarness.java:351)
		at org.apache.solr.util.TestHarness.query(TestHarness.java:333)
		at org.apache.solr.SolrTestCaseJ4.assertQEx(SolrTestCaseJ4.java:601)
		at org.apache.solr.request.SimpleFacetsTest.testRangeFacetInfiniteLoopDetection(SimpleFacetsTest.java:2052)
		at sun.reflect.NativeMethodAccessorImpl.invoke0(Native Method)
		at sun.reflect.NativeMethodAccessorImpl.invoke(NativeMethodAccessorImpl.java:57)
		at sun.reflect.DelegatingMethodAccessorImpl.invoke(DelegatingMethodAccessorImpl.java:43)
		at java.lang.reflect.Method.invoke(Method.java:616)
		at com.carrotsearch.randomizedtesting.RandomizedRunner.invoke(RandomizedRunner.java:1559)
		at com.carrotsearch.randomizedtesting.RandomizedRunner.access$600(RandomizedRunner.java:79)
		at com.carrotsearch.randomizedtesting.RandomizedRunner$6.evaluate(RandomizedRunner.java:737)
		at com.carrotsearch.randomizedtesting.RandomizedRunner$7.evaluate(RandomizedRunner.java:773)
		at com.carrotsearch.randomizedtesting.RandomizedRunner$8.evaluate(RandomizedRunner.java:787)
		at com.carrotsearch.randomizedtesting.rules.SystemPropertiesRestoreRule$1.evaluate(SystemPropertiesRestoreRule.java:53)
		at org.apache.lucene.util.TestRuleSetupTeardownChained$1.evaluate(TestRuleSetupTeardownChained.java:50)
		at org.apache.lucene.util.TestRuleFieldCacheSanity$1.evaluate(TestRuleFieldCacheSanity.java:32)
		at org.apache.lucene.util.AbstractBeforeAfterRule$1.evaluate(AbstractBeforeAfterRule.java:45)
		at com.carrotsearch.randomizedtesting.rules.SystemPropertiesInvariantRule$1.evaluate(SystemPropertiesInvariantRule.java:55)
		at org.apache.lucene.util.TestRuleThreadAndTestName$1.evaluate(TestRuleThreadAndTestName.java:48)
		at org.apache.lucene.util.TestRuleIgnoreAfterMaxFailures$1.evaluate(TestRuleIgnoreAfterMaxFailures.java:70)
		at org.apache.lucene.util.TestRuleMarkFailure$1.evaluate(TestRuleMarkFailure.java:48)
		at com.carrotsearch.randomizedtesting.rules.StatementAdapter.evaluate(StatementAdapter.java:36)
		at com.carrotsearch.randomizedtesting.ThreadLeakControl$StatementRunner.run(ThreadLeakControl.java:345)
		at com.carrotsearch.randomizedtesting.ThreadLeakControl.forkTimeoutingTask(ThreadLeakControl.java:769)
		at com.carrotsearch.randomizedtesting.ThreadLeakControl$3.evaluate(ThreadLeakControl.java:429)
		at com.carrotsearch.randomizedtesting.RandomizedRunner.runSingleTest(RandomizedRunner.java:746)
		at com.carrotsearch.randomizedtesting.RandomizedRunner$3.evaluate(RandomizedRunner.java:648)
		at com.carrotsearch.randomizedtesting.RandomizedRunner$4.evaluate(RandomizedRunner.java:682)
		at com.carrotsearch.randomizedtesting.RandomizedRunner$5.evaluate(RandomizedRunner.java:693)
		at com.carrotsearch.randomizedtesting.rules.StatementAdapter.evaluate(StatementAdapter.java:36)
		at com.carrotsearch.randomizedtesting.rules.SystemPropertiesRestoreRule$1.evaluate(SystemPropertiesRestoreRule.java:53)
		at org.apache.lucene.util.AbstractBeforeAfterRule$1.evaluate(AbstractBeforeAfterRule.java:45)
		at org.apache.lucene.util.TestRuleStoreClassName$1.evaluate(TestRuleStoreClassName.java:38)
		at com.carrotsearch.randomizedtesting.rules.SystemPropertiesInvariantRule$1.evaluate(SystemPropertiesInvariantRule.java:55)
		at com.carrotsearch.randomizedtesting.rules.NoShadowingOrOverridesOnMethodsRule$1.evaluate(NoShadowingOrOverridesOnMethodsRule.java:39)
		at com.carrotsearch.randomizedtesting.rules.NoShadowingOrOverridesOnMethodsRule$1.evaluate(NoShadowingOrOverridesOnMethodsRule.java:39)
		at org.apache.lucene.util.TestRuleAssertionsRequired$1.evaluate(TestRuleAssertionsRequired.java:40)
		at org.apache.lucene.util.TestRuleMarkFailure$1.evaluate(TestRuleMarkFailure.java:48)
		at org.apache.lucene.util.TestRuleIgnoreAfterMaxFailures$1.evaluate(TestRuleIgnoreAfterMaxFailures.java:70)
		at org.apache.lucene.util.TestRuleIgnoreTestSuites$1.evaluate(TestRuleIgnoreTestSuites.java:55)
		at com.carrotsearch.randomizedtesting.rules.StatementAdapter.evaluate(StatementAdapter.java:36)
		at com.carrotsearch.randomizedtesting.ThreadLeakControl$StatementRunner.run(ThreadLeakControl.java:345)
		at java.lang.Thread.run(Thread.java:679)
	
1824 T1424 C5 oasc.SolrException.log SEVERE org.apache.solr.common.SolrException: range facet infinite loop: gap is either zero, or too small relative start/end and caused underflow: 9.9E12 + 0.0003 = 9.9E12
		at org.apache.solr.request.SimpleFacets.getFacetRangeCounts(SimpleFacets.java:1122)
		at org.apache.solr.request.SimpleFacets.getFacetRangeCounts(SimpleFacets.java:1074)
		at org.apache.solr.request.SimpleFacets.getFacetRangeCounts(SimpleFacets.java:1018)
		at org.apache.solr.request.SimpleFacets.getFacetCounts(SimpleFacets.java:208)
		at org.apache.solr.handler.component.FacetComponent.process(FacetComponent.java:87)
		at org.apache.solr.handler.component.SearchHandler.handleRequestBody(SearchHandler.java:206)
		at org.apache.solr.handler.RequestHandlerBase.handleRequest(RequestHandlerBase.java:129)
		at org.apache.solr.core.SolrCore.execute(SolrCore.java:1658)
		at org.apache.solr.util.TestHarness.query(TestHarness.java:351)
		at org.apache.solr.util.TestHarness.query(TestHarness.java:333)
		at org.apache.solr.SolrTestCaseJ4.assertQEx(SolrTestCaseJ4.java:601)
		at org.apache.solr.request.SimpleFacetsTest.testRangeFacetInfiniteLoopDetection(SimpleFacetsTest.java:2052)
		at sun.reflect.NativeMethodAccessorImpl.invoke0(Native Method)
		at sun.reflect.NativeMethodAccessorImpl.invoke(NativeMethodAccessorImpl.java:57)
		at sun.reflect.DelegatingMethodAccessorImpl.invoke(DelegatingMethodAccessorImpl.java:43)
		at java.lang.reflect.Method.invoke(Method.java:616)
		at com.carrotsearch.randomizedtesting.RandomizedRunner.invoke(RandomizedRunner.java:1559)
		at com.carrotsearch.randomizedtesting.RandomizedRunner.access$600(RandomizedRunner.java:79)
		at com.carrotsearch.randomizedtesting.RandomizedRunner$6.evaluate(RandomizedRunner.java:737)
		at com.carrotsearch.randomizedtesting.RandomizedRunner$7.evaluate(RandomizedRunner.java:773)
		at com.carrotsearch.randomizedtesting.RandomizedRunner$8.evaluate(RandomizedRunner.java:787)
		at com.carrotsearch.randomizedtesting.rules.SystemPropertiesRestoreRule$1.evaluate(SystemPropertiesRestoreRule.java:53)
		at org.apache.lucene.util.TestRuleSetupTeardownChained$1.evaluate(TestRuleSetupTeardownChained.java:50)
		at org.apache.lucene.util.TestRuleFieldCacheSanity$1.evaluate(TestRuleFieldCacheSanity.java:32)
		at org.apache.lucene.util.AbstractBeforeAfterRule$1.evaluate(AbstractBeforeAfterRule.java:45)
		at com.carrotsearch.randomizedtesting.rules.SystemPropertiesInvariantRule$1.evaluate(SystemPropertiesInvariantRule.java:55)
		at org.apache.lucene.util.TestRuleThreadAndTestName$1.evaluate(TestRuleThreadAndTestName.java:48)
		at org.apache.lucene.util.TestRuleIgnoreAfterMaxFailures$1.evaluate(TestRuleIgnoreAfterMaxFailures.java:70)
		at org.apache.lucene.util.TestRuleMarkFailure$1.evaluate(TestRuleMarkFailure.java:48)
		at com.carrotsearch.randomizedtesting.rules.StatementAdapter.evaluate(StatementAdapter.java:36)
		at com.carrotsearch.randomizedtesting.ThreadLeakControl$StatementRunner.run(ThreadLeakControl.java:345)
		at com.carrotsearch.randomizedtesting.ThreadLeakControl.forkTimeoutingTask(ThreadLeakControl.java:769)
		at com.carrotsearch.randomizedtesting.ThreadLeakControl$3.evaluate(ThreadLeakControl.java:429)
		at com.carrotsearch.randomizedtesting.RandomizedRunner.runSingleTest(RandomizedRunner.java:746)
		at com.carrotsearch.randomizedtesting.RandomizedRunner$3.evaluate(RandomizedRunner.java:648)
		at com.carrotsearch.randomizedtesting.RandomizedRunner$4.evaluate(RandomizedRunner.java:682)
		at com.carrotsearch.randomizedtesting.RandomizedRunner$5.evaluate(RandomizedRunner.java:693)
		at com.carrotsearch.randomizedtesting.rules.StatementAdapter.evaluate(StatementAdapter.java:36)
		at com.carrotsearch.randomizedtesting.rules.SystemPropertiesRestoreRule$1.evaluate(SystemPropertiesRestoreRule.java:53)
		at org.apache.lucene.util.AbstractBeforeAfterRule$1.evaluate(AbstractBeforeAfterRule.java:45)
		at org.apache.lucene.util.TestRuleStoreClassName$1.evaluate(TestRuleStoreClassName.java:38)
		at com.carrotsearch.randomizedtesting.rules.SystemPropertiesInvariantRule$1.evaluate(SystemPropertiesInvariantRule.java:55)
		at com.carrotsearch.randomizedtesting.rules.NoShadowingOrOverridesOnMethodsRule$1.evaluate(NoShadowingOrOverridesOnMethodsRule.java:39)
		at com.carrotsearch.randomizedtesting.rules.NoShadowingOrOverridesOnMethodsRule$1.evaluate(NoShadowingOrOverridesOnMethodsRule.java:39)
		at org.apache.lucene.util.TestRuleAssertionsRequired$1.evaluate(TestRuleAssertionsRequired.java:40)
		at org.apache.lucene.util.TestRuleMarkFailure$1.evaluate(TestRuleMarkFailure.java:48)
		at org.apache.lucene.util.TestRuleIgnoreAfterMaxFailures$1.evaluate(TestRuleIgnoreAfterMaxFailures.java:70)
		at org.apache.lucene.util.TestRuleIgnoreTestSuites$1.evaluate(TestRuleIgnoreTestSuites.java:55)
		at com.carrotsearch.randomizedtesting.rules.StatementAdapter.evaluate(StatementAdapter.java:36)
		at com.carrotsearch.randomizedtesting.ThreadLeakControl$StatementRunner.run(ThreadLeakControl.java:345)
		at java.lang.Thread.run(Thread.java:679)
	
Tests run: 31, Failures: 0, Errors: 0, Skipped: 0, Time elapsed: 2.985 sec
Running org.apache.solr.TestSolrCoreProperties
Tests run: 1, Failures: 0, Errors: 0, Skipped: 0, Time elapsed: 0.171 sec
Running org.apache.solr.servlet.DirectSolrConnectionTest
Tests run: 2, Failures: 0, Errors: 0, Skipped: 0, Time elapsed: 0.195 sec
Running org.apache.solr.client.solrj.embedded.MultiCoreExampleJettyTest
Tests run: 2, Failures: 0, Errors: 0, Skipped: 0, Time elapsed: 1.338 sec
Running org.apache.solr.util.PrimUtilsTest
Tests run: 2, Failures: 0, Errors: 0, Skipped: 0, Time elapsed: 0.088 sec
Running org.apache.solr.search.SpatialFilterTest
Creating dataDir: /usr/home/hudson/hudson-slave/workspace/Lucene-Solr-Maven-4.x/maven-build/solr/core/target/test/./solrtest-SpatialFilterTest-1344861859432
Tests run: 3, Failures: 0, Errors: 0, Skipped: 0, Time elapsed: 0.978 sec
Running org.apache.solr.update.SolrCmdDistributorTest
{responseHeader={status=0,QTime=2},index={numDocs=124,maxDoc=124,version=40,segmentCount=8,current=true,hasDeletions=false,directory=org.apache.lucene.store.MockDirectoryWrapper:MockDirWrapper(org.apache.lucene.store.RAMDirectory@1f6839df lockFactory=org.apache.lucene.store.NativeFSLockFactory@2c698e2),userData={commitTimeMSec=1344861862293},lastModified=Mon Aug 13 15:51:26 GMT+03:07 2012},fields={_version_={type=long,schema=ITS----O------,index=-TS-----------,docs=124},id={type=int,schema=ITS----O------,index=-TS-----------,docs=124},intDefault={type=int,schema=ITS----O------,index=-TS-----------,docs=124},multiDefault={type=string,schema=I-SM---------l,index=ITS-----------,docs=124},range_facet_l={type=long,schema=ITSM---O------,dynamicBase=*_l,index=-TS-----------,docs=124},range_facet_si={type=sint,schema=I-S----------l,dynamicBase=*_si,index=ITS-----------,docs=124},range_facet_sl={type=slong,schema=I-SM---------l,dynamicBase=*_sl,index=ITS-----------,docs=124},timestamp={type=date,schema=ITS-----------,index=-TS-----------,docs=124}},info={key={I=Indexed,T=Tokenized,S=Stored,M=Multivalued,V=TermVector Stored,o=Store Offset With TermVector,p=Store Position With TermVector,O=Omit Norms,F=Omit Term Frequencies & Positions,P=Omit Positions,L=Lazy,B=Binary,f=Sort Missing First,l=Sort Missing Last},NOTE=Document Frequency (df) is not updated when a document is marked for deletion.  df values include deleted documents.}}
{responseHeader={status=0,QTime=1},index={numDocs=124,maxDoc=124,version=29,segmentCount=4,current=true,hasDeletions=false,directory=org.apache.lucene.store.BaseDirectoryWrapper:BaseDirectoryWrapper(org.apache.lucene.store.RAMDirectory@735099db lockFactory=org.apache.lucene.store.NativeFSLockFactory@2df98841),userData={commitTimeMSec=1344861862287},lastModified=Mon Aug 13 15:51:26 GMT+03:07 2012},fields={_version_={type=long,schema=ITS----O------,index=-TS-----------,docs=124},id={type=int,schema=ITS----O------,index=-TS-----------,docs=124},intDefault={type=int,schema=ITS----O------,index=-TS-----------,docs=124},multiDefault={type=string,schema=I-SM---------l,index=ITS-----------,docs=124},range_facet_l={type=long,schema=ITSM---O------,dynamicBase=*_l,index=-TS-----------,docs=124},range_facet_si={type=sint,schema=I-S----------l,dynamicBase=*_si,index=ITS-----------,docs=124},range_facet_sl={type=slong,schema=I-SM---------l,dynamicBase=*_sl,index=ITS-----------,docs=124},timestamp={type=date,schema=ITS-----------,index=-TS-----------,docs=124}},info={key={I=Indexed,T=Tokenized,S=Stored,M=Multivalued,V=TermVector Stored,o=Store Offset With TermVector,p=Store Position With TermVector,O=Omit Norms,F=Omit Term Frequencies & Positions,P=Omit Positions,L=Lazy,B=Binary,f=Sort Missing First,l=Sort Missing Last},NOTE=Document Frequency (df) is not updated when a document is marked for deletion.  df values include deleted documents.}}
{responseHeader={status=0,QTime=1},index={numDocs=125,maxDoc=125,version=33,segmentCount=6,current=true,hasDeletions=false,directory=org.apache.lucene.store.MockDirectoryWrapper:MockDirWrapper(org.apache.lucene.store.RAMDirectory@655134b0 lockFactory=org.apache.lucene.store.NativeFSLockFactory@5fd632b1),userData={commitTimeMSec=1344861862282},lastModified=Mon Aug 13 15:51:26 GMT+03:07 2012},fields={_version_={type=long,schema=ITS----O------,index=-TS-----------,docs=125},id={type=int,schema=ITS----O------,index=-TS-----------,docs=125},intDefault={type=int,schema=ITS----O------,index=-TS-----------,docs=125},multiDefault={type=string,schema=I-SM---------l,index=ITS-----------,docs=125},range_facet_l={type=long,schema=ITSM---O------,dynamicBase=*_l,index=-TS-----------,docs=125},range_facet_si={type=sint,schema=I-S----------l,dynamicBase=*_si,index=ITS-----------,docs=125},range_facet_sl={type=slong,schema=I-SM---------l,dynamicBase=*_sl,index=ITS-----------,docs=125},timestamp={type=date,schema=ITS-----------,index=-TS-----------,docs=125}},info={key={I=Indexed,T=Tokenized,S=Stored,M=Multivalued,V=TermVector Stored,o=Store Offset With TermVector,p=Store Position With TermVector,O=Omit Norms,F=Omit Term Frequencies & Positions,P=Omit Positions,L=Lazy,B=Binary,f=Sort Missing First,l=Sort Missing Last},NOTE=Document Frequency (df) is not updated when a document is marked for deletion.  df values include deleted documents.}}
{responseHeader={status=0,QTime=1},index={numDocs=134,maxDoc=134,version=31,segmentCount=5,current=true,hasDeletions=false,directory=org.apache.lucene.store.MockDirectoryWrapper:MockDirWrapper(org.apache.lucene.store.RAMDirectory@484667bb lockFactory=org.apache.lucene.store.NativeFSLockFactory@6d9bc8ff),userData={commitTimeMSec=1344861862294},lastModified=Mon Aug 13 15:51:26 GMT+03:07 2012},fields={_version_={type=long,schema=ITS----O------,index=-TS-----------,docs=134},id={type=int,schema=ITS----O------,index=-TS-----------,docs=134},intDefault={type=int,schema=ITS----O------,index=-TS-----------,docs=134},multiDefault={type=string,schema=I-SM---------l,index=ITS-----------,docs=134},range_facet_l={type=long,schema=ITSM---O------,dynamicBase=*_l,index=-TS-----------,docs=134},range_facet_si={type=sint,schema=I-S----------l,dynamicBase=*_si,index=ITS-----------,docs=134},range_facet_sl={type=slong,schema=I-SM---------l,dynamicBase=*_sl,index=ITS-----------,docs=134},timestamp={type=date,schema=ITS-----------,index=-TS-----------,docs=134}},info={key={I=Indexed,T=Tokenized,S=Stored,M=Multivalued,V=TermVector Stored,o=Store Offset With TermVector,p=Store Position With TermVector,O=Omit Norms,F=Omit Term Frequencies & Positions,P=Omit Positions,L=Lazy,B=Binary,f=Sort Missing First,l=Sort Missing Last},NOTE=Document Frequency (df) is not updated when a document is marked for deletion.  df values include deleted documents.}}
Tests run: 1, Failures: 0, Errors: 0, Skipped: 0, Time elapsed: 2.299 sec
Running org.apache.solr.schema.IndexSchemaRuntimeFieldTest
Creating dataDir: /usr/home/hudson/hudson-slave/workspace/Lucene-Solr-Maven-4.x/maven-build/solr/core/target/test/./solrtest-IndexSchemaRuntimeFieldTest-1344861862701
Tests run: 1, Failures: 0, Errors: 0, Skipped: 0, Time elapsed: 0.363 sec
Running org.apache.solr.util.TestSystemIdResolver
Tests run: 1, Failures: 0, Errors: 0, Skipped: 0, Time elapsed: 0.028 sec
Running org.apache.solr.TestPluginEnable
Creating dataDir: /usr/home/hudson/hudson-slave/workspace/Lucene-Solr-Maven-4.x/maven-build/solr/core/target/test/./solrtest-TestPluginEnable-1344861863099
Tests run: 1, Failures: 0, Errors: 0, Skipped: 0, Time elapsed: 0.068 sec
Running org.apache.solr.search.TestFoldingMultitermQuery
Creating dataDir: /usr/home/hudson/hudson-slave/workspace/Lucene-Solr-Maven-4.x/maven-build/solr/core/target/test/./solrtest-TestFoldingMultitermQuery-1344861863162
Tests run: 18, Failures: 0, Errors: 0, Skipped: 0, Time elapsed: 0.451 sec
Running org.apache.solr.spelling.SpellCheckCollatorTest
Creating dataDir: /usr/home/hudson/hudson-slave/workspace/Lucene-Solr-Maven-4.x/maven-build/solr/core/target/test/./solrtest-SpellCheckCollatorTest-1344861863614
Tests run: 7, Failures: 0, Errors: 0, Skipped: 0, Time elapsed: 0.979 sec
Running org.apache.solr.search.TestRangeQuery
Creating dataDir: /usr/home/hudson/hudson-slave/workspace/Lucene-Solr-Maven-4.x/maven-build/solr/core/target/test/./solrtest-TestRangeQuery-1344861864597
Tests run: 2, Failures: 0, Errors: 0, Skipped: 0, Time elapsed: 5.516 sec
Running org.apache.solr.client.solrj.embedded.MergeIndexesEmbeddedTest
!!!! WARNING: best effort to remove /usr/home/hudson/hudson-slave/workspace/Lucene-Solr-Maven-4.x/maven-build/solr/core/target/test/./org.apache.solr.client.solrj.embedded.MergeIndexesEmbeddedTest-1344861870113 FAILED !!!!!
!!!! WARNING: best effort to remove /usr/home/hudson/hudson-slave/workspace/Lucene-Solr-Maven-4.x/maven-build/solr/core/target/test/./org.apache.solr.client.solrj.embedded.MergeIndexesEmbeddedTest-1344861870403 FAILED !!!!!
Tests run: 2, Failures: 0, Errors: 0, Skipped: 0, Time elapsed: 0.715 sec
Running org.apache.solr.core.TestMergePolicyConfig
Creating dataDir: /usr/home/hudson/hudson-slave/workspace/Lucene-Solr-Maven-4.x/maven-build/solr/core/target/test/./solrtest-TestMergePolicyConfig-1344861870826
Tests run: 1, Failures: 0, Errors: 0, Skipped: 0, Time elapsed: 0.275 sec
Running org.apache.solr.core.TestSolrXMLSerializer
Tests run: 1, Failures: 0, Errors: 0, Skipped: 0, Time elapsed: 0.019 sec
Running org.apache.solr.search.TestIndexSearcher
Creating dataDir: /usr/home/hudson/hudson-slave/workspace/Lucene-Solr-Maven-4.x/maven-build/solr/core/target/test/./solrtest-TestIndexSearcher-1344861871120
Tests run: 2, Failures: 0, Errors: 0, Skipped: 0, Time elapsed: 0.925 sec
Running org.apache.solr.search.TestSurroundQueryParser
Tests run: 1, Failures: 0, Errors: 0, Skipped: 0, Time elapsed: 0.593 sec
Running org.apache.solr.client.solrj.response.DocumentAnalysisResponseTest
Tests run: 1, Failures: 0, Errors: 0, Skipped: 0, Time elapsed: 0.019 sec
Running org.apache.solr.highlight.HighlighterTest
Creating dataDir: /usr/home/hudson/hudson-slave/workspace/Lucene-Solr-Maven-4.x/maven-build/solr/core/target/test/./solrtest-HighlighterTest-1344861872667
Tests run: 27, Failures: 0, Errors: 0, Skipped: 0, Time elapsed: 1.034 sec
Running org.apache.solr.cloud.TestHashPartitioner
Tests run: 1, Failures: 0, Errors: 0, Skipped: 0, Time elapsed: 5.525 sec
Running org.apache.solr.spelling.suggest.TestPhraseSuggestions
Creating dataDir: /usr/home/hudson/hudson-slave/workspace/Lucene-Solr-Maven-4.x/maven-build/solr/core/target/test/./solrtest-TestPhraseSuggestions-1344861879225
Tests run: 1, Failures: 0, Errors: 0, Skipped: 0, Time elapsed: 0.122 sec
Running org.apache.solr.handler.component.StatsComponentTest
ASYNC  NEW_CORE C6 name=collection1 org.apache.solr.core.SolrCore@6c8a1fb9
2636 T1642 C6 oasc.SolrException.log SEVERE org.apache.solr.common.SolrException: Stats can only facet on single-valued fields, not: foo_ss
		at org.apache.solr.handler.component.SimpleStats.getFieldCacheStats(StatsComponent.java:261)
		at org.apache.solr.handler.component.SimpleStats.getStatsFields(StatsComponent.java:227)
		at org.apache.solr.handler.component.SimpleStats.getStatsCounts(StatsComponent.java:201)
		at org.apache.solr.handler.component.StatsComponent.process(StatsComponent.java:70)
		at org.apache.solr.handler.component.SearchHandler.handleRequestBody(SearchHandler.java:206)
		at org.apache.solr.handler.RequestHandlerBase.handleRequest(RequestHandlerBase.java:129)
		at org.apache.solr.core.SolrCore.execute(SolrCore.java:1658)
		at org.apache.solr.util.TestHarness.query(TestHarness.java:351)
		at org.apache.solr.util.TestHarness.query(TestHarness.java:333)
		at org.apache.solr.util.AbstractSolrTestCase.assertQEx(AbstractSolrTestCase.java:290)
		at org.apache.solr.handler.component.StatsComponentTest.testStatsFacetMultivaluedErrorHandling(StatsComponentTest.java:360)
		at sun.reflect.NativeMethodAccessorImpl.invoke0(Native Method)
		at sun.reflect.NativeMethodAccessorImpl.invoke(NativeMethodAccessorImpl.java:57)
		at sun.reflect.DelegatingMethodAccessorImpl.invoke(DelegatingMethodAccessorImpl.java:43)
		at java.lang.reflect.Method.invoke(Method.java:616)
		at com.carrotsearch.randomizedtesting.RandomizedRunner.invoke(RandomizedRunner.java:1559)
		at com.carrotsearch.randomizedtesting.RandomizedRunner.access$600(RandomizedRunner.java:79)
		at com.carrotsearch.randomizedtesting.RandomizedRunner$6.evaluate(RandomizedRunner.java:737)
		at com.carrotsearch.randomizedtesting.RandomizedRunner$7.evaluate(RandomizedRunner.java:773)
		at com.carrotsearch.randomizedtesting.RandomizedRunner$8.evaluate(RandomizedRunner.java:787)
		at com.carrotsearch.randomizedtesting.rules.SystemPropertiesRestoreRule$1.evaluate(SystemPropertiesRestoreRule.java:53)
		at org.apache.lucene.util.TestRuleSetupTeardownChained$1.evaluate(TestRuleSetupTeardownChained.java:50)
		at org.apache.lucene.util.TestRuleFieldCacheSanity$1.evaluate(TestRuleFieldCacheSanity.java:32)
		at org.apache.lucene.util.AbstractBeforeAfterRule$1.evaluate(AbstractBeforeAfterRule.java:45)
		at com.carrotsearch.randomizedtesting.rules.SystemPropertiesInvariantRule$1.evaluate(SystemPropertiesInvariantRule.java:55)
		at org.apache.lucene.util.TestRuleThreadAndTestName$1.evaluate(TestRuleThreadAndTestName.java:48)
		at org.apache.lucene.util.TestRuleIgnoreAfterMaxFailures$1.evaluate(TestRuleIgnoreAfterMaxFailures.java:70)
		at org.apache.lucene.util.TestRuleMarkFailure$1.evaluate(TestRuleMarkFailure.java:48)
		at com.carrotsearch.randomizedtesting.rules.StatementAdapter.evaluate(StatementAdapter.java:36)
		at com.carrotsearch.randomizedtesting.ThreadLeakControl$StatementRunner.run(ThreadLeakControl.java:345)
		at com.carrotsearch.randomizedtesting.ThreadLeakControl.forkTimeoutingTask(ThreadLeakControl.java:769)
		at com.carrotsearch.randomizedtesting.ThreadLeakControl$3.evaluate(ThreadLeakControl.java:429)
		at com.carrotsearch.randomizedtesting.RandomizedRunner.runSingleTest(RandomizedRunner.java:746)
		at com.carrotsearch.randomizedtesting.RandomizedRunner$3.evaluate(RandomizedRunner.java:648)
		at com.carrotsearch.randomizedtesting.RandomizedRunner$4.evaluate(RandomizedRunner.java:682)
		at com.carrotsearch.randomizedtesting.RandomizedRunner$5.evaluate(RandomizedRunner.java:693)
		at com.carrotsearch.randomizedtesting.rules.StatementAdapter.evaluate(StatementAdapter.java:36)
		at com.carrotsearch.randomizedtesting.rules.SystemPropertiesRestoreRule$1.evaluate(SystemPropertiesRestoreRule.java:53)
		at org.apache.lucene.util.AbstractBeforeAfterRule$1.evaluate(AbstractBeforeAfterRule.java:45)
		at org.apache.lucene.util.TestRuleStoreClassName$1.evaluate(TestRuleStoreClassName.java:38)
		at com.carrotsearch.randomizedtesting.rules.SystemPropertiesInvariantRule$1.evaluate(SystemPropertiesInvariantRule.java:55)
		at com.carrotsearch.randomizedtesting.rules.NoShadowingOrOverridesOnMethodsRule$1.evaluate(NoShadowingOrOverridesOnMethodsRule.java:39)
		at com.carrotsearch.randomizedtesting.rules.NoShadowingOrOverridesOnMethodsRule$1.evaluate(NoShadowingOrOverridesOnMethodsRule.java:39)
		at org.apache.lucene.util.TestRuleAssertionsRequired$1.evaluate(TestRuleAssertionsRequired.java:40)
		at org.apache.lucene.util.TestRuleMarkFailure$1.evaluate(TestRuleMarkFailure.java:48)
		at org.apache.lucene.util.TestRuleIgnoreAfterMaxFailures$1.evaluate(TestRuleIgnoreAfterMaxFailures.java:70)
		at org.apache.lucene.util.TestRuleIgnoreTestSuites$1.evaluate(TestRuleIgnoreTestSuites.java:55)
		at com.carrotsearch.randomizedtesting.rules.StatementAdapter.evaluate(StatementAdapter.java:36)
		at com.carrotsearch.randomizedtesting.ThreadLeakControl$StatementRunner.run(ThreadLeakControl.java:345)
		at java.lang.Thread.run(Thread.java:679)
	
Tests run: 7, Failures: 0, Errors: 0, Skipped: 0, Time elapsed: 2.834 sec
Running org.apache.solr.handler.PingRequestHandlerTest
Creating dataDir: /usr/home/hudson/hudson-slave/workspace/Lucene-Solr-Maven-4.x/maven-build/solr/core/target/test/./solrtest-PingRequestHandlerTest-1344861882191
Tests run: 5, Failures: 0, Errors: 0, Skipped: 0, Time elapsed: 0.513 sec
Running org.apache.solr.client.solrj.embedded.LargeVolumeBinaryJettyTest
Creating dataDir: /usr/home/hudson/hudson-slave/workspace/Lucene-Solr-Maven-4.x/maven-build/solr/core/target/test/./solrtest-LargeVolumeBinaryJettyTest-1344861882701
Tests run: 1, Failures: 0, Errors: 0, Skipped: 0, Time elapsed: 1.268 sec
Running org.apache.solr.client.solrj.embedded.TestSolrProperties
Tests run: 1, Failures: 0, Errors: 0, Skipped: 0, Time elapsed: 0.744 sec
Running org.apache.solr.cloud.ZkNodePropsTest
Tests run: 1, Failures: 0, Errors: 0, Skipped: 0, Time elapsed: 0.016 sec
Running org.apache.solr.search.similarities.TestDefaultSimilarityFactory
Creating dataDir: /usr/home/hudson/hudson-slave/workspace/Lucene-Solr-Maven-4.x/maven-build/solr/core/target/test/./solrtest-TestDefaultSimilarityFactory-1344861884726
Tests run: 2, Failures: 0, Errors: 0, Skipped: 0, Time elapsed: 0.095 sec
Running org.apache.solr.search.TestQueryTypes
Tests run: 1, Failures: 0, Errors: 0, Skipped: 0, Time elapsed: 0.483 sec
Running org.apache.solr.DisMaxRequestHandlerTest
Creating dataDir: /usr/home/hudson/hudson-slave/workspace/Lucene-Solr-Maven-4.x/maven-build/solr/core/target/test/./solrtest-DisMaxRequestHandlerTest-1344861885302
Tests run: 2, Failures: 0, Errors: 0, Skipped: 0, Time elapsed: 0.741 sec
Running org.apache.solr.core.TestSolrDeletionPolicy1
Creating dataDir: /usr/home/hudson/hudson-slave/workspace/Lucene-Solr-Maven-4.x/maven-build/solr/core/target/test/./solrtest-TestSolrDeletionPolicy1-1344861886046
Tests run: 3, Failures: 0, Errors: 0, Skipped: 0, Time elapsed: 0.679 sec
Running org.apache.solr.search.TestReload
Creating dataDir: /usr/home/hudson/hudson-slave/workspace/Lucene-Solr-Maven-4.x/maven-build/solr/core/target/test/./solrtest-TestReload-1344861886721
!!! softCommittrue
!!! softCommitfalse
!!! softCommitfalse
!!! softCommitfalse
!!! softCommitfalse
!!! softCommitfalse
Tests run: 1, Failures: 0, Errors: 0, Skipped: 0, Time elapsed: 3.794 sec
Running org.apache.solr.spelling.suggest.SuggesterWFSTTest
Creating dataDir: /usr/home/hudson/hudson-slave/workspace/Lucene-Solr-Maven-4.x/maven-build/solr/core/target/test/./solrtest-SuggesterWFSTTest-1344861890529
NOTE: per solr.test.leavedatadir, dataDir will not be removed: /usr/home/hudson/hudson-slave/workspace/Lucene-Solr-Maven-4.x/maven-build/solr/core/target/test/./solrtest-SuggesterWFSTTest-1344861890529
Tests run: 4, Failures: 0, Errors: 0, Skipped: 0, Time elapsed: 0.683 sec
Running org.apache.solr.schema.DateFieldTest
Tests run: 8, Failures: 0, Errors: 0, Skipped: 1, Time elapsed: 0.029 sec
Running org.apache.solr.search.TestLFUCache
Creating dataDir: /usr/home/hudson/hudson-slave/workspace/Lucene-Solr-Maven-4.x/maven-build/solr/core/target/test/./solrtest-TestLFUCache-1344861891232
{39=39, 38=38, 37=37, 36=36, 35=35, 34=34, 33=33, 32=32, 31=31, 30=30}
Tests run: 5, Failures: 0, Errors: 0, Skipped: 0, Time elapsed: 0.289 sec
Running org.apache.solr.handler.component.TermVectorComponentTest
Creating dataDir: /usr/home/hudson/hudson-slave/workspace/Lucene-Solr-Maven-4.x/maven-build/solr/core/target/test/./solrtest-TermVectorComponentTest-1344861891521
Tests run: 3, Failures: 0, Errors: 0, Skipped: 0, Time elapsed: 0.389 sec
Running org.apache.solr.search.TestFastLRUCache
Tests run: 7, Failures: 0, Errors: 0, Skipped: 0, Time elapsed: 0.04 sec
Running org.apache.solr.handler.component.SearchHandlerTest
Creating dataDir: /usr/home/hudson/hudson-slave/workspace/Lucene-Solr-Maven-4.x/maven-build/solr/core/target/test/./solrtest-SearchHandlerTest-1344861891952
29 T3 oasu.ConcurrentLRUCache.finalize SEVERE ConcurrentLRUCache was not destroyed prior to finalize(), indicates a bug -- POSSIBLE RESOURCE LEAK!!!
Tests run: 1, Failures: 0, Errors: 0, Skipped: 0, Time elapsed: 0.368 sec
Running org.apache.solr.client.solrj.embedded.TestEmbeddedSolrServer
Tests run: 2, Failures: 0, Errors: 0, Skipped: 0, Time elapsed: 0.324 sec
Running org.apache.solr.request.TestWriterPerf
Tests run: 1, Failures: 0, Errors: 0, Skipped: 0, Time elapsed: 0.819 sec
Running org.apache.solr.spelling.suggest.SuggesterTest
Creating dataDir: /usr/home/hudson/hudson-slave/workspace/Lucene-Solr-Maven-4.x/maven-build/solr/core/target/test/./solrtest-SuggesterTest-1344861893463
NOTE: per solr.test.leavedatadir, dataDir will not be removed: /usr/home/hudson/hudson-slave/workspace/Lucene-Solr-Maven-4.x/maven-build/solr/core/target/test/./solrtest-SuggesterTest-1344861893463
Tests run: 4, Failures: 0, Errors: 0, Skipped: 0, Time elapsed: 0.535 sec
Running org.apache.solr.util.SolrPluginUtilsTest
Creating dataDir: /usr/home/hudson/hudson-slave/workspace/Lucene-Solr-Maven-4.x/maven-build/solr/core/target/test/./solrtest-SolrPluginUtilsTest-1344861893999
Tests run: 7, Failures: 0, Errors: 0, Skipped: 0, Time elapsed: 0.377 sec
Running org.apache.solr.search.TestFiltering
Creating dataDir: /usr/home/hudson/hudson-slave/workspace/Lucene-Solr-Maven-4.x/maven-build/solr/core/target/test/./solrtest-TestFiltering-1344861894377
Tests run: 2, Failures: 0, Errors: 0, Skipped: 0, Time elapsed: 10.809 sec
Running org.apache.solr.search.TestRealTimeGet
Creating dataDir: /usr/home/hudson/hudson-slave/workspace/Lucene-Solr-Maven-4.x/maven-build/solr/core/target/test/./solrtest-TestRealTimeGet-1344861905187
Tests run: 4, Failures: 0, Errors: 0, Skipped: 0, Time elapsed: 1.625 sec
Running org.apache.solr.client.solrj.TestBatchUpdate
Creating dataDir: /usr/home/hudson/hudson-slave/workspace/Lucene-Solr-Maven-4.x/maven-build/solr/core/target/test/./solrtest-TestBatchUpdate-1344861906814
Tests run: 3, Failures: 0, Errors: 0, Skipped: 0, Time elapsed: 1.019 sec
Running org.apache.solr.search.TestValueSourceCache
Creating dataDir: /usr/home/hudson/hudson-slave/workspace/Lucene-Solr-Maven-4.x/maven-build/solr/core/target/test/./solrtest-TestValueSourceCache-1344861907833
Tests run: 2, Failures: 0, Errors: 0, Skipped: 0, Time elapsed: 0.42 sec
Running org.apache.solr.search.TestQueryUtils
Tests run: 1, Failures: 0, Errors: 0, Skipped: 0, Time elapsed: 0.419 sec
Running org.apache.solr.client.solrj.embedded.JettyWebappTest
Tests run: 1, Failures: 0, Errors: 0, Skipped: 0, Time elapsed: 0.679 sec
Running org.apache.solr.cloud.LeaderElectionIntegrationTest
Creating dataDir: /usr/home/hudson/hudson-slave/workspace/Lucene-Solr-Maven-4.x/maven-build/solr/core/target/test/./solrtest-LeaderElectionIntegrationTest-1344861909356
3220 T1846 oasc.SolrException.log SEVERE Sync Failed
3224 T1849 oasc.SolrException.log SEVERE Sync Failed
3228 T1852 oasc.SolrException.log SEVERE Sync Failed
3232 T1855 oasc.SolrException.log SEVERE Sync Failed
3236 T1846 oasc.SolrException.log SEVERE Sync Failed
3240 T1849 oasc.SolrException.log SEVERE Sync Failed
3244 T1852 oasc.SolrException.log SEVERE Sync Failed
3248 T1855 oasc.SolrException.log SEVERE Sync Failed
3254 T1849 oasc.SolrException.log SEVERE Sync Failed
3258 T1852 oasc.SolrException.log SEVERE Sync Failed
3262 T1855 oasc.SolrException.log SEVERE Sync Failed
Creating dataDir: /usr/home/hudson/hudson-slave/workspace/Lucene-Solr-Maven-4.x/maven-build/solr/core/target/test/./solrtest-LeaderElectionIntegrationTest-1344861915719
Tests run: 2, Failures: 0, Errors: 0, Skipped: 0, Time elapsed: 17.677 sec
Running org.apache.solr.schema.BadIndexSchemaTest
Creating dataDir: /usr/home/hudson/hudson-slave/workspace/Lucene-Solr-Maven-4.x/maven-build/solr/core/target/test/./solrtest-BadIndexSchemaTest-1344861927036
85 T1934 oasc.SolrCore.initCodec SEVERE FieldType 'pulsing1' is configured with a postings format, but the codec does not support it: class org.apache.solr.core.SolrCore$3
Creating dataDir: /usr/home/hudson/hudson-slave/workspace/Lucene-Solr-Maven-4.x/maven-build/solr/core/target/test/./solrtest-BadIndexSchemaTest-1344861927122
134 T3 oasc.CoreContainer.finalize SEVERE CoreContainer was not shutdown prior to finalize(), indicates a bug -- POSSIBLE RESOURCE LEAK!!!  instance=1656772538
134 T3 oasc.SolrCore.finalize SEVERE REFCOUNT ERROR: unreferenced org.apache.solr.core.SolrCore@41bfa6fc (collection1) has a reference count of 1
167 T1934 oass.IndexSchema.readSchema SEVERE uniqueKey field (id) can not be the dest of a copyField (src=XXX)
Creating dataDir: /usr/home/hudson/hudson-slave/workspace/Lucene-Solr-Maven-4.x/maven-build/solr/core/target/test/./solrtest-BadIndexSchemaTest-1344861927202
241 T1934 oass.IndexSchema.readSchema SEVERE uniqueKey field (null) can not be configured with a default value (XXX)
Creating dataDir: /usr/home/hudson/hudson-slave/workspace/Lucene-Solr-Maven-4.x/maven-build/solr/core/target/test/./solrtest-BadIndexSchemaTest-1344861927277
316 T1934 oass.IndexSchema.readSchema SEVERE uniqueKey field (null) can not be configured to be multivalued
Creating dataDir: /usr/home/hudson/hudson-slave/workspace/Lucene-Solr-Maven-4.x/maven-build/solr/core/target/test/./solrtest-BadIndexSchemaTest-1344861927354
Creating dataDir: /usr/home/hudson/hudson-slave/workspace/Lucene-Solr-Maven-4.x/maven-build/solr/core/target/test/./solrtest-BadIndexSchemaTest-1344861927433
Creating dataDir: /usr/home/hudson/hudson-slave/workspace/Lucene-Solr-Maven-4.x/maven-build/solr/core/target/test/./solrtest-BadIndexSchemaTest-1344861927511
Creating dataDir: /usr/home/hudson/hudson-slave/workspace/Lucene-Solr-Maven-4.x/maven-build/solr/core/target/test/./solrtest-BadIndexSchemaTest-1344861927586
Creating dataDir: /usr/home/hudson/hudson-slave/workspace/Lucene-Solr-Maven-4.x/maven-build/solr/core/target/test/./solrtest-BadIndexSchemaTest-1344861927662
Creating dataDir: /usr/home/hudson/hudson-slave/workspace/Lucene-Solr-Maven-4.x/maven-build/solr/core/target/test/./solrtest-BadIndexSchemaTest-1344861927737
Creating dataDir: /usr/home/hudson/hudson-slave/workspace/Lucene-Solr-Maven-4.x/maven-build/solr/core/target/test/./solrtest-BadIndexSchemaTest-1344861927810
847 T1934 oass.IndexSchema.readSchema SEVERE FieldType 'sim1' is configured with a similarity, but the global similarity does not support it: class org.apache.solr.search.similarities.DefaultSimilarityFactory
Creating dataDir: /usr/home/hudson/hudson-slave/workspace/Lucene-Solr-Maven-4.x/maven-build/solr/core/target/test/./solrtest-BadIndexSchemaTest-1344861927884
Creating dataDir: /usr/home/hudson/hudson-slave/workspace/Lucene-Solr-Maven-4.x/maven-build/solr/core/target/test/./solrtest-BadIndexSchemaTest-1344861927933
Creating dataDir: /usr/home/hudson/hudson-slave/workspace/Lucene-Solr-Maven-4.x/maven-build/solr/core/target/test/./solrtest-BadIndexSchemaTest-1344861927982
Creating dataDir: /usr/home/hudson/hudson-slave/workspace/Lucene-Solr-Maven-4.x/maven-build/solr/core/target/test/./solrtest-BadIndexSchemaTest-1344861928033
Tests run: 9, Failures: 0, Errors: 0, Skipped: 0, Time elapsed: 1.062 sec
Running org.apache.solr.search.TestSolrJ
Tests run: 1, Failures: 0, Errors: 0, Skipped: 0, Time elapsed: 0.011 sec
Running org.apache.solr.analysis.TestCollationKeyRangeQueries
Creating dataDir: /usr/home/hudson/hudson-slave/workspace/Lucene-Solr-Maven-4.x/maven-build/solr/core/target/test/./solrtest-TestCollationKeyRangeQueries-1344861928105
Tests run: 3, Failures: 0, Errors: 0, Skipped: 0, Time elapsed: 0.139 sec
Running org.apache.solr.client.solrj.embedded.SolrExampleStreamingTest
Creating dataDir: /usr/home/hudson/hudson-slave/workspace/Lucene-Solr-Maven-4.x/maven-build/solr/core/target/test/./solrtest-SolrExampleStreamingTest-1344861928247
ASYNC  NEW_CORE C7 name=collection1 org.apache.solr.core.SolrCore@3a2663b8
4992 T1949 C7 oasc.SolrException.log SEVERE org.apache.solr.common.SolrException: Document contains multiple values for uniqueKey field: id=[DOCID, DOCID2]
		at org.apache.solr.update.AddUpdateCommand.getIndexedId(AddUpdateCommand.java:94)
		at org.apache.solr.update.processor.DistributedUpdateProcessor.versionAdd(DistributedUpdateProcessor.java:429)
		at org.apache.solr.update.processor.DistributedUpdateProcessor.processAdd(DistributedUpdateProcessor.java:315)
		at org.apache.solr.handler.loader.XMLLoader.processUpdate(XMLLoader.java:230)
		at org.apache.solr.handler.loader.XMLLoader.load(XMLLoader.java:157)
		at org.apache.solr.handler.UpdateRequestHandler$1.load(UpdateRequestHandler.java:92)
		at org.apache.solr.handler.ContentStreamHandlerBase.handleRequestBody(ContentStreamHandlerBase.java:74)
		at org.apache.solr.handler.RequestHandlerBase.handleRequest(RequestHandlerBase.java:129)
		at org.apache.solr.core.SolrCore.execute(SolrCore.java:1658)
		at org.apache.solr.servlet.SolrDispatchFilter.execute(SolrDispatchFilter.java:454)
		at org.apache.solr.servlet.SolrDispatchFilter.doFilter(SolrDispatchFilter.java:275)
		at org.eclipse.jetty.servlet.ServletHandler$CachedChain.doFilter(ServletHandler.java:1337)
		at org.eclipse.jetty.servlet.ServletHandler.doHandle(ServletHandler.java:484)
		at org.eclipse.jetty.server.session.SessionHandler.doHandle(SessionHandler.java:231)
		at org.eclipse.jetty.server.handler.ScopedHandler.handle(ScopedHandler.java:119)
		at org.eclipse.jetty.server.handler.GzipHandler.handle(GzipHandler.java:267)
		at org.eclipse.jetty.server.handler.ContextHandler.doHandle(ContextHandler.java:1067)
		at org.eclipse.jetty.servlet.ServletHandler.doScope(ServletHandler.java:413)
		at org.eclipse.jetty.server.session.SessionHandler.doScope(SessionHandler.java:192)
		at org.eclipse.jetty.server.handler.ContextHandler.doScope(ContextHandler.java:999)
		at org.eclipse.jetty.server.handler.ScopedHandler.handle(ScopedHandler.java:117)
		at org.eclipse.jetty.server.handler.HandlerWrapper.handle(HandlerWrapper.java:111)
		at org.eclipse.jetty.server.Server.handle(Server.java:351)
		at org.eclipse.jetty.server.AbstractHttpConnection.handleRequest(AbstractHttpConnection.java:454)
		at org.eclipse.jetty.server.BlockingHttpConnection.handleRequest(BlockingHttpConnection.java:47)
		at org.eclipse.jetty.server.AbstractHttpConnection.content(AbstractHttpConnection.java:900)
		at org.eclipse.jetty.server.AbstractHttpConnection$RequestHandler.content(AbstractHttpConnection.java:954)
		at org.eclipse.jetty.http.HttpParser.parseNext(HttpParser.java:952)
		at org.eclipse.jetty.http.HttpParser.parseAvailable(HttpParser.java:235)
		at org.eclipse.jetty.server.BlockingHttpConnection.handle(BlockingHttpConnection.java:66)
		at org.eclipse.jetty.server.bio.SocketConnector$ConnectorEndPoint.run(SocketConnector.java:254)
		at org.eclipse.jetty.util.thread.QueuedThreadPool.runJob(QueuedThreadPool.java:599)
		at org.eclipse.jetty.util.thread.QueuedThreadPool$3.run(QueuedThreadPool.java:534)
		at java.lang.Thread.run(Thread.java:679)
	
Tests run: 22, Failures: 0, Errors: 0, Skipped: 0, Time elapsed: 11.841 sec
Running org.apache.solr.handler.component.TermsComponentTest
Creating dataDir: /usr/home/hudson/hudson-slave/workspace/Lucene-Solr-Maven-4.x/maven-build/solr/core/target/test/./solrtest-TermsComponentTest-1344861940088
Tests run: 13, Failures: 0, Errors: 0, Skipped: 0, Time elapsed: 0.495 sec
Running org.apache.solr.core.SolrCoreTest
Creating dataDir: /usr/home/hudson/hudson-slave/workspace/Lucene-Solr-Maven-4.x/maven-build/solr/core/target/test/./solrtest-SolrCoreTest-1344861940590
Creating dataDir: /usr/home/hudson/hudson-slave/workspace/Lucene-Solr-Maven-4.x/maven-build/solr/core/target/test/./solrtest-SolrCoreTest-1344861941083
Creating dataDir: /usr/home/hudson/hudson-slave/workspace/Lucene-Solr-Maven-4.x/maven-build/solr/core/target/test/./solrtest-SolrCoreTest-1344861941588
Creating dataDir: /usr/home/hudson/hudson-slave/workspace/Lucene-Solr-Maven-4.x/maven-build/solr/core/target/test/./solrtest-SolrCoreTest-1344861942199
Creating dataDir: /usr/home/hudson/hudson-slave/workspace/Lucene-Solr-Maven-4.x/maven-build/solr/core/target/test/./solrtest-SolrCoreTest-1344861943674
Creating dataDir: /usr/home/hudson/hudson-slave/workspace/Lucene-Solr-Maven-4.x/maven-build/solr/core/target/test/./solrtest-SolrCoreTest-1344861944168
Tests run: 6, Failures: 0, Errors: 0, Skipped: 0, Time elapsed: 4.065 sec
Running org.apache.solr.update.TestIndexingPerformance
Tests run: 1, Failures: 0, Errors: 0, Skipped: 0, Time elapsed: 0.503 sec
Running org.apache.solr.update.processor.UpdateRequestProcessorFactoryTest
Tests run: 2, Failures: 0, Errors: 0, Skipped: 0, Time elapsed: 0.778 sec
Running org.apache.solr.handler.TestReplicationHandler
replicate slave to master
22866 T2121 oasc.SolrException.log SEVERE SnapPull failed :org.apache.solr.common.SolrException: Unable to download segments_e completely. Downloaded 0!=122
		at org.apache.solr.handler.SnapPuller$FileFetcher.cleanup(SnapPuller.java:1117)
		at org.apache.solr.handler.SnapPuller$FileFetcher.fetchFile(SnapPuller.java:1001)
		at org.apache.solr.handler.SnapPuller.downloadIndexFiles(SnapPuller.java:629)
		at org.apache.solr.handler.SnapPuller.fetchLatestIndex(SnapPuller.java:333)
		at org.apache.solr.handler.ReplicationHandler.doFetch(ReplicationHandler.java:297)
		at org.apache.solr.handler.ReplicationHandler$1.run(ReplicationHandler.java:178)
	
30068 T2199 oash.SnapPuller.fetchLatestIndex SEVERE Master at: http://localhost:56177/solr is not available. Index fetch failed. Exception: org.apache.solr.client.solrj.SolrServerException: IOException occured when talking to server at: http://localhost:56177/solr
Tests run: 1, Failures: 0, Errors: 0, Skipped: 0, Time elapsed: 30.199 sec
Running org.apache.solr.update.DirectUpdateHandlerTest
Creating dataDir: /usr/home/hudson/hudson-slave/workspace/Lucene-Solr-Maven-4.x/maven-build/solr/core/target/test/./solrtest-DirectUpdateHandlerTest-1344861976138
Creating dataDir: /usr/home/hudson/hudson-slave/workspace/Lucene-Solr-Maven-4.x/maven-build/solr/core/target/test/./solrtest-DirectUpdateHandlerTest-1344861976717
Creating dataDir: /usr/home/hudson/hudson-slave/workspace/Lucene-Solr-Maven-4.x/maven-build/solr/core/target/test/./solrtest-DirectUpdateHandlerTest-1344861977266
Tests run: 6, Failures: 0, Errors: 0, Skipped: 0, Time elapsed: 1.842 sec
Running org.apache.solr.core.TestCodecSupport
Creating dataDir: /usr/home/hudson/hudson-slave/workspace/Lucene-Solr-Maven-4.x/maven-build/solr/core/target/test/./solrtest-TestCodecSupport-1344861977980
Tests run: 3, Failures: 0, Errors: 0, Skipped: 0, Time elapsed: 0.108 sec
Running org.apache.solr.handler.XmlUpdateRequestHandlerTest
Creating dataDir: /usr/home/hudson/hudson-slave/workspace/Lucene-Solr-Maven-4.x/maven-build/solr/core/target/test/./solrtest-XmlUpdateRequestHandlerTest-1344861978090
Tests run: 3, Failures: 0, Errors: 0, Skipped: 0, Time elapsed: 0.499 sec
Running org.apache.solr.client.solrj.SolrExceptionTest
Tests run: 1, Failures: 0, Errors: 0, Skipped: 0, Time elapsed: 0.027 sec
Running org.apache.solr.MinimalSchemaTest
Creating dataDir: /usr/home/hudson/hudson-slave/workspace/Lucene-Solr-Maven-4.x/maven-build/solr/core/target/test/./solrtest-MinimalSchemaTest-1344861978616
Tests run: 3, Failures: 0, Errors: 0, Skipped: 0, Time elapsed: 0.403 sec
Running org.apache.solr.handler.component.DistributedQueryElevationComponentTest
Tests run: 1, Failures: 0, Errors: 0, Skipped: 0, Time elapsed: 1.351 sec
Running org.apache.solr.client.solrj.embedded.SolrExampleEmbeddedTest
Creating dataDir: /usr/home/hudson/hudson-slave/workspace/Lucene-Solr-Maven-4.x/maven-build/solr/core/target/test/./solrtest-SolrExampleEmbeddedTest-1344861980376
Tests run: 22, Failures: 0, Errors: 0, Skipped: 0, Time elapsed: 3.883 sec
Running org.apache.solr.schema.TestOmitPositions
Creating dataDir: /usr/home/hudson/hudson-slave/workspace/Lucene-Solr-Maven-4.x/maven-build/solr/core/target/test/./solrtest-TestOmitPositions-1344861984255
Tests run: 2, Failures: 0, Errors: 0, Skipped: 0, Time elapsed: 0.615 sec
Running org.apache.solr.cloud.TestMultiCoreConfBootstrap
Creating dataDir: /usr/home/hudson/hudson-slave/workspace/Lucene-Solr-Maven-4.x/maven-build/solr/core/target/test/./solrtest-TestMultiCoreConfBootstrap-1344861984876
Tests run: 1, Failures: 0, Errors: 0, Skipped: 0, Time elapsed: 5.209 sec
Running org.apache.solr.common.params.SolrParamTest
Tests run: 1, Failures: 0, Errors: 0, Skipped: 0, Time elapsed: 0.025 sec
Running org.apache.solr.search.TestLRUCache
Tests run: 3, Failures: 0, Errors: 0, Skipped: 0, Time elapsed: 0.026 sec
Running org.apache.solr.schema.PreAnalyzedFieldTest
Tests run: 3, Failures: 0, Errors: 0, Skipped: 0, Time elapsed: 0.036 sec
Running org.apache.solr.search.TestSort
Creating dataDir: /usr/home/hudson/hudson-slave/workspace/Lucene-Solr-Maven-4.x/maven-build/solr/core/target/test/./solrtest-TestSort-1344861990169
Tests run: 2, Failures: 0, Errors: 0, Skipped: 0, Time elapsed: 3.274 sec
Running org.apache.solr.schema.CopyFieldTest
Creating dataDir: /usr/home/hudson/hudson-slave/workspace/Lucene-Solr-Maven-4.x/maven-build/solr/core/target/test/./solrtest-CopyFieldTest-1344861993444
Tests run: 6, Failures: 0, Errors: 0, Skipped: 0, Time elapsed: 0.274 sec
Running org.apache.solr.servlet.SolrRequestParserTest
Creating dataDir: /usr/home/hudson/hudson-slave/workspace/Lucene-Solr-Maven-4.x/maven-build/solr/core/target/test/./solrtest-SolrRequestParserTest-1344861993715
Tests run: 4, Failures: 0, Errors: 0, Skipped: 0, Time elapsed: 0.589 sec
Running org.apache.solr.request.TestRemoteStreaming
Creating dataDir: /usr/home/hudson/hudson-slave/workspace/Lucene-Solr-Maven-4.x/maven-build/solr/core/target/test/./solrtest-TestRemoteStreaming-1344861994310
Tests run: 4, Failures: 0, Errors: 0, Skipped: 0, Time elapsed: 0.499 sec
Running org.apache.solr.schema.TestCollationField
Creating dataDir: /usr/home/hudson/hudson-slave/workspace/Lucene-Solr-Maven-4.x/maven-build/solr/core/target/test/./solrtest-TestCollationField-1344861994822
Tests run: 8, Failures: 0, Errors: 0, Skipped: 0, Time elapsed: 0.291 sec
Running org.apache.solr.client.solrj.embedded.LargeVolumeJettyTest
Creating dataDir: /usr/home/hudson/hudson-slave/workspace/Lucene-Solr-Maven-4.x/maven-build/solr/core/target/test/./solrtest-LargeVolumeJettyTest-1344861995101
Tests run: 1, Failures: 0, Errors: 0, Skipped: 0, Time elapsed: 0.844 sec
Running org.apache.solr.highlight.FastVectorHighlighterTest
Creating dataDir: /usr/home/hudson/hudson-slave/workspace/Lucene-Solr-Maven-4.x/maven-build/solr/core/target/test/./solrtest-FastVectorHighlighterTest-1344861995944
Tests run: 2, Failures: 0, Errors: 0, Skipped: 0, Time elapsed: 0.5 sec
Running org.apache.solr.cloud.LeaderElectionTest
Creating dataDir: /usr/home/hudson/hudson-slave/workspace/Lucene-Solr-Maven-4.x/maven-build/solr/core/target/test/./solrtest-LeaderElectionTest-1344861996443
2829 T2414 oasc.Overseer.createOverseerNode SEVERE Could not create Overseer node: class org.apache.zookeeper.KeeperException$SessionExpiredException:KeeperErrorCode = Session expired for /overseer
Tests run: 4, Failures: 0, Errors: 0, Skipped: 0, Time elapsed: 12.652 sec
Running org.apache.solr.internal.csv.writer.CSVConfigTest
Tests run: 7, Failures: 0, Errors: 0, Skipped: 0, Time elapsed: 0.001 sec
Running org.apache.solr.schema.MultiTermTest
Creating dataDir: /usr/home/hudson/hudson-slave/workspace/Lucene-Solr-Maven-4.x/maven-build/solr/core/target/test/./solrtest-MultiTermTest-1344862009101
Tests run: 3, Failures: 0, Errors: 0, Skipped: 0, Time elapsed: 0.212 sec
Running org.apache.solr.search.function.distance.DistanceFunctionTest
Creating dataDir: /usr/home/hudson/hudson-slave/workspace/Lucene-Solr-Maven-4.x/maven-build/solr/core/target/test/./solrtest-DistanceFunctionTest-1344862009313
Tests run: 3, Failures: 0, Errors: 0, Skipped: 0, Time elapsed: 0.61 sec
Running org.apache.solr.util.TestUtils
Tests run: 3, Failures: 0, Errors: 0, Skipped: 0, Time elapsed: 0.021 sec
Running org.apache.solr.spelling.SpellPossibilityIteratorTest
Tests run: 3, Failures: 0, Errors: 0, Skipped: 0, Time elapsed: 0.499 sec
Running org.apache.solr.core.CoreContainerCoreInitFailuresTest
380 T2503 oasc.SolrException.log SEVERE Exception during parsing file: solrconfig.xml:org.xml.sax.SAXParseException; systemId: solrres:/solrconfig.xml; lineNumber: 1; columnNumber: 1; Content is not allowed in prolog.
		at com.sun.org.apache.xerces.internal.util.ErrorHandlerWrapper.createSAXParseException(ErrorHandlerWrapper.java:198)
		at com.sun.org.apache.xerces.internal.util.ErrorHandlerWrapper.fatalError(ErrorHandlerWrapper.java:177)
		at com.sun.org.apache.xerces.internal.impl.XMLErrorReporter.reportError(XMLErrorReporter.java:391)
		at com.sun.org.apache.xerces.internal.impl.XMLScanner.reportFatalError(XMLScanner.java:1404)
		at com.sun.org.apache.xerces.internal.impl.XMLDocumentScannerImpl$PrologDriver.next(XMLDocumentScannerImpl.java:1014)
		at com.sun.org.apache.xerces.internal.impl.XMLDocumentScannerImpl.next(XMLDocumentScannerImpl.java:625)
		at com.sun.org.apache.xerces.internal.impl.XMLNSDocumentScannerImpl.next(XMLNSDocumentScannerImpl.java:116)
		at com.sun.org.apache.xerces.internal.impl.XMLDocumentFragmentScannerImpl.scanDocument(XMLDocumentFragmentScannerImpl.java:488)
		at com.sun.org.apache.xerces.internal.parsers.XML11Configuration.parse(XML11Configuration.java:819)
		at com.sun.org.apache.xerces.internal.parsers.XML11Configuration.parse(XML11Configuration.java:748)
		at com.sun.org.apache.xerces.internal.parsers.XMLParser.parse(XMLParser.java:123)
		at com.sun.org.apache.xerces.internal.parsers.DOMParser.parse(DOMParser.java:239)
		at com.sun.org.apache.xerces.internal.jaxp.DocumentBuilderImpl.parse(DocumentBuilderImpl.java:288)
		at org.apache.solr.core.Config.<init>(Config.java:129)
		at org.apache.solr.core.Config.<init>(Config.java:78)
		at org.apache.solr.core.SolrConfig.<init>(SolrConfig.java:117)
		at org.apache.solr.core.SolrCore.reload(SolrCore.java:365)
		at org.apache.solr.core.CoreContainer.reload(CoreContainer.java:1015)
		at org.apache.solr.core.CoreContainerCoreInitFailuresTest.testFlowBadFromStart(CoreContainerCoreInitFailuresTest.java:257)
		at sun.reflect.NativeMethodAccessorImpl.invoke0(Native Method)
		at sun.reflect.NativeMethodAccessorImpl.invoke(NativeMethodAccessorImpl.java:57)
		at sun.reflect.DelegatingMethodAccessorImpl.invoke(DelegatingMethodAccessorImpl.java:43)
		at java.lang.reflect.Method.invoke(Method.java:616)
		at com.carrotsearch.randomizedtesting.RandomizedRunner.invoke(RandomizedRunner.java:1559)
		at com.carrotsearch.randomizedtesting.RandomizedRunner.access$600(RandomizedRunner.java:79)
		at com.carrotsearch.randomizedtesting.RandomizedRunner$6.evaluate(RandomizedRunner.java:737)
		at com.carrotsearch.randomizedtesting.RandomizedRunner$7.evaluate(RandomizedRunner.java:773)
		at com.carrotsearch.randomizedtesting.RandomizedRunner$8.evaluate(RandomizedRunner.java:787)
		at com.carrotsearch.randomizedtesting.rules.SystemPropertiesRestoreRule$1.evaluate(SystemPropertiesRestoreRule.java:53)
		at org.apache.lucene.util.TestRuleSetupTeardownChained$1.evaluate(TestRuleSetupTeardownChained.java:50)
		at org.apache.lucene.util.TestRuleFieldCacheSanity$1.evaluate(TestRuleFieldCacheSanity.java:32)
		at org.apache.lucene.util.AbstractBeforeAfterRule$1.evaluate(AbstractBeforeAfterRule.java:45)
		at com.carrotsearch.randomizedtesting.rules.SystemPropertiesInvariantRule$1.evaluate(SystemPropertiesInvariantRule.java:55)
		at org.apache.lucene.util.TestRuleThreadAndTestName$1.evaluate(TestRuleThreadAndTestName.java:48)
		at org.apache.lucene.util.TestRuleIgnoreAfterMaxFailures$1.evaluate(TestRuleIgnoreAfterMaxFailures.java:70)
		at org.apache.lucene.util.TestRuleMarkFailure$1.evaluate(TestRuleMarkFailure.java:48)
		at com.carrotsearch.randomizedtesting.rules.StatementAdapter.evaluate(StatementAdapter.java:36)
		at com.carrotsearch.randomizedtesting.ThreadLeakControl$StatementRunner.run(ThreadLeakControl.java:345)
		at com.carrotsearch.randomizedtesting.ThreadLeakControl.forkTimeoutingTask(ThreadLeakControl.java:769)
		at com.carrotsearch.randomizedtesting.ThreadLeakControl$3.evaluate(ThreadLeakControl.java:429)
		at com.carrotsearch.randomizedtesting.RandomizedRunner.runSingleTest(RandomizedRunner.java:746)
		at com.carrotsearch.randomizedtesting.RandomizedRunner$3.evaluate(RandomizedRunner.java:648)
		at com.carrotsearch.randomizedtesting.RandomizedRunner$4.evaluate(RandomizedRunner.java:682)
		at com.carrotsearch.randomizedtesting.RandomizedRunner$5.evaluate(RandomizedRunner.java:693)
		at com.carrotsearch.randomizedtesting.rules.StatementAdapter.evaluate(StatementAdapter.java:36)
		at com.carrotsearch.randomizedtesting.rules.SystemPropertiesRestoreRule$1.evaluate(SystemPropertiesRestoreRule.java:53)
		at org.apache.lucene.util.AbstractBeforeAfterRule$1.evaluate(AbstractBeforeAfterRule.java:45)
		at org.apache.lucene.util.TestRuleStoreClassName$1.evaluate(TestRuleStoreClassName.java:38)
		at com.carrotsearch.randomizedtesting.rules.SystemPropertiesInvariantRule$1.evaluate(SystemPropertiesInvariantRule.java:55)
		at com.carrotsearch.randomizedtesting.rules.NoShadowingOrOverridesOnMethodsRule$1.evaluate(NoShadowingOrOverridesOnMethodsRule.java:39)
		at com.carrotsearch.randomizedtesting.rules.NoShadowingOrOverridesOnMethodsRule$1.evaluate(NoShadowingOrOverridesOnMethodsRule.java:39)
		at org.apache.lucene.util.TestRuleAssertionsRequired$1.evaluate(TestRuleAssertionsRequired.java:40)
		at org.apache.lucene.util.TestRuleMarkFailure$1.evaluate(TestRuleMarkFailure.java:48)
		at org.apache.lucene.util.TestRuleIgnoreAfterMaxFailures$1.evaluate(TestRuleIgnoreAfterMaxFailures.java:70)
		at org.apache.lucene.util.TestRuleIgnoreTestSuites$1.evaluate(TestRuleIgnoreTestSuites.java:55)
		at com.carrotsearch.randomizedtesting.rules.StatementAdapter.evaluate(StatementAdapter.java:36)
		at com.carrotsearch.randomizedtesting.ThreadLeakControl$StatementRunner.run(ThreadLeakControl.java:345)
		at java.lang.Thread.run(Thread.java:679)
	
Tests run: 2, Failures: 0, Errors: 0, Skipped: 0, Time elapsed: 0.46 sec
Running org.apache.solr.update.processor.ScriptEngineTest
Tests run: 6, Failures: 0, Errors: 0, Skipped: 1, Time elapsed: 0.096 sec
Running org.apache.solr.spelling.suggest.SuggesterFSTTest
559 T3 oasc.SolrCore.finalize SEVERE REFCOUNT ERROR: unreferenced org.apache.solr.core.SolrCore@32c45b09 (col_bad) has a reference count of 1
Creating dataDir: /usr/home/hudson/hudson-slave/workspace/Lucene-Solr-Maven-4.x/maven-build/solr/core/target/test/./solrtest-SuggesterFSTTest-1344862011014
NOTE: per solr.test.leavedatadir, dataDir will not be removed: /usr/home/hudson/hudson-slave/workspace/Lucene-Solr-Maven-4.x/maven-build/solr/core/target/test/./solrtest-SuggesterFSTTest-1344862011014
Tests run: 4, Failures: 0, Errors: 0, Skipped: 0, Time elapsed: 0.782 sec
Running org.apache.solr.internal.csv.writer.CSVConfigGuesserTest
Tests run: 3, Failures: 0, Errors: 0, Skipped: 0, Time elapsed: 0.002 sec
Running org.apache.solr.util.TimeZoneUtilsTest
Tests run: 5, Failures: 0, Errors: 0, Skipped: 0, Time elapsed: 0.13 sec
Running org.apache.solr.util.FileUtilsTest
Tests run: 1, Failures: 0, Errors: 0, Skipped: 0, Time elapsed: 0.015 sec
Running org.apache.solr.cloud.OverseerTest
Creating dataDir: /usr/home/hudson/hudson-slave/workspace/Lucene-Solr-Maven-4.x/maven-build/solr/core/target/test/./solrtest-OverseerTest-1344862011942
8991 T2690 oasc.Overseer.createOverseerNode SEVERE Could not create Overseer node: class org.apache.zookeeper.KeeperException$SessionExpiredException:KeeperErrorCode = Session expired for /overseer
Tests run: 8, Failures: 0, Errors: 0, Skipped: 0, Time elapsed: 29.241 sec
Running org.apache.solr.core.TestConfig
Creating dataDir: /usr/home/hudson/hudson-slave/workspace/Lucene-Solr-Maven-4.x/maven-build/solr/core/target/test/./solrtest-TestConfig-1344862041185
Tests run: 8, Failures: 0, Errors: 0, Skipped: 0, Time elapsed: 0.236 sec
Running org.apache.solr.internal.csv.CSVStrategyTest
Tests run: 5, Failures: 0, Errors: 0, Skipped: 0, Time elapsed: 0 sec
Running org.apache.solr.core.TestQuerySenderListener
Creating dataDir: /usr/home/hudson/hudson-slave/workspace/Lucene-Solr-Maven-4.x/maven-build/solr/core/target/test/./solrtest-TestQuerySenderListener-1344862041422
Tests run: 3, Failures: 0, Errors: 0, Skipped: 0, Time elapsed: 0.41 sec
Running org.apache.solr.TestDistributedSearch
Tests run: 1, Failures: 0, Errors: 0, Skipped: 0, Time elapsed: 89.298 sec
Running org.apache.solr.response.TestPHPSerializedResponseWriter
Creating dataDir: /usr/home/hudson/hudson-slave/workspace/Lucene-Solr-Maven-4.x/maven-build/solr/core/target/test/./solrtest-TestPHPSerializedResponseWriter-1344862131128
Tests run: 2, Failures: 0, Errors: 0, Skipped: 0, Time elapsed: 0.36 sec
Running org.apache.solr.schema.RequiredFieldsTest
Creating dataDir: /usr/home/hudson/hudson-slave/workspace/Lucene-Solr-Maven-4.x/maven-build/solr/core/target/test/./solrtest-RequiredFieldsTest-1344862131489
Tests run: 3, Failures: 0, Errors: 0, Skipped: 0, Time elapsed: 0.328 sec
Running org.apache.solr.core.TestArbitraryIndexDir
Tests run: 1, Failures: 0, Errors: 0, Skipped: 0, Time elapsed: 0.552 sec
Running org.apache.solr.TestDocumentBuilder
doc1: SolrInputDocument[field1=value1, field2=value1, field3=value2, field4=15, field5=[45, 33, 20]]
clone: SolrInputDocument[field1=value1, field2=value1, field3=value2, field4=15, field5=[45, 33, 20]]
Tests run: 1, Failures: 0, Errors: 0, Skipped: 0, Time elapsed: 0.019 sec
Running org.apache.solr.AnalysisAfterCoreReloadTest
Tests run: 1, Failures: 0, Errors: 0, Skipped: 0, Time elapsed: 1.139 sec
Running org.apache.solr.core.TestJmxIntegration
Tests run: 3, Failures: 0, Errors: 0, Skipped: 1, Time elapsed: 0.688 sec
Running org.apache.solr.core.AlternateDirectoryTest
Creating dataDir: /usr/home/hudson/hudson-slave/workspace/Lucene-Solr-Maven-4.x/maven-build/solr/core/target/test/./solrtest-AlternateDirectoryTest-1344862134216
Tests run: 1, Failures: 0, Errors: 0, Skipped: 0, Time elapsed: 0.275 sec
Running org.apache.solr.search.QueryEqualityTest
Creating dataDir: /usr/home/hudson/hudson-slave/workspace/Lucene-Solr-Maven-4.x/maven-build/solr/core/target/test/./solrtest-QueryEqualityTest-1344862134496
Tests run: 59, Failures: 0, Errors: 0, Skipped: 0, Time elapsed: 0.419 sec
Running org.apache.solr.handler.component.SpellCheckComponentTest
Creating dataDir: /usr/home/hudson/hudson-slave/workspace/Lucene-Solr-Maven-4.x/maven-build/solr/core/target/test/./solrtest-SpellCheckComponentTest-1344862134913
Tests run: 9, Failures: 0, Errors: 0, Skipped: 0, Time elapsed: 6.957 sec
Running org.apache.solr.search.TestStressRecovery
Creating dataDir: /usr/home/hudson/hudson-slave/workspace/Lucene-Solr-Maven-4.x/maven-build/solr/core/target/test/./solrtest-TestStressRecovery-1344862141876
Tests run: 1, Failures: 0, Errors: 0, Skipped: 0, Time elapsed: 7.635 sec
Running org.apache.solr.request.TestFaceting
Creating dataDir: /usr/home/hudson/hudson-slave/workspace/Lucene-Solr-Maven-4.x/maven-build/solr/core/target/test/./solrtest-TestFaceting-1344862149508
Tests run: 3, Failures: 0, Errors: 0, Skipped: 0, Time elapsed: 4.841 sec
Running org.apache.solr.core.TestPropInjectDefaults
Creating dataDir: /usr/home/hudson/hudson-slave/workspace/Lucene-Solr-Maven-4.x/maven-build/solr/core/target/test/./solrtest-TestPropInjectDefaults-1344862154352
Tests run: 2, Failures: 0, Errors: 0, Skipped: 0, Time elapsed: 0.389 sec
Running org.apache.solr.core.PluginInfoTest
Tests run: 9, Failures: 0, Errors: 0, Skipped: 0, Time elapsed: 0.089 sec
Running org.apache.solr.handler.component.DistributedSpellCheckComponentTest
Tests run: 1, Failures: 0, Errors: 0, Skipped: 0, Time elapsed: 6.06 sec
Running org.apache.solr.client.solrj.response.TestSpellCheckResponse
Creating dataDir: /usr/home/hudson/hudson-slave/workspace/Lucene-Solr-Maven-4.x/maven-build/solr/core/target/test/./solrtest-TestSpellCheckResponse-1344862160891
Tests run: 3, Failures: 0, Errors: 0, Skipped: 0, Time elapsed: 0.49 sec
Running org.apache.solr.update.processor.StatelessScriptUpdateProcessorFactoryTest
Creating dataDir: /usr/home/hudson/hudson-slave/workspace/Lucene-Solr-Maven-4.x/maven-build/solr/core/target/test/./solrtest-StatelessScriptUpdateProcessorFactoryTest-1344862161385
Tests run: 7, Failures: 0, Errors: 0, Skipped: 0, Time elapsed: 0.794 sec
Running org.apache.solr.schema.CurrencyFieldTest
Creating dataDir: /usr/home/hudson/hudson-slave/workspace/Lucene-Solr-Maven-4.x/maven-build/solr/core/target/test/./solrtest-CurrencyFieldTest-1344862162178
Tests run: 8, Failures: 0, Errors: 0, Skipped: 1, Time elapsed: 0.477 sec
Running org.apache.solr.handler.BinaryUpdateRequestHandlerTest
Creating dataDir: /usr/home/hudson/hudson-slave/workspace/Lucene-Solr-Maven-4.x/maven-build/solr/core/target/test/./solrtest-BinaryUpdateRequestHandlerTest-1344862162653
null
Tests run: 1, Failures: 0, Errors: 0, Skipped: 0, Time elapsed: 0.365 sec
Running org.apache.solr.client.solrj.embedded.LargeVolumeEmbeddedTest
Creating dataDir: /usr/home/hudson/hudson-slave/workspace/Lucene-Solr-Maven-4.x/maven-build/solr/core/target/test/./solrtest-LargeVolumeEmbeddedTest-1344862163019
Tests run: 1, Failures: 0, Errors: 0, Skipped: 0, Time elapsed: 0.724 sec
Running org.apache.solr.handler.DocumentAnalysisRequestHandlerTest
Creating dataDir: /usr/home/hudson/hudson-slave/workspace/Lucene-Solr-Maven-4.x/maven-build/solr/core/target/test/./solrtest-DocumentAnalysisRequestHandlerTest-1344862163745
Tests run: 4, Failures: 0, Errors: 0, Skipped: 0, Time elapsed: 0.41 sec
Running org.apache.solr.update.AutoCommitTest
Tests run: 3, Failures: 0, Errors: 0, Skipped: 0, Time elapsed: 7.703 sec
Running org.apache.solr.update.processor.URLClassifyProcessorTest
Tests run: 7, Failures: 0, Errors: 0, Skipped: 0, Time elapsed: 0.137 sec
Running org.apache.solr.request.JSONWriterTest
Creating dataDir: /usr/home/hudson/hudson-slave/workspace/Lucene-Solr-Maven-4.x/maven-build/solr/core/target/test/./solrtest-JSONWriterTest-1344862172001
Tests run: 3, Failures: 0, Errors: 0, Skipped: 0, Time elapsed: 0.482 sec
Running org.apache.solr.search.similarities.TestBM25SimilarityFactory
Creating dataDir: /usr/home/hudson/hudson-slave/workspace/Lucene-Solr-Maven-4.x/maven-build/solr/core/target/test/./solrtest-TestBM25SimilarityFactory-1344862172483
Tests run: 2, Failures: 0, Errors: 0, Skipped: 0, Time elapsed: 0.098 sec
Running org.apache.solr.TestDistributedGrouping
Tests run: 1, Failures: 0, Errors: 0, Skipped: 0, Time elapsed: 10.774 sec
Running org.apache.solr.core.ResourceLoaderTest
Tests run: 4, Failures: 0, Errors: 0, Skipped: 0, Time elapsed: 0.084 sec

Results :

Tests in error: 
  testDistribSearch(org.apache.solr.cloud.BasicDistributedZkTest): ERROR: [doc=1000] multiple values encountered for non multiValued field val_i: [10, 20]

Tests run: 1142, Failures: 0, Errors: 1, Skipped: 18

[INFO] ------------------------------------------------------------------------
[INFO] SKIPPING Apache Solr Search Server
[INFO]    task-segment: [install]
[INFO] This project has been banned from further executions due to previous failures.
[INFO] ------------------------------------------------------------------------
[INFO] ------------------------------------------------------------------------
[INFO] SKIPPING Apache Solr Test Framework
[INFO]    task-segment: [install]
[INFO] This project has been banned from further executions due to previous failures.
[INFO] ------------------------------------------------------------------------
[INFO] ------------------------------------------------------------------------
[INFO] SKIPPING Apache Solr Analysis Extras
[INFO]    task-segment: [install]
[INFO] This project has been banned from further executions due to previous failures.
[INFO] ------------------------------------------------------------------------
[INFO] ------------------------------------------------------------------------
[INFO] SKIPPING Apache Solr Clustering
[INFO]    task-segment: [install]
[INFO] This project has been banned from further executions due to previous failures.
[INFO] ------------------------------------------------------------------------
[INFO] ------------------------------------------------------------------------
[INFO] SKIPPING Apache Solr DataImportHandler
[INFO]    task-segment: [install]
[INFO] This project has been banned from further executions due to previous failures.
[INFO] ------------------------------------------------------------------------
[INFO] ------------------------------------------------------------------------
[INFO] SKIPPING Apache Solr DataImportHandler Extras
[INFO]    task-segment: [install]
[INFO] This project has been banned from further executions due to previous failures.
[INFO] ------------------------------------------------------------------------
[INFO] ------------------------------------------------------------------------
[INFO] SKIPPING Apache Solr Content Extraction Library
[INFO]    task-segment: [install]
[INFO] This project has been banned from further executions due to previous failures.
[INFO] ------------------------------------------------------------------------
[INFO] ------------------------------------------------------------------------
[INFO] SKIPPING Apache Solr Language Identifier
[INFO]    task-segment: [install]
[INFO] This project has been banned from further executions due to previous failures.
[INFO] ------------------------------------------------------------------------
[INFO] ------------------------------------------------------------------------
[INFO] SKIPPING Apache Solr UIMA integration
[INFO]    task-segment: [install]
[INFO] This project has been banned from further executions due to previous failures.
[INFO] ------------------------------------------------------------------------
[INFO] ------------------------------------------------------------------------
[INFO] SKIPPING Apache Solr Velocity
[INFO]    task-segment: [install]
[INFO] This project has been banned from further executions due to previous failures.
[INFO] ------------------------------------------------------------------------
[INFO] ------------------------------------------------------------------------
[INFO] Building Apache Solr Contrib aggregator POM
[INFO]    task-segment: [install]
[INFO] ------------------------------------------------------------------------
[INFO] [groovy:execute {execution: generate-timestamps}]
[INFO] [buildnumber:create {execution: default}]
[INFO] [enforcer:enforce {execution: enforce-java-compat-version-and-maven-2.2.1}]
[INFO] [remote-resources:process {execution: default}]
[INFO] [bundle:manifest {execution: bundle-manifest}]
[WARNING] Ignoring project type pom - supportedProjectTypes = [jar, bundle]
[INFO] [site:attach-descriptor {execution: default-attach-descriptor}]
[INFO] [install:install {execution: default-install}]
[INFO] Installing /usr/home/hudson/hudson-slave/workspace/Lucene-Solr-Maven-4.x/maven-build/solr/contrib/pom.xml to /home/hudson/.m2/repository/org/apache/solr/solr-contrib-aggregator/4.0-SNAPSHOT/solr-contrib-aggregator-4.0-SNAPSHOT.pom
[INFO] 
[INFO] 
[INFO] ------------------------------------------------------------------------
[INFO] Reactor Summary:
[INFO] ------------------------------------------------------------------------
[INFO] Grandparent POM for Apache Lucene Core and Apache Solr  SUCCESS [7.766s]
[INFO] Lucene parent POM ..................................... SUCCESS [0.059s]
[INFO] Lucene Core ........................................... SUCCESS [4:52.935s]
[INFO] Lucene Test Framework ................................. SUCCESS [5.017s]
[INFO] Lucene Common Analyzers ............................... SUCCESS [2:00.892s]
[INFO] Lucene ICU Analysis Components ........................ SUCCESS [11.564s]
[INFO] Lucene Kuromoji Japanese Morphological Analyzer ....... SUCCESS [30.366s]
[INFO] Lucene Morfologik Polish Lemmatizer ................... SUCCESS [4.504s]
[INFO] Lucene Phonetic Filters ............................... SUCCESS [17.991s]
[INFO] Lucene Smart Chinese Analyzer ......................... SUCCESS [7.689s]
[INFO] Lucene Stempel Analyzer ............................... SUCCESS [4.999s]
[INFO] Lucene UIMA Analysis Components ....................... SUCCESS [21.764s]
[INFO] Lucene Analysis Modules aggregator POM ................ SUCCESS [0.279s]
[INFO] Lucene Queries ........................................ SUCCESS [9.652s]
[INFO] Lucene Sandbox ........................................ SUCCESS [7.176s]
[INFO] Lucene QueryParsers ................................... SUCCESS [14.460s]
[INFO] Lucene Memory ......................................... SUCCESS [8.605s]
[INFO] Lucene Highlighter .................................... SUCCESS [8.749s]
[INFO] Lucene Facets ......................................... SUCCESS [56.467s]
[INFO] Lucene Benchmark ...................................... SUCCESS [24.736s]
[INFO] Lucene Demo ........................................... SUCCESS [5.034s]
[INFO] Lucene Grouping ....................................... SUCCESS [17.963s]
[INFO] Lucene Join ........................................... SUCCESS [16.741s]
[INFO] Lucene Miscellaneous .................................. SUCCESS [6.384s]
[INFO] Lucene Spatial ........................................ SUCCESS [8.829s]
[INFO] Lucene Suggest ........................................ SUCCESS [18.456s]
[INFO] Apache Solr parent POM ................................ SUCCESS [0.072s]
[INFO] Apache Solr Solrj ..................................... SUCCESS [3.992s]
[INFO] Apache Solr Core ...................................... FAILED [11:23.124s]
[INFO] Apache Solr Search Server ............................. SKIPPED (dependency build failed or was skipped)
[INFO] Apache Solr Test Framework ............................ SKIPPED (dependency build failed or was skipped)
[INFO] Apache Solr Analysis Extras ........................... SKIPPED (dependency build failed or was skipped)
[INFO] Apache Solr Clustering ................................ SKIPPED (dependency build failed or was skipped)
[INFO] Apache Solr DataImportHandler ......................... SKIPPED (dependency build failed or was skipped)
[INFO] Apache Solr DataImportHandler Extras .................. SKIPPED (dependency build failed or was skipped)
[INFO] Apache Solr Content Extraction Library ................ SKIPPED (dependency build failed or was skipped)
[INFO] Apache Solr Language Identifier ....................... SKIPPED (dependency build failed or was skipped)
[INFO] Apache Solr UIMA integration .......................... SKIPPED (dependency build failed or was skipped)
[INFO] Apache Solr Velocity .................................. SKIPPED (dependency build failed or was skipped)
[INFO] Apache Solr Contrib aggregator POM .................... SUCCESS [0.089s]
[INFO] ------------------------------------------------------------------------
[INFO] Error for project: Apache Solr Core (during install)
[INFO] ------------------------------------------------------------------------
[INFO] There are test failures.

Please refer to /usr/home/hudson/hudson-slave/workspace/Lucene-Solr-Maven-4.x/maven-build/solr/core/target/surefire-reports for the individual test results.
[INFO] ------------------------------------------------------------------------
[INFO] For more information, run Maven with the -e switch
[INFO] ------------------------------------------------------------------------
[INFO] BUILD ERRORS
[INFO] ------------------------------------------------------------------------
[INFO] Total time: 23 minutes 37 seconds
[INFO] Finished at: Mon Aug 13 12:49:43 UTC 2012
[INFO] Final Memory: 186M/1146M
[INFO] ------------------------------------------------------------------------
Build step 'Invoke top-level Maven targets' marked build as failure
Recording test results
Email was triggered for: Failure
Sending email for trigger: Failure




Mime
View raw message