lucene-dev mailing list archives

Site index · List index
Message view « Date » · « Thread »
Top « Date » · « Thread »
From Apache Jenkins Server <jenk...@builds.apache.org>
Subject [JENKINS] Lucene-Solr-tests-only-4.x-nightly - Build # 1 - Failure
Date Sat, 11 Aug 2012 19:58:34 GMT
Build: https://builds.apache.org/job/Lucene-Solr-tests-only-4.x-nightly/1/

1 tests failed.
FAILED:  junit.framework.TestSuite.org.apache.solr.handler.TestReplicationHandler

Error Message:
ERROR: SolrIndexSearcher opens=76 closes=75

Stack Trace:
java.lang.AssertionError: ERROR: SolrIndexSearcher opens=76 closes=75
	at __randomizedtesting.SeedInfo.seed([13E99180E433CDC8]:0)
	at org.junit.Assert.fail(Assert.java:93)
	at org.apache.solr.SolrTestCaseJ4.endTrackingSearchers(SolrTestCaseJ4.java:216)
	at org.apache.solr.SolrTestCaseJ4.afterClass(SolrTestCaseJ4.java:82)
	at sun.reflect.GeneratedMethodAccessor17.invoke(Unknown Source)
	at sun.reflect.DelegatingMethodAccessorImpl.invoke(DelegatingMethodAccessorImpl.java:43)
	at java.lang.reflect.Method.invoke(Method.java:616)
	at com.carrotsearch.randomizedtesting.RandomizedRunner.invoke(RandomizedRunner.java:1995)
	at com.carrotsearch.randomizedtesting.RandomizedRunner.access$1100(RandomizedRunner.java:132)
	at com.carrotsearch.randomizedtesting.RandomizedRunner$5.evaluate(RandomizedRunner.java:754)
	at com.carrotsearch.randomizedtesting.rules.SystemPropertiesRestoreRule$1.evaluate(SystemPropertiesRestoreRule.java:53)
	at org.apache.lucene.util.AbstractBeforeAfterRule$1.evaluate(AbstractBeforeAfterRule.java:45)
	at org.apache.lucene.util.TestRuleReportUncaughtExceptions$1.evaluate(TestRuleReportUncaughtExceptions.java:68)
	at org.apache.lucene.util.TestRuleStoreClassName$1.evaluate(TestRuleStoreClassName.java:38)
	at com.carrotsearch.randomizedtesting.rules.SystemPropertiesInvariantRule$1.evaluate(SystemPropertiesInvariantRule.java:55)
	at org.apache.lucene.util.TestRuleNoInstanceHooksOverrides$1.evaluate(TestRuleNoInstanceHooksOverrides.java:53)
	at org.apache.lucene.util.TestRuleNoStaticHooksShadowing$1.evaluate(TestRuleNoStaticHooksShadowing.java:52)
	at org.apache.lucene.util.TestRuleAssertionsRequired$1.evaluate(TestRuleAssertionsRequired.java:36)
	at org.apache.lucene.util.TestRuleMarkFailure$1.evaluate(TestRuleMarkFailure.java:48)
	at org.apache.lucene.util.TestRuleIgnoreAfterMaxFailures$1.evaluate(TestRuleIgnoreAfterMaxFailures.java:70)
	at org.apache.lucene.util.TestRuleIgnoreTestSuites$1.evaluate(TestRuleIgnoreTestSuites.java:55)
	at com.carrotsearch.randomizedtesting.RandomizedRunner.runSuite(RandomizedRunner.java:605)
	at com.carrotsearch.randomizedtesting.RandomizedRunner.access$400(RandomizedRunner.java:132)
	at com.carrotsearch.randomizedtesting.RandomizedRunner$2.run(RandomizedRunner.java:551)




Build Log:
[...truncated 13608 lines...]
[junit4:junit4] Suite: org.apache.solr.handler.TestReplicationHandler
[junit4:junit4]    > (@BeforeClass output)
[junit4:junit4]   2> 3 T1745 oejs.Server.doStart jetty-8.1.2.v20120308
[junit4:junit4]   2> 6 T1745 oejs.AbstractConnector.doStart Started SocketConnector@0.0.0.0:19994
[junit4:junit4]   2> 6 T1745 oasc.SolrResourceLoader.locateSolrHome JNDI not configured
for solr (NoInitialContextEx)
[junit4:junit4]   2> 7 T1745 oasc.SolrResourceLoader.locateSolrHome using system property
solr.solr.home: ./org.apache.solr.handler.TestReplicationHandler$SolrInstance-1344714109394/master
[junit4:junit4]   2> 7 T1745 oasc.SolrResourceLoader.<init> new SolrResourceLoader
for deduced Solr Home: './org.apache.solr.handler.TestReplicationHandler$SolrInstance-1344714109394/master/'
[junit4:junit4]   2> 19 T1745 oass.SolrDispatchFilter.init SolrDispatchFilter.init()
[junit4:junit4]   2> 19 T1745 oasc.SolrResourceLoader.locateSolrHome JNDI not configured
for solr (NoInitialContextEx)
[junit4:junit4]   2> 19 T1745 oasc.SolrResourceLoader.locateSolrHome using system property
solr.solr.home: ./org.apache.solr.handler.TestReplicationHandler$SolrInstance-1344714109394/master
[junit4:junit4]   2> 20 T1745 oasc.CoreContainer$Initializer.initialize looking for solr.xml:
/usr/home/hudson/hudson-slave/workspace/Lucene-Solr-tests-only-4.x-nightly/solr/build/solr-core/test/J1/./org.apache.solr.handler.TestReplicationHandler$SolrInstance-1344714109394/master/solr.xml
[junit4:junit4]   2> 20 T1745 oasc.CoreContainer.<init> New CoreContainer 234378693
[junit4:junit4]   2> 20 T1745 oasc.CoreContainer$Initializer.initialize no solr.xml file
found - using default
[junit4:junit4]   2> 20 T1745 oasc.CoreContainer.load Loading CoreContainer using Solr
Home: './org.apache.solr.handler.TestReplicationHandler$SolrInstance-1344714109394/master/'
[junit4:junit4]   2> 21 T1745 oasc.SolrResourceLoader.<init> new SolrResourceLoader
for directory: './org.apache.solr.handler.TestReplicationHandler$SolrInstance-1344714109394/master/'
[junit4:junit4]   2> 34 T1745 oasc.CoreContainer.load Registering Log Listener
[junit4:junit4]   2> 46 T1745 oasc.CoreContainer.create Creating SolrCore 'collection1'
using instanceDir: ./org.apache.solr.handler.TestReplicationHandler$SolrInstance-1344714109394/master/collection1
[junit4:junit4]   2> 47 T1745 oasc.SolrResourceLoader.<init> new SolrResourceLoader
for directory: './org.apache.solr.handler.TestReplicationHandler$SolrInstance-1344714109394/master/collection1/'
[junit4:junit4]   2> 73 T1745 oasc.SolrConfig.<init> Using Lucene MatchVersion: LUCENE_40
[junit4:junit4]   2> 109 T1745 oasc.SolrConfig.<init> Loaded SolrConfig: solrconfig.xml
[junit4:junit4]   2> 110 T1745 oass.IndexSchema.readSchema Reading Solr Schema
[junit4:junit4]   2> 113 T1745 oass.IndexSchema.readSchema Schema name=test
[junit4:junit4]   2> 125 T1745 oass.IndexSchema.readSchema unique key field: id
[junit4:junit4]   2> 126 T1745 oasc.SolrCore.<init> [collection1] Opening new SolrCore
at ./org.apache.solr.handler.TestReplicationHandler$SolrInstance-1344714109394/master/collection1/,
dataDir=./org.apache.solr.handler.TestReplicationHandler$SolrInstance-1344714109394/master/collection1/data/
[junit4:junit4]   2> 126 T1745 oasc.SolrCore.<init> JMX monitoring not detected for
core: collection1
[junit4:junit4]   2> 126 T1745 oasc.SolrCore.getNewIndexDir WARNING New index directory
detected: old=null new=./org.apache.solr.handler.TestReplicationHandler$SolrInstance-1344714109394/master/collection1/data/index/
[junit4:junit4]   2> 127 T1745 oasc.SolrCore.initIndex WARNING [collection1] Solr index
directory './org.apache.solr.handler.TestReplicationHandler$SolrInstance-1344714109394/master/collection1/data/index'
doesn't exist. Creating new index...
[junit4:junit4]   2> 131 T1745 oasc.SolrDeletionPolicy.onCommit SolrDeletionPolicy.onCommit:
commits:num=1
[junit4:junit4]   2> 		commit{dir=NRTCachingDirectory(org.apache.lucene.store.NIOFSDirectory@/usr/home/hudson/hudson-slave/workspace/Lucene-Solr-tests-only-4.x-nightly/solr/build/solr-core/test/J1/org.apache.solr.handler.TestReplicationHandler$SolrInstance-1344714109394/master/collection1/data/index
lockFactory=org.apache.lucene.store.SingleInstanceLockFactory@22265e80; maxCacheMB=48.0 maxMergeSizeMB=4.0),segFN=segments_1,generation=1,filenames=[segments_1]
[junit4:junit4]   2> 131 T1745 oasc.SolrDeletionPolicy.updateCommits newest commit = 1
[junit4:junit4]   2> 132 T1745 oasc.RequestHandlers.initHandlersFromConfig created standard:
solr.StandardRequestHandler
[junit4:junit4]   2> 132 T1745 oasc.RequestHandlers.initHandlersFromConfig created /replication:
solr.ReplicationHandler
[junit4:junit4]   2> 133 T1745 oasc.RequestHandlers.initHandlersFromConfig created defaults:
solr.StandardRequestHandler
[junit4:junit4]   2> 133 T1745 oasc.RequestHandlers.initHandlersFromConfig adding lazy
requestHandler: solr.StandardRequestHandler
[junit4:junit4]   2> 133 T1745 oasc.RequestHandlers.initHandlersFromConfig created lazy:
solr.StandardRequestHandler
[junit4:junit4]   2> 133 T1745 oasc.RequestHandlers.initHandlersFromConfig created /update:
solr.UpdateRequestHandler
[junit4:junit4]   2> 134 T1745 oashl.XMLLoader.init xsltCacheLifetimeSeconds=60
[junit4:junit4]   2> 137 T1745 oass.SolrIndexSearcher.<init> Opening Searcher@8efdaaa
main
[junit4:junit4]   2> 137 T1745 oasu.CommitTracker.<init> Hard AutoCommit: disabled
[junit4:junit4]   2> 138 T1745 oasu.CommitTracker.<init> Soft AutoCommit: disabled
[junit4:junit4]   2> 138 T1745 oashc.HttpShardHandlerFactory.getParameter Setting socketTimeout
to: 0
[junit4:junit4]   2> 138 T1745 oashc.HttpShardHandlerFactory.getParameter Setting urlScheme
to: http://
[junit4:junit4]   2> 138 T1745 oashc.HttpShardHandlerFactory.getParameter Setting connTimeout
to: 0
[junit4:junit4]   2> 139 T1745 oashc.HttpShardHandlerFactory.getParameter Setting maxConnectionsPerHost
to: 20
[junit4:junit4]   2> 139 T1745 oashc.HttpShardHandlerFactory.getParameter Setting corePoolSize
to: 0
[junit4:junit4]   2> 139 T1745 oashc.HttpShardHandlerFactory.getParameter Setting maximumPoolSize
to: 2147483647
[junit4:junit4]   2> 139 T1745 oashc.HttpShardHandlerFactory.getParameter Setting maxThreadIdleTime
to: 5
[junit4:junit4]   2> 140 T1745 oashc.HttpShardHandlerFactory.getParameter Setting sizeOfQueue
to: -1
[junit4:junit4]   2> 140 T1745 oashc.HttpShardHandlerFactory.getParameter Setting fairnessPolicy
to: false
[junit4:junit4]   2> 140 T1745 oascsi.HttpClientUtil.createClient Creating new http client,
config:maxConnectionsPerHost=20&maxConnections=10000&socketTimeout=0&connTimeout=0&retry=false
[junit4:junit4]   2> 150 T1745 oash.ReplicationHandler.inform Replication enabled for following
config files: schema.xml
[junit4:junit4]   2> 151 T1745 oash.ReplicationHandler.inform Commits will be reserved
for  10000
[junit4:junit4]   2> 151 T1755 oasc.SolrCore.registerSearcher [collection1] Registered
new searcher Searcher@8efdaaa main{StandardDirectoryReader(segments_1:1)}
[junit4:junit4]   2> 151 T1745 oasc.CoreContainer.register registering core: collection1
[junit4:junit4]   2> 151 T1745 oass.SolrDispatchFilter.init user.dir=/usr/home/hudson/hudson-slave/workspace/Lucene-Solr-tests-only-4.x-nightly/solr/build/solr-core/test/J1
[junit4:junit4]   2> 151 T1745 oass.SolrDispatchFilter.init SolrDispatchFilter.init() done
[junit4:junit4]   2> 152 T1745 oascsi.HttpClientUtil.createClient Creating new http client,
config:maxConnections=128&maxConnectionsPerHost=32&followRedirects=false
[junit4:junit4]   2> 164 T1745 oejs.Server.doStart jetty-8.1.2.v20120308
[junit4:junit4]   2> 166 T1745 oejs.AbstractConnector.doStart Started SocketConnector@0.0.0.0:38952
[junit4:junit4]   2> 166 T1745 oasc.SolrResourceLoader.locateSolrHome JNDI not configured
for solr (NoInitialContextEx)
[junit4:junit4]   2> 167 T1745 oasc.SolrResourceLoader.locateSolrHome using system property
solr.solr.home: ./org.apache.solr.handler.TestReplicationHandler$SolrInstance-1344714109555/slave
[junit4:junit4]   2> 167 T1745 oasc.SolrResourceLoader.<init> new SolrResourceLoader
for deduced Solr Home: './org.apache.solr.handler.TestReplicationHandler$SolrInstance-1344714109555/slave/'
[junit4:junit4]   2> 178 T1745 oass.SolrDispatchFilter.init SolrDispatchFilter.init()
[junit4:junit4]   2> 179 T1745 oasc.SolrResourceLoader.locateSolrHome JNDI not configured
for solr (NoInitialContextEx)
[junit4:junit4]   2> 179 T1745 oasc.SolrResourceLoader.locateSolrHome using system property
solr.solr.home: ./org.apache.solr.handler.TestReplicationHandler$SolrInstance-1344714109555/slave
[junit4:junit4]   2> 179 T1745 oasc.CoreContainer$Initializer.initialize looking for solr.xml:
/usr/home/hudson/hudson-slave/workspace/Lucene-Solr-tests-only-4.x-nightly/solr/build/solr-core/test/J1/./org.apache.solr.handler.TestReplicationHandler$SolrInstance-1344714109555/slave/solr.xml
[junit4:junit4]   2> 179 T1745 oasc.CoreContainer.<init> New CoreContainer 2135591424
[junit4:junit4]   2> 180 T1745 oasc.CoreContainer$Initializer.initialize no solr.xml file
found - using default
[junit4:junit4]   2> 180 T1745 oasc.CoreContainer.load Loading CoreContainer using Solr
Home: './org.apache.solr.handler.TestReplicationHandler$SolrInstance-1344714109555/slave/'
[junit4:junit4]   2> 180 T1745 oasc.SolrResourceLoader.<init> new SolrResourceLoader
for directory: './org.apache.solr.handler.TestReplicationHandler$SolrInstance-1344714109555/slave/'
[junit4:junit4]   2> 193 T1745 oasc.CoreContainer.load Registering Log Listener
[junit4:junit4]   2> 209 T1745 oasc.CoreContainer.create Creating SolrCore 'collection1'
using instanceDir: ./org.apache.solr.handler.TestReplicationHandler$SolrInstance-1344714109555/slave/collection1
[junit4:junit4]   2> 209 T1745 oasc.SolrResourceLoader.<init> new SolrResourceLoader
for directory: './org.apache.solr.handler.TestReplicationHandler$SolrInstance-1344714109555/slave/collection1/'
[junit4:junit4]   2> 234 T1745 oasc.SolrConfig.<init> Using Lucene MatchVersion:
LUCENE_40
[junit4:junit4]   2> 268 T1745 oasc.SolrConfig.<init> Loaded SolrConfig: solrconfig.xml
[junit4:junit4]   2> 268 T1745 oass.IndexSchema.readSchema Reading Solr Schema
[junit4:junit4]   2> 271 T1745 oass.IndexSchema.readSchema Schema name=test
[junit4:junit4]   2> 283 T1745 oass.IndexSchema.readSchema unique key field: id
[junit4:junit4]   2> 284 T1745 oasc.SolrCore.<init> [collection1] Opening new SolrCore
at ./org.apache.solr.handler.TestReplicationHandler$SolrInstance-1344714109555/slave/collection1/,
dataDir=./org.apache.solr.handler.TestReplicationHandler$SolrInstance-1344714109555/slave/collection1/data/
[junit4:junit4]   2> 284 T1745 oasc.SolrCore.<init> JMX monitoring not detected for
core: collection1
[junit4:junit4]   2> 285 T1745 oasc.SolrCore.getNewIndexDir WARNING New index directory
detected: old=null new=./org.apache.solr.handler.TestReplicationHandler$SolrInstance-1344714109555/slave/collection1/data/index/
[junit4:junit4]   2> 285 T1745 oasc.SolrCore.initIndex WARNING [collection1] Solr index
directory './org.apache.solr.handler.TestReplicationHandler$SolrInstance-1344714109555/slave/collection1/data/index'
doesn't exist. Creating new index...
[junit4:junit4]   2> 289 T1745 oasc.SolrDeletionPolicy.onCommit SolrDeletionPolicy.onCommit:
commits:num=1
[junit4:junit4]   2> 		commit{dir=NRTCachingDirectory(org.apache.lucene.store.NIOFSDirectory@/usr/home/hudson/hudson-slave/workspace/Lucene-Solr-tests-only-4.x-nightly/solr/build/solr-core/test/J1/org.apache.solr.handler.TestReplicationHandler$SolrInstance-1344714109555/slave/collection1/data/index
lockFactory=org.apache.lucene.store.SingleInstanceLockFactory@4a2e2067; maxCacheMB=48.0 maxMergeSizeMB=4.0),segFN=segments_1,generation=1,filenames=[segments_1]
[junit4:junit4]   2> 290 T1745 oasc.SolrDeletionPolicy.updateCommits newest commit = 1
[junit4:junit4]   2> 291 T1745 oasc.RequestHandlers.initHandlersFromConfig created standard:
solr.StandardRequestHandler
[junit4:junit4]   2> 291 T1745 oasc.RequestHandlers.initHandlersFromConfig created defaults:
solr.StandardRequestHandler
[junit4:junit4]   2> 291 T1745 oasc.RequestHandlers.initHandlersFromConfig adding lazy
requestHandler: solr.StandardRequestHandler
[junit4:junit4]   2> 291 T1745 oasc.RequestHandlers.initHandlersFromConfig created lazy:
solr.StandardRequestHandler
[junit4:junit4]   2> 292 T1745 oasc.RequestHandlers.initHandlersFromConfig created /update:
solr.UpdateRequestHandler
[junit4:junit4]   2> 292 T1745 oasc.RequestHandlers.initHandlersFromConfig created /replication:
solr.ReplicationHandler
[junit4:junit4]   2> 293 T1745 oashl.XMLLoader.init xsltCacheLifetimeSeconds=60
[junit4:junit4]   2> 295 T1745 oass.SolrIndexSearcher.<init> Opening Searcher@70b34ab2
main
[junit4:junit4]   2> 296 T1745 oasu.CommitTracker.<init> Hard AutoCommit: disabled
[junit4:junit4]   2> 296 T1745 oasu.CommitTracker.<init> Soft AutoCommit: disabled
[junit4:junit4]   2> 296 T1745 oashc.HttpShardHandlerFactory.getParameter Setting socketTimeout
to: 0
[junit4:junit4]   2> 297 T1745 oashc.HttpShardHandlerFactory.getParameter Setting urlScheme
to: http://
[junit4:junit4]   2> 297 T1745 oashc.HttpShardHandlerFactory.getParameter Setting connTimeout
to: 0
[junit4:junit4]   2> 297 T1745 oashc.HttpShardHandlerFactory.getParameter Setting maxConnectionsPerHost
to: 20
[junit4:junit4]   2> 297 T1745 oashc.HttpShardHandlerFactory.getParameter Setting corePoolSize
to: 0
[junit4:junit4]   2> 298 T1745 oashc.HttpShardHandlerFactory.getParameter Setting maximumPoolSize
to: 2147483647
[junit4:junit4]   2> 298 T1745 oashc.HttpShardHandlerFactory.getParameter Setting maxThreadIdleTime
to: 5
[junit4:junit4]   2> 298 T1745 oashc.HttpShardHandlerFactory.getParameter Setting sizeOfQueue
to: -1
[junit4:junit4]   2> 298 T1745 oashc.HttpShardHandlerFactory.getParameter Setting fairnessPolicy
to: false
[junit4:junit4]   2> 299 T1745 oascsi.HttpClientUtil.createClient Creating new http client,
config:maxConnectionsPerHost=20&maxConnections=10000&socketTimeout=0&connTimeout=0&retry=false
[junit4:junit4]   2> 312 T1745 oash.SnapPuller.startExecutorService Poll Scheduled at an
interval of 1000ms
[junit4:junit4]   2> 312 T1765 oasc.SolrCore.registerSearcher [collection1] Registered
new searcher Searcher@70b34ab2 main{StandardDirectoryReader(segments_1:1)}
[junit4:junit4]   2> 312 T1745 oasc.CoreContainer.register registering core: collection1
[junit4:junit4]   2> 312 T1745 oass.SolrDispatchFilter.init user.dir=/usr/home/hudson/hudson-slave/workspace/Lucene-Solr-tests-only-4.x-nightly/solr/build/solr-core/test/J1
[junit4:junit4]   2> 312 T1745 oass.SolrDispatchFilter.init SolrDispatchFilter.init() done
[junit4:junit4]   2> 313 T1745 oascsi.HttpClientUtil.createClient Creating new http client,
config:maxConnections=128&maxConnectionsPerHost=32&followRedirects=false
[junit4:junit4]   2> 
[junit4:junit4]    > (@AfterClass output)
[junit4:junit4]   2> 27719 T1745 oasc.CoreContainer.shutdown Shutting down CoreContainer
instance=169001343
[junit4:junit4]   2> 27719 T1745 oasc.SolrCore.close [collection1]  CLOSING SolrCore org.apache.solr.core.SolrCore@7095251c
[junit4:junit4]   2> 27720 T1745 oasc.SolrCore.closeSearcher [collection1] Closing main
searcher on request.
[junit4:junit4]   2> 27720 T1745 oasu.DirectUpdateHandler2.close closing DirectUpdateHandler2{commits=1,autocommits=0,soft
autocommits=0,optimizes=0,rollbacks=0,expungeDeletes=0,docsPending=0,adds=0,deletesById=0,deletesByQuery=0,errors=0,cumulative_adds=493,cumulative_deletesById=0,cumulative_deletesByQuery=1,cumulative_errors=0}
[junit4:junit4]   2> 27722 T1745 oejsh.ContextHandler.doStop stopped o.e.j.s.ServletContextHandler{/solr,null}
[junit4:junit4]   2> 27774 T1745 oasc.CoreContainer.shutdown Shutting down CoreContainer
instance=1903295329
[junit4:junit4]   2> 27774 T1745 oasc.SolrCore.close [collection1]  CLOSING SolrCore org.apache.solr.core.SolrCore@1f491ded
[junit4:junit4]   2> 27774 T1745 oasc.SolrCore.closeSearcher [collection1] Closing main
searcher on request.
[junit4:junit4]   2> 27775 T1745 oasu.DirectUpdateHandler2.close closing DirectUpdateHandler2{commits=2,autocommits=0,soft
autocommits=0,optimizes=0,rollbacks=0,expungeDeletes=0,docsPending=0,adds=0,deletesById=0,deletesByQuery=0,errors=0,cumulative_adds=1,cumulative_deletesById=0,cumulative_deletesByQuery=0,cumulative_errors=0}
[junit4:junit4]   2> 27775 T1745 oejsh.ContextHandler.doStop stopped o.e.j.s.ServletContextHandler{/solr,null}
[junit4:junit4]   2> 27832 T1745 oas.SolrTestCaseJ4.deleteCore ###deleteCore
[junit4:junit4]   2> 30609 T1947 oash.SnapPuller.fetchLatestIndex SEVERE Master at: http://localhost:50296/solr
is not available. Index fetch failed. Exception: org.apache.solr.client.solrj.SolrServerException:
IOException occured when talking to server at: http://localhost:50296/solr
[junit4:junit4]   2> 30609 T1947 oash.SnapPuller.logReplicationTimeAndConfFiles WARNING
Exception while updating statistics java.io.FileNotFoundException: ./org.apache.solr.handler.TestReplicationHandler$SolrInstance-1344714109555/slave/collection1/data/replication.properties
(No such file or directory)
[junit4:junit4]   2> 	at java.io.FileOutputStream.open(Native Method)
[junit4:junit4]   2> 	at java.io.FileOutputStream.<init>(FileOutputStream.java:209)
[junit4:junit4]   2> 	at java.io.FileOutputStream.<init>(FileOutputStream.java:160)
[junit4:junit4]   2> 	at org.apache.solr.handler.SnapPuller.logReplicationTimeAndConfFiles(SnapPuller.java:481)
[junit4:junit4]   2> 	at org.apache.solr.handler.SnapPuller.fetchLatestIndex(SnapPuller.java:407)
[junit4:junit4]   2> 	at org.apache.solr.handler.ReplicationHandler.doFetch(ReplicationHandler.java:297)
[junit4:junit4]   2> 	at org.apache.solr.handler.SnapPuller$1.run(SnapPuller.java:175)
[junit4:junit4]   2> 	at java.util.concurrent.Executors$RunnableAdapter.call(Executors.java:471)
[junit4:junit4]   2> 	at java.util.concurrent.FutureTask$Sync.innerRunAndReset(FutureTask.java:351)
[junit4:junit4]   2> 	at java.util.concurrent.FutureTask.runAndReset(FutureTask.java:178)
[junit4:junit4]   2> 	at java.util.concurrent.ScheduledThreadPoolExecutor$ScheduledFutureTask.access$201(ScheduledThreadPoolExecutor.java:165)
[junit4:junit4]   2> 	at java.util.concurrent.ScheduledThreadPoolExecutor$ScheduledFutureTask.run(ScheduledThreadPoolExecutor.java:267)
[junit4:junit4]   2> 	at java.util.concurrent.ThreadPoolExecutor.runWorker(ThreadPoolExecutor.java:1110)
[junit4:junit4]   2> 	at java.util.concurrent.ThreadPoolExecutor$Worker.run(ThreadPoolExecutor.java:603)
[junit4:junit4]   2> 	at java.lang.Thread.run(Thread.java:679)
[junit4:junit4]   2> 
[junit4:junit4]   2> 148954 T1745 oas.SolrTestCaseJ4.endTrackingSearchers SEVERE ERROR:
SolrIndexSearcher opens=76 closes=75
[junit4:junit4]   2> NOTE: test params are: codec=SimpleText, sim=RandomSimilarityProvider(queryNorm=true,coord=yes):
{}, locale=ar_OM, timezone=America/Belem
[junit4:junit4]   2> NOTE: FreeBSD 9.0-RELEASE amd64/Sun Microsystems Inc. 1.6.0_32 (64-bit)/cpus=16,threads=1,free=109584608,total=238551040
[junit4:junit4]   2> NOTE: All tests run in this JVM: [LeaderElectionTest, TestSolrDeletionPolicy2,
TestLRUCache, TestMultiCoreConfBootstrap, TestSolrDeletionPolicy1, PrimitiveFieldTypeTest,
HighlighterTest, RequiredFieldsTest, PeerSyncTest, TestStressReorder, IndexSchemaTest, ScriptEngineTest,
IndexReaderFactoryTest, TestFoldingMultitermQuery, TestPluginEnable, TestBM25SimilarityFactory,
QueryEqualityTest, TestRealTimeGet, TestMergePolicyConfig, ShowFileRequestHandlerTest, URLClassifyProcessorTest,
OpenExchangeRatesOrgProviderTest, SpellingQueryConverterTest, TestQueryUtils, OutputWriterTest,
TestReversedWildcardFilterFactory, TestSort, TestStressLucene, DebugComponentTest, SolrIndexConfigTest,
FieldMutatingUpdateProcessorTest, ConvertedLegacyTest, BadIndexSchemaTest, TestValueSourceCache,
RecoveryZkTest, TestOmitPositions, OverseerTest, PrimUtilsTest, TestDocSet, BasicZkTest, TestWriterPerf,
TestFunctionQuery, SuggesterTest, BasicFunctionalityTest, TestCharFilters, TestCodecSupport,
TestCSVLoader, TestArbitraryIndexDir, StatsComponentTest, RAMDirectoryFactoryTest, TestBinaryField,
QueryParsingTest, UUIDFieldTest, TestRecovery, SpellCheckComponentTest, FullSolrCloudDistribCmdsTest,
TestReplicationHandler]
[junit4:junit4]   2> NOTE: download the large Jenkins line-docs file by running 'ant get-jenkins-line-docs'
in the lucene directory.
[junit4:junit4]   2> NOTE: reproduce with: ant test  -Dtestcase=TestReplicationHandler
-Dtests.seed=13E99180E433CDC8 -Dtests.multiplier=3 -Dtests.nightly=true -Dtests.slow=true
-Dtests.linedocsfile=/home/hudson/lucene-data/enwiki.random.lines.txt -Dtests.locale=ar_OM
-Dtests.timezone=America/Belem -Dtests.file.encoding=UTF-8
[junit4:junit4]   2> 
[junit4:junit4] ERROR   0.00s J1 | TestReplicationHandler (suite)
[junit4:junit4]    > Throwable #1: java.lang.AssertionError: ERROR: SolrIndexSearcher opens=76
closes=75
[junit4:junit4]    > 	at __randomizedtesting.SeedInfo.seed([13E99180E433CDC8]:0)
[junit4:junit4]    > 	at org.junit.Assert.fail(Assert.java:93)
[junit4:junit4]    > 	at org.apache.solr.SolrTestCaseJ4.endTrackingSearchers(SolrTestCaseJ4.java:216)
[junit4:junit4]    > 	at org.apache.solr.SolrTestCaseJ4.afterClass(SolrTestCaseJ4.java:82)
[junit4:junit4]    > 	at sun.reflect.GeneratedMethodAccessor17.invoke(Unknown Source)
[junit4:junit4]    > 	at sun.reflect.DelegatingMethodAccessorImpl.invoke(DelegatingMethodAccessorImpl.java:43)
[junit4:junit4]    > 	at java.lang.reflect.Method.invoke(Method.java:616)
[junit4:junit4]    > 	at com.carrotsearch.randomizedtesting.RandomizedRunner.invoke(RandomizedRunner.java:1995)
[junit4:junit4]    > 	at com.carrotsearch.randomizedtesting.RandomizedRunner.access$1100(RandomizedRunner.java:132)
[junit4:junit4]    > 	at com.carrotsearch.randomizedtesting.RandomizedRunner$5.evaluate(RandomizedRunner.java:754)
[junit4:junit4]    > 	at com.carrotsearch.randomizedtesting.rules.SystemPropertiesRestoreRule$1.evaluate(SystemPropertiesRestoreRule.java:53)
[junit4:junit4]    > 	at org.apache.lucene.util.AbstractBeforeAfterRule$1.evaluate(AbstractBeforeAfterRule.java:45)
[junit4:junit4]    > 	at org.apache.lucene.util.TestRuleReportUncaughtExceptions$1.evaluate(TestRuleReportUncaughtExceptions.java:68)
[junit4:junit4]    > 	at org.apache.lucene.util.TestRuleStoreClassName$1.evaluate(TestRuleStoreClassName.java:38)
[junit4:junit4]    > 	at com.carrotsearch.randomizedtesting.rules.SystemPropertiesInvariantRule$1.evaluate(SystemPropertiesInvariantRule.java:55)
[junit4:junit4]    > 	at org.apache.lucene.util.TestRuleNoInstanceHooksOverrides$1.evaluate(TestRuleNoInstanceHooksOverrides.java:53)
[junit4:junit4]    > 	at org.apache.lucene.util.TestRuleNoStaticHooksShadowing$1.evaluate(TestRuleNoStaticHooksShadowing.java:52)
[junit4:junit4]    > 	at org.apache.lucene.util.TestRuleAssertionsRequired$1.evaluate(TestRuleAssertionsRequired.java:36)
[junit4:junit4]    > 	at org.apache.lucene.util.TestRuleMarkFailure$1.evaluate(TestRuleMarkFailure.java:48)
[junit4:junit4]    > 	at org.apache.lucene.util.TestRuleIgnoreAfterMaxFailures$1.evaluate(TestRuleIgnoreAfterMaxFailures.java:70)
[junit4:junit4]    > 	at org.apache.lucene.util.TestRuleIgnoreTestSuites$1.evaluate(TestRuleIgnoreTestSuites.java:55)
[junit4:junit4]    > 	at com.carrotsearch.randomizedtesting.RandomizedRunner.runSuite(RandomizedRunner.java:605)
[junit4:junit4]    > 	at com.carrotsearch.randomizedtesting.RandomizedRunner.access$400(RandomizedRunner.java:132)
[junit4:junit4]    > 	at com.carrotsearch.randomizedtesting.RandomizedRunner$2.run(RandomizedRunner.java:551)
[junit4:junit4]    >
[junit4:junit4] Completed on J1 in 148.98s, 1 test, 1 failure <<< FAILURES!

[...truncated 472 lines...]
BUILD FAILED
/usr/home/hudson/hudson-slave/workspace/Lucene-Solr-tests-only-4.x-nightly/build.xml:29: The
following error occurred while executing this line:
/usr/home/hudson/hudson-slave/workspace/Lucene-Solr-tests-only-4.x-nightly/solr/build.xml:144:
The following error occurred while executing this line:
/usr/home/hudson/hudson-slave/workspace/Lucene-Solr-tests-only-4.x-nightly/lucene/module-build.xml:62:
The following error occurred while executing this line:
/usr/home/hudson/hudson-slave/workspace/Lucene-Solr-tests-only-4.x-nightly/lucene/common-build.xml:1095:
The following error occurred while executing this line:
/usr/home/hudson/hudson-slave/workspace/Lucene-Solr-tests-only-4.x-nightly/lucene/common-build.xml:790:
There were test failures: 225 suites, 905 tests, 1 suite-level error, 6 ignored (1 assumption)

Total time: 107 minutes 4 seconds
Build step 'Invoke Ant' marked build as failure
Recording test results
Email was triggered for: Failure
Sending email for trigger: Failure



Mime
View raw message