lucene-dev mailing list archives

Site index · List index
Message view « Date » · « Thread »
Top « Date » · « Thread »
From Policeman Jenkins Server <jenk...@sd-datasolutions.de>
Subject [JENKINS] Lucene-Solr-trunk-Linux (64bit/jdk1.8.0-ea-b49) - Build # 203 - Failure!
Date Sun, 05 Aug 2012 21:17:14 GMT
Build: http://jenkins.sd-datasolutions.de/job/Lucene-Solr-trunk-Linux/203/
Java: 64bit/jdk1.8.0-ea-b49 -XX:+UseConcMarkSweepGC

1 tests failed.
REGRESSION:  org.apache.solr.handler.component.DistributedQueryElevationComponentTest.testDistribSearch

Error Message:
.responseHeader.params.qt:/elevate!=false

Stack Trace:
junit.framework.AssertionFailedError: .responseHeader.params.qt:/elevate!=false
	at __randomizedtesting.SeedInfo.seed([105EC6E8761EF9A8:91B848F001419994]:0)
	at junit.framework.Assert.fail(Assert.java:50)
	at org.apache.solr.BaseDistributedSearchTestCase.compareResponses(BaseDistributedSearchTestCase.java:670)
	at org.apache.solr.BaseDistributedSearchTestCase.query(BaseDistributedSearchTestCase.java:392)
	at org.apache.solr.handler.component.DistributedQueryElevationComponentTest.doTest(DistributedQueryElevationComponentTest.java:81)
	at org.apache.solr.BaseDistributedSearchTestCase.testDistribSearch(BaseDistributedSearchTestCase.java:679)
	at sun.reflect.NativeMethodAccessorImpl.invoke0(Native Method)
	at sun.reflect.NativeMethodAccessorImpl.invoke(NativeMethodAccessorImpl.java:57)
	at sun.reflect.DelegatingMethodAccessorImpl.invoke(DelegatingMethodAccessorImpl.java:43)
	at java.lang.reflect.Method.invoke(Method.java:474)
	at com.carrotsearch.randomizedtesting.RandomizedRunner.invoke(RandomizedRunner.java:1995)
	at com.carrotsearch.randomizedtesting.RandomizedRunner.access$1100(RandomizedRunner.java:132)
	at com.carrotsearch.randomizedtesting.RandomizedRunner$6.evaluate(RandomizedRunner.java:818)
	at com.carrotsearch.randomizedtesting.RandomizedRunner$7.evaluate(RandomizedRunner.java:877)
	at com.carrotsearch.randomizedtesting.RandomizedRunner$8.evaluate(RandomizedRunner.java:891)
	at com.carrotsearch.randomizedtesting.rules.SystemPropertiesRestoreRule$1.evaluate(SystemPropertiesRestoreRule.java:53)
	at org.apache.lucene.util.TestRuleSetupTeardownChained$1.evaluate(TestRuleSetupTeardownChained.java:50)
	at org.apache.lucene.util.TestRuleFieldCacheSanity$1.evaluate(TestRuleFieldCacheSanity.java:32)
	at org.apache.lucene.util.AbstractBeforeAfterRule$1.evaluate(AbstractBeforeAfterRule.java:45)
	at com.carrotsearch.randomizedtesting.rules.SystemPropertiesInvariantRule$1.evaluate(SystemPropertiesInvariantRule.java:55)
	at org.apache.lucene.util.TestRuleReportUncaughtExceptions$1.evaluate(TestRuleReportUncaughtExceptions.java:68)
	at org.apache.lucene.util.TestRuleThreadAndTestName$1.evaluate(TestRuleThreadAndTestName.java:48)
	at org.apache.lucene.util.TestRuleIgnoreAfterMaxFailures$1.evaluate(TestRuleIgnoreAfterMaxFailures.java:70)
	at org.apache.lucene.util.TestRuleMarkFailure$1.evaluate(TestRuleMarkFailure.java:48)
	at com.carrotsearch.randomizedtesting.RandomizedRunner.runSingleTest(RandomizedRunner.java:825)
	at com.carrotsearch.randomizedtesting.RandomizedRunner.access$700(RandomizedRunner.java:132)
	at com.carrotsearch.randomizedtesting.RandomizedRunner$3$1.run(RandomizedRunner.java:671)
	at com.carrotsearch.randomizedtesting.RandomizedRunner$3.evaluate(RandomizedRunner.java:697)
	at com.carrotsearch.randomizedtesting.RandomizedRunner$4.evaluate(RandomizedRunner.java:736)
	at com.carrotsearch.randomizedtesting.RandomizedRunner$5.evaluate(RandomizedRunner.java:747)
	at com.carrotsearch.randomizedtesting.rules.SystemPropertiesRestoreRule$1.evaluate(SystemPropertiesRestoreRule.java:53)
	at org.apache.lucene.util.AbstractBeforeAfterRule$1.evaluate(AbstractBeforeAfterRule.java:45)
	at org.apache.lucene.util.TestRuleReportUncaughtExceptions$1.evaluate(TestRuleReportUncaughtExceptions.java:68)
	at org.apache.lucene.util.TestRuleStoreClassName$1.evaluate(TestRuleStoreClassName.java:38)
	at com.carrotsearch.randomizedtesting.rules.SystemPropertiesInvariantRule$1.evaluate(SystemPropertiesInvariantRule.java:55)
	at org.apache.lucene.util.TestRuleNoInstanceHooksOverrides$1.evaluate(TestRuleNoInstanceHooksOverrides.java:53)
	at org.apache.lucene.util.TestRuleNoStaticHooksShadowing$1.evaluate(TestRuleNoStaticHooksShadowing.java:52)
	at org.apache.lucene.util.TestRuleAssertionsRequired$1.evaluate(TestRuleAssertionsRequired.java:36)
	at org.apache.lucene.util.TestRuleMarkFailure$1.evaluate(TestRuleMarkFailure.java:48)
	at org.apache.lucene.util.TestRuleIgnoreAfterMaxFailures$1.evaluate(TestRuleIgnoreAfterMaxFailures.java:70)
	at org.apache.lucene.util.TestRuleIgnoreTestSuites$1.evaluate(TestRuleIgnoreTestSuites.java:55)
	at com.carrotsearch.randomizedtesting.RandomizedRunner.runSuite(RandomizedRunner.java:605)
	at com.carrotsearch.randomizedtesting.RandomizedRunner.access$400(RandomizedRunner.java:132)
	at com.carrotsearch.randomizedtesting.RandomizedRunner$2.run(RandomizedRunner.java:551)




Build Log:
[...truncated 7527 lines...]
[junit4:junit4] Suite: org.apache.solr.handler.component.DistributedQueryElevationComponentTest
[junit4:junit4] FAILURE 1.39s J0 | DistributedQueryElevationComponentTest.testDistribSearch
[junit4:junit4]    > Throwable #1: junit.framework.AssertionFailedError: .responseHeader.params.qt:/elevate!=false
[junit4:junit4]    > 	at __randomizedtesting.SeedInfo.seed([105EC6E8761EF9A8:91B848F001419994]:0)
[junit4:junit4]    > 	at junit.framework.Assert.fail(Assert.java:50)
[junit4:junit4]    > 	at org.apache.solr.BaseDistributedSearchTestCase.compareResponses(BaseDistributedSearchTestCase.java:670)
[junit4:junit4]    > 	at org.apache.solr.BaseDistributedSearchTestCase.query(BaseDistributedSearchTestCase.java:392)
[junit4:junit4]    > 	at org.apache.solr.handler.component.DistributedQueryElevationComponentTest.doTest(DistributedQueryElevationComponentTest.java:81)
[junit4:junit4]    > 	at org.apache.solr.BaseDistributedSearchTestCase.testDistribSearch(BaseDistributedSearchTestCase.java:679)
[junit4:junit4]    > 	at sun.reflect.NativeMethodAccessorImpl.invoke0(Native Method)
[junit4:junit4]    > 	at sun.reflect.NativeMethodAccessorImpl.invoke(NativeMethodAccessorImpl.java:57)
[junit4:junit4]    > 	at sun.reflect.DelegatingMethodAccessorImpl.invoke(DelegatingMethodAccessorImpl.java:43)
[junit4:junit4]    > 	at java.lang.reflect.Method.invoke(Method.java:474)
[junit4:junit4]    > 	at com.carrotsearch.randomizedtesting.RandomizedRunner.invoke(RandomizedRunner.java:1995)
[junit4:junit4]    > 	at com.carrotsearch.randomizedtesting.RandomizedRunner.access$1100(RandomizedRunner.java:132)
[junit4:junit4]    > 	at com.carrotsearch.randomizedtesting.RandomizedRunner$6.evaluate(RandomizedRunner.java:818)
[junit4:junit4]    > 	at com.carrotsearch.randomizedtesting.RandomizedRunner$7.evaluate(RandomizedRunner.java:877)
[junit4:junit4]    > 	at com.carrotsearch.randomizedtesting.RandomizedRunner$8.evaluate(RandomizedRunner.java:891)
[junit4:junit4]    > 	at com.carrotsearch.randomizedtesting.rules.SystemPropertiesRestoreRule$1.evaluate(SystemPropertiesRestoreRule.java:53)
[junit4:junit4]    > 	at org.apache.lucene.util.TestRuleSetupTeardownChained$1.evaluate(TestRuleSetupTeardownChained.java:50)
[junit4:junit4]    > 	at org.apache.lucene.util.TestRuleFieldCacheSanity$1.evaluate(TestRuleFieldCacheSanity.java:32)
[junit4:junit4]    > 	at org.apache.lucene.util.AbstractBeforeAfterRule$1.evaluate(AbstractBeforeAfterRule.java:45)
[junit4:junit4]    > 	at com.carrotsearch.randomizedtesting.rules.SystemPropertiesInvariantRule$1.evaluate(SystemPropertiesInvariantRule.java:55)
[junit4:junit4]    > 	at org.apache.lucene.util.TestRuleReportUncaughtExceptions$1.evaluate(TestRuleReportUncaughtExceptions.java:68)
[junit4:junit4]    > 	at org.apache.lucene.util.TestRuleThreadAndTestName$1.evaluate(TestRuleThreadAndTestName.java:48)
[junit4:junit4]    > 	at org.apache.lucene.util.TestRuleIgnoreAfterMaxFailures$1.evaluate(TestRuleIgnoreAfterMaxFailures.java:70)
[junit4:junit4]    > 	at org.apache.lucene.util.TestRuleMarkFailure$1.evaluate(TestRuleMarkFailure.java:48)
[junit4:junit4]    > 	at com.carrotsearch.randomizedtesting.RandomizedRunner.runSingleTest(RandomizedRunner.java:825)
[junit4:junit4]    > 	at com.carrotsearch.randomizedtesting.RandomizedRunner.access$700(RandomizedRunner.java:132)
[junit4:junit4]    > 	at com.carrotsearch.randomizedtesting.RandomizedRunner$3$1.run(RandomizedRunner.java:671)
[junit4:junit4]    > 	at com.carrotsearch.randomizedtesting.RandomizedRunner$3.evaluate(RandomizedRunner.java:697)
[junit4:junit4]    > 	at com.carrotsearch.randomizedtesting.RandomizedRunner$4.evaluate(RandomizedRunner.java:736)
[junit4:junit4]    > 	at com.carrotsearch.randomizedtesting.RandomizedRunner$5.evaluate(RandomizedRunner.java:747)
[junit4:junit4]    > 	at com.carrotsearch.randomizedtesting.rules.SystemPropertiesRestoreRule$1.evaluate(SystemPropertiesRestoreRule.java:53)
[junit4:junit4]    > 	at org.apache.lucene.util.AbstractBeforeAfterRule$1.evaluate(AbstractBeforeAfterRule.java:45)
[junit4:junit4]    > 	at org.apache.lucene.util.TestRuleReportUncaughtExceptions$1.evaluate(TestRuleReportUncaughtExceptions.java:68)
[junit4:junit4]    > 	at org.apache.lucene.util.TestRuleStoreClassName$1.evaluate(TestRuleStoreClassName.java:38)
[junit4:junit4]    > 	at com.carrotsearch.randomizedtesting.rules.SystemPropertiesInvariantRule$1.evaluate(SystemPropertiesInvariantRule.java:55)
[junit4:junit4]    > 	at org.apache.lucene.util.TestRuleNoInstanceHooksOverrides$1.evaluate(TestRuleNoInstanceHooksOverrides.java:53)
[junit4:junit4]    > 	at org.apache.lucene.util.TestRuleNoStaticHooksShadowing$1.evaluate(TestRuleNoStaticHooksShadowing.java:52)
[junit4:junit4]    > 	at org.apache.lucene.util.TestRuleAssertionsRequired$1.evaluate(TestRuleAssertionsRequired.java:36)
[junit4:junit4]    > 	at org.apache.lucene.util.TestRuleMarkFailure$1.evaluate(TestRuleMarkFailure.java:48)
[junit4:junit4]    > 	at org.apache.lucene.util.TestRuleIgnoreAfterMaxFailures$1.evaluate(TestRuleIgnoreAfterMaxFailures.java:70)
[junit4:junit4]    > 	at org.apache.lucene.util.TestRuleIgnoreTestSuites$1.evaluate(TestRuleIgnoreTestSuites.java:55)
[junit4:junit4]    > 	at com.carrotsearch.randomizedtesting.RandomizedRunner.runSuite(RandomizedRunner.java:605)
[junit4:junit4]    > 	at com.carrotsearch.randomizedtesting.RandomizedRunner.access$400(RandomizedRunner.java:132)
[junit4:junit4]    > 	at com.carrotsearch.randomizedtesting.RandomizedRunner$2.run(RandomizedRunner.java:551)
[junit4:junit4]    > 
[junit4:junit4]   2> 2 T1727 oas.SolrTestCaseJ4.setUp ###Starting testDistribSearch
[junit4:junit4]   2> 2 T1727 oejs.Server.doStart jetty-8.1.2.v20120308
[junit4:junit4]   2> 4 T1727 oejs.AbstractConnector.doStart Started SocketConnector@0.0.0.0:47339
[junit4:junit4]   2> 5 T1727 oasc.SolrResourceLoader.locateSolrHome JNDI not configured for solr (NoInitialContextEx)
[junit4:junit4]   2> 5 T1727 oasc.SolrResourceLoader.locateSolrHome using system property solr.solr.home: /mnt/ssd/jenkins/workspace/Lucene-Solr-trunk-Linux/checkout/solr/build/solr-core/test-files/solr
[junit4:junit4]   2> 5 T1727 oasc.SolrResourceLoader.<init> new SolrResourceLoader for deduced Solr Home: '/mnt/ssd/jenkins/workspace/Lucene-Solr-trunk-Linux/checkout/solr/build/solr-core/test-files/solr/'
[junit4:junit4]   2> 13 T1727 oass.SolrDispatchFilter.init SolrDispatchFilter.init()
[junit4:junit4]   2> 14 T1727 oasc.SolrResourceLoader.locateSolrHome JNDI not configured for solr (NoInitialContextEx)
[junit4:junit4]   2> 14 T1727 oasc.SolrResourceLoader.locateSolrHome using system property solr.solr.home: /mnt/ssd/jenkins/workspace/Lucene-Solr-trunk-Linux/checkout/solr/build/solr-core/test-files/solr
[junit4:junit4]   2> 14 T1727 oasc.CoreContainer$Initializer.initialize looking for solr.xml: /mnt/ssd/jenkins/workspace/Lucene-Solr-trunk-Linux/checkout/solr/build/solr-core/test-files/solr/solr.xml
[junit4:junit4]   2> 15 T1727 oasc.CoreContainer.<init> New CoreContainer 507741047
[junit4:junit4]   2> 15 T1727 oasc.CoreContainer.load Loading CoreContainer using Solr Home: '/mnt/ssd/jenkins/workspace/Lucene-Solr-trunk-Linux/checkout/solr/build/solr-core/test-files/solr/'
[junit4:junit4]   2> 15 T1727 oasc.SolrResourceLoader.<init> new SolrResourceLoader for directory: '/mnt/ssd/jenkins/workspace/Lucene-Solr-trunk-Linux/checkout/solr/build/solr-core/test-files/solr/'
[junit4:junit4]   2> 24 T1727 oasc.CoreContainer.load Registering Log Listener
[junit4:junit4]   2> 32 T1727 oasc.CoreContainer.create Creating SolrCore 'collection1' using instanceDir: /mnt/ssd/jenkins/workspace/Lucene-Solr-trunk-Linux/checkout/solr/build/solr-core/test-files/solr/collection1
[junit4:junit4]   2> 32 T1727 oasc.SolrResourceLoader.<init> new SolrResourceLoader for directory: '/mnt/ssd/jenkins/workspace/Lucene-Solr-trunk-Linux/checkout/solr/build/solr-core/test-files/solr/collection1/'
[junit4:junit4]   2> 32 T1727 oasc.SolrResourceLoader.replaceClassLoader Adding 'file:/mnt/ssd/jenkins/workspace/Lucene-Solr-trunk-Linux/checkout/solr/build/solr-core/test-files/solr/collection1/lib/README' to classloader
[junit4:junit4]   2> 33 T1727 oasc.SolrResourceLoader.replaceClassLoader Adding 'file:/mnt/ssd/jenkins/workspace/Lucene-Solr-trunk-Linux/checkout/solr/build/solr-core/test-files/solr/collection1/lib/classes/' to classloader
[junit4:junit4]   2> 48 T1727 oasc.SolrConfig.<init> Using Lucene MatchVersion: LUCENE_50
[junit4:junit4]   2> 71 T1727 oasc.SolrConfig.<init> Loaded SolrConfig: solrconfig-elevate.xml
[junit4:junit4]   2> 71 T1727 oass.IndexSchema.readSchema Reading Solr Schema
[junit4:junit4]   2> 73 T1727 oass.IndexSchema.readSchema Schema name=example
[junit4:junit4]   2> 182 T1727 oass.IndexSchema.readSchema default search field in schema is text
[junit4:junit4]   2> 185 T1727 oass.IndexSchema.readSchema unique key field: id
[junit4:junit4]   2> 187 T1727 oasc.SolrCore.<init> [collection1] Opening new SolrCore at /mnt/ssd/jenkins/workspace/Lucene-Solr-trunk-Linux/checkout/solr/build/solr-core/test-files/solr/collection1/, dataDir=./org.apache.solr.handler.component.DistributedQueryElevationComponentTest-1344201376772/control/data/
[junit4:junit4]   2> 187 T1727 oasc.JmxMonitoredMap.<init> JMX monitoring is enabled. Adding Solr mbeans to JMX Server: com.sun.jmx.mbeanserver.JmxMBeanServer@6d980f5d
[junit4:junit4]   2> 188 T1727 oasc.SolrCore.getNewIndexDir WARNING New index directory detected: old=null new=./org.apache.solr.handler.component.DistributedQueryElevationComponentTest-1344201376772/control/data/index/
[junit4:junit4]   2> 188 T1727 oasc.SolrCore.initIndex WARNING [collection1] Solr index directory './org.apache.solr.handler.component.DistributedQueryElevationComponentTest-1344201376772/control/data/index' doesn't exist. Creating new index...
[junit4:junit4]   2> 190 T1727 oasc.SolrDeletionPolicy.onCommit SolrDeletionPolicy.onCommit: commits:num=1
[junit4:junit4]   2> 		commit{dir=MockDirWrapper(org.apache.lucene.store.NIOFSDirectory@/mnt/ssd/jenkins/workspace/Lucene-Solr-trunk-Linux/checkout/solr/build/solr-core/test/J0/index5405454061tmp lockFactory=org.apache.lucene.store.SingleInstanceLockFactory@71509316),segFN=segments_1,generation=1,filenames=[segments_1]
[junit4:junit4]   2> 191 T1727 oasc.SolrDeletionPolicy.updateCommits newest commit = 1
[junit4:junit4]   2> 192 T1727 oasc.RequestHandlers.initHandlersFromConfig created /update: solr.UpdateRequestHandler
[junit4:junit4]   2> 192 T1727 oasc.RequestHandlers.initHandlersFromConfig created /elevate: org.apache.solr.handler.component.SearchHandler
[junit4:junit4]   2> 192 T1727 oasc.RequestHandlers.initHandlersFromConfig created /dataElevate: org.apache.solr.handler.component.SearchHandler
[junit4:junit4]   2> 193 T1727 oashl.XMLLoader.init xsltCacheLifetimeSeconds=60
[junit4:junit4]   2> 193 T1727 oasc.RequestHandlers.initHandlersFromConfig WARNING no default request handler is registered (either '/select' or 'standard')
[junit4:junit4]   2> 195 T1727 oasc.SolrCore.initDeprecatedSupport WARNING solrconfig.xml uses deprecated <admin/gettableFiles>, Please update your config to use the ShowFileRequestHandler.
[junit4:junit4]   2> 196 T1727 oasc.SolrCore.initDeprecatedSupport WARNING adding ShowFileRequestHandler with hidden files: [SCHEMA.XML, MISSING.FUNCTIONS.UPDATEPROCESSOR.JS, SOLRCONFIG-SPELLCHECKER.XML, SOLRCONFIG-SCRIPT-UPDATEPROCESSOR.XML, BAD-SCHEMA-EXTERNAL-FILEFIELD.XML, BAD-SCHEMA-UNIQUEKEY-IS-COPYFIELD-DEST.XML, MAPPING-ISOLATIN1ACCENT.TXT, BAD-SCHEMA-NOT-INDEXED-BUT-POS.XML, HUNSPELL-TEST.DIC, SCHEMA-LMDIRICHLET.XML, SOLRCONFIG-ALTDIRECTORY.XML, BAD-SOLRCONFIG-INVALID-SCRIPTFILE.XML, STEMDICT.TXT, FRENCHARTICLES.TXT, SCHEMA-CHARFILTERS.XML, SCHEMA-COPYFIELD-TEST.XML, STOPWORDS.TXT, DA_COMPOUNDDICTIONARY.TXT, SCHEMA-DFR.XML, BAD-SCHEMA-SIM-GLOBAL-VS-FT-MISMATCH.XML, BAD-SCHEMA-DUP-DYNAMICFIELD.XML, THROW.ERROR.ON.ADD.UPDATEPROCESSOR.JS, SOLRCONFIG-BASIC.XML, ELEVATE.XML, SOLRCONFIG-NATIVELOCK.XML, BAD-SCHEMA-UNIQUEKEY-USES-DEFAULT.XML, SOLRCONFIG-SOLCOREPROPERTIES.XML, SOLRCONFIG-SLAVE1.XML, SOLRCONFIG-XINCLUDE.XML, SCHEMA-REVERSED.XML, SOLRCONFIG-TRANSFORMERS.XML, STOPWITHBOM.TXT, PHRASESUGGEST.TXT, SOLRCONFIG-MERGEPOLICY.XML, SOLRCONFIG-DELPOLICY1.XML, BAD_SOLRCONFIG.XML, BAD-SCHEMA-NOT-INDEXED-BUT-NORMS.XML, SCHEMASURROUND.XML, SCHEMA-TFIDF.XML, HUNSPELL-TEST.AFF, SCHEMA-REPLICATION2.XML, BAD-MP-SOLRCONFIG.XML, SCHEMA-IB.XML, BAD-SOLRCONFIG-BOGUS-SCRIPTENGINE-NAME.XML, STOPTYPES-2.TXT, SCHEMA-PHRASESUGGEST.XML, TRIVIAL.UPDATEPROCESSOR1.JS, SOLRCONFIG-MASTER1.XML, BAD-SCHEMA-DUP-FIELD.XML, MISSLEADING.EXTENSION.UPDATEPROCESSOR.JS.TXT, SOLRCONFIG-MASTER.XML, SCHEMA_CODEC.XML, DA_UTF8.XML, SOLRCONFIG-QUERYSENDER.XML, SCHEMA-TRIE.XML, SOLRCONFIG-QUERYSENDER-NOQUERY.XML, SCHEMA-MINIMAL.XML, WDFTYPES.TXT, STOPWORDSWRONGENCODING.TXT, BAD-SCHEMA-DUP-FIELDTYPE.XML, SCHEMA-FOLDING.XML, SOLRCONFIG-ENABLEPLUGIN.XML, SOLRCONFIG-PROPINJECT-INDEXDEFAULT.XML, SCHEMA-BM25.XML, HYPHENATION.DTD, COMPOUNDDICTIONARY.TXT, ADDFIELDS.UPDATEPROCESSOR.JS, SCHEMA-COLLATE.XML, SOLRCONFIG_CODEC.XML, BAD-SCHEMA-NOT-INDEXED-BUT-TF.XML, SOLRCONFIG-ELEVATE.XML, SOLRCONFIG-REPEATER.XML, STOP-2.TXT, SCHEMA15.XML, SOLRCONFIG-REQHANDLER.INCL, STOPTYPES-1.TXT, SOLRCONFIG-CACHING.XML, SCHEMA-REQUIRED-FIELDS.XML, BAD-SCHEMA-UNIQUEKEY-MULTIVALUED.XML, SOLRCONFIG-MASTER2.XML, SCHEMA-LMJELINEKMERCER.XML, SOLRCONFIG-LAZYWRITER.XML, OPEN-EXCHANGE-RATES.JSON, SCHEMA-LUCENEMATCHVERSION.XML, BAD-SOLRCONFIG-MISSING-SCRIPTFILE.XML, SOLRCONFIG-FUNCTIONQUERY.XML, SOLRCONFIG-TLOG.XML, STOP-SNOWBALL.TXT, SOLRCONFIG-MASTER3.XML, SOLRCONFIG-NOCACHE.XML, BAD-SCHEMA-CODEC-GLOBAL-VS-FT-MISMATCH.XML, SCHEMA11.XML, CONDITIONAL.UPDATEPROCESSOR.JS, KEEP-1.TXT, TRIVIAL.UPDATEPROCESSOR0.JS, STOP-1.TXT, SCHEMA-SPELLCHECKER.XML, SOLRCONFIG-TERMINDEX.XML, SCHEMA12.XML, CURRENCY.XML, SOLRCONFIG-SPELLCHECKCOMPONENT.XML, SCHEMA-REPLICATION1.XML, SOLRCONFIG-SIMPLELOCK.XML, SOLRCONFIG_PERF.XML, XSLT, SOLRCONFIG-PROPINJECT.XML, SOLRCONFIG-HIGHLIGHT.XML, BAD-SCHEMA-ANALYZER-CLASS-AND-NESTED.XML, BAD-SCHEMA-NONTEXT-ANALYZER.XML, SCHEMA-SIM.XML, SOLRCONFIG-MASTER1-KEEPONEBACKUP.XML, KEEP-2.TXT, SYNONYMS.TXT, SCHEMA-BINARYFIELD.XML, PROTWORDS.TXT, OLD_SYNONYMS.TXT, SOLRCONFIG-PHRASESUGGEST.XML, SOLRCONFIG-DELPOLICY2.XML, SOLRCONFIG-UPDATE-PROCESSOR-CHAINS.XML, SCHEMA-STOP-KEEP.XML, SOLRCONFIG-SOLR-749.XML, BAD-SCHEMA-OMIT-TF-BUT-NOT-POS.XML, SOLRCONFIG-SLAVE.XML, SCHEMA-NUMERIC.XML, SCHEMA-NOT-REQUIRED-UNIQUE-KEY.XML]
[junit4:junit4]   2> 198 T1727 oass.SolrIndexSearcher.<init> Opening Searcher@60288ea8 main
[junit4:junit4]   2> 198 T1727 oass.SolrIndexSearcher.getIndexDir WARNING WARNING: Directory impl does not support setting indexDir: org.apache.lucene.store.MockDirectoryWrapper
[junit4:junit4]   2> 199 T1727 oasu.CommitTracker.<init> Hard AutoCommit: disabled
[junit4:junit4]   2> 199 T1727 oasu.CommitTracker.<init> Soft AutoCommit: disabled
[junit4:junit4]   2> 199 T1727 oashc.QueryElevationComponent.inform Loading QueryElevation from: /mnt/ssd/jenkins/workspace/Lucene-Solr-trunk-Linux/checkout/solr/build/solr-core/test-files/solr/collection1/conf/elevate.xml
[junit4:junit4]   2> 208 T1727 oashc.QueryElevationComponent.inform Loading QueryElevation from: /mnt/ssd/jenkins/workspace/Lucene-Solr-trunk-Linux/checkout/solr/build/solr-core/test-files/solr/collection1/conf/elevate.xml
[junit4:junit4]   2> 215 T1727 oashc.HttpShardHandlerFactory.getParameter Setting socketTimeout to: 0
[junit4:junit4]   2> 216 T1727 oashc.HttpShardHandlerFactory.getParameter Setting urlScheme to: http://
[junit4:junit4]   2> 216 T1727 oashc.HttpShardHandlerFactory.getParameter Setting connTimeout to: 0
[junit4:junit4]   2> 216 T1727 oashc.HttpShardHandlerFactory.getParameter Setting maxConnectionsPerHost to: 20
[junit4:junit4]   2> 216 T1727 oashc.HttpShardHandlerFactory.getParameter Setting corePoolSize to: 0
[junit4:junit4]   2> 217 T1727 oashc.HttpShardHandlerFactory.getParameter Setting maximumPoolSize to: 2147483647
[junit4:junit4]   2> 217 T1727 oashc.HttpShardHandlerFactory.getParameter Setting maxThreadIdleTime to: 5
[junit4:junit4]   2> 217 T1727 oashc.HttpShardHandlerFactory.getParameter Setting sizeOfQueue to: -1
[junit4:junit4]   2> 218 T1727 oashc.HttpShardHandlerFactory.getParameter Setting fairnessPolicy to: false
[junit4:junit4]   2> 218 T1727 oascsi.HttpClientUtil.createClient Creating new http client, config:maxConnectionsPerHost=20&maxConnections=10000&socketTimeout=0&connTimeout=0&retry=false
[junit4:junit4]   2> 220 T1737 oasc.SolrCore.registerSearcher [collection1] Registered new searcher Searcher@60288ea8 main{StandardDirectoryReader(segments_1:1)}
[junit4:junit4]   2> 221 T1727 oasc.CoreContainer.register registering core: collection1
[junit4:junit4]   2> 221 T1727 oass.SolrDispatchFilter.init user.dir=/mnt/ssd/jenkins/workspace/Lucene-Solr-trunk-Linux/checkout/solr/build/solr-core/test/J0
[junit4:junit4]   2> 221 T1727 oass.SolrDispatchFilter.init SolrDispatchFilter.init() done
[junit4:junit4]   2> 222 T1727 oascsi.HttpClientUtil.createClient Creating new http client, config:maxConnections=128&maxConnectionsPerHost=32&followRedirects=false
[junit4:junit4]   2> 224 T1727 oejs.Server.doStart jetty-8.1.2.v20120308
[junit4:junit4]   2> 230 T1727 oejs.AbstractConnector.doStart Started SocketConnector@0.0.0.0:55281
[junit4:junit4]   2> 230 T1727 oasc.SolrResourceLoader.locateSolrHome JNDI not configured for solr (NoInitialContextEx)
[junit4:junit4]   2> 231 T1727 oasc.SolrResourceLoader.locateSolrHome using system property solr.solr.home: /mnt/ssd/jenkins/workspace/Lucene-Solr-trunk-Linux/checkout/solr/build/solr-core/test-files/solr
[junit4:junit4]   2> 231 T1727 oasc.SolrResourceLoader.<init> new SolrResourceLoader for deduced Solr Home: '/mnt/ssd/jenkins/workspace/Lucene-Solr-trunk-Linux/checkout/solr/build/solr-core/test-files/solr/'
[junit4:junit4]   2> 240 T1727 oass.SolrDispatchFilter.init SolrDispatchFilter.init()
[junit4:junit4]   2> 240 T1727 oasc.SolrResourceLoader.locateSolrHome JNDI not configured for solr (NoInitialContextEx)
[junit4:junit4]   2> 240 T1727 oasc.SolrResourceLoader.locateSolrHome using system property solr.solr.home: /mnt/ssd/jenkins/workspace/Lucene-Solr-trunk-Linux/checkout/solr/build/solr-core/test-files/solr
[junit4:junit4]   2> 241 T1727 oasc.CoreContainer$Initializer.initialize looking for solr.xml: /mnt/ssd/jenkins/workspace/Lucene-Solr-trunk-Linux/checkout/solr/build/solr-core/test-files/solr/solr.xml
[junit4:junit4]   2> 241 T1727 oasc.CoreContainer.<init> New CoreContainer 2091555932
[junit4:junit4]   2> 241 T1727 oasc.CoreContainer.load Loading CoreContainer using Solr Home: '/mnt/ssd/jenkins/workspace/Lucene-Solr-trunk-Linux/checkout/solr/build/solr-core/test-files/solr/'
[junit4:junit4]   2> 241 T1727 oasc.SolrResourceLoader.<init> new SolrResourceLoader for directory: '/mnt/ssd/jenkins/workspace/Lucene-Solr-trunk-Linux/checkout/solr/build/solr-core/test-files/solr/'
[junit4:junit4]   2> 252 T1727 oasc.CoreContainer.load Registering Log Listener
[junit4:junit4]   2> 264 T1727 oasc.CoreContainer.create Creating SolrCore 'collection1' using instanceDir: /mnt/ssd/jenkins/workspace/Lucene-Solr-trunk-Linux/checkout/solr/build/solr-core/test-files/solr/collection1
[junit4:junit4]   2> 265 T1727 oasc.SolrResourceLoader.<init> new SolrResourceLoader for directory: '/mnt/ssd/jenkins/workspace/Lucene-Solr-trunk-Linux/checkout/solr/build/solr-core/test-files/solr/collection1/'
[junit4:junit4]   2> 265 T1727 oasc.SolrResourceLoader.replaceClassLoader Adding 'file:/mnt/ssd/jenkins/workspace/Lucene-Solr-trunk-Linux/checkout/solr/build/solr-core/test-files/solr/collection1/lib/README' to classloader
[junit4:junit4]   2> 266 T1727 oasc.SolrResourceLoader.replaceClassLoader Adding 'file:/mnt/ssd/jenkins/workspace/Lucene-Solr-trunk-Linux/checkout/solr/build/solr-core/test-files/solr/collection1/lib/classes/' to classloader
[junit4:junit4]   2> 289 T1727 oasc.SolrConfig.<init> Using Lucene MatchVersion: LUCENE_50
[junit4:junit4]   2> 334 T1727 oasc.SolrConfig.<init> Loaded SolrConfig: solrconfig-elevate.xml
[junit4:junit4]   2> 334 T1727 oass.IndexSchema.readSchema Reading Solr Schema
[junit4:junit4]   2> 336 T1727 oass.IndexSchema.readSchema Schema name=example
[junit4:junit4]   2> 454 T1727 oass.IndexSchema.readSchema default search field in schema is text
[junit4:junit4]   2> 455 T1727 oass.IndexSchema.readSchema unique key field: id
[junit4:junit4]   2> 457 T1727 oasc.SolrCore.<init> [collection1] Opening new SolrCore at /mnt/ssd/jenkins/workspace/Lucene-Solr-trunk-Linux/checkout/solr/build/solr-core/test-files/solr/collection1/, dataDir=./org.apache.solr.handler.component.DistributedQueryElevationComponentTest-1344201376772/shard0/data/
[junit4:junit4]   2> 457 T1727 oasc.JmxMonitoredMap.<init> JMX monitoring is enabled. Adding Solr mbeans to JMX Server: com.sun.jmx.mbeanserver.JmxMBeanServer@6d980f5d
[junit4:junit4]   2> 458 T1727 oasc.SolrCore.getNewIndexDir WARNING New index directory detected: old=null new=./org.apache.solr.handler.component.DistributedQueryElevationComponentTest-1344201376772/shard0/data/index/
[junit4:junit4]   2> 458 T1727 oasc.SolrCore.initIndex WARNING [collection1] Solr index directory './org.apache.solr.handler.component.DistributedQueryElevationComponentTest-1344201376772/shard0/data/index' doesn't exist. Creating new index...
[junit4:junit4]   2> 459 T1727 oasc.SolrDeletionPolicy.onCommit SolrDeletionPolicy.onCommit: commits:num=1
[junit4:junit4]   2> 		commit{dir=MockDirWrapper(org.apache.lucene.store.RAMDirectory@5fb65b0e lockFactory=org.apache.lucene.store.SingleInstanceLockFactory@7597e082),segFN=segments_1,generation=1,filenames=[segments_1]
[junit4:junit4]   2> 459 T1727 oasc.SolrDeletionPolicy.updateCommits newest commit = 1
[junit4:junit4]   2> 460 T1727 oasc.RequestHandlers.initHandlersFromConfig created /update: solr.UpdateRequestHandler
[junit4:junit4]   2> 460 T1727 oasc.RequestHandlers.initHandlersFromConfig created /elevate: org.apache.solr.handler.component.SearchHandler
[junit4:junit4]   2> 461 T1727 oasc.RequestHandlers.initHandlersFromConfig created /dataElevate: org.apache.solr.handler.component.SearchHandler
[junit4:junit4]   2> 461 T1727 oashl.XMLLoader.init xsltCacheLifetimeSeconds=60
[junit4:junit4]   2> 461 T1727 oasc.RequestHandlers.initHandlersFromConfig WARNING no default request handler is registered (either '/select' or 'standard')
[junit4:junit4]   2> 462 T1727 oasc.SolrCore.initDeprecatedSupport WARNING solrconfig.xml uses deprecated <admin/gettableFiles>, Please update your config to use the ShowFileRequestHandler.
[junit4:junit4]   2> 463 T1727 oasc.SolrCore.initDeprecatedSupport WARNING adding ShowFileRequestHandler with hidden files: [SCHEMA.XML, MISSING.FUNCTIONS.UPDATEPROCESSOR.JS, SOLRCONFIG-SPELLCHECKER.XML, SOLRCONFIG-SCRIPT-UPDATEPROCESSOR.XML, BAD-SCHEMA-EXTERNAL-FILEFIELD.XML, BAD-SCHEMA-UNIQUEKEY-IS-COPYFIELD-DEST.XML, MAPPING-ISOLATIN1ACCENT.TXT, BAD-SCHEMA-NOT-INDEXED-BUT-POS.XML, HUNSPELL-TEST.DIC, SCHEMA-LMDIRICHLET.XML, SOLRCONFIG-ALTDIRECTORY.XML, BAD-SOLRCONFIG-INVALID-SCRIPTFILE.XML, STEMDICT.TXT, FRENCHARTICLES.TXT, SCHEMA-CHARFILTERS.XML, SCHEMA-COPYFIELD-TEST.XML, STOPWORDS.TXT, DA_COMPOUNDDICTIONARY.TXT, SCHEMA-DFR.XML, BAD-SCHEMA-SIM-GLOBAL-VS-FT-MISMATCH.XML, BAD-SCHEMA-DUP-DYNAMICFIELD.XML, THROW.ERROR.ON.ADD.UPDATEPROCESSOR.JS, SOLRCONFIG-BASIC.XML, ELEVATE.XML, SOLRCONFIG-NATIVELOCK.XML, BAD-SCHEMA-UNIQUEKEY-USES-DEFAULT.XML, SOLRCONFIG-SOLCOREPROPERTIES.XML, SOLRCONFIG-SLAVE1.XML, SOLRCONFIG-XINCLUDE.XML, SCHEMA-REVERSED.XML, SOLRCONFIG-TRANSFORMERS.XML, STOPWITHBOM.TXT, PHRASESUGGEST.TXT, SOLRCONFIG-MERGEPOLICY.XML, SOLRCONFIG-DELPOLICY1.XML, BAD_SOLRCONFIG.XML, BAD-SCHEMA-NOT-INDEXED-BUT-NORMS.XML, SCHEMASURROUND.XML, SCHEMA-TFIDF.XML, HUNSPELL-TEST.AFF, SCHEMA-REPLICATION2.XML, BAD-MP-SOLRCONFIG.XML, SCHEMA-IB.XML, BAD-SOLRCONFIG-BOGUS-SCRIPTENGINE-NAME.XML, STOPTYPES-2.TXT, SCHEMA-PHRASESUGGEST.XML, TRIVIAL.UPDATEPROCESSOR1.JS, SOLRCONFIG-MASTER1.XML, BAD-SCHEMA-DUP-FIELD.XML, MISSLEADING.EXTENSION.UPDATEPROCESSOR.JS.TXT, SOLRCONFIG-MASTER.XML, SCHEMA_CODEC.XML, DA_UTF8.XML, SOLRCONFIG-QUERYSENDER.XML, SCHEMA-TRIE.XML, SOLRCONFIG-QUERYSENDER-NOQUERY.XML, SCHEMA-MINIMAL.XML, WDFTYPES.TXT, STOPWORDSWRONGENCODING.TXT, BAD-SCHEMA-DUP-FIELDTYPE.XML, SCHEMA-FOLDING.XML, SOLRCONFIG-ENABLEPLUGIN.XML, SOLRCONFIG-PROPINJECT-INDEXDEFAULT.XML, SCHEMA-BM25.XML, HYPHENATION.DTD, COMPOUNDDICTIONARY.TXT, ADDFIELDS.UPDATEPROCESSOR.JS, SCHEMA-COLLATE.XML, SOLRCONFIG_CODEC.XML, BAD-SCHEMA-NOT-INDEXED-BUT-TF.XML, SOLRCONFIG-ELEVATE.XML, SOLRCONFIG-REPEATER.XML, STOP-2.TXT, SCHEMA15.XML, SOLRCONFIG-REQHANDLER.INCL, STOPTYPES-1.TXT, SOLRCONFIG-CACHING.XML, SCHEMA-REQUIRED-FIELDS.XML, BAD-SCHEMA-UNIQUEKEY-MULTIVALUED.XML, SOLRCONFIG-MASTER2.XML, SCHEMA-LMJELINEKMERCER.XML, SOLRCONFIG-LAZYWRITER.XML, OPEN-EXCHANGE-RATES.JSON, SCHEMA-LUCENEMATCHVERSION.XML, BAD-SOLRCONFIG-MISSING-SCRIPTFILE.XML, SOLRCONFIG-FUNCTIONQUERY.XML, SOLRCONFIG-TLOG.XML, STOP-SNOWBALL.TXT, SOLRCONFIG-MASTER3.XML, SOLRCONFIG-NOCACHE.XML, BAD-SCHEMA-CODEC-GLOBAL-VS-FT-MISMATCH.XML, SCHEMA11.XML, CONDITIONAL.UPDATEPROCESSOR.JS, KEEP-1.TXT, TRIVIAL.UPDATEPROCESSOR0.JS, STOP-1.TXT, SCHEMA-SPELLCHECKER.XML, SOLRCONFIG-TERMINDEX.XML, SCHEMA12.XML, CURRENCY.XML, SOLRCONFIG-SPELLCHECKCOMPONENT.XML, SCHEMA-REPLICATION1.XML, SOLRCONFIG-SIMPLELOCK.XML, SOLRCONFIG_PERF.XML, XSLT, SOLRCONFIG-PROPINJECT.XML, SOLRCONFIG-HIGHLIGHT.XML, BAD-SCHEMA-ANALYZER-CLASS-AND-NESTED.XML, BAD-SCHEMA-NONTEXT-ANALYZER.XML, SCHEMA-SIM.XML, SOLRCONFIG-MASTER1-KEEPONEBACKUP.XML, KEEP-2.TXT, SYNONYMS.TXT, SCHEMA-BINARYFIELD.XML, PROTWORDS.TXT, OLD_SYNONYMS.TXT, SOLRCONFIG-PHRASESUGGEST.XML, SOLRCONFIG-DELPOLICY2.XML, SOLRCONFIG-UPDATE-PROCESSOR-CHAINS.XML, SCHEMA-STOP-KEEP.XML, SOLRCONFIG-SOLR-749.XML, BAD-SCHEMA-OMIT-TF-BUT-NOT-POS.XML, SOLRCONFIG-SLAVE.XML, SCHEMA-NUMERIC.XML, SCHEMA-NOT-REQUIRED-UNIQUE-KEY.XML]
[junit4:junit4]   2> 464 T1727 oass.SolrIndexSearcher.<init> Opening Searcher@1e9509ef main
[junit4:junit4]   2> 464 T1727 oass.SolrIndexSearcher.getIndexDir WARNING WARNING: Directory impl does not support setting indexDir: org.apache.lucene.store.MockDirectoryWrapper
[junit4:junit4]   2> 465 T1727 oasu.CommitTracker.<init> Hard AutoCommit: disabled
[junit4:junit4]   2> 465 T1727 oasu.CommitTracker.<init> Soft AutoCommit: disabled
[junit4:junit4]   2> 465 T1727 oashc.QueryElevationComponent.inform Loading QueryElevation from: /mnt/ssd/jenkins/workspace/Lucene-Solr-trunk-Linux/checkout/solr/build/solr-core/test-files/solr/collection1/conf/elevate.xml
[junit4:junit4]   2> 470 T1727 oashc.QueryElevationComponent.inform Loading QueryElevation from: /mnt/ssd/jenkins/workspace/Lucene-Solr-trunk-Linux/checkout/solr/build/solr-core/test-files/solr/collection1/conf/elevate.xml
[junit4:junit4]   2> 475 T1727 oashc.HttpShardHandlerFactory.getParameter Setting socketTimeout to: 0
[junit4:junit4]   2> 475 T1727 oashc.HttpShardHandlerFactory.getParameter Setting urlScheme to: http://
[junit4:junit4]   2> 475 T1727 oashc.HttpShardHandlerFactory.getParameter Setting connTimeout to: 0
[junit4:junit4]   2> 475 T1727 oashc.HttpShardHandlerFactory.getParameter Setting maxConnectionsPerHost to: 20
[junit4:junit4]   2> 476 T1727 oashc.HttpShardHandlerFactory.getParameter Setting corePoolSize to: 0
[junit4:junit4]   2> 476 T1727 oashc.HttpShardHandlerFactory.getParameter Setting maximumPoolSize to: 2147483647
[junit4:junit4]   2> 476 T1727 oashc.HttpShardHandlerFactory.getParameter Setting maxThreadIdleTime to: 5
[junit4:junit4]   2> 476 T1727 oashc.HttpShardHandlerFactory.getParameter Setting sizeOfQueue to: -1
[junit4:junit4]   2> 476 T1727 oashc.HttpShardHandlerFactory.getParameter Setting fairnessPolicy to: false
[junit4:junit4]   2> 477 T1727 oascsi.HttpClientUtil.createClient Creating new http client, config:maxConnectionsPerHost=20&maxConnections=10000&socketTimeout=0&connTimeout=0&retry=false
[junit4:junit4]   2> 479 T1747 oasc.SolrCore.registerSearcher [collection1] Registered new searcher Searcher@1e9509ef main{StandardDirectoryReader(segments_1:1)}
[junit4:junit4]   2> 479 T1727 oasc.CoreContainer.register registering core: collection1
[junit4:junit4]   2> 479 T1727 oass.SolrDispatchFilter.init user.dir=/mnt/ssd/jenkins/workspace/Lucene-Solr-trunk-Linux/checkout/solr/build/solr-core/test/J0
[junit4:junit4]   2> 479 T1727 oass.SolrDispatchFilter.init SolrDispatchFilter.init() done
[junit4:junit4]   2> 480 T1727 oascsi.HttpClientUtil.createClient Creating new http client, config:maxConnections=128&maxConnectionsPerHost=32&followRedirects=false
[junit4:junit4]   2> 482 T1727 oejs.Server.doStart jetty-8.1.2.v20120308
[junit4:junit4]   2> 492 T1727 oejs.AbstractConnector.doStart Started SocketConnector@0.0.0.0:52054
[junit4:junit4]   2> 497 T1727 oasc.SolrResourceLoader.locateSolrHome JNDI not configured for solr (NoInitialContextEx)
[junit4:junit4]   2> 497 T1727 oasc.SolrResourceLoader.locateSolrHome using system property solr.solr.home: /mnt/ssd/jenkins/workspace/Lucene-Solr-trunk-Linux/checkout/solr/build/solr-core/test-files/solr
[junit4:junit4]   2> 497 T1727 oasc.SolrResourceLoader.<init> new SolrResourceLoader for deduced Solr Home: '/mnt/ssd/jenkins/workspace/Lucene-Solr-trunk-Linux/checkout/solr/build/solr-core/test-files/solr/'
[junit4:junit4]   2> 510 T1727 oass.SolrDispatchFilter.init SolrDispatchFilter.init()
[junit4:junit4]   2> 515 T1727 oasc.SolrResourceLoader.locateSolrHome JNDI not configured for solr (NoInitialContextEx)
[junit4:junit4]   2> 515 T1727 oasc.SolrResourceLoader.locateSolrHome using system property solr.solr.home: /mnt/ssd/jenkins/workspace/Lucene-Solr-trunk-Linux/checkout/solr/build/solr-core/test-files/solr
[junit4:junit4]   2> 516 T1727 oasc.CoreContainer$Initializer.initialize looking for solr.xml: /mnt/ssd/jenkins/workspace/Lucene-Solr-trunk-Linux/checkout/solr/build/solr-core/test-files/solr/solr.xml
[junit4:junit4]   2> 516 T1727 oasc.CoreContainer.<init> New CoreContainer 758758930
[junit4:junit4]   2> 516 T1727 oasc.CoreContainer.load Loading CoreContainer using Solr Home: '/mnt/ssd/jenkins/workspace/Lucene-Solr-trunk-Linux/checkout/solr/build/solr-core/test-files/solr/'
[junit4:junit4]   2> 517 T1727 oasc.SolrResourceLoader.<init> new SolrResourceLoader for directory: '/mnt/ssd/jenkins/workspace/Lucene-Solr-trunk-Linux/checkout/solr/build/solr-core/test-files/solr/'
[junit4:junit4]   2> 528 T1727 oasc.CoreContainer.load Registering Log Listener
[junit4:junit4]   2> 535 T1727 oasc.CoreContainer.create Creating SolrCore 'collection1' using instanceDir: /mnt/ssd/jenkins/workspace/Lucene-Solr-trunk-Linux/checkout/solr/build/solr-core/test-files/solr/collection1
[junit4:junit4]   2> 536 T1727 oasc.SolrResourceLoader.<init> new SolrResourceLoader for directory: '/mnt/ssd/jenkins/workspace/Lucene-Solr-trunk-Linux/checkout/solr/build/solr-core/test-files/solr/collection1/'
[junit4:junit4]   2> 536 T1727 oasc.SolrResourceLoader.replaceClassLoader Adding 'file:/mnt/ssd/jenkins/workspace/Lucene-Solr-trunk-Linux/checkout/solr/build/solr-core/test-files/solr/collection1/lib/README' to classloader
[junit4:junit4]   2> 536 T1727 oasc.SolrResourceLoader.replaceClassLoader Adding 'file:/mnt/ssd/jenkins/workspace/Lucene-Solr-trunk-Linux/checkout/solr/build/solr-core/test-files/solr/collection1/lib/classes/' to classloader
[junit4:junit4]   2> 551 T1727 oasc.SolrConfig.<init> Using Lucene MatchVersion: LUCENE_50
[junit4:junit4]   2> 575 T1727 oasc.SolrConfig.<init> Loaded SolrConfig: solrconfig-elevate.xml
[junit4:junit4]   2> 575 T1727 oass.IndexSchema.readSchema Reading Solr Schema
[junit4:junit4]   2> 577 T1727 oass.IndexSchema.readSchema Schema name=example
[junit4:junit4]   2> 690 T1727 oass.IndexSchema.readSchema default search field in schema is text
[junit4:junit4]   2> 692 T1727 oass.IndexSchema.readSchema unique key field: id
[junit4:junit4]   2> 694 T1727 oasc.SolrCore.<init> [collection1] Opening new SolrCore at /mnt/ssd/jenkins/workspace/Lucene-Solr-trunk-Linux/checkout/solr/build/solr-core/test-files/solr/collection1/, dataDir=./org.apache.solr.handler.component.DistributedQueryElevationComponentTest-1344201376772/shard1/data/
[junit4:junit4]   2> 694 T1727 oasc.JmxMonitoredMap.<init> JMX monitoring is enabled. Adding Solr mbeans to JMX Server: com.sun.jmx.mbeanserver.JmxMBeanServer@6d980f5d
[junit4:junit4]   2> 694 T1727 oasc.SolrCore.getNewIndexDir WARNING New index directory detected: old=null new=./org.apache.solr.handler.component.DistributedQueryElevationComponentTest-1344201376772/shard1/data/index/
[junit4:junit4]   2> 694 T1727 oasc.SolrCore.initIndex WARNING [collection1] Solr index directory './org.apache.solr.handler.component.DistributedQueryElevationComponentTest-1344201376772/shard1/data/index' doesn't exist. Creating new index...
[junit4:junit4]   2> 695 T1727 oasc.SolrDeletionPolicy.onCommit SolrDeletionPolicy.onCommit: commits:num=1
[junit4:junit4]   2> 		commit{dir=MockDirWrapper(org.apache.lucene.store.RAMDirectory@1a99e0ac lockFactory=org.apache.lucene.store.SingleInstanceLockFactory@7b0b3b84),segFN=segments_1,generation=1,filenames=[segments_1]
[junit4:junit4]   2> 696 T1727 oasc.SolrDeletionPolicy.updateCommits newest commit = 1
[junit4:junit4]   2> 696 T1727 oasc.RequestHandlers.initHandlersFromConfig created /update: solr.UpdateRequestHandler
[junit4:junit4]   2> 697 T1727 oasc.RequestHandlers.initHandlersFromConfig created /elevate: org.apache.solr.handler.component.SearchHandler
[junit4:junit4]   2> 697 T1727 oasc.RequestHandlers.initHandlersFromConfig created /dataElevate: org.apache.solr.handler.component.SearchHandler
[junit4:junit4]   2> 697 T1727 oashl.XMLLoader.init xsltCacheLifetimeSeconds=60
[junit4:junit4]   2> 697 T1727 oasc.RequestHandlers.initHandlersFromConfig WARNING no default request handler is registered (either '/select' or 'standard')
[junit4:junit4]   2> 698 T1727 oasc.SolrCore.initDeprecatedSupport WARNING solrconfig.xml uses deprecated <admin/gettableFiles>, Please update your config to use the ShowFileRequestHandler.
[junit4:junit4]   2> 699 T1727 oasc.SolrCore.initDeprecatedSupport WARNING adding ShowFileRequestHandler with hidden files: [SCHEMA.XML, MISSING.FUNCTIONS.UPDATEPROCESSOR.JS, SOLRCONFIG-SPELLCHECKER.XML, SOLRCONFIG-SCRIPT-UPDATEPROCESSOR.XML, BAD-SCHEMA-EXTERNAL-FILEFIELD.XML, BAD-SCHEMA-UNIQUEKEY-IS-COPYFIELD-DEST.XML, MAPPING-ISOLATIN1ACCENT.TXT, BAD-SCHEMA-NOT-INDEXED-BUT-POS.XML, HUNSPELL-TEST.DIC, SCHEMA-LMDIRICHLET.XML, SOLRCONFIG-ALTDIRECTORY.XML, BAD-SOLRCONFIG-INVALID-SCRIPTFILE.XML, STEMDICT.TXT, FRENCHARTICLES.TXT, SCHEMA-CHARFILTERS.XML, SCHEMA-COPYFIELD-TEST.XML, STOPWORDS.TXT, DA_COMPOUNDDICTIONARY.TXT, SCHEMA-DFR.XML, BAD-SCHEMA-SIM-GLOBAL-VS-FT-MISMATCH.XML, BAD-SCHEMA-DUP-DYNAMICFIELD.XML, THROW.ERROR.ON.ADD.UPDATEPROCESSOR.JS, SOLRCONFIG-BASIC.XML, ELEVATE.XML, SOLRCONFIG-NATIVELOCK.XML, BAD-SCHEMA-UNIQUEKEY-USES-DEFAULT.XML, SOLRCONFIG-SOLCOREPROPERTIES.XML, SOLRCONFIG-SLAVE1.XML, SOLRCONFIG-XINCLUDE.XML, SCHEMA-REVERSED.XML, SOLRCONFIG-TRANSFORMERS.XML, STOPWITHBOM.TXT, PHRASESUGGEST.TXT, SOLRCONFIG-MERGEPOLICY.XML, SOLRCONFIG-DELPOLICY1.XML, BAD_SOLRCONFIG.XML, BAD-SCHEMA-NOT-INDEXED-BUT-NORMS.XML, SCHEMASURROUND.XML, SCHEMA-TFIDF.XML, HUNSPELL-TEST.AFF, SCHEMA-REPLICATION2.XML, BAD-MP-SOLRCONFIG.XML, SCHEMA-IB.XML, BAD-SOLRCONFIG-BOGUS-SCRIPTENGINE-NAME.XML, STOPTYPES-2.TXT, SCHEMA-PHRASESUGGEST.XML, TRIVIAL.UPDATEPROCESSOR1.JS, SOLRCONFIG-MASTER1.XML, BAD-SCHEMA-DUP-FIELD.XML, MISSLEADING.EXTENSION.UPDATEPROCESSOR.JS.TXT, SOLRCONFIG-MASTER.XML, SCHEMA_CODEC.XML, DA_UTF8.XML, SOLRCONFIG-QUERYSENDER.XML, SCHEMA-TRIE.XML, SOLRCONFIG-QUERYSENDER-NOQUERY.XML, SCHEMA-MINIMAL.XML, WDFTYPES.TXT, STOPWORDSWRONGENCODING.TXT, BAD-SCHEMA-DUP-FIELDTYPE.XML, SCHEMA-FOLDING.XML, SOLRCONFIG-ENABLEPLUGIN.XML, SOLRCONFIG-PROPINJECT-INDEXDEFAULT.XML, SCHEMA-BM25.XML, HYPHENATION.DTD, COMPOUNDDICTIONARY.TXT, ADDFIELDS.UPDATEPROCESSOR.JS, SCHEMA-COLLATE.XML, SOLRCONFIG_CODEC.XML, BAD-SCHEMA-NOT-INDEXED-BUT-TF.XML, SOLRCONFIG-ELEVATE.XML, SOLRCONFIG-REPEATER.XML, STOP-2.TXT, SCHEMA15.XML, SOLRCONFIG-REQHANDLER.INCL, STOPTYPES-1.TXT, SOLRCONFIG-CACHING.XML, SCHEMA-REQUIRED-FIELDS.XML, BAD-SCHEMA-UNIQUEKEY-MULTIVALUED.XML, SOLRCONFIG-MASTER2.XML, SCHEMA-LMJELINEKMERCER.XML, SOLRCONFIG-LAZYWRITER.XML, OPEN-EXCHANGE-RATES.JSON, SCHEMA-LUCENEMATCHVERSION.XML, BAD-SOLRCONFIG-MISSING-SCRIPTFILE.XML, SOLRCONFIG-FUNCTIONQUERY.XML, SOLRCONFIG-TLOG.XML, STOP-SNOWBALL.TXT, SOLRCONFIG-MASTER3.XML, SOLRCONFIG-NOCACHE.XML, BAD-SCHEMA-CODEC-GLOBAL-VS-FT-MISMATCH.XML, SCHEMA11.XML, CONDITIONAL.UPDATEPROCESSOR.JS, KEEP-1.TXT, TRIVIAL.UPDATEPROCESSOR0.JS, STOP-1.TXT, SCHEMA-SPELLCHECKER.XML, SOLRCONFIG-TERMINDEX.XML, SCHEMA12.XML, CURRENCY.XML, SOLRCONFIG-SPELLCHECKCOMPONENT.XML, SCHEMA-REPLICATION1.XML, SOLRCONFIG-SIMPLELOCK.XML, SOLRCONFIG_PERF.XML, XSLT, SOLRCONFIG-PROPINJECT.XML, SOLRCONFIG-HIGHLIGHT.XML, BAD-SCHEMA-ANALYZER-CLASS-AND-NESTED.XML, BAD-SCHEMA-NONTEXT-ANALYZER.XML, SCHEMA-SIM.XML, SOLRCONFIG-MASTER1-KEEPONEBACKUP.XML, KEEP-2.TXT, SYNONYMS.TXT, SCHEMA-BINARYFIELD.XML, PROTWORDS.TXT, OLD_SYNONYMS.TXT, SOLRCONFIG-PHRASESUGGEST.XML, SOLRCONFIG-DELPOLICY2.XML, SOLRCONFIG-UPDATE-PROCESSOR-CHAINS.XML, SCHEMA-STOP-KEEP.XML, SOLRCONFIG-SOLR-749.XML, BAD-SCHEMA-OMIT-TF-BUT-NOT-POS.XML, SOLRCONFIG-SLAVE.XML, SCHEMA-NUMERIC.XML, SCHEMA-NOT-REQUIRED-UNIQUE-KEY.XML]
[junit4:junit4]   2> 702 T1727 oass.SolrIndexSearcher.<init> Opening Searcher@7093ed6a main
[junit4:junit4]   2> 703 T1727 oass.SolrIndexSearcher.getIndexDir WARNING WARNING: Directory impl does not support setting indexDir: org.apache.lucene.store.MockDirectoryWrapper
[junit4:junit4]   2> 703 T1727 oasu.CommitTracker.<init> Hard AutoCommit: disabled
[junit4:junit4]   2> 704 T1727 oasu.CommitTracker.<init> Soft AutoCommit: disabled
[junit4:junit4]   2> 704 T1727 oashc.QueryElevationComponent.inform Loading QueryElevation from: /mnt/ssd/jenkins/workspace/Lucene-Solr-trunk-Linux/checkout/solr/build/solr-core/test-files/solr/collection1/conf/elevate.xml
[junit4:junit4]   2> 709 T1727 oashc.QueryElevationComponent.inform Loading QueryElevation from: /mnt/ssd/jenkins/workspace/Lucene-Solr-trunk-Linux/checkout/solr/build/solr-core/test-files/solr/collection1/conf/elevate.xml
[junit4:junit4]   2> 714 T1727 oashc.HttpShardHandlerFactory.getParameter Setting socketTimeout to: 0
[junit4:junit4]   2> 714 T1727 oashc.HttpShardHandlerFactory.getParameter Setting urlScheme to: http://
[junit4:junit4]   2> 714 T1727 oashc.HttpShardHandlerFactory.getParameter Setting connTimeout to: 0
[junit4:junit4]   2> 714 T1727 oashc.HttpShardHandlerFactory.getParameter Setting maxConnectionsPerHost to: 20
[junit4:junit4]   2> 715 T1727 oashc.HttpShardHandlerFactory.getParameter Setting corePoolSize to: 0
[junit4:junit4]   2> 715 T1727 oashc.HttpShardHandlerFactory.getParameter Setting maximumPoolSize to: 2147483647
[junit4:junit4]   2> 715 T1727 oashc.HttpShardHandlerFactory.getParameter Setting maxThreadIdleTime to: 5
[junit4:junit4]   2> 715 T1727 oashc.HttpShardHandlerFactory.getParameter Setting sizeOfQueue to: -1
[junit4:junit4]   2> 715 T1727 oashc.HttpShardHandlerFactory.getParameter Setting fairnessPolicy to: false
[junit4:junit4]   2> 715 T1727 oascsi.HttpClientUtil.createClient Creating new http client, config:maxConnectionsPerHost=20&maxConnections=10000&socketTimeout=0&connTimeout=0&retry=false
[junit4:junit4]   2> 717 T1757 oasc.SolrCore.registerSearcher [collection1] Registered new searcher Searcher@7093ed6a main{StandardDirectoryReader(segments_1:1)}
[junit4:junit4]   2> 718 T1727 oasc.CoreContainer.register registering core: collection1
[junit4:junit4]   2> 718 T1727 oass.SolrDispatchFilter.init user.dir=/mnt/ssd/jenkins/workspace/Lucene-Solr-trunk-Linux/checkout/solr/build/solr-core/test/J0
[junit4:junit4]   2> 718 T1727 oass.SolrDispatchFilter.init SolrDispatchFilter.init() done
[junit4:junit4]   2> 718 T1727 oascsi.HttpClientUtil.createClient Creating new http client, config:maxConnections=128&maxConnectionsPerHost=32&followRedirects=false
[junit4:junit4]   2> 720 T1727 oejs.Server.doStart jetty-8.1.2.v20120308
[junit4:junit4]   2> 722 T1727 oejs.AbstractConnector.doStart Started SocketConnector@0.0.0.0:46899
[junit4:junit4]   2> 722 T1727 oasc.SolrResourceLoader.locateSolrHome JNDI not configured for solr (NoInitialContextEx)
[junit4:junit4]   2> 722 T1727 oasc.SolrResourceLoader.locateSolrHome using system property solr.solr.home: /mnt/ssd/jenkins/workspace/Lucene-Solr-trunk-Linux/checkout/solr/build/solr-core/test-files/solr
[junit4:junit4]   2> 722 T1727 oasc.SolrResourceLoader.<init> new SolrResourceLoader for deduced Solr Home: '/mnt/ssd/jenkins/workspace/Lucene-Solr-trunk-Linux/checkout/solr/build/solr-core/test-files/solr/'
[junit4:junit4]   2> 728 T1727 oass.SolrDispatchFilter.init SolrDispatchFilter.init()
[junit4:junit4]   2> 728 T1727 oasc.SolrResourceLoader.locateSolrHome JNDI not configured for solr (NoInitialContextEx)
[junit4:junit4]   2> 728 T1727 oasc.SolrResourceLoader.locateSolrHome using system property solr.solr.home: /mnt/ssd/jenkins/workspace/Lucene-Solr-trunk-Linux/checkout/solr/build/solr-core/test-files/solr
[junit4:junit4]   2> 729 T1727 oasc.CoreContainer$Initializer.initialize looking for solr.xml: /mnt/ssd/jenkins/workspace/Lucene-Solr-trunk-Linux/checkout/solr/build/solr-core/test-files/solr/solr.xml
[junit4:junit4]   2> 729 T1727 oasc.CoreContainer.<init> New CoreContainer 1151795172
[junit4:junit4]   2> 729 T1727 oasc.CoreContainer.load Loading CoreContainer using Solr Home: '/mnt/ssd/jenkins/workspace/Lucene-Solr-trunk-Linux/checkout/solr/build/solr-core/test-files/solr/'
[junit4:junit4]   2> 729 T1727 oasc.SolrResourceLoader.<init> new SolrResourceLoader for directory: '/mnt/ssd/jenkins/workspace/Lucene-Solr-trunk-Linux/checkout/solr/build/solr-core/test-files/solr/'
[junit4:junit4]   2> 736 T1727 oasc.CoreContainer.load Registering Log Listener
[junit4:junit4]   2> 744 T1727 oasc.CoreContainer.create Creating SolrCore 'collection1' using instanceDir: /mnt/ssd/jenkins/workspace/Lucene-Solr-trunk-Linux/checkout/solr/build/solr-core/test-files/solr/collection1
[junit4:junit4]   2> 744 T1727 oasc.SolrResourceLoader.<init> new SolrResourceLoader for directory: '/mnt/ssd/jenkins/workspace/Lucene-Solr-trunk-Linux/checkout/solr/build/solr-core/test-files/solr/collection1/'
[junit4:junit4]   2> 745 T1727 oasc.SolrResourceLoader.replaceClassLoader Adding 'file:/mnt/ssd/jenkins/workspace/Lucene-Solr-trunk-Linux/checkout/solr/build/solr-core/test-files/solr/collection1/lib/README' to classloader
[junit4:junit4]   2> 745 T1727 oasc.SolrResourceLoader.replaceClassLoader Adding 'file:/mnt/ssd/jenkins/workspace/Lucene-Solr-trunk-Linux/checkout/solr/build/solr-core/test-files/solr/collection1/lib/classes/' to classloader
[junit4:junit4]   2> 760 T1727 oasc.SolrConfig.<init> Using Lucene MatchVersion: LUCENE_50
[junit4:junit4]   2> 783 T1727 oasc.SolrConfig.<init> Loaded SolrConfig: solrconfig-elevate.xml
[junit4:junit4]   2> 783 T1727 oass.IndexSchema.readSchema Reading Solr Schema
[junit4:junit4]   2> 786 T1727 oass.IndexSchema.readSchema Schema name=example
[junit4:junit4]   2> 886 T1727 oass.IndexSchema.readSchema default search field in schema is text
[junit4:junit4]   2> 887 T1727 oass.IndexSchema.readSchema unique key field: id
[junit4:junit4]   2> 889 T1727 oasc.SolrCore.<init> [collection1] Opening new SolrCore at /mnt/ssd/jenkins/workspace/Lucene-Solr-trunk-Linux/checkout/solr/build/solr-core/test-files/solr/collection1/, dataDir=./org.apache.solr.handler.component.DistributedQueryElevationComponentTest-1344201376772/shard2/data/
[junit4:junit4]   2> 889 T1727 oasc.JmxMonitoredMap.<init> JMX monitoring is enabled. Adding Solr mbeans to JMX Server: com.sun.jmx.mbeanserver.JmxMBeanServer@6d980f5d
[junit4:junit4]   2> 890 T1727 oasc.SolrCore.getNewIndexDir WARNING New index directory detected: old=null new=./org.apache.solr.handler.component.DistributedQueryElevationComponentTest-1344201376772/shard2/data/index/
[junit4:junit4]   2> 890 T1727 oasc.SolrCore.initIndex WARNING [collection1] Solr index directory './org.apache.solr.handler.component.DistributedQueryElevationComponentTest-1344201376772/shard2/data/index' doesn't exist. Creating new index...
[junit4:junit4]   2> 891 T1727 oasc.SolrDeletionPolicy.onCommit SolrDeletionPolicy.onCommit: commits:num=1
[junit4:junit4]   2> 		commit{dir=MockDirWrapper(org.apache.lucene.store.RAMDirectory@6e5890d0 lockFactory=org.apache.lucene.store.SingleInstanceLockFactory@e9334cc),segFN=segments_1,generation=1,filenames=[segments_1]
[junit4:junit4]   2> 891 T1727 oasc.SolrDeletionPolicy.updateCommits newest commit = 1
[junit4:junit4]   2> 892 T1727 oasc.RequestHandlers.initHandlersFromConfig created /update: solr.UpdateRequestHandler
[junit4:junit4]   2> 892 T1727 oasc.RequestHandlers.initHandlersFromConfig created /elevate: org.apache.solr.handler.component.SearchHandler
[junit4:junit4]   2> 892 T1727 oasc.RequestHandlers.initHandlersFromConfig created /dataElevate: org.apache.solr.handler.component.SearchHandler
[junit4:junit4]   2> 893 T1727 oashl.XMLLoader.init xsltCacheLifetimeSeconds=60
[junit4:junit4]   2> 893 T1727 oasc.RequestHandlers.initHandlersFromConfig WARNING no default request handler is registered (either '/select' or 'standard')
[junit4:junit4]   2> 894 T1727 oasc.SolrCore.initDeprecatedSupport WARNING solrconfig.xml uses deprecated <admin/gettableFiles>, Please update your config to use the ShowFileRequestHandler.
[junit4:junit4]   2> 895 T1727 oasc.SolrCore.initDeprecatedSupport WARNING adding ShowFileRequestHandler with hidden files: [SCHEMA.XML, MISSING.FUNCTIONS.UPDATEPROCESSOR.JS, SOLRCONFIG-SPELLCHECKER.XML, SOLRCONFIG-SCRIPT-UPDATEPROCESSOR.XML, BAD-SCHEMA-EXTERNAL-FILEFIELD.XML, BAD-SCHEMA-UNIQUEKEY-IS-COPYFIELD-DEST.XML, MAPPING-ISOLATIN1ACCENT.TXT, BAD-SCHEMA-NOT-INDEXED-BUT-POS.XML, HUNSPELL-TEST.DIC, SCHEMA-LMDIRICHLET.XML, SOLRCONFIG-ALTDIRECTORY.XML, BAD-SOLRCONFIG-INVALID-SCRIPTFILE.XML, STEMDICT.TXT, FRENCHARTICLES.TXT, SCHEMA-CHARFILTERS.XML, SCHEMA-COPYFIELD-TEST.XML, STOPWORDS.TXT, DA_COMPOUNDDICTIONARY.TXT, SCHEMA-DFR.XML, BAD-SCHEMA-SIM-GLOBAL-VS-FT-MISMATCH.XML, BAD-SCHEMA-DUP-DYNAMICFIELD.XML, THROW.ERROR.ON.ADD.UPDATEPROCESSOR.JS, SOLRCONFIG-BASIC.XML, ELEVATE.XML, SOLRCONFIG-NATIVELOCK.XML, BAD-SCHEMA-UNIQUEKEY-USES-DEFAULT.XML, SOLRCONFIG-SOLCOREPROPERTIES.XML, SOLRCONFIG-SLAVE1.XML, SOLRCONFIG-XINCLUDE.XML, SCHEMA-REVERSED.XML, SOLRCONFIG-TRANSFORMERS.XML, STOPWITHBOM.TXT, PHRASESUGGEST.TXT, SOLRCONFIG-MERGEPOLICY.XML, SOLRCONFIG-DELPOLICY1.XML, BAD_SOLRCONFIG.XML, BAD-SCHEMA-NOT-INDEXED-BUT-NORMS.XML, SCHEMASURROUND.XML, SCHEMA-TFIDF.XML, HUNSPELL-TEST.AFF, SCHEMA-REPLICATION2.XML, BAD-MP-SOLRCONFIG.XML, SCHEMA-IB.XML, BAD-SOLRCONFIG-BOGUS-SCRIPTENGINE-NAME.XML, STOPTYPES-2.TXT, SCHEMA-PHRASESUGGEST.XML, TRIVIAL.UPDATEPROCESSOR1.JS, SOLRCONFIG-MASTER1.XML, BAD-SCHEMA-DUP-FIELD.XML, MISSLEADING.EXTENSION.UPDATEPROCESSOR.JS.TXT, SOLRCONFIG-MASTER.XML, SCHEMA_CODEC.XML, DA_UTF8.XML, SOLRCONFIG-QUERYSENDER.XML, SCHEMA-TRIE.XML, SOLRCONFIG-QUERYSENDER-NOQUERY.XML, SCHEMA-MINIMAL.XML, WDFTYPES.TXT, STOPWORDSWRONGENCODING.TXT, BAD-SCHEMA-DUP-FIELDTYPE.XML, SCHEMA-FOLDING.XML, SOLRCONFIG-ENABLEPLUGIN.XML, SOLRCONFIG-PROPINJECT-INDEXDEFAULT.XML, SCHEMA-BM25.XML, HYPHENATION.DTD, COMPOUNDDICTIONARY.TXT, ADDFIELDS.UPDATEPROCESSOR.JS, SCHEMA-COLLATE.XML, SOLRCONFIG_CODEC.XML, BAD-SCHEMA-NOT-INDEXED-BUT-TF.XML, SOLRCONFIG-ELEVATE.XML, SOLRCONFIG-REPEATER.XML, STOP-2.TXT, SCHEMA15.XML, SOLRCONFIG-REQHANDLER.INCL, STOPTYPES-1.TXT, SOLRCONFIG-CACHING.XML, SCHEMA-REQUIRED-FIELDS.XML, BAD-SCHEMA-UNIQUEKEY-MULTIVALUED.XML, SOLRCONFIG-MASTER2.XML, SCHEMA-LMJELINEKMERCER.XML, SOLRCONFIG-LAZYWRITER.XML, OPEN-EXCHANGE-RATES.JSON, SCHEMA-LUCENEMATCHVERSION.XML, BAD-SOLRCONFIG-MISSING-SCRIPTFILE.XML, SOLRCONFIG-FUNCTIONQUERY.XML, SOLRCONFIG-TLOG.XML, STOP-SNOWBALL.TXT, SOLRCONFIG-MASTER3.XML, SOLRCONFIG-NOCACHE.XML, BAD-SCHEMA-CODEC-GLOBAL-VS-FT-MISMATCH.XML, SCHEMA11.XML, CONDITIONAL.UPDATEPROCESSOR.JS, KEEP-1.TXT, TRIVIAL.UPDATEPROCESSOR0.JS, STOP-1.TXT, SCHEMA-SPELLCHECKER.XML, SOLRCONFIG-TERMINDEX.XML, SCHEMA12.XML, CURRENCY.XML, SOLRCONFIG-SPELLCHECKCOMPONENT.XML, SCHEMA-REPLICATION1.XML, SOLRCONFIG-SIMPLELOCK.XML, SOLRCONFIG_PERF.XML, XSLT, SOLRCONFIG-PROPINJECT.XML, SOLRCONFIG-HIGHLIGHT.XML, BAD-SCHEMA-ANALYZER-CLASS-AND-NESTED.XML, BAD-SCHEMA-NONTEXT-ANALYZER.XML, SCHEMA-SIM.XML, SOLRCONFIG-MASTER1-KEEPONEBACKUP.XML, KEEP-2.TXT, SYNONYMS.TXT, SCHEMA-BINARYFIELD.XML, PROTWORDS.TXT, OLD_SYNONYMS.TXT, SOLRCONFIG-PHRASESUGGEST.XML, SOLRCONFIG-DELPOLICY2.XML, SOLRCONFIG-UPDATE-PROCESSOR-CHAINS.XML, SCHEMA-STOP-KEEP.XML, SOLRCONFIG-SOLR-749.XML, BAD-SCHEMA-OMIT-TF-BUT-NOT-POS.XML, SOLRCONFIG-SLAVE.XML, SCHEMA-NUMERIC.XML, SCHEMA-NOT-REQUIRED-UNIQUE-KEY.XML]
[junit4:junit4]   2> 896 T1727 oass.SolrIndexSearcher.<init> Opening Searcher@38c25498 main
[junit4:junit4]   2> 896 T1727 oass.SolrIndexSearcher.getIndexDir WARNING WARNING: Directory impl does not support setting indexDir: org.apache.lucene.store.MockDirectoryWrapper
[junit4:junit4]   2> 897 T1727 oasu.CommitTracker.<init> Hard AutoCommit: disabled
[junit4:junit4]   2> 897 T1727 oasu.CommitTracker.<init> Soft AutoCommit: disabled
[junit4:junit4]   2> 897 T1727 oashc.QueryElevationComponent.inform Loading QueryElevation from: /mnt/ssd/jenkins/workspace/Lucene-Solr-trunk-Linux/checkout/solr/build/solr-core/test-files/solr/collection1/conf/elevate.xml
[junit4:junit4]   2> 903 T1727 oashc.QueryElevationComponent.inform Loading QueryElevation from: /mnt/ssd/jenkins/workspace/Lucene-Solr-trunk-Linux/checkout/solr/build/solr-core/test-files/solr/collection1/conf/elevate.xml
[junit4:junit4]   2> 907 T1727 oashc.HttpShardHandlerFactory.getParameter Setting socketTimeout to: 0
[junit4:junit4]   2> 908 T1727 oashc.HttpShardHandlerFactory.getParameter Setting urlScheme to: http://
[junit4:junit4]   2> 908 T1727 oashc.HttpShardHandlerFactory.getParameter Setting connTimeout to: 0
[junit4:junit4]   2> 908 T1727 oashc.HttpShardHandlerFactory.getParameter Setting maxConnectionsPerHost to: 20
[junit4:junit4]   2> 908 T1727 oashc.HttpShardHandlerFactory.getParameter Setting corePoolSize to: 0
[junit4:junit4]   2> 909 T1727 oashc.HttpShardHandlerFactory.getParameter Setting maximumPoolSize to: 2147483647
[junit4:junit4]   2> 909 T1727 oashc.HttpShardHandlerFactory.getParameter Setting maxThreadIdleTime to: 5
[junit4:junit4]   2> 909 T1727 oashc.HttpShardHandlerFactory.getParameter Setting sizeOfQueue to: -1
[junit4:junit4]   2> 909 T1727 oashc.HttpShardHandlerFactory.getParameter Setting fairnessPolicy to: false
[junit4:junit4]   2> 909 T1727 oascsi.HttpClientUtil.createClient Creating new http client, config:maxConnectionsPerHost=20&maxConnections=10000&socketTimeout=0&connTimeout=0&retry=false
[junit4:junit4]   2> 911 T1767 oasc.SolrCore.registerSearcher [collection1] Registered new searcher Searcher@38c25498 main{StandardDirectoryReader(segments_1:1)}
[junit4:junit4]   2> 911 T1727 oasc.CoreContainer.register registering core: collection1
[junit4:junit4]   2> 912 T1727 oass.SolrDispatchFilter.init user.dir=/mnt/ssd/jenkins/workspace/Lucene-Solr-trunk-Linux/checkout/solr/build/solr-core/test/J0
[junit4:junit4]   2> 912 T1727 oass.SolrDispatchFilter.init SolrDispatchFilter.init() done
[junit4:junit4]   2> 912 T1727 oascsi.HttpClientUtil.createClient Creating new http client, config:maxConnections=128&maxConnectionsPerHost=32&followRedirects=false
[junit4:junit4]   2> ASYNC  NEW_CORE C101 name=collection1 org.apache.solr.core.SolrCore@587ac99c
[junit4:junit4]   2> 918 T1730 C101 oasu.DirectUpdateHandler2.deleteAll [collection1] REMOVING ALL DOCUMENTS FROM INDEX
[junit4:junit4]   2> 920 T1730 C101 oasc.SolrDeletionPolicy.onInit SolrDeletionPolicy.onInit: commits:num=1
[junit4:junit4]   2> 		commit{dir=MockDirWrapper(org.apache.lucene.store.NIOFSDirectory@/mnt/ssd/jenkins/workspace/Lucene-Solr-trunk-Linux/checkout/solr/build/solr-core/test/J0/index5405454061tmp lockFactory=org.apache.lucene.store.SingleInstanceLockFactory@71509316),segFN=segments_1,generation=1,filenames=[segments_1]
[junit4:junit4]   2> 921 T1730 C101 oasc.SolrDeletionPolicy.updateCommits newest commit = 1
[junit4:junit4]   2> 921 T1730 C101 UPDATE [collection1] webapp=/solr path=/update params={version=2&wt=javabin} {deleteByQuery=*:*} 0 3
[junit4:junit4]   2> ASYNC  NEW_CORE C102 name=collection1 org.apache.solr.core.SolrCore@12352788
[junit4:junit4]   2> 925 T1740 C102 oasu.DirectUpdateHandler2.deleteAll [collection1] REMOVING ALL DOCUMENTS FROM INDEX
[junit4:junit4]   2> 926 T1740 C102 oasc.SolrDeletionPolicy.onInit SolrDeletionPolicy.onInit: commits:num=1
[junit4:junit4]   2> 		commit{dir=MockDirWrapper(org.apache.lucene.store.RAMDirectory@5fb65b0e lockFactory=org.apache.lucene.store.SingleInstanceLockFactory@7597e082),segFN=segments_1,generation=1,filenames=[segments_1]
[junit4:junit4]   2> 927 T1740 C102 oasc.SolrDeletionPolicy.updateCommits newest commit = 1
[junit4:junit4]   2> 927 T1740 C102 UPDATE [collection1] webapp=/solr path=/update params={version=2&wt=javabin} {deleteByQuery=*:*} 0 2
[junit4:junit4]   2> ASYNC  NEW_CORE C103 name=collection1 org.apache.solr.core.SolrCore@11f7a983
[junit4:junit4]   2> 931 T1750 C103 oasu.DirectUpdateHandler2.deleteAll [collection1] REMOVING ALL DOCUMENTS FROM INDEX
[junit4:junit4]   2> 932 T1750 C103 oasc.SolrDeletionPolicy.onInit SolrDeletionPolicy.onInit: commits:num=1
[junit4:junit4]   2> 		commit{dir=MockDirWrapper(org.apache.lucene.store.RAMDirectory@1a99e0ac lockFactory=org.apache.lucene.store.SingleInstanceLockFactory@7b0b3b84),segFN=segments_1,generation=1,filenames=[segments_1]
[junit4:junit4]   2> 933 T1750 C103 oasc.SolrDeletionPolicy.updateCommits newest commit = 1
[junit4:junit4]   2> 933 T1750 C103 UPDATE [collection1] webapp=/solr path=/update params={version=2&wt=javabin} {deleteByQuery=*:*} 0 2
[junit4:junit4]   2> ASYNC  NEW_CORE C104 name=collection1 org.apache.solr.core.SolrCore@5d6a4ec1
[junit4:junit4]   2> 937 T1760 C104 oasu.DirectUpdateHandler2.deleteAll [collection1] REMOVING ALL DOCUMENTS FROM INDEX
[junit4:junit4]   2> 938 T1760 C104 oasc.SolrDeletionPolicy.onInit SolrDeletionPolicy.onInit: commits:num=1
[junit4:junit4]   2> 		commit{dir=MockDirWrapper(org.apache.lucene.store.RAMDirectory@6e5890d0 lockFactory=org.apache.lucene.store.SingleInstanceLockFactory@e9334cc),segFN=segments_1,generation=1,filenames=[segments_1]
[junit4:junit4]   2> 938 T1760 C104 oasc.SolrDeletionPolicy.updateCommits newest commit = 1
[junit4:junit4]   2> 939 T1760 C104 UPDATE [collection1] webapp=/solr path=/update params={version=2&wt=javabin} {deleteByQuery=*:*} 0 2
[junit4:junit4]   2> 942 T1730 C101 UPDATE [collection1] webapp=/solr path=/update params={version=2&wt=javabin} {add=[1]} 0 1
[junit4:junit4]   2> 944 T1740 C102 UPDATE [collection1] webapp=/solr path=/update params={version=2&wt=javabin} {add=[1]} 0 0
[junit4:junit4]   2> 946 T1730 C101 UPDATE [collection1] webapp=/solr path=/update params={version=2&wt=javabin} {add=[2]} 0 0
[junit4:junit4]   2> 949 T1750 C103 UPDATE [collection1] webapp=/solr path=/update params={version=2&wt=javabin} {add=[2]} 0 1
[junit4:junit4]   2> 951 T1730 C101 UPDATE [collection1] webapp=/solr path=/update params={version=2&wt=javabin} {add=[3]} 0 0
[junit4:junit4]   2> 953 T1760 C104 UPDATE [collection1] webapp=/solr path=/update params={version=2&wt=javabin} {add=[3]} 0 0
[junit4:junit4]   2> 955 T1730 C101 UPDATE [collection1] webapp=/solr path=/update params={version=2&wt=javabin} {add=[4]} 0 0
[junit4:junit4]   2> 957 T1740 C102 UPDATE [collection1] webapp=/solr path=/update params={version=2&wt=javabin} {add=[4]} 0 0
[junit4:junit4]   2> 959 T1730 C101 UPDATE [collection1] webapp=/solr path=/update params={version=2&wt=javabin} {add=[5]} 0 0
[junit4:junit4]   2> 961 T1750 C103 UPDATE [collection1] webapp=/solr path=/update params={version=2&wt=javabin} {add=[5]} 0 0
[junit4:junit4]   2> 963 T1730 C101 UPDATE [collection1] webapp=/solr path=/update params={version=2&wt=javabin} {add=[6]} 0 0
[junit4:junit4]   2> 965 T1760 C104 UPDATE [collection1] webapp=/solr path=/update params={version=2&wt=javabin} {add=[6]} 0 0
[junit4:junit4]   2> 969 T1730 C101 UPDATE [collection1] webapp=/solr path=/update params={version=2&wt=javabin} {add=[7]} 0 2
[junit4:junit4]   2> 978 T1760 C104 UPDATE [collection1] webapp=/solr path=/update params={version=2&wt=javabin} {add=[7]} 0 0
[junit4:junit4]   2> 981 T1730 C101 oasu.DirectUpdateHandler2.commit start commit{flags=0,_version_=0,optimize=false,openSearcher=true,waitSearcher=true,expungeDeletes=false,softCommit=false}
[junit4:junit4]   2> 990 T1730 C101 oasc.SolrDeletionPolicy.onCommit SolrDeletionPolicy.onCommit: commits:num=2
[junit4:junit4]   2> 		commit{dir=MockDirWrapper(org.apache.lucene.store.NIOFSDirectory@/mnt/ssd/jenkins/workspace/Lucene-Solr-trunk-Linux/checkout/solr/build/solr-core/test/J0/index5405454061tmp lockFactory=org.apache.lucene.store.SingleInstanceLockFactory@71509316),segFN=segments_1,generation=1,filenames=[segments_1]
[junit4:junit4]   2> 		commit{dir=MockDirWrapper(org.apache.lucene.store.NIOFSDirectory@/mnt/ssd/jenkins/workspace/Lucene-Solr-trunk-Linux/checkout/solr/build/solr-core/test/J0/index5405454061tmp lockFactory=org.apache.lucene.store.SingleInstanceLockFactory@71509316),segFN=segments_2,generation=2,filenames=[_0_Memory_0.ram, _0.fdt, _0_Direct_0.frq, _0.fnm, _0_Direct_0.prx, _0_nrm.cfs, _0.si, _0.fdx, _0_Direct_0.tim, _0_Direct_0.tip, segments_2, _0_nrm.cfe]
[junit4:junit4]   2> 990 T1730 C101 oasc.SolrDeletionPolicy.updateCommits newest commit = 2
[junit4:junit4]   2> 993 T1730 C101 oass.SolrIndexSearcher.<init> Opening Searcher@617c8341 main
[junit4:junit4]   2> 993 T1730 C101 oass.SolrIndexSearcher.getIndexDir WARNING WARNING: Directory impl does not support setting indexDir: org.apache.lucene.store.MockDirectoryWrapper
[junit4:junit4]   2> 993 T1730 C101 oasu.DirectUpdateHandler2.commit end_commit_flush
[junit4:junit4]   2> 994 T1737 oasc.SolrCore.registerSearcher [collection1] Registered new searcher Searcher@617c8341 main{StandardDirectoryReader(segments_2:4 _0(5.0):C7)}
[junit4:junit4]   2> 994 T1730 C101 UPDATE [collection1] webapp=/solr path=/update params={waitSearcher=true&wt=javabin&softCommit=false&commit=true&version=2} {commit=} 0 13
[junit4:junit4]   2> 997 T1740 C102 oasu.DirectUpdateHandler2.commit start commit{flags=0,_version_=0,optimize=false,openSearcher=true,waitSearcher=true,expungeDeletes=false,softCommit=false}
[junit4:junit4]   2> 999 T1740 C102 oasc.SolrDeletionPolicy.onCommit SolrDeletionPolicy.onCommit: commits:num=2
[junit4:junit4]   2> 		commit{dir=MockDirWrapper(org.apache.lucene.store.RAMDirectory@5fb65b0e lockFactory=org.apache.lucene.store.SingleInstanceLockFactory@7597e082),segFN=segments_1,generation=1,filenames=[segments_1]
[junit4:junit4]   2> 		commit{dir=MockDirWrapper(org.apache.lucene.store.RAMDirectory@5fb65b0e lockFactory=org.apache.lucene.store.SingleInstanceLockFactory@7597e082),segFN=segments_2,generation=2,filenames=[_0_Memory_0.ram, _0.fdt, _0_Direct_0.frq, _0.fnm, _0_Direct_0.prx, _0_nrm.cfs, _0.si, _0.fdx, _0_Direct_0.tim, _0_Direct_0.tip, segments_2, _0_nrm.cfe]
[junit4:junit4]   2> 999 T1740 C102 oasc.SolrDeletionPolicy.updateCommits newest commit = 2
[junit4:junit4]   2> 1017 T1740 C102 oass.SolrIndexSearcher.<init> Opening Searcher@458ee7c4 main
[junit4:junit4]   2> 1017 T1740 C102 oass.SolrIndexSearcher.getIndexDir WARNING WARNING: Directory impl does not support setting indexDir: org.apache.lucene.store.MockDirectoryWrapper
[junit4:junit4]   2> 1017 T1740 C102 oasu.DirectUpdateHandler2.commit end_commit_flush
[junit4:junit4]   2> 1018 T1747 oasc.SolrCore.registerSearcher [collection1] Registered new searcher Searcher@458ee7c4 main{StandardDirectoryReader(segments_2:4 _0(5.0):C2)}
[junit4:junit4]   2> 1019 T1740 C102 UPDATE [collection1] webapp=/solr path=/update params={waitSearcher=true&wt=javabin&softCommit=false&commit=true&version=2} {commit=} 0 22
[junit4:junit4]   2> 1021 T1750 C103 oasu.DirectUpdateHandler2.commit start commit{flags=0,_version_=0,optimize=false,openSearcher=true,waitSearcher=true,expungeDeletes=false,softCommit=false}
[junit4:junit4]   2> 1022 T1750 C103 oasc.SolrDeletionPolicy.onCommit SolrDeletionPolicy.onCommit: commits:num=2
[junit4:junit4]   2> 		commit{dir=MockDirWrapper(org.apache.lucene.store.RAMDirectory@1a99e0ac lockFactory=org.apache.lucene.store.SingleInstanceLockFactory@7b0b3b84),segFN=segments_1,generation=1,filenames=[segments_1]
[junit4:junit4]   2> 		commit{dir=MockDirWrapper(org.apache.lucene.store.RAMDirectory@1a99e0ac lockFactory=org.apache.lucene.store.SingleInstanceLockFactory@7b0b3b84),segFN=segments_2,generation=2,filenames=[_0_Memory_0.ram, _0.fdt, _0_Direct_0.frq, _0.fnm, _0_Direct_0.prx, _0_nrm.cfs, _0.si, _0.fdx, _0_Direct_0.tim, _0_Direct_0.tip, segments_2, _0_nrm.cfe]
[junit4:junit4]   2> 1022 T1750 C103 oasc.SolrDeletionPolicy.updateCommits newest commit = 2
[junit4:junit4]   2> 1024 T1750 C103 oass.SolrIndexSearcher.<init> Opening Searcher@4082076a main
[junit4:junit4]   2> 1024 T1750 C103 oass.SolrIndexSearcher.getIndexDir WARNING WARNING: Directory impl does not support setting indexDir: org.apache.lucene.store.MockDirectoryWrapper
[junit4:junit4]   2> 1024 T1750 C103 oasu.DirectUpdateHandler2.commit end_commit_flush
[junit4:junit4]   2> 1025 T1757 oasc.SolrCore.registerSearcher [collection1] Registered new searcher Searcher@4082076a main{StandardDirectoryReader(segments_2:4 _0(5.0):C2)}
[junit4:junit4]   2> 1026 T1750 C103 UPDATE [collection1] webapp=/solr path=/update params={waitSearcher=true&wt=javabin&softCommit=false&commit=true&version=2} {commit=} 0 5
[junit4:junit4]   2> 1028 T1760 C104 oasu.DirectUpdateHandler2.commit start commit{flags=0,_version_=0,optimize=false,openSearcher=true,waitSearcher=true,expungeDeletes=false,softCommit=false}
[junit4:junit4]   2> 1029 T1760 C104 oasc.SolrDeletionPolicy.onCommit SolrDeletionPolicy.onCommit: commits:num=2
[junit4:junit4]   2> 		commit{dir=MockDirWrapper(org.apache.lucene.store.RAMDirectory@6e5890d0 lockFactory=org.apache.lucene.store.SingleInstanceLockFactory@e9334cc),segFN=segments_1,generation=1,filenames=[segments_1]
[junit4:junit4]   2> 		commit{dir=MockDirWrapper(org.apache.lucene.store.RAMDirectory@6e5890d0 lockFactory=org.apache.lucene.store.SingleInstanceLockFactory@e9334cc),segFN=segments_2,generation=2,filenames=[_0_Memory_0.ram, _0.fdt, _0_Direct_0.frq, _0.fnm, _0_Direct_0.prx, _0_nrm.cfs, _0.si, _0.fdx, _0_Direct_0.tim, _0_Direct_0.tip, segments_2, _0_nrm.cfe]
[junit4:junit4]   2> 1030 T1760 C104 oasc.SolrDeletionPolicy.updateCommits newest commit = 2
[junit4:junit4]   2> 1031 T1760 C104 oass.SolrIndexSearcher.<init> Opening Searcher@6ac8f8db main
[junit4:junit4]   2> 1031 T1760 C104 oass.SolrIndexSearcher.getIndexDir WARNING WARNING: Directory impl does not support setting indexDir: org.apache.lucene.store.MockDirectoryWrapper
[junit4:junit4]   2> 1031 T1760 C104 oasu.DirectUpdateHandler2.commit end_commit_flush
[junit4:junit4]   2> 1032 T1767 oasc.SolrCore.registerSearcher [collection1] Registered new searcher Searcher@6ac8f8db main{StandardDirectoryReader(segments_2:4 _0(5.0):C3)}
[junit4:junit4]   2> 1033 T1760 C104 UPDATE [collection1] webapp=/solr path=/update params={waitSearcher=true&wt=javabin&softCommit=false&commit=true&version=2} {commit=} 0 5
[junit4:junit4]   2> 1041 T1730 C101 REQ [collection1] webapp=/solr path=/elevate params={shards.qt=/elevate&version=2&fl=id,+score,+[elevated]&wt=javabin&rows=500&q=*:*&sort=id+desc&qt=/elevate&distrib=false} hits=7 status=0 QTime=6 
[junit4:junit4]   2> 1095 T1741 C102 REQ [collection1] webapp=/solr path=/elevate params={NOW=1344201377828&shard.url=localhost:55281/solr&fl=id,score&start=0&rows=500&sort=id+desc&shards.qt=/elevate&version=2&fsv=true&isShard=true&wt=javabin&q=*:*&qt=/elevate&distrib=false} hits=2 status=0 QTime=1 
[junit4:junit4]   2> 1103 T1761 C104 REQ [collection1] webapp=/solr path=/elevate params={NOW=1344201377828&shard.url=localhost:46899/solr&fl=id,score&start=0&rows=500&sort=id+desc&shards.qt=/elevate&version=2&fsv=true&isShard=true&wt=javabin&q=*:*&qt=/elevate&distrib=false} hits=3 status=0 QTime=1 
[junit4:junit4]   2> 1109 T1751 C103 REQ [collection1] webapp=/solr path=/elevate params={NOW=1344201377828&shard.url=[::1]:33332/solr|localhost:52054/solr&fl=id,score&start=0&rows=500&sort=id+desc&shards.qt=/elevate&version=2&fsv=true&isShard=true&wt=javabin&q=*:*&qt=/elevate&distrib=false} hits=2 status=0 QTime=0 
[junit4:junit4]   2> 1113 T1761 C104 REQ [collection1] webapp=/solr path=/elevate params={NOW=1344201377828&shard.url=localhost:46899/solr&fl=id,+score,+[elevated]&rows=500&ids=7.0,3.0,6.0&shards.qt=/elevate&version=2&isShard=true&wt=javabin&q=*:*&qt=/elevate&distrib=false} status=0 QTime=0 
[junit4:junit4]   2> 1113 T1741 C102 REQ [collection1] webapp=/solr path=/elevate params={NOW=1344201377828&shard.url=localhost:55281/solr&fl=id,+score,+[elevated]&rows=500&ids=1.0,4.0&shards.qt=/elevate&version=2&isShard=true&wt=javabin&q=*:*&qt=/elevate&distrib=false} status=0 QTime=0 
[junit4:junit4]   2> 1113 T1751 C103 REQ [collection1] webapp=/solr path=/elevate params={NOW=1344201377828&shard.url=[::1]:33332/solr|localhost:52054/solr&fl=id,+score,+[elevated]&rows=500&ids=5.0,2.0&shards.qt=/elevate&version=2&isShard=true&wt=javabin&q=*:*&qt=/elevate&distrib=false} status=0 QTime=0 
[junit4:junit4]   2> 1117 T1750 C103 REQ [collection1] webapp=/solr path=/elevate params={shards=localhost:55281/solr,[::1]:33332/solr|localhost:52054/solr,localhost:46899/solr&shards.qt=/elevate&version=2&fl=id,+score,+[elevated]&wt=javabin&rows=500&q=*:*&sort=id+desc&qt=/elevate} status=0 QTime=59 
[junit4:junit4]   2> 1118 T1727 oas.BaseDistributedSearchTestCase.compareResponses SEVERE Mismatched responses:
[junit4:junit4]   2> 	{responseHeader={status=0,QTime=59,params={shards=localhost:55281/solr,[::1]:33332/solr|localhost:52054/solr,localhost:46899/solr,shards.qt=/elevate,version=2,fl=id, score, [elevated],wt=javabin,rows=500,q=*:*,sort=id desc,qt=/elevate}},response={numFound=7,start=0,maxScore=1.0,docs=[SolrDocument{id=7.0, [elevated]=false, score=1.0}, SolrDocument{id=6.0, [elevated]=false, score=1.0}, SolrDocument{id=5.0, [elevated]=false, score=1.0}, SolrDocument{id=4.0, [elevated]=false, score=1.0}, SolrDocument{id=3.0, [elevated]=false, score=1.0}, SolrDocument{id=2.0, [elevated]=false, score=1.0}, SolrDocument{id=1.0, [elevated]=false, score=1.0}]}}
[junit4:junit4]   2> 	{responseHeader={status=0,QTime=6,params={shards.qt=/elevate,version=2,fl=id, score, [elevated],wt=javabin,rows=500,q=*:*,sort=id desc,qt=/elevate,distrib=false}},response={numFound=7,start=0,maxScore=1.0,docs=[SolrDocument{id=7.0, score=1.0, [elevated]=false}, SolrDocument{id=6.0, score=1.0, [elevated]=false}, SolrDocument{id=5.0, score=1.0, [elevated]=false}, SolrDocument{id=4.0, score=1.0, [elevated]=false}, SolrDocument{id=3.0, score=1.0, [elevated]=false}, SolrDocument{id=2.0, score=1.0, [elevated]=false}, SolrDocument{id=1.0, score=1.0, [elevated]=false}]}}
[junit4:junit4]   2> 1119 T1727 oasc.CoreContainer.shutdown Shutting down CoreContainer instance=507741047
[junit4:junit4]   2> 1119 T1727 oasc.SolrCore.close [collection1]  CLOSING SolrCore org.apache.solr.core.SolrCore@587ac99c
[junit4:junit4]   2> 1121 T1727 oasc.SolrCore.closeSearcher [collection1] Closing main searcher on request.
[junit4:junit4]   2> 1121 T1727 oasu.DirectUpdateHandler2.close closing DirectUpdateHandler2{commits=1,autocommits=0,soft autocommits=0,optimizes=0,rollbacks=0,expungeDeletes=0,docsPending=0,adds=0,deletesById=0,deletesByQuery=0,errors=0,cumulative_adds=7,cumulative_deletesById=0,cumulative_deletesByQuery=1,cumulative_errors=0}
[junit4:junit4]   2> 1125 T1727 oejsh.ContextHandler.doStop stopped o.e.j.s.ServletContextHandler{/solr,null}
[junit4:junit4]   2> 1177 T1727 oasc.CoreContainer.shutdown Shutting down CoreContainer instance=2091555932
[junit4:junit4]   2> 1178 T1727 oasc.SolrCore.close [collection1]  CLOSING SolrCore org.apache.solr.core.SolrCore@12352788
[junit4:junit4]   2> 1179 T1727 oasc.SolrCore.closeSearcher [collection1] Closing main searcher on request.
[junit4:junit4]   2> 1180 T1727 oasu.DirectUpdateHandler2.close closing DirectUpdateHandler2{commits=1,autocommits=0,soft autocommits=0,optimizes=0,rollbacks=0,expungeDeletes=0,docsPending=0,adds=0,deletesById=0,deletesByQuery=0,errors=0,cumulative_adds=2,cumulative_deletesById=0,cumulative_deletesByQuery=1,cumulative_errors=0}
[junit4:junit4]   2> 1182 T1727 oejsh.ContextHandler.doStop stopped o.e.j.s.ServletContextHandler{/solr,null}
[junit4:junit4]   2> 1233 T1727 oasc.CoreContainer.shutdown Shutting down CoreContainer instance=758758930
[junit4:junit4]   2> 1234 T1727 oasc.SolrCore.close [collection1]  CLOSING SolrCore org.apache.solr.core.SolrCore@11f7a983
[junit4:junit4]   2> 1234 T1727 oasc.SolrCore.closeSearcher [collection1] Closing main searcher on request.
[junit4:junit4]   2> 1235 T1727 oasu.DirectUpdateHandler2.close closing DirectUpdateHandler2{commits=1,autocommits=0,soft autocommits=0,optimizes=0,rollbacks=0,expungeDeletes=0,docsPending=0,adds=0,deletesById=0,deletesByQuery=0,errors=0,cumulative_adds=2,cumulative_deletesById=0,cumulative_deletesByQuery=1,cumulative_errors=0}
[junit4:junit4]   2> 1237 T1727 oejsh.ContextHandler.doStop stopped o.e.j.s.ServletContextHandler{/solr,null}
[junit4:junit4]   2> 1289 T1727 oasc.CoreContainer.shutdown Shutting down CoreContainer instance=1151795172
[junit4:junit4]   2> 1290 T1727 oasc.SolrCore.close [collection1]  CLOSING SolrCore org.apache.solr.core.SolrCore@5d6a4ec1
[junit4:junit4]   2> 1290 T1727 oasc.SolrCore.closeSearcher [collection1] Closing main searcher on request.
[junit4:junit4]   2> 1290 T1727 oasu.DirectUpdateHandler2.close closing DirectUpdateHandler2{commits=1,autocommits=0,soft autocommits=0,optimizes=0,rollbacks=0,expungeDeletes=0,docsPending=0,adds=0,deletesById=0,deletesByQuery=0,errors=0,cumulative_adds=3,cumulative_deletesById=0,cumulative_deletesByQuery=1,cumulative_errors=0}
[junit4:junit4]   2> 1293 T1727 oejsh.ContextHandler.doStop stopped o.e.j.s.ServletContextHandler{/solr,null}
[junit4:junit4]   2> 1344 T1727 oas.SolrTestCaseJ4.tearDown ###Ending testDistribSearch
[junit4:junit4]   2> NOTE: reproduce with: ant test  -Dtestcase=DistributedQueryElevationComponentTest -Dtests.method=testDistribSearch -Dtests.seed=105EC6E8761EF9A8 -Dtests.multiplier=3 -Dtests.slow=true -Dtests.locale=ru -Dtests.timezone=America/Cancun -Dtests.file.encoding=UTF-8
[junit4:junit4]   2>
[junit4:junit4]    > (@AfterClass output)
[junit4:junit4]   2> 1395 T1727 oas.SolrTestCaseJ4.deleteCore ###deleteCore
[junit4:junit4]   2> NOTE: test params are: codec=Lucene40: {text=PostingsFormat(name=Memory doPackFST= true), int_i=PostingsFormat(name=Memory doPackFST= true), id=PostingsFormat(name=Direct), field_t=PostingsFormat(name=Memory doPackFST= true), plow_t=PostingsFormat(name=Direct)}, sim=DefaultSimilarity, locale=ru, timezone=America/Cancun
[junit4:junit4]   2> NOTE: Linux 3.2.0-27-generic amd64/Oracle Corporation 1.8.0-ea (64-bit)/cpus=8,threads=1,free=122666376,total=518979584
[junit4:junit4]   2> NOTE: All tests run in this JVM: [BasicFunctionalityTest, TestUtils, BadComponentTest, TestUpdate, TestBinaryField, SoftAutoCommitTest, SpellingQueryConverterTest, DirectSolrSpellCheckerTest, SpellCheckCollatorTest, TestBadConfig, SolrPluginUtilsTest, SuggesterFSTTest, DateMathParserTest, DistributedSpellCheckComponentTest, TestPHPSerializedResponseWriter, ReturnFieldsTest, TestLFUCache, TestOmitPositions, BasicZkTest, AnalysisAfterCoreReloadTest, TestIndexingPerformance, SimpleFacetsTest, TestSolrCoreProperties, ConvertedLegacyTest, ScriptEngineTest, FileUtilsTest, CurrencyFieldTest, DefaultValueUpdateProcessorTest, SuggesterWFSTTest, DisMaxRequestHandlerTest, TestValueSourceCache, SearchHandlerTest, SpatialFilterTest, PluginInfoTest, TestQuerySenderListener, PreAnalyzedFieldTest, TestFoldingMultitermQuery, DistanceFunctionTest, TestFiltering, LeaderElectionIntegrationTest, IndexBasedSpellCheckerTest, PingRequestHandlerTest, TestRandomFaceting, CoreContainerCoreInitFailuresTest, TestCodecSupport, FullSolrCloudDistribCmdsTest, XmlUpdateRequestHandlerTest, TestPhraseSuggestions, TestFunctionQuery, TestConfig, TestMergePolicyConfig, RecoveryZkTest, TestReplicationHandler, TestRealTimeGet, ZkControllerTest, TestDistributedGrouping, TestExtendedDismaxParser, TestHashPartitioner, DistributedTermsComponentTest, TestJoin, SolrRequestParserTest, CacheHeaderTest, TestCSVLoader, DocumentBuilderTest, DistributedQueryElevationComponentTest]
[junit4:junit4]   2> 
[junit4:junit4] Completed on J0 in 1.42s, 1 test, 1 failure <<< FAILURES!

[...truncated 226 lines...]
BUILD FAILED
/mnt/ssd/jenkins/workspace/Lucene-Solr-trunk-Linux/checkout/build.xml:29: The following error occurred while executing this line:
/mnt/ssd/jenkins/workspace/Lucene-Solr-trunk-Linux/checkout/solr/build.xml:144: The following error occurred while executing this line:
/mnt/ssd/jenkins/workspace/Lucene-Solr-trunk-Linux/checkout/lucene/module-build.xml:62: The following error occurred while executing this line:
/mnt/ssd/jenkins/workspace/Lucene-Solr-trunk-Linux/checkout/lucene/common-build.xml:1095: The following error occurred while executing this line:
/mnt/ssd/jenkins/workspace/Lucene-Solr-trunk-Linux/checkout/lucene/common-build.xml:790: There were test failures: 223 suites, 898 tests, 1 failure, 5 ignored

Total time: 18 minutes 56 seconds
Build step 'Execute shell' marked build as failure
Archiving artifacts
Recording test results
Email was triggered for: Failure
Sending email for trigger: Failure



Mime
View raw message