lucene-dev mailing list archives

Site index · List index
Message view « Date » · « Thread »
Top « Date » · « Thread »
From Policeman Jenkins Server <jenk...@sd-datasolutions.de>
Subject [JENKINS] Lucene-Solr-4.x-Linux (64bit/jdk1.8.0-ea-b49) - Build # 98 - Failure!
Date Thu, 02 Aug 2012 06:15:24 GMT
Build: http://jenkins.sd-datasolutions.de/job/Lucene-Solr-4.x-Linux/98/
Java: 64bit/jdk1.8.0-ea-b49 -XX:+UseSerialGC

1 tests failed.
REGRESSION:  org.apache.solr.handler.component.DistributedQueryElevationComponentTest.testDistribSearch

Error Message:
.responseHeader.params.shards.qt:/elevate!=false

Stack Trace:
junit.framework.AssertionFailedError: .responseHeader.params.shards.qt:/elevate!=false
	at __randomizedtesting.SeedInfo.seed([A69D4244CFBDD68C:277BCC5CB8E2B6B0]:0)
	at junit.framework.Assert.fail(Assert.java:50)
	at org.apache.solr.BaseDistributedSearchTestCase.compareResponses(BaseDistributedSearchTestCase.java:670)
	at org.apache.solr.BaseDistributedSearchTestCase.query(BaseDistributedSearchTestCase.java:392)
	at org.apache.solr.handler.component.DistributedQueryElevationComponentTest.doTest(DistributedQueryElevationComponentTest.java:81)
	at org.apache.solr.BaseDistributedSearchTestCase.testDistribSearch(BaseDistributedSearchTestCase.java:679)
	at sun.reflect.NativeMethodAccessorImpl.invoke0(Native Method)
	at sun.reflect.NativeMethodAccessorImpl.invoke(NativeMethodAccessorImpl.java:57)
	at sun.reflect.DelegatingMethodAccessorImpl.invoke(DelegatingMethodAccessorImpl.java:43)
	at java.lang.reflect.Method.invoke(Method.java:474)
	at com.carrotsearch.randomizedtesting.RandomizedRunner.invoke(RandomizedRunner.java:1995)
	at com.carrotsearch.randomizedtesting.RandomizedRunner.access$1100(RandomizedRunner.java:132)
	at com.carrotsearch.randomizedtesting.RandomizedRunner$6.evaluate(RandomizedRunner.java:818)
	at com.carrotsearch.randomizedtesting.RandomizedRunner$7.evaluate(RandomizedRunner.java:877)
	at com.carrotsearch.randomizedtesting.RandomizedRunner$8.evaluate(RandomizedRunner.java:891)
	at com.carrotsearch.randomizedtesting.rules.SystemPropertiesRestoreRule$1.evaluate(SystemPropertiesRestoreRule.java:53)
	at org.apache.lucene.util.TestRuleSetupTeardownChained$1.evaluate(TestRuleSetupTeardownChained.java:50)
	at org.apache.lucene.util.TestRuleFieldCacheSanity$1.evaluate(TestRuleFieldCacheSanity.java:32)
	at org.apache.lucene.util.AbstractBeforeAfterRule$1.evaluate(AbstractBeforeAfterRule.java:45)
	at com.carrotsearch.randomizedtesting.rules.SystemPropertiesInvariantRule$1.evaluate(SystemPropertiesInvariantRule.java:55)
	at org.apache.lucene.util.TestRuleReportUncaughtExceptions$1.evaluate(TestRuleReportUncaughtExceptions.java:68)
	at org.apache.lucene.util.TestRuleThreadAndTestName$1.evaluate(TestRuleThreadAndTestName.java:48)
	at org.apache.lucene.util.TestRuleIgnoreAfterMaxFailures$1.evaluate(TestRuleIgnoreAfterMaxFailures.java:70)
	at org.apache.lucene.util.TestRuleMarkFailure$1.evaluate(TestRuleMarkFailure.java:48)
	at com.carrotsearch.randomizedtesting.RandomizedRunner.runSingleTest(RandomizedRunner.java:825)
	at com.carrotsearch.randomizedtesting.RandomizedRunner.access$700(RandomizedRunner.java:132)
	at com.carrotsearch.randomizedtesting.RandomizedRunner$3$1.run(RandomizedRunner.java:671)
	at com.carrotsearch.randomizedtesting.RandomizedRunner$3.evaluate(RandomizedRunner.java:697)
	at com.carrotsearch.randomizedtesting.RandomizedRunner$4.evaluate(RandomizedRunner.java:736)
	at com.carrotsearch.randomizedtesting.RandomizedRunner$5.evaluate(RandomizedRunner.java:747)
	at com.carrotsearch.randomizedtesting.rules.SystemPropertiesRestoreRule$1.evaluate(SystemPropertiesRestoreRule.java:53)
	at org.apache.lucene.util.AbstractBeforeAfterRule$1.evaluate(AbstractBeforeAfterRule.java:45)
	at org.apache.lucene.util.TestRuleReportUncaughtExceptions$1.evaluate(TestRuleReportUncaughtExceptions.java:68)
	at org.apache.lucene.util.TestRuleStoreClassName$1.evaluate(TestRuleStoreClassName.java:38)
	at com.carrotsearch.randomizedtesting.rules.SystemPropertiesInvariantRule$1.evaluate(SystemPropertiesInvariantRule.java:55)
	at org.apache.lucene.util.TestRuleNoInstanceHooksOverrides$1.evaluate(TestRuleNoInstanceHooksOverrides.java:53)
	at org.apache.lucene.util.TestRuleNoStaticHooksShadowing$1.evaluate(TestRuleNoStaticHooksShadowing.java:52)
	at org.apache.lucene.util.TestRuleAssertionsRequired$1.evaluate(TestRuleAssertionsRequired.java:36)
	at org.apache.lucene.util.TestRuleMarkFailure$1.evaluate(TestRuleMarkFailure.java:48)
	at org.apache.lucene.util.TestRuleIgnoreAfterMaxFailures$1.evaluate(TestRuleIgnoreAfterMaxFailures.java:70)
	at org.apache.lucene.util.TestRuleIgnoreTestSuites$1.evaluate(TestRuleIgnoreTestSuites.java:55)
	at com.carrotsearch.randomizedtesting.RandomizedRunner.runSuite(RandomizedRunner.java:605)
	at com.carrotsearch.randomizedtesting.RandomizedRunner.access$400(RandomizedRunner.java:132)
	at com.carrotsearch.randomizedtesting.RandomizedRunner$2.run(RandomizedRunner.java:551)




Build Log:
[...truncated 7175 lines...]
[junit4:junit4] Suite: org.apache.solr.handler.component.DistributedQueryElevationComponentTest
[junit4:junit4] FAILURE 2.73s J1 | DistributedQueryElevationComponentTest.testDistribSearch
[junit4:junit4]    > Throwable #1: junit.framework.AssertionFailedError: .responseHeader.params.shards.qt:/elevate!=false
[junit4:junit4]    > 	at __randomizedtesting.SeedInfo.seed([A69D4244CFBDD68C:277BCC5CB8E2B6B0]:0)
[junit4:junit4]    > 	at junit.framework.Assert.fail(Assert.java:50)
[junit4:junit4]    > 	at org.apache.solr.BaseDistributedSearchTestCase.compareResponses(BaseDistributedSearchTestCase.java:670)
[junit4:junit4]    > 	at org.apache.solr.BaseDistributedSearchTestCase.query(BaseDistributedSearchTestCase.java:392)
[junit4:junit4]    > 	at org.apache.solr.handler.component.DistributedQueryElevationComponentTest.doTest(DistributedQueryElevationComponentTest.java:81)
[junit4:junit4]    > 	at org.apache.solr.BaseDistributedSearchTestCase.testDistribSearch(BaseDistributedSearchTestCase.java:679)
[junit4:junit4]    > 	at sun.reflect.NativeMethodAccessorImpl.invoke0(Native Method)
[junit4:junit4]    > 	at sun.reflect.NativeMethodAccessorImpl.invoke(NativeMethodAccessorImpl.java:57)
[junit4:junit4]    > 	at sun.reflect.DelegatingMethodAccessorImpl.invoke(DelegatingMethodAccessorImpl.java:43)
[junit4:junit4]    > 	at java.lang.reflect.Method.invoke(Method.java:474)
[junit4:junit4]    > 	at com.carrotsearch.randomizedtesting.RandomizedRunner.invoke(RandomizedRunner.java:1995)
[junit4:junit4]    > 	at com.carrotsearch.randomizedtesting.RandomizedRunner.access$1100(RandomizedRunner.java:132)
[junit4:junit4]    > 	at com.carrotsearch.randomizedtesting.RandomizedRunner$6.evaluate(RandomizedRunner.java:818)
[junit4:junit4]    > 	at com.carrotsearch.randomizedtesting.RandomizedRunner$7.evaluate(RandomizedRunner.java:877)
[junit4:junit4]    > 	at com.carrotsearch.randomizedtesting.RandomizedRunner$8.evaluate(RandomizedRunner.java:891)
[junit4:junit4]    > 	at com.carrotsearch.randomizedtesting.rules.SystemPropertiesRestoreRule$1.evaluate(SystemPropertiesRestoreRule.java:53)
[junit4:junit4]    > 	at org.apache.lucene.util.TestRuleSetupTeardownChained$1.evaluate(TestRuleSetupTeardownChained.java:50)
[junit4:junit4]    > 	at org.apache.lucene.util.TestRuleFieldCacheSanity$1.evaluate(TestRuleFieldCacheSanity.java:32)
[junit4:junit4]    > 	at org.apache.lucene.util.AbstractBeforeAfterRule$1.evaluate(AbstractBeforeAfterRule.java:45)
[junit4:junit4]    > 	at com.carrotsearch.randomizedtesting.rules.SystemPropertiesInvariantRule$1.evaluate(SystemPropertiesInvariantRule.java:55)
[junit4:junit4]    > 	at org.apache.lucene.util.TestRuleReportUncaughtExceptions$1.evaluate(TestRuleReportUncaughtExceptions.java:68)
[junit4:junit4]    > 	at org.apache.lucene.util.TestRuleThreadAndTestName$1.evaluate(TestRuleThreadAndTestName.java:48)
[junit4:junit4]    > 	at org.apache.lucene.util.TestRuleIgnoreAfterMaxFailures$1.evaluate(TestRuleIgnoreAfterMaxFailures.java:70)
[junit4:junit4]    > 	at org.apache.lucene.util.TestRuleMarkFailure$1.evaluate(TestRuleMarkFailure.java:48)
[junit4:junit4]    > 	at com.carrotsearch.randomizedtesting.RandomizedRunner.runSingleTest(RandomizedRunner.java:825)
[junit4:junit4]    > 	at com.carrotsearch.randomizedtesting.RandomizedRunner.access$700(RandomizedRunner.java:132)
[junit4:junit4]    > 	at com.carrotsearch.randomizedtesting.RandomizedRunner$3$1.run(RandomizedRunner.java:671)
[junit4:junit4]    > 	at com.carrotsearch.randomizedtesting.RandomizedRunner$3.evaluate(RandomizedRunner.java:697)
[junit4:junit4]    > 	at com.carrotsearch.randomizedtesting.RandomizedRunner$4.evaluate(RandomizedRunner.java:736)
[junit4:junit4]    > 	at com.carrotsearch.randomizedtesting.RandomizedRunner$5.evaluate(RandomizedRunner.java:747)
[junit4:junit4]    > 	at com.carrotsearch.randomizedtesting.rules.SystemPropertiesRestoreRule$1.evaluate(SystemPropertiesRestoreRule.java:53)
[junit4:junit4]    > 	at org.apache.lucene.util.AbstractBeforeAfterRule$1.evaluate(AbstractBeforeAfterRule.java:45)
[junit4:junit4]    > 	at org.apache.lucene.util.TestRuleReportUncaughtExceptions$1.evaluate(TestRuleReportUncaughtExceptions.java:68)
[junit4:junit4]    > 	at org.apache.lucene.util.TestRuleStoreClassName$1.evaluate(TestRuleStoreClassName.java:38)
[junit4:junit4]    > 	at com.carrotsearch.randomizedtesting.rules.SystemPropertiesInvariantRule$1.evaluate(SystemPropertiesInvariantRule.java:55)
[junit4:junit4]    > 	at org.apache.lucene.util.TestRuleNoInstanceHooksOverrides$1.evaluate(TestRuleNoInstanceHooksOverrides.java:53)
[junit4:junit4]    > 	at org.apache.lucene.util.TestRuleNoStaticHooksShadowing$1.evaluate(TestRuleNoStaticHooksShadowing.java:52)
[junit4:junit4]    > 	at org.apache.lucene.util.TestRuleAssertionsRequired$1.evaluate(TestRuleAssertionsRequired.java:36)
[junit4:junit4]    > 	at org.apache.lucene.util.TestRuleMarkFailure$1.evaluate(TestRuleMarkFailure.java:48)
[junit4:junit4]    > 	at org.apache.lucene.util.TestRuleIgnoreAfterMaxFailures$1.evaluate(TestRuleIgnoreAfterMaxFailures.java:70)
[junit4:junit4]    > 	at org.apache.lucene.util.TestRuleIgnoreTestSuites$1.evaluate(TestRuleIgnoreTestSuites.java:55)
[junit4:junit4]    > 	at com.carrotsearch.randomizedtesting.RandomizedRunner.runSuite(RandomizedRunner.java:605)
[junit4:junit4]    > 	at com.carrotsearch.randomizedtesting.RandomizedRunner.access$400(RandomizedRunner.java:132)
[junit4:junit4]    > 	at com.carrotsearch.randomizedtesting.RandomizedRunner$2.run(RandomizedRunner.java:551)
[junit4:junit4]    > 
[junit4:junit4]   2> 4 T72 oas.SolrTestCaseJ4.setUp ###Starting testDistribSearch
[junit4:junit4]   2> 77 T72 oejs.Server.doStart jetty-8.1.2.v20120308
[junit4:junit4]   2> 182 T72 oejs.AbstractConnector.doStart Started SocketConnector@0.0.0.0:36013
[junit4:junit4]   2> 333 T72 oasc.SolrResourceLoader.locateSolrHome JNDI not configured for solr (NoInitialContextEx)
[junit4:junit4]   2> 333 T72 oasc.SolrResourceLoader.locateSolrHome using system property solr.solr.home: /mnt/ssd/jenkins/workspace/Lucene-Solr-4.x-Linux/checkout/solr/build/solr-core/test-files/solr
[junit4:junit4]   2> 334 T72 oasc.SolrResourceLoader.<init> new SolrResourceLoader for deduced Solr Home: '/mnt/ssd/jenkins/workspace/Lucene-Solr-4.x-Linux/checkout/solr/build/solr-core/test-files/solr/'
[junit4:junit4]   2> 343 T72 oass.SolrDispatchFilter.init SolrDispatchFilter.init()
[junit4:junit4]   2> 343 T72 oasc.SolrResourceLoader.locateSolrHome JNDI not configured for solr (NoInitialContextEx)
[junit4:junit4]   2> 344 T72 oasc.SolrResourceLoader.locateSolrHome using system property solr.solr.home: /mnt/ssd/jenkins/workspace/Lucene-Solr-4.x-Linux/checkout/solr/build/solr-core/test-files/solr
[junit4:junit4]   2> 345 T72 oasc.CoreContainer$Initializer.initialize looking for solr.xml: /mnt/ssd/jenkins/workspace/Lucene-Solr-4.x-Linux/checkout/solr/build/solr-core/test-files/solr/solr.xml
[junit4:junit4]   2> 345 T72 oasc.CoreContainer.<init> New CoreContainer 877728880
[junit4:junit4]   2> 346 T72 oasc.CoreContainer.load Loading CoreContainer using Solr Home: '/mnt/ssd/jenkins/workspace/Lucene-Solr-4.x-Linux/checkout/solr/build/solr-core/test-files/solr/'
[junit4:junit4]   2> 346 T72 oasc.SolrResourceLoader.<init> new SolrResourceLoader for directory: '/mnt/ssd/jenkins/workspace/Lucene-Solr-4.x-Linux/checkout/solr/build/solr-core/test-files/solr/'
[junit4:junit4]   2> 356 T72 oasc.CoreContainer.load Registering Log Listener
[junit4:junit4]   2> 375 T72 oasc.CoreContainer.create Creating SolrCore 'collection1' using instanceDir: /mnt/ssd/jenkins/workspace/Lucene-Solr-4.x-Linux/checkout/solr/build/solr-core/test-files/solr/collection1
[junit4:junit4]   2> 376 T72 oasc.SolrResourceLoader.<init> new SolrResourceLoader for directory: '/mnt/ssd/jenkins/workspace/Lucene-Solr-4.x-Linux/checkout/solr/build/solr-core/test-files/solr/collection1/'
[junit4:junit4]   2> 377 T72 oasc.SolrResourceLoader.replaceClassLoader Adding 'file:/mnt/ssd/jenkins/workspace/Lucene-Solr-4.x-Linux/checkout/solr/build/solr-core/test-files/solr/collection1/lib/README' to classloader
[junit4:junit4]   2> 378 T72 oasc.SolrResourceLoader.replaceClassLoader Adding 'file:/mnt/ssd/jenkins/workspace/Lucene-Solr-4.x-Linux/checkout/solr/build/solr-core/test-files/solr/collection1/lib/classes/' to classloader
[junit4:junit4]   2> 417 T72 oasc.SolrConfig.<init> Using Lucene MatchVersion: LUCENE_40
[junit4:junit4]   2> 527 T72 oasc.SolrConfig.<init> Loaded SolrConfig: solrconfig-elevate.xml
[junit4:junit4]   2> 527 T72 oass.IndexSchema.readSchema Reading Solr Schema
[junit4:junit4]   2> 531 T72 oass.IndexSchema.readSchema Schema name=example
[junit4:junit4]   2> 777 T72 oass.IndexSchema.readSchema default search field in schema is text
[junit4:junit4]   2> 780 T72 oass.IndexSchema.readSchema unique key field: id
[junit4:junit4]   2> 785 T72 oasc.SolrCore.<init> [collection1] Opening new SolrCore at /mnt/ssd/jenkins/workspace/Lucene-Solr-4.x-Linux/checkout/solr/build/solr-core/test-files/solr/collection1/, dataDir=./org.apache.solr.handler.component.DistributedQueryElevationComponentTest-1343887693708/control/data/
[junit4:junit4]   2> 786 T72 oasc.JmxMonitoredMap.<init> JMX monitoring is enabled. Adding Solr mbeans to JMX Server: com.sun.jmx.mbeanserver.JmxMBeanServer@6210eb73
[junit4:junit4]   2> 787 T72 oasc.SolrCore.getNewIndexDir WARNING New index directory detected: old=null new=./org.apache.solr.handler.component.DistributedQueryElevationComponentTest-1343887693708/control/data/index/
[junit4:junit4]   2> 787 T72 oasc.SolrCore.initIndex WARNING [collection1] Solr index directory './org.apache.solr.handler.component.DistributedQueryElevationComponentTest-1343887693708/control/data/index' doesn't exist. Creating new index...
[junit4:junit4]   2> 790 T72 oasc.SolrDeletionPolicy.onCommit SolrDeletionPolicy.onCommit: commits:num=1
[junit4:junit4]   2> 		commit{dir=MockDirWrapper(org.apache.lucene.store.RAMDirectory@2fefb21c lockFactory=org.apache.lucene.store.SingleInstanceLockFactory@18b73570),segFN=segments_1,generation=1,filenames=[segments_1]
[junit4:junit4]   2> 792 T72 oasc.SolrDeletionPolicy.updateCommits newest commit = 1
[junit4:junit4]   2> 796 T72 oasc.RequestHandlers.initHandlersFromConfig created /update: solr.UpdateRequestHandler
[junit4:junit4]   2> 797 T72 oasc.RequestHandlers.initHandlersFromConfig created /elevate: org.apache.solr.handler.component.SearchHandler
[junit4:junit4]   2> 798 T72 oasc.RequestHandlers.initHandlersFromConfig created /dataElevate: org.apache.solr.handler.component.SearchHandler
[junit4:junit4]   2> 799 T72 oashl.XMLLoader.init xsltCacheLifetimeSeconds=60
[junit4:junit4]   2> 799 T72 oasc.RequestHandlers.initHandlersFromConfig WARNING no default request handler is registered (either '/select' or 'standard')
[junit4:junit4]   2> 801 T72 oasc.SolrCore.initDeprecatedSupport WARNING solrconfig.xml uses deprecated <admin/gettableFiles>, Please update your config to use the ShowFileRequestHandler.
[junit4:junit4]   2> 802 T72 oasc.SolrCore.initDeprecatedSupport WARNING adding ShowFileRequestHandler with hidden files: [SCHEMA-COLLATE.XML, BAD-SOLRCONFIG-BOGUS-SCRIPTENGINE-NAME.XML, SOLRCONFIG-SLAVE.XML, SOLRCONFIG-MASTER.XML, OPEN-EXCHANGE-RATES.JSON, SCHEMA-PHRASESUGGEST.XML, SOLRCONFIG-NOCACHE.XML, SOLRCONFIG_CODEC.XML, SCHEMA-BM25.XML, SCHEMA-NOT-REQUIRED-UNIQUE-KEY.XML, ELEVATE.XML, BAD-SCHEMA-NOT-INDEXED-BUT-POS.XML, BAD-SCHEMA-DUP-FIELD.XML, STOP-2.TXT, XSLT, SOLRCONFIG-UPDATE-PROCESSOR-CHAINS.XML, SCHEMA-BINARYFIELD.XML, BAD-SCHEMA-EXTERNAL-FILEFIELD.XML, SOLRCONFIG-MASTER1.XML, DA_COMPOUNDDICTIONARY.TXT, ADDFIELDS.UPDATEPROCESSOR.JS, SOLRCONFIG-SPELLCHECKER.XML, SCHEMA-COPYFIELD-TEST.XML, BAD_SOLRCONFIG.XML, MISSLEADING.EXTENSION.UPDATEPROCESSOR.JS.TXT, SCHEMA11.XML, BAD-SCHEMA-UNIQUEKEY-MULTIVALUED.XML, BAD-SOLRCONFIG-INVALID-SCRIPTFILE.XML, SOLRCONFIG-MASTER1-KEEPONEBACKUP.XML, SCHEMA-TRIE.XML, SCHEMA-COLLATEFILTER.XML, SCHEMA-REPLICATION1.XML, STOPWORDSWRONGENCODING.TXT, SCHEMA-LUCENEMATCHVERSION.XML, TRIVIAL.UPDATEPROCESSOR1.JS, SOLRCONFIG-MERGEPOLICY.XML, SOLRCONFIG-SIMPLELOCK.XML, SOLRCONFIG-REQHANDLER.INCL, SOLRCONFIG-MASTER2.XML, CONDITIONAL.UPDATEPROCESSOR.JS, STOP-1.TXT, HUNSPELL-TEST.DIC, PHRASESUGGEST.TXT, STOPWITHBOM.TXT, SOLRCONFIG-BASIC.XML, PROTWORDS.TXT, FRENCHARTICLES.TXT, BAD-SOLRCONFIG-MISSING-SCRIPTFILE.XML, BAD-SCHEMA-ANALYZER-CLASS-AND-NESTED.XML, BAD-SCHEMA-NONTEXT-ANALYZER.XML, SCHEMA12.XML, SOLRCONFIG-SLAVE1.XML, SOLRCONFIG-ENABLEPLUGIN.XML, MISSING.FUNCTIONS.UPDATEPROCESSOR.JS, OLD_SYNONYMS.TXT, SCHEMA-LMJELINEKMERCER.XML, SOLRCONFIG-PHRASESUGGEST.XML, BAD-MP-SOLRCONFIG.XML, SOLRCONFIG-TRANSFORMERS.XML, SOLRCONFIG-SOLCOREPROPERTIES.XML, BAD-SCHEMA-UNIQUEKEY-USES-DEFAULT.XML, SOLRCONFIG-TERMINDEX.XML, STOPTYPES-1.TXT, SCHEMA.XML, SCHEMA-SIM.XML, BAD-SCHEMA-NOT-INDEXED-BUT-TF.XML, SOLRCONFIG-SCRIPT-UPDATEPROCESSOR.XML, SOLRCONFIG-QUERYSENDER.XML, SCHEMA-LMDIRICHLET.XML, SOLRCONFIG-XINCLUDE.XML, HUNSPELL-TEST.AFF, SYNONYMS.TXT, SOLRCONFIG-LAZYWRITER.XML, STEMDICT.TXT, SCHEMA-FOLDING.XML, SCHEMA-REVERSED.XML, SOLRCONFIG_PERF.XML, SOLRCONFIG-SPELLCHECKCOMPONENT.XML, SCHEMA-IB.XML, STOPWORDS.TXT, SCHEMA-STOP-KEEP.XML, BAD-SCHEMA-CODEC-GLOBAL-VS-FT-MISMATCH.XML, SOLRCONFIG-CACHING.XML, SCHEMA-TFIDF.XML, SOLRCONFIG-DELPOLICY2.XML, SOLRCONFIG-ALTDIRECTORY.XML, KEEP-2.TXT, HYPHENATION.DTD, SOLRCONFIG-HIGHLIGHT.XML, SCHEMA-NUMERIC.XML, BAD-SCHEMA-DUP-FIELDTYPE.XML, SCHEMA-CHARFILTERS.XML, SCHEMA-MINIMAL.XML, COMPOUNDDICTIONARY.TXT, SOLRCONFIG-PROPINJECT.XML, SCHEMA-DFR.XML, SCHEMA15.XML, SOLRCONFIG-FUNCTIONQUERY.XML, SOLRCONFIG-ELEVATE.XML, SOLRCONFIG-REPEATER.XML, DA_UTF8.XML, SCHEMA-REQUIRED-FIELDS.XML, BAD-SCHEMA-SIM-GLOBAL-VS-FT-MISMATCH.XML, BAD-SCHEMA-UNIQUEKEY-IS-COPYFIELD-DEST.XML, CURRENCY.XML, SOLRCONFIG-QUERYSENDER-NOQUERY.XML, MAPPING-ISOLATIN1ACCENT.TXT, TRIVIAL.UPDATEPROCESSOR0.JS, SOLRCONFIG-SOLR-749.XML, THROW.ERROR.ON.ADD.UPDATEPROCESSOR.JS, BAD-SCHEMA-NOT-INDEXED-BUT-NORMS.XML, SOLRCONFIG-TLOG.XML, BAD-SCHEMA-DUP-DYNAMICFIELD.XML, SOLRCONFIG-NATIVELOCK.XML, SCHEMA-SPELLCHECKER.XML, WDFTYPES.TXT, SOLRCONFIG-MASTER3.XML, SCHEMA_CODEC.XML, STOPTYPES-2.TXT, SCHEMASURROUND.XML, SOLRCONFIG-DELPOLICY1.XML, SOLRCONFIG-PROPINJECT-INDEXDEFAULT.XML, BAD-SCHEMA-OMIT-TF-BUT-NOT-POS.XML, STOP-SNOWBALL.TXT, SCHEMA-REPLICATION2.XML, KEEP-1.TXT, SOLRCONFIG-BASIC-LUCENEVERSION31.XML]
[junit4:junit4]   2> 812 T72 oass.SolrIndexSearcher.<init> Opening Searcher@28b7b9be main
[junit4:junit4]   2> 812 T72 oass.SolrIndexSearcher.getIndexDir WARNING WARNING: Directory impl does not support setting indexDir: org.apache.lucene.store.MockDirectoryWrapper
[junit4:junit4]   2> 813 T72 oasu.CommitTracker.<init> Hard AutoCommit: disabled
[junit4:junit4]   2> 813 T72 oasu.CommitTracker.<init> Soft AutoCommit: disabled
[junit4:junit4]   2> 815 T72 oashc.QueryElevationComponent.inform Loading QueryElevation from: /mnt/ssd/jenkins/workspace/Lucene-Solr-4.x-Linux/checkout/solr/build/solr-core/test-files/solr/collection1/conf/elevate.xml
[junit4:junit4]   2> 861 T72 oashc.QueryElevationComponent.inform Loading QueryElevation from: /mnt/ssd/jenkins/workspace/Lucene-Solr-4.x-Linux/checkout/solr/build/solr-core/test-files/solr/collection1/conf/elevate.xml
[junit4:junit4]   2> 870 T72 oashc.HttpShardHandlerFactory.getParameter Setting socketTimeout to: 0
[junit4:junit4]   2> 870 T72 oashc.HttpShardHandlerFactory.getParameter Setting urlScheme to: http://
[junit4:junit4]   2> 870 T72 oashc.HttpShardHandlerFactory.getParameter Setting connTimeout to: 0
[junit4:junit4]   2> 871 T72 oashc.HttpShardHandlerFactory.getParameter Setting maxConnectionsPerHost to: 20
[junit4:junit4]   2> 871 T72 oashc.HttpShardHandlerFactory.getParameter Setting corePoolSize to: 0
[junit4:junit4]   2> 871 T72 oashc.HttpShardHandlerFactory.getParameter Setting maximumPoolSize to: 2147483647
[junit4:junit4]   2> 872 T72 oashc.HttpShardHandlerFactory.getParameter Setting maxThreadIdleTime to: 5
[junit4:junit4]   2> 872 T72 oashc.HttpShardHandlerFactory.getParameter Setting sizeOfQueue to: -1
[junit4:junit4]   2> 872 T72 oashc.HttpShardHandlerFactory.getParameter Setting fairnessPolicy to: false
[junit4:junit4]   2> 873 T72 oascsi.HttpClientUtil.createClient Creating new http client, config:maxConnectionsPerHost=20&maxConnections=10000&socketTimeout=0&connTimeout=0&retry=false
[junit4:junit4]   2> 901 T83 oasc.SolrCore.registerSearcher [collection1] Registered new searcher Searcher@28b7b9be main{StandardDirectoryReader(segments_1:1)}
[junit4:junit4]   2> 907 T72 oasc.CoreContainer.register registering core: collection1
[junit4:junit4]   2> 908 T72 oass.SolrDispatchFilter.init user.dir=/mnt/ssd/jenkins/workspace/Lucene-Solr-4.x-Linux/checkout/solr/build/solr-core/test/J1
[junit4:junit4]   2> 908 T72 oass.SolrDispatchFilter.init SolrDispatchFilter.init() done
[junit4:junit4]   2> 915 T72 oascsi.HttpClientUtil.createClient Creating new http client, config:maxConnections=128&maxConnectionsPerHost=32&followRedirects=false
[junit4:junit4]   2> 920 T72 oejs.Server.doStart jetty-8.1.2.v20120308
[junit4:junit4]   2> 1000 T72 oejs.AbstractConnector.doStart Started SocketConnector@0.0.0.0:37234
[junit4:junit4]   2> 1000 T72 oasc.SolrResourceLoader.locateSolrHome JNDI not configured for solr (NoInitialContextEx)
[junit4:junit4]   2> 1001 T72 oasc.SolrResourceLoader.locateSolrHome using system property solr.solr.home: /mnt/ssd/jenkins/workspace/Lucene-Solr-4.x-Linux/checkout/solr/build/solr-core/test-files/solr
[junit4:junit4]   2> 1001 T72 oasc.SolrResourceLoader.<init> new SolrResourceLoader for deduced Solr Home: '/mnt/ssd/jenkins/workspace/Lucene-Solr-4.x-Linux/checkout/solr/build/solr-core/test-files/solr/'
[junit4:junit4]   2> 1010 T72 oass.SolrDispatchFilter.init SolrDispatchFilter.init()
[junit4:junit4]   2> 1011 T72 oasc.SolrResourceLoader.locateSolrHome JNDI not configured for solr (NoInitialContextEx)
[junit4:junit4]   2> 1011 T72 oasc.SolrResourceLoader.locateSolrHome using system property solr.solr.home: /mnt/ssd/jenkins/workspace/Lucene-Solr-4.x-Linux/checkout/solr/build/solr-core/test-files/solr
[junit4:junit4]   2> 1011 T72 oasc.CoreContainer$Initializer.initialize looking for solr.xml: /mnt/ssd/jenkins/workspace/Lucene-Solr-4.x-Linux/checkout/solr/build/solr-core/test-files/solr/solr.xml
[junit4:junit4]   2> 1012 T72 oasc.CoreContainer.<init> New CoreContainer 1453605374
[junit4:junit4]   2> 1012 T72 oasc.CoreContainer.load Loading CoreContainer using Solr Home: '/mnt/ssd/jenkins/workspace/Lucene-Solr-4.x-Linux/checkout/solr/build/solr-core/test-files/solr/'
[junit4:junit4]   2> 1012 T72 oasc.SolrResourceLoader.<init> new SolrResourceLoader for directory: '/mnt/ssd/jenkins/workspace/Lucene-Solr-4.x-Linux/checkout/solr/build/solr-core/test-files/solr/'
[junit4:junit4]   2> 1054 T72 oasc.CoreContainer.load Registering Log Listener
[junit4:junit4]   2> 1066 T72 oasc.CoreContainer.create Creating SolrCore 'collection1' using instanceDir: /mnt/ssd/jenkins/workspace/Lucene-Solr-4.x-Linux/checkout/solr/build/solr-core/test-files/solr/collection1
[junit4:junit4]   2> 1066 T72 oasc.SolrResourceLoader.<init> new SolrResourceLoader for directory: '/mnt/ssd/jenkins/workspace/Lucene-Solr-4.x-Linux/checkout/solr/build/solr-core/test-files/solr/collection1/'
[junit4:junit4]   2> 1071 T72 oasc.SolrResourceLoader.replaceClassLoader Adding 'file:/mnt/ssd/jenkins/workspace/Lucene-Solr-4.x-Linux/checkout/solr/build/solr-core/test-files/solr/collection1/lib/README' to classloader
[junit4:junit4]   2> 1071 T72 oasc.SolrResourceLoader.replaceClassLoader Adding 'file:/mnt/ssd/jenkins/workspace/Lucene-Solr-4.x-Linux/checkout/solr/build/solr-core/test-files/solr/collection1/lib/classes/' to classloader
[junit4:junit4]   2> 1101 T72 oasc.SolrConfig.<init> Using Lucene MatchVersion: LUCENE_40
[junit4:junit4]   2> 1144 T72 oasc.SolrConfig.<init> Loaded SolrConfig: solrconfig-elevate.xml
[junit4:junit4]   2> 1145 T72 oass.IndexSchema.readSchema Reading Solr Schema
[junit4:junit4]   2> 1152 T72 oass.IndexSchema.readSchema Schema name=example
[junit4:junit4]   2> 1338 T72 oass.IndexSchema.readSchema default search field in schema is text
[junit4:junit4]   2> 1341 T72 oass.IndexSchema.readSchema unique key field: id
[junit4:junit4]   2> 1345 T72 oasc.SolrCore.<init> [collection1] Opening new SolrCore at /mnt/ssd/jenkins/workspace/Lucene-Solr-4.x-Linux/checkout/solr/build/solr-core/test-files/solr/collection1/, dataDir=./org.apache.solr.handler.component.DistributedQueryElevationComponentTest-1343887693708/shard0/data/
[junit4:junit4]   2> 1346 T72 oasc.JmxMonitoredMap.<init> JMX monitoring is enabled. Adding Solr mbeans to JMX Server: com.sun.jmx.mbeanserver.JmxMBeanServer@6210eb73
[junit4:junit4]   2> 1346 T72 oasc.SolrCore.getNewIndexDir WARNING New index directory detected: old=null new=./org.apache.solr.handler.component.DistributedQueryElevationComponentTest-1343887693708/shard0/data/index/
[junit4:junit4]   2> 1347 T72 oasc.SolrCore.initIndex WARNING [collection1] Solr index directory './org.apache.solr.handler.component.DistributedQueryElevationComponentTest-1343887693708/shard0/data/index' doesn't exist. Creating new index...
[junit4:junit4]   2> 1348 T72 oasc.SolrDeletionPolicy.onCommit SolrDeletionPolicy.onCommit: commits:num=1
[junit4:junit4]   2> 		commit{dir=MockDirWrapper(org.apache.lucene.store.RAMDirectory@393ddcaf lockFactory=org.apache.lucene.store.SingleInstanceLockFactory@590df01d),segFN=segments_1,generation=1,filenames=[segments_1]
[junit4:junit4]   2> 1349 T72 oasc.SolrDeletionPolicy.updateCommits newest commit = 1
[junit4:junit4]   2> 1350 T72 oasc.RequestHandlers.initHandlersFromConfig created /update: solr.UpdateRequestHandler
[junit4:junit4]   2> 1350 T72 oasc.RequestHandlers.initHandlersFromConfig created /elevate: org.apache.solr.handler.component.SearchHandler
[junit4:junit4]   2> 1351 T72 oasc.RequestHandlers.initHandlersFromConfig created /dataElevate: org.apache.solr.handler.component.SearchHandler
[junit4:junit4]   2> 1351 T72 oashl.XMLLoader.init xsltCacheLifetimeSeconds=60
[junit4:junit4]   2> 1352 T72 oasc.RequestHandlers.initHandlersFromConfig WARNING no default request handler is registered (either '/select' or 'standard')
[junit4:junit4]   2> 1353 T72 oasc.SolrCore.initDeprecatedSupport WARNING solrconfig.xml uses deprecated <admin/gettableFiles>, Please update your config to use the ShowFileRequestHandler.
[junit4:junit4]   2> 1354 T72 oasc.SolrCore.initDeprecatedSupport WARNING adding ShowFileRequestHandler with hidden files: [SCHEMA-COLLATE.XML, BAD-SOLRCONFIG-BOGUS-SCRIPTENGINE-NAME.XML, SOLRCONFIG-SLAVE.XML, SOLRCONFIG-MASTER.XML, OPEN-EXCHANGE-RATES.JSON, SCHEMA-PHRASESUGGEST.XML, SOLRCONFIG-NOCACHE.XML, SOLRCONFIG_CODEC.XML, SCHEMA-BM25.XML, SCHEMA-NOT-REQUIRED-UNIQUE-KEY.XML, ELEVATE.XML, BAD-SCHEMA-NOT-INDEXED-BUT-POS.XML, BAD-SCHEMA-DUP-FIELD.XML, STOP-2.TXT, XSLT, SOLRCONFIG-UPDATE-PROCESSOR-CHAINS.XML, SCHEMA-BINARYFIELD.XML, BAD-SCHEMA-EXTERNAL-FILEFIELD.XML, SOLRCONFIG-MASTER1.XML, DA_COMPOUNDDICTIONARY.TXT, ADDFIELDS.UPDATEPROCESSOR.JS, SOLRCONFIG-SPELLCHECKER.XML, SCHEMA-COPYFIELD-TEST.XML, BAD_SOLRCONFIG.XML, MISSLEADING.EXTENSION.UPDATEPROCESSOR.JS.TXT, SCHEMA11.XML, BAD-SCHEMA-UNIQUEKEY-MULTIVALUED.XML, BAD-SOLRCONFIG-INVALID-SCRIPTFILE.XML, SOLRCONFIG-MASTER1-KEEPONEBACKUP.XML, SCHEMA-TRIE.XML, SCHEMA-COLLATEFILTER.XML, SCHEMA-REPLICATION1.XML, STOPWORDSWRONGENCODING.TXT, SCHEMA-LUCENEMATCHVERSION.XML, TRIVIAL.UPDATEPROCESSOR1.JS, SOLRCONFIG-MERGEPOLICY.XML, SOLRCONFIG-SIMPLELOCK.XML, SOLRCONFIG-REQHANDLER.INCL, SOLRCONFIG-MASTER2.XML, CONDITIONAL.UPDATEPROCESSOR.JS, STOP-1.TXT, HUNSPELL-TEST.DIC, PHRASESUGGEST.TXT, STOPWITHBOM.TXT, SOLRCONFIG-BASIC.XML, PROTWORDS.TXT, FRENCHARTICLES.TXT, BAD-SOLRCONFIG-MISSING-SCRIPTFILE.XML, BAD-SCHEMA-ANALYZER-CLASS-AND-NESTED.XML, BAD-SCHEMA-NONTEXT-ANALYZER.XML, SCHEMA12.XML, SOLRCONFIG-SLAVE1.XML, SOLRCONFIG-ENABLEPLUGIN.XML, MISSING.FUNCTIONS.UPDATEPROCESSOR.JS, OLD_SYNONYMS.TXT, SCHEMA-LMJELINEKMERCER.XML, SOLRCONFIG-PHRASESUGGEST.XML, BAD-MP-SOLRCONFIG.XML, SOLRCONFIG-TRANSFORMERS.XML, SOLRCONFIG-SOLCOREPROPERTIES.XML, BAD-SCHEMA-UNIQUEKEY-USES-DEFAULT.XML, SOLRCONFIG-TERMINDEX.XML, STOPTYPES-1.TXT, SCHEMA.XML, SCHEMA-SIM.XML, BAD-SCHEMA-NOT-INDEXED-BUT-TF.XML, SOLRCONFIG-SCRIPT-UPDATEPROCESSOR.XML, SOLRCONFIG-QUERYSENDER.XML, SCHEMA-LMDIRICHLET.XML, SOLRCONFIG-XINCLUDE.XML, HUNSPELL-TEST.AFF, SYNONYMS.TXT, SOLRCONFIG-LAZYWRITER.XML, STEMDICT.TXT, SCHEMA-FOLDING.XML, SCHEMA-REVERSED.XML, SOLRCONFIG_PERF.XML, SOLRCONFIG-SPELLCHECKCOMPONENT.XML, SCHEMA-IB.XML, STOPWORDS.TXT, SCHEMA-STOP-KEEP.XML, BAD-SCHEMA-CODEC-GLOBAL-VS-FT-MISMATCH.XML, SOLRCONFIG-CACHING.XML, SCHEMA-TFIDF.XML, SOLRCONFIG-DELPOLICY2.XML, SOLRCONFIG-ALTDIRECTORY.XML, KEEP-2.TXT, HYPHENATION.DTD, SOLRCONFIG-HIGHLIGHT.XML, SCHEMA-NUMERIC.XML, BAD-SCHEMA-DUP-FIELDTYPE.XML, SCHEMA-CHARFILTERS.XML, SCHEMA-MINIMAL.XML, COMPOUNDDICTIONARY.TXT, SOLRCONFIG-PROPINJECT.XML, SCHEMA-DFR.XML, SCHEMA15.XML, SOLRCONFIG-FUNCTIONQUERY.XML, SOLRCONFIG-ELEVATE.XML, SOLRCONFIG-REPEATER.XML, DA_UTF8.XML, SCHEMA-REQUIRED-FIELDS.XML, BAD-SCHEMA-SIM-GLOBAL-VS-FT-MISMATCH.XML, BAD-SCHEMA-UNIQUEKEY-IS-COPYFIELD-DEST.XML, CURRENCY.XML, SOLRCONFIG-QUERYSENDER-NOQUERY.XML, MAPPING-ISOLATIN1ACCENT.TXT, TRIVIAL.UPDATEPROCESSOR0.JS, SOLRCONFIG-SOLR-749.XML, THROW.ERROR.ON.ADD.UPDATEPROCESSOR.JS, BAD-SCHEMA-NOT-INDEXED-BUT-NORMS.XML, SOLRCONFIG-TLOG.XML, BAD-SCHEMA-DUP-DYNAMICFIELD.XML, SOLRCONFIG-NATIVELOCK.XML, SCHEMA-SPELLCHECKER.XML, WDFTYPES.TXT, SOLRCONFIG-MASTER3.XML, SCHEMA_CODEC.XML, STOPTYPES-2.TXT, SCHEMASURROUND.XML, SOLRCONFIG-DELPOLICY1.XML, SOLRCONFIG-PROPINJECT-INDEXDEFAULT.XML, BAD-SCHEMA-OMIT-TF-BUT-NOT-POS.XML, STOP-SNOWBALL.TXT, SCHEMA-REPLICATION2.XML, KEEP-1.TXT, SOLRCONFIG-BASIC-LUCENEVERSION31.XML]
[junit4:junit4]   2> 1356 T72 oass.SolrIndexSearcher.<init> Opening Searcher@2ab4b8ed main
[junit4:junit4]   2> 1357 T72 oass.SolrIndexSearcher.getIndexDir WARNING WARNING: Directory impl does not support setting indexDir: org.apache.lucene.store.MockDirectoryWrapper
[junit4:junit4]   2> 1357 T72 oasu.CommitTracker.<init> Hard AutoCommit: disabled
[junit4:junit4]   2> 1358 T72 oasu.CommitTracker.<init> Soft AutoCommit: disabled
[junit4:junit4]   2> 1358 T72 oashc.QueryElevationComponent.inform Loading QueryElevation from: /mnt/ssd/jenkins/workspace/Lucene-Solr-4.x-Linux/checkout/solr/build/solr-core/test-files/solr/collection1/conf/elevate.xml
[junit4:junit4]   2> 1366 T72 oashc.QueryElevationComponent.inform Loading QueryElevation from: /mnt/ssd/jenkins/workspace/Lucene-Solr-4.x-Linux/checkout/solr/build/solr-core/test-files/solr/collection1/conf/elevate.xml
[junit4:junit4]   2> 1373 T72 oashc.HttpShardHandlerFactory.getParameter Setting socketTimeout to: 0
[junit4:junit4]   2> 1373 T72 oashc.HttpShardHandlerFactory.getParameter Setting urlScheme to: http://
[junit4:junit4]   2> 1374 T72 oashc.HttpShardHandlerFactory.getParameter Setting connTimeout to: 0
[junit4:junit4]   2> 1374 T72 oashc.HttpShardHandlerFactory.getParameter Setting maxConnectionsPerHost to: 20
[junit4:junit4]   2> 1374 T72 oashc.HttpShardHandlerFactory.getParameter Setting corePoolSize to: 0
[junit4:junit4]   2> 1374 T72 oashc.HttpShardHandlerFactory.getParameter Setting maximumPoolSize to: 2147483647
[junit4:junit4]   2> 1375 T72 oashc.HttpShardHandlerFactory.getParameter Setting maxThreadIdleTime to: 5
[junit4:junit4]   2> 1375 T72 oashc.HttpShardHandlerFactory.getParameter Setting sizeOfQueue to: -1
[junit4:junit4]   2> 1375 T72 oashc.HttpShardHandlerFactory.getParameter Setting fairnessPolicy to: false
[junit4:junit4]   2> 1375 T72 oascsi.HttpClientUtil.createClient Creating new http client, config:maxConnectionsPerHost=20&maxConnections=10000&socketTimeout=0&connTimeout=0&retry=false
[junit4:junit4]   2> 1380 T93 oasc.SolrCore.registerSearcher [collection1] Registered new searcher Searcher@2ab4b8ed main{StandardDirectoryReader(segments_1:1)}
[junit4:junit4]   2> 1380 T72 oasc.CoreContainer.register registering core: collection1
[junit4:junit4]   2> 1381 T72 oass.SolrDispatchFilter.init user.dir=/mnt/ssd/jenkins/workspace/Lucene-Solr-4.x-Linux/checkout/solr/build/solr-core/test/J1
[junit4:junit4]   2> 1381 T72 oass.SolrDispatchFilter.init SolrDispatchFilter.init() done
[junit4:junit4]   2> 1382 T72 oascsi.HttpClientUtil.createClient Creating new http client, config:maxConnections=128&maxConnectionsPerHost=32&followRedirects=false
[junit4:junit4]   2> 1385 T72 oejs.Server.doStart jetty-8.1.2.v20120308
[junit4:junit4]   2> 1387 T72 oejs.AbstractConnector.doStart Started SocketConnector@0.0.0.0:45985
[junit4:junit4]   2> 1387 T72 oasc.SolrResourceLoader.locateSolrHome JNDI not configured for solr (NoInitialContextEx)
[junit4:junit4]   2> 1388 T72 oasc.SolrResourceLoader.locateSolrHome using system property solr.solr.home: /mnt/ssd/jenkins/workspace/Lucene-Solr-4.x-Linux/checkout/solr/build/solr-core/test-files/solr
[junit4:junit4]   2> 1388 T72 oasc.SolrResourceLoader.<init> new SolrResourceLoader for deduced Solr Home: '/mnt/ssd/jenkins/workspace/Lucene-Solr-4.x-Linux/checkout/solr/build/solr-core/test-files/solr/'
[junit4:junit4]   2> 1393 T72 oass.SolrDispatchFilter.init SolrDispatchFilter.init()
[junit4:junit4]   2> 1394 T72 oasc.SolrResourceLoader.locateSolrHome JNDI not configured for solr (NoInitialContextEx)
[junit4:junit4]   2> 1394 T72 oasc.SolrResourceLoader.locateSolrHome using system property solr.solr.home: /mnt/ssd/jenkins/workspace/Lucene-Solr-4.x-Linux/checkout/solr/build/solr-core/test-files/solr
[junit4:junit4]   2> 1394 T72 oasc.CoreContainer$Initializer.initialize looking for solr.xml: /mnt/ssd/jenkins/workspace/Lucene-Solr-4.x-Linux/checkout/solr/build/solr-core/test-files/solr/solr.xml
[junit4:junit4]   2> 1394 T72 oasc.CoreContainer.<init> New CoreContainer 2138056720
[junit4:junit4]   2> 1395 T72 oasc.CoreContainer.load Loading CoreContainer using Solr Home: '/mnt/ssd/jenkins/workspace/Lucene-Solr-4.x-Linux/checkout/solr/build/solr-core/test-files/solr/'
[junit4:junit4]   2> 1395 T72 oasc.SolrResourceLoader.<init> new SolrResourceLoader for directory: '/mnt/ssd/jenkins/workspace/Lucene-Solr-4.x-Linux/checkout/solr/build/solr-core/test-files/solr/'
[junit4:junit4]   2> 1403 T72 oasc.CoreContainer.load Registering Log Listener
[junit4:junit4]   2> 1416 T72 oasc.CoreContainer.create Creating SolrCore 'collection1' using instanceDir: /mnt/ssd/jenkins/workspace/Lucene-Solr-4.x-Linux/checkout/solr/build/solr-core/test-files/solr/collection1
[junit4:junit4]   2> 1417 T72 oasc.SolrResourceLoader.<init> new SolrResourceLoader for directory: '/mnt/ssd/jenkins/workspace/Lucene-Solr-4.x-Linux/checkout/solr/build/solr-core/test-files/solr/collection1/'
[junit4:junit4]   2> 1417 T72 oasc.SolrResourceLoader.replaceClassLoader Adding 'file:/mnt/ssd/jenkins/workspace/Lucene-Solr-4.x-Linux/checkout/solr/build/solr-core/test-files/solr/collection1/lib/README' to classloader
[junit4:junit4]   2> 1418 T72 oasc.SolrResourceLoader.replaceClassLoader Adding 'file:/mnt/ssd/jenkins/workspace/Lucene-Solr-4.x-Linux/checkout/solr/build/solr-core/test-files/solr/collection1/lib/classes/' to classloader
[junit4:junit4]   2> 1439 T72 oasc.SolrConfig.<init> Using Lucene MatchVersion: LUCENE_40
[junit4:junit4]   2> 1480 T72 oasc.SolrConfig.<init> Loaded SolrConfig: solrconfig-elevate.xml
[junit4:junit4]   2> 1481 T72 oass.IndexSchema.readSchema Reading Solr Schema
[junit4:junit4]   2> 1484 T72 oass.IndexSchema.readSchema Schema name=example
[junit4:junit4]   2> 1638 T72 oass.IndexSchema.readSchema default search field in schema is text
[junit4:junit4]   2> 1640 T72 oass.IndexSchema.readSchema unique key field: id
[junit4:junit4]   2> 1644 T72 oasc.SolrCore.<init> [collection1] Opening new SolrCore at /mnt/ssd/jenkins/workspace/Lucene-Solr-4.x-Linux/checkout/solr/build/solr-core/test-files/solr/collection1/, dataDir=./org.apache.solr.handler.component.DistributedQueryElevationComponentTest-1343887693708/shard1/data/
[junit4:junit4]   2> 1644 T72 oasc.JmxMonitoredMap.<init> JMX monitoring is enabled. Adding Solr mbeans to JMX Server: com.sun.jmx.mbeanserver.JmxMBeanServer@6210eb73
[junit4:junit4]   2> 1644 T72 oasc.SolrCore.getNewIndexDir WARNING New index directory detected: old=null new=./org.apache.solr.handler.component.DistributedQueryElevationComponentTest-1343887693708/shard1/data/index/
[junit4:junit4]   2> 1645 T72 oasc.SolrCore.initIndex WARNING [collection1] Solr index directory './org.apache.solr.handler.component.DistributedQueryElevationComponentTest-1343887693708/shard1/data/index' doesn't exist. Creating new index...
[junit4:junit4]   2> 1646 T72 oasc.SolrDeletionPolicy.onCommit SolrDeletionPolicy.onCommit: commits:num=1
[junit4:junit4]   2> 		commit{dir=MockDirWrapper(org.apache.lucene.store.RAMDirectory@339a13e5 lockFactory=org.apache.lucene.store.SingleInstanceLockFactory@74c63c6d),segFN=segments_1,generation=1,filenames=[segments_1]
[junit4:junit4]   2> 1646 T72 oasc.SolrDeletionPolicy.updateCommits newest commit = 1
[junit4:junit4]   2> 1647 T72 oasc.RequestHandlers.initHandlersFromConfig created /update: solr.UpdateRequestHandler
[junit4:junit4]   2> 1648 T72 oasc.RequestHandlers.initHandlersFromConfig created /elevate: org.apache.solr.handler.component.SearchHandler
[junit4:junit4]   2> 1648 T72 oasc.RequestHandlers.initHandlersFromConfig created /dataElevate: org.apache.solr.handler.component.SearchHandler
[junit4:junit4]   2> 1649 T72 oashl.XMLLoader.init xsltCacheLifetimeSeconds=60
[junit4:junit4]   2> 1649 T72 oasc.RequestHandlers.initHandlersFromConfig WARNING no default request handler is registered (either '/select' or 'standard')
[junit4:junit4]   2> 1650 T72 oasc.SolrCore.initDeprecatedSupport WARNING solrconfig.xml uses deprecated <admin/gettableFiles>, Please update your config to use the ShowFileRequestHandler.
[junit4:junit4]   2> 1651 T72 oasc.SolrCore.initDeprecatedSupport WARNING adding ShowFileRequestHandler with hidden files: [SCHEMA-COLLATE.XML, BAD-SOLRCONFIG-BOGUS-SCRIPTENGINE-NAME.XML, SOLRCONFIG-SLAVE.XML, SOLRCONFIG-MASTER.XML, OPEN-EXCHANGE-RATES.JSON, SCHEMA-PHRASESUGGEST.XML, SOLRCONFIG-NOCACHE.XML, SOLRCONFIG_CODEC.XML, SCHEMA-BM25.XML, SCHEMA-NOT-REQUIRED-UNIQUE-KEY.XML, ELEVATE.XML, BAD-SCHEMA-NOT-INDEXED-BUT-POS.XML, BAD-SCHEMA-DUP-FIELD.XML, STOP-2.TXT, XSLT, SOLRCONFIG-UPDATE-PROCESSOR-CHAINS.XML, SCHEMA-BINARYFIELD.XML, BAD-SCHEMA-EXTERNAL-FILEFIELD.XML, SOLRCONFIG-MASTER1.XML, DA_COMPOUNDDICTIONARY.TXT, ADDFIELDS.UPDATEPROCESSOR.JS, SOLRCONFIG-SPELLCHECKER.XML, SCHEMA-COPYFIELD-TEST.XML, BAD_SOLRCONFIG.XML, MISSLEADING.EXTENSION.UPDATEPROCESSOR.JS.TXT, SCHEMA11.XML, BAD-SCHEMA-UNIQUEKEY-MULTIVALUED.XML, BAD-SOLRCONFIG-INVALID-SCRIPTFILE.XML, SOLRCONFIG-MASTER1-KEEPONEBACKUP.XML, SCHEMA-TRIE.XML, SCHEMA-COLLATEFILTER.XML, SCHEMA-REPLICATION1.XML, STOPWORDSWRONGENCODING.TXT, SCHEMA-LUCENEMATCHVERSION.XML, TRIVIAL.UPDATEPROCESSOR1.JS, SOLRCONFIG-MERGEPOLICY.XML, SOLRCONFIG-SIMPLELOCK.XML, SOLRCONFIG-REQHANDLER.INCL, SOLRCONFIG-MASTER2.XML, CONDITIONAL.UPDATEPROCESSOR.JS, STOP-1.TXT, HUNSPELL-TEST.DIC, PHRASESUGGEST.TXT, STOPWITHBOM.TXT, SOLRCONFIG-BASIC.XML, PROTWORDS.TXT, FRENCHARTICLES.TXT, BAD-SOLRCONFIG-MISSING-SCRIPTFILE.XML, BAD-SCHEMA-ANALYZER-CLASS-AND-NESTED.XML, BAD-SCHEMA-NONTEXT-ANALYZER.XML, SCHEMA12.XML, SOLRCONFIG-SLAVE1.XML, SOLRCONFIG-ENABLEPLUGIN.XML, MISSING.FUNCTIONS.UPDATEPROCESSOR.JS, OLD_SYNONYMS.TXT, SCHEMA-LMJELINEKMERCER.XML, SOLRCONFIG-PHRASESUGGEST.XML, BAD-MP-SOLRCONFIG.XML, SOLRCONFIG-TRANSFORMERS.XML, SOLRCONFIG-SOLCOREPROPERTIES.XML, BAD-SCHEMA-UNIQUEKEY-USES-DEFAULT.XML, SOLRCONFIG-TERMINDEX.XML, STOPTYPES-1.TXT, SCHEMA.XML, SCHEMA-SIM.XML, BAD-SCHEMA-NOT-INDEXED-BUT-TF.XML, SOLRCONFIG-SCRIPT-UPDATEPROCESSOR.XML, SOLRCONFIG-QUERYSENDER.XML, SCHEMA-LMDIRICHLET.XML, SOLRCONFIG-XINCLUDE.XML, HUNSPELL-TEST.AFF, SYNONYMS.TXT, SOLRCONFIG-LAZYWRITER.XML, STEMDICT.TXT, SCHEMA-FOLDING.XML, SCHEMA-REVERSED.XML, SOLRCONFIG_PERF.XML, SOLRCONFIG-SPELLCHECKCOMPONENT.XML, SCHEMA-IB.XML, STOPWORDS.TXT, SCHEMA-STOP-KEEP.XML, BAD-SCHEMA-CODEC-GLOBAL-VS-FT-MISMATCH.XML, SOLRCONFIG-CACHING.XML, SCHEMA-TFIDF.XML, SOLRCONFIG-DELPOLICY2.XML, SOLRCONFIG-ALTDIRECTORY.XML, KEEP-2.TXT, HYPHENATION.DTD, SOLRCONFIG-HIGHLIGHT.XML, SCHEMA-NUMERIC.XML, BAD-SCHEMA-DUP-FIELDTYPE.XML, SCHEMA-CHARFILTERS.XML, SCHEMA-MINIMAL.XML, COMPOUNDDICTIONARY.TXT, SOLRCONFIG-PROPINJECT.XML, SCHEMA-DFR.XML, SCHEMA15.XML, SOLRCONFIG-FUNCTIONQUERY.XML, SOLRCONFIG-ELEVATE.XML, SOLRCONFIG-REPEATER.XML, DA_UTF8.XML, SCHEMA-REQUIRED-FIELDS.XML, BAD-SCHEMA-SIM-GLOBAL-VS-FT-MISMATCH.XML, BAD-SCHEMA-UNIQUEKEY-IS-COPYFIELD-DEST.XML, CURRENCY.XML, SOLRCONFIG-QUERYSENDER-NOQUERY.XML, MAPPING-ISOLATIN1ACCENT.TXT, TRIVIAL.UPDATEPROCESSOR0.JS, SOLRCONFIG-SOLR-749.XML, THROW.ERROR.ON.ADD.UPDATEPROCESSOR.JS, BAD-SCHEMA-NOT-INDEXED-BUT-NORMS.XML, SOLRCONFIG-TLOG.XML, BAD-SCHEMA-DUP-DYNAMICFIELD.XML, SOLRCONFIG-NATIVELOCK.XML, SCHEMA-SPELLCHECKER.XML, WDFTYPES.TXT, SOLRCONFIG-MASTER3.XML, SCHEMA_CODEC.XML, STOPTYPES-2.TXT, SCHEMASURROUND.XML, SOLRCONFIG-DELPOLICY1.XML, SOLRCONFIG-PROPINJECT-INDEXDEFAULT.XML, BAD-SCHEMA-OMIT-TF-BUT-NOT-POS.XML, STOP-SNOWBALL.TXT, SCHEMA-REPLICATION2.XML, KEEP-1.TXT, SOLRCONFIG-BASIC-LUCENEVERSION31.XML]
[junit4:junit4]   2> 1653 T72 oass.SolrIndexSearcher.<init> Opening Searcher@246fb611 main
[junit4:junit4]   2> 1653 T72 oass.SolrIndexSearcher.getIndexDir WARNING WARNING: Directory impl does not support setting indexDir: org.apache.lucene.store.MockDirectoryWrapper
[junit4:junit4]   2> 1654 T72 oasu.CommitTracker.<init> Hard AutoCommit: disabled
[junit4:junit4]   2> 1654 T72 oasu.CommitTracker.<init> Soft AutoCommit: disabled
[junit4:junit4]   2> 1654 T72 oashc.QueryElevationComponent.inform Loading QueryElevation from: /mnt/ssd/jenkins/workspace/Lucene-Solr-4.x-Linux/checkout/solr/build/solr-core/test-files/solr/collection1/conf/elevate.xml
[junit4:junit4]   2> 1660 T72 oashc.QueryElevationComponent.inform Loading QueryElevation from: /mnt/ssd/jenkins/workspace/Lucene-Solr-4.x-Linux/checkout/solr/build/solr-core/test-files/solr/collection1/conf/elevate.xml
[junit4:junit4]   2> 1666 T72 oashc.HttpShardHandlerFactory.getParameter Setting socketTimeout to: 0
[junit4:junit4]   2> 1666 T72 oashc.HttpShardHandlerFactory.getParameter Setting urlScheme to: http://
[junit4:junit4]   2> 1666 T72 oashc.HttpShardHandlerFactory.getParameter Setting connTimeout to: 0
[junit4:junit4]   2> 1666 T72 oashc.HttpShardHandlerFactory.getParameter Setting maxConnectionsPerHost to: 20
[junit4:junit4]   2> 1667 T72 oashc.HttpShardHandlerFactory.getParameter Setting corePoolSize to: 0
[junit4:junit4]   2> 1667 T72 oashc.HttpShardHandlerFactory.getParameter Setting maximumPoolSize to: 2147483647
[junit4:junit4]   2> 1667 T72 oashc.HttpShardHandlerFactory.getParameter Setting maxThreadIdleTime to: 5
[junit4:junit4]   2> 1667 T72 oashc.HttpShardHandlerFactory.getParameter Setting sizeOfQueue to: -1
[junit4:junit4]   2> 1667 T72 oashc.HttpShardHandlerFactory.getParameter Setting fairnessPolicy to: false
[junit4:junit4]   2> 1668 T72 oascsi.HttpClientUtil.createClient Creating new http client, config:maxConnectionsPerHost=20&maxConnections=10000&socketTimeout=0&connTimeout=0&retry=false
[junit4:junit4]   2> 1670 T103 oasc.SolrCore.registerSearcher [collection1] Registered new searcher Searcher@246fb611 main{StandardDirectoryReader(segments_1:1)}
[junit4:junit4]   2> 1670 T72 oasc.CoreContainer.register registering core: collection1
[junit4:junit4]   2> 1671 T72 oass.SolrDispatchFilter.init user.dir=/mnt/ssd/jenkins/workspace/Lucene-Solr-4.x-Linux/checkout/solr/build/solr-core/test/J1
[junit4:junit4]   2> 1671 T72 oass.SolrDispatchFilter.init SolrDispatchFilter.init() done
[junit4:junit4]   2> 1671 T72 oascsi.HttpClientUtil.createClient Creating new http client, config:maxConnections=128&maxConnectionsPerHost=32&followRedirects=false
[junit4:junit4]   2> 1673 T72 oejs.Server.doStart jetty-8.1.2.v20120308
[junit4:junit4]   2> 1675 T72 oejs.AbstractConnector.doStart Started SocketConnector@0.0.0.0:51985
[junit4:junit4]   2> 1676 T72 oasc.SolrResourceLoader.locateSolrHome JNDI not configured for solr (NoInitialContextEx)
[junit4:junit4]   2> 1676 T72 oasc.SolrResourceLoader.locateSolrHome using system property solr.solr.home: /mnt/ssd/jenkins/workspace/Lucene-Solr-4.x-Linux/checkout/solr/build/solr-core/test-files/solr
[junit4:junit4]   2> 1676 T72 oasc.SolrResourceLoader.<init> new SolrResourceLoader for deduced Solr Home: '/mnt/ssd/jenkins/workspace/Lucene-Solr-4.x-Linux/checkout/solr/build/solr-core/test-files/solr/'
[junit4:junit4]   2> 1682 T72 oass.SolrDispatchFilter.init SolrDispatchFilter.init()
[junit4:junit4]   2> 1682 T72 oasc.SolrResourceLoader.locateSolrHome JNDI not configured for solr (NoInitialContextEx)
[junit4:junit4]   2> 1682 T72 oasc.SolrResourceLoader.locateSolrHome using system property solr.solr.home: /mnt/ssd/jenkins/workspace/Lucene-Solr-4.x-Linux/checkout/solr/build/solr-core/test-files/solr
[junit4:junit4]   2> 1683 T72 oasc.CoreContainer$Initializer.initialize looking for solr.xml: /mnt/ssd/jenkins/workspace/Lucene-Solr-4.x-Linux/checkout/solr/build/solr-core/test-files/solr/solr.xml
[junit4:junit4]   2> 1683 T72 oasc.CoreContainer.<init> New CoreContainer 1357556021
[junit4:junit4]   2> 1683 T72 oasc.CoreContainer.load Loading CoreContainer using Solr Home: '/mnt/ssd/jenkins/workspace/Lucene-Solr-4.x-Linux/checkout/solr/build/solr-core/test-files/solr/'
[junit4:junit4]   2> 1683 T72 oasc.SolrResourceLoader.<init> new SolrResourceLoader for directory: '/mnt/ssd/jenkins/workspace/Lucene-Solr-4.x-Linux/checkout/solr/build/solr-core/test-files/solr/'
[junit4:junit4]   2> 1692 T72 oasc.CoreContainer.load Registering Log Listener
[junit4:junit4]   2> 1705 T72 oasc.CoreContainer.create Creating SolrCore 'collection1' using instanceDir: /mnt/ssd/jenkins/workspace/Lucene-Solr-4.x-Linux/checkout/solr/build/solr-core/test-files/solr/collection1
[junit4:junit4]   2> 1706 T72 oasc.SolrResourceLoader.<init> new SolrResourceLoader for directory: '/mnt/ssd/jenkins/workspace/Lucene-Solr-4.x-Linux/checkout/solr/build/solr-core/test-files/solr/collection1/'
[junit4:junit4]   2> 1706 T72 oasc.SolrResourceLoader.replaceClassLoader Adding 'file:/mnt/ssd/jenkins/workspace/Lucene-Solr-4.x-Linux/checkout/solr/build/solr-core/test-files/solr/collection1/lib/README' to classloader
[junit4:junit4]   2> 1707 T72 oasc.SolrResourceLoader.replaceClassLoader Adding 'file:/mnt/ssd/jenkins/workspace/Lucene-Solr-4.x-Linux/checkout/solr/build/solr-core/test-files/solr/collection1/lib/classes/' to classloader
[junit4:junit4]   2> 1752 T72 oasc.SolrConfig.<init> Using Lucene MatchVersion: LUCENE_40
[junit4:junit4]   2> 1796 T72 oasc.SolrConfig.<init> Loaded SolrConfig: solrconfig-elevate.xml
[junit4:junit4]   2> 1796 T72 oass.IndexSchema.readSchema Reading Solr Schema
[junit4:junit4]   2> 1804 T72 oass.IndexSchema.readSchema Schema name=example
[junit4:junit4]   2> 1977 T72 oass.IndexSchema.readSchema default search field in schema is text
[junit4:junit4]   2> 1979 T72 oass.IndexSchema.readSchema unique key field: id
[junit4:junit4]   2> 1982 T72 oasc.SolrCore.<init> [collection1] Opening new SolrCore at /mnt/ssd/jenkins/workspace/Lucene-Solr-4.x-Linux/checkout/solr/build/solr-core/test-files/solr/collection1/, dataDir=./org.apache.solr.handler.component.DistributedQueryElevationComponentTest-1343887693708/shard2/data/
[junit4:junit4]   2> 1983 T72 oasc.JmxMonitoredMap.<init> JMX monitoring is enabled. Adding Solr mbeans to JMX Server: com.sun.jmx.mbeanserver.JmxMBeanServer@6210eb73
[junit4:junit4]   2> 1983 T72 oasc.SolrCore.getNewIndexDir WARNING New index directory detected: old=null new=./org.apache.solr.handler.component.DistributedQueryElevationComponentTest-1343887693708/shard2/data/index/
[junit4:junit4]   2> 1984 T72 oasc.SolrCore.initIndex WARNING [collection1] Solr index directory './org.apache.solr.handler.component.DistributedQueryElevationComponentTest-1343887693708/shard2/data/index' doesn't exist. Creating new index...
[junit4:junit4]   2> 1985 T72 oasc.SolrDeletionPolicy.onCommit SolrDeletionPolicy.onCommit: commits:num=1
[junit4:junit4]   2> 		commit{dir=MockDirWrapper(org.apache.lucene.store.RAMDirectory@4caabc8c lockFactory=org.apache.lucene.store.SingleInstanceLockFactory@4290e01e),segFN=segments_1,generation=1,filenames=[segments_1]
[junit4:junit4]   2> 1985 T72 oasc.SolrDeletionPolicy.updateCommits newest commit = 1
[junit4:junit4]   2> 1986 T72 oasc.RequestHandlers.initHandlersFromConfig created /update: solr.UpdateRequestHandler
[junit4:junit4]   2> 1987 T72 oasc.RequestHandlers.initHandlersFromConfig created /elevate: org.apache.solr.handler.component.SearchHandler
[junit4:junit4]   2> 1987 T72 oasc.RequestHandlers.initHandlersFromConfig created /dataElevate: org.apache.solr.handler.component.SearchHandler
[junit4:junit4]   2> 1988 T72 oashl.XMLLoader.init xsltCacheLifetimeSeconds=60
[junit4:junit4]   2> 1988 T72 oasc.RequestHandlers.initHandlersFromConfig WARNING no default request handler is registered (either '/select' or 'standard')
[junit4:junit4]   2> 1989 T72 oasc.SolrCore.initDeprecatedSupport WARNING solrconfig.xml uses deprecated <admin/gettableFiles>, Please update your config to use the ShowFileRequestHandler.
[junit4:junit4]   2> 1990 T72 oasc.SolrCore.initDeprecatedSupport WARNING adding ShowFileRequestHandler with hidden files: [SCHEMA-COLLATE.XML, BAD-SOLRCONFIG-BOGUS-SCRIPTENGINE-NAME.XML, SOLRCONFIG-SLAVE.XML, SOLRCONFIG-MASTER.XML, OPEN-EXCHANGE-RATES.JSON, SCHEMA-PHRASESUGGEST.XML, SOLRCONFIG-NOCACHE.XML, SOLRCONFIG_CODEC.XML, SCHEMA-BM25.XML, SCHEMA-NOT-REQUIRED-UNIQUE-KEY.XML, ELEVATE.XML, BAD-SCHEMA-NOT-INDEXED-BUT-POS.XML, BAD-SCHEMA-DUP-FIELD.XML, STOP-2.TXT, XSLT, SOLRCONFIG-UPDATE-PROCESSOR-CHAINS.XML, SCHEMA-BINARYFIELD.XML, BAD-SCHEMA-EXTERNAL-FILEFIELD.XML, SOLRCONFIG-MASTER1.XML, DA_COMPOUNDDICTIONARY.TXT, ADDFIELDS.UPDATEPROCESSOR.JS, SOLRCONFIG-SPELLCHECKER.XML, SCHEMA-COPYFIELD-TEST.XML, BAD_SOLRCONFIG.XML, MISSLEADING.EXTENSION.UPDATEPROCESSOR.JS.TXT, SCHEMA11.XML, BAD-SCHEMA-UNIQUEKEY-MULTIVALUED.XML, BAD-SOLRCONFIG-INVALID-SCRIPTFILE.XML, SOLRCONFIG-MASTER1-KEEPONEBACKUP.XML, SCHEMA-TRIE.XML, SCHEMA-COLLATEFILTER.XML, SCHEMA-REPLICATION1.XML, STOPWORDSWRONGENCODING.TXT, SCHEMA-LUCENEMATCHVERSION.XML, TRIVIAL.UPDATEPROCESSOR1.JS, SOLRCONFIG-MERGEPOLICY.XML, SOLRCONFIG-SIMPLELOCK.XML, SOLRCONFIG-REQHANDLER.INCL, SOLRCONFIG-MASTER2.XML, CONDITIONAL.UPDATEPROCESSOR.JS, STOP-1.TXT, HUNSPELL-TEST.DIC, PHRASESUGGEST.TXT, STOPWITHBOM.TXT, SOLRCONFIG-BASIC.XML, PROTWORDS.TXT, FRENCHARTICLES.TXT, BAD-SOLRCONFIG-MISSING-SCRIPTFILE.XML, BAD-SCHEMA-ANALYZER-CLASS-AND-NESTED.XML, BAD-SCHEMA-NONTEXT-ANALYZER.XML, SCHEMA12.XML, SOLRCONFIG-SLAVE1.XML, SOLRCONFIG-ENABLEPLUGIN.XML, MISSING.FUNCTIONS.UPDATEPROCESSOR.JS, OLD_SYNONYMS.TXT, SCHEMA-LMJELINEKMERCER.XML, SOLRCONFIG-PHRASESUGGEST.XML, BAD-MP-SOLRCONFIG.XML, SOLRCONFIG-TRANSFORMERS.XML, SOLRCONFIG-SOLCOREPROPERTIES.XML, BAD-SCHEMA-UNIQUEKEY-USES-DEFAULT.XML, SOLRCONFIG-TERMINDEX.XML, STOPTYPES-1.TXT, SCHEMA.XML, SCHEMA-SIM.XML, BAD-SCHEMA-NOT-INDEXED-BUT-TF.XML, SOLRCONFIG-SCRIPT-UPDATEPROCESSOR.XML, SOLRCONFIG-QUERYSENDER.XML, SCHEMA-LMDIRICHLET.XML, SOLRCONFIG-XINCLUDE.XML, HUNSPELL-TEST.AFF, SYNONYMS.TXT, SOLRCONFIG-LAZYWRITER.XML, STEMDICT.TXT, SCHEMA-FOLDING.XML, SCHEMA-REVERSED.XML, SOLRCONFIG_PERF.XML, SOLRCONFIG-SPELLCHECKCOMPONENT.XML, SCHEMA-IB.XML, STOPWORDS.TXT, SCHEMA-STOP-KEEP.XML, BAD-SCHEMA-CODEC-GLOBAL-VS-FT-MISMATCH.XML, SOLRCONFIG-CACHING.XML, SCHEMA-TFIDF.XML, SOLRCONFIG-DELPOLICY2.XML, SOLRCONFIG-ALTDIRECTORY.XML, KEEP-2.TXT, HYPHENATION.DTD, SOLRCONFIG-HIGHLIGHT.XML, SCHEMA-NUMERIC.XML, BAD-SCHEMA-DUP-FIELDTYPE.XML, SCHEMA-CHARFILTERS.XML, SCHEMA-MINIMAL.XML, COMPOUNDDICTIONARY.TXT, SOLRCONFIG-PROPINJECT.XML, SCHEMA-DFR.XML, SCHEMA15.XML, SOLRCONFIG-FUNCTIONQUERY.XML, SOLRCONFIG-ELEVATE.XML, SOLRCONFIG-REPEATER.XML, DA_UTF8.XML, SCHEMA-REQUIRED-FIELDS.XML, BAD-SCHEMA-SIM-GLOBAL-VS-FT-MISMATCH.XML, BAD-SCHEMA-UNIQUEKEY-IS-COPYFIELD-DEST.XML, CURRENCY.XML, SOLRCONFIG-QUERYSENDER-NOQUERY.XML, MAPPING-ISOLATIN1ACCENT.TXT, TRIVIAL.UPDATEPROCESSOR0.JS, SOLRCONFIG-SOLR-749.XML, THROW.ERROR.ON.ADD.UPDATEPROCESSOR.JS, BAD-SCHEMA-NOT-INDEXED-BUT-NORMS.XML, SOLRCONFIG-TLOG.XML, BAD-SCHEMA-DUP-DYNAMICFIELD.XML, SOLRCONFIG-NATIVELOCK.XML, SCHEMA-SPELLCHECKER.XML, WDFTYPES.TXT, SOLRCONFIG-MASTER3.XML, SCHEMA_CODEC.XML, STOPTYPES-2.TXT, SCHEMASURROUND.XML, SOLRCONFIG-DELPOLICY1.XML, SOLRCONFIG-PROPINJECT-INDEXDEFAULT.XML, BAD-SCHEMA-OMIT-TF-BUT-NOT-POS.XML, STOP-SNOWBALL.TXT, SCHEMA-REPLICATION2.XML, KEEP-1.TXT, SOLRCONFIG-BASIC-LUCENEVERSION31.XML]
[junit4:junit4]   2> 1991 T72 oass.SolrIndexSearcher.<init> Opening Searcher@75a69570 main
[junit4:junit4]   2> 1991 T72 oass.SolrIndexSearcher.getIndexDir WARNING WARNING: Directory impl does not support setting indexDir: org.apache.lucene.store.MockDirectoryWrapper
[junit4:junit4]   2> 1992 T72 oasu.CommitTracker.<init> Hard AutoCommit: disabled
[junit4:junit4]   2> 1992 T72 oasu.CommitTracker.<init> Soft AutoCommit: disabled
[junit4:junit4]   2> 1992 T72 oashc.QueryElevationComponent.inform Loading QueryElevation from: /mnt/ssd/jenkins/workspace/Lucene-Solr-4.x-Linux/checkout/solr/build/solr-core/test-files/solr/collection1/conf/elevate.xml
[junit4:junit4]   2> 2005 T72 oashc.QueryElevationComponent.inform Loading QueryElevation from: /mnt/ssd/jenkins/workspace/Lucene-Solr-4.x-Linux/checkout/solr/build/solr-core/test-files/solr/collection1/conf/elevate.xml
[junit4:junit4]   2> 2011 T72 oashc.HttpShardHandlerFactory.getParameter Setting socketTimeout to: 0
[junit4:junit4]   2> 2011 T72 oashc.HttpShardHandlerFactory.getParameter Setting urlScheme to: http://
[junit4:junit4]   2> 2011 T72 oashc.HttpShardHandlerFactory.getParameter Setting connTimeout to: 0
[junit4:junit4]   2> 2012 T72 oashc.HttpShardHandlerFactory.getParameter Setting maxConnectionsPerHost to: 20
[junit4:junit4]   2> 2012 T72 oashc.HttpShardHandlerFactory.getParameter Setting corePoolSize to: 0
[junit4:junit4]   2> 2012 T72 oashc.HttpShardHandlerFactory.getParameter Setting maximumPoolSize to: 2147483647
[junit4:junit4]   2> 2012 T72 oashc.HttpShardHandlerFactory.getParameter Setting maxThreadIdleTime to: 5
[junit4:junit4]   2> 2012 T72 oashc.HttpShardHandlerFactory.getParameter Setting sizeOfQueue to: -1
[junit4:junit4]   2> 2013 T72 oashc.HttpShardHandlerFactory.getParameter Setting fairnessPolicy to: false
[junit4:junit4]   2> 2013 T72 oascsi.HttpClientUtil.createClient Creating new http client, config:maxConnectionsPerHost=20&maxConnections=10000&socketTimeout=0&connTimeout=0&retry=false
[junit4:junit4]   2> 2016 T113 oasc.SolrCore.registerSearcher [collection1] Registered new searcher Searcher@75a69570 main{StandardDirectoryReader(segments_1:1)}
[junit4:junit4]   2> 2016 T72 oasc.CoreContainer.register registering core: collection1
[junit4:junit4]   2> 2016 T72 oass.SolrDispatchFilter.init user.dir=/mnt/ssd/jenkins/workspace/Lucene-Solr-4.x-Linux/checkout/solr/build/solr-core/test/J1
[junit4:junit4]   2> 2017 T72 oass.SolrDispatchFilter.init SolrDispatchFilter.init() done
[junit4:junit4]   2> 2017 T72 oascsi.HttpClientUtil.createClient Creating new http client, config:maxConnections=128&maxConnectionsPerHost=32&followRedirects=false
[junit4:junit4]   2> ASYNC  NEW_CORE C10 name=collection1 org.apache.solr.core.SolrCore@236aaabe
[junit4:junit4]   2> 2141 T76 C10 oasu.DirectUpdateHandler2.deleteAll [collection1] REMOVING ALL DOCUMENTS FROM INDEX
[junit4:junit4]   2> 2142 T76 C10 oasc.SolrDeletionPolicy.onInit SolrDeletionPolicy.onInit: commits:num=1
[junit4:junit4]   2> 		commit{dir=MockDirWrapper(org.apache.lucene.store.RAMDirectory@2fefb21c lockFactory=org.apache.lucene.store.SingleInstanceLockFactory@18b73570),segFN=segments_1,generation=1,filenames=[segments_1]
[junit4:junit4]   2> 2143 T76 C10 oasc.SolrDeletionPolicy.updateCommits newest commit = 1
[junit4:junit4]   2> 2143 T76 C10 UPDATE [collection1] webapp=/solr path=/update params={version=2&wt=javabin} {deleteByQuery=*:*} 0 7
[junit4:junit4]   2> ASYNC  NEW_CORE C11 name=collection1 org.apache.solr.core.SolrCore@2a1a9d11
[junit4:junit4]   2> 2161 T86 C11 oasu.DirectUpdateHandler2.deleteAll [collection1] REMOVING ALL DOCUMENTS FROM INDEX
[junit4:junit4]   2> 2162 T86 C11 oasc.SolrDeletionPolicy.onInit SolrDeletionPolicy.onInit: commits:num=1
[junit4:junit4]   2> 		commit{dir=MockDirWrapper(org.apache.lucene.store.RAMDirectory@393ddcaf lockFactory=org.apache.lucene.store.SingleInstanceLockFactory@590df01d),segFN=segments_1,generation=1,filenames=[segments_1]
[junit4:junit4]   2> 2163 T86 C11 oasc.SolrDeletionPolicy.updateCommits newest commit = 1
[junit4:junit4]   2> 2163 T86 C11 UPDATE [collection1] webapp=/solr path=/update params={version=2&wt=javabin} {deleteByQuery=*:*} 0 2
[junit4:junit4]   2> ASYNC  NEW_CORE C12 name=collection1 org.apache.solr.core.SolrCore@74a7c970
[junit4:junit4]   2> 2169 T96 C12 oasu.DirectUpdateHandler2.deleteAll [collection1] REMOVING ALL DOCUMENTS FROM INDEX
[junit4:junit4]   2> 2170 T96 C12 oasc.SolrDeletionPolicy.onInit SolrDeletionPolicy.onInit: commits:num=1
[junit4:junit4]   2> 		commit{dir=MockDirWrapper(org.apache.lucene.store.RAMDirectory@339a13e5 lockFactory=org.apache.lucene.store.SingleInstanceLockFactory@74c63c6d),segFN=segments_1,generation=1,filenames=[segments_1]
[junit4:junit4]   2> 2170 T96 C12 oasc.SolrDeletionPolicy.updateCommits newest commit = 1
[junit4:junit4]   2> 2171 T96 C12 UPDATE [collection1] webapp=/solr path=/update params={version=2&wt=javabin} {deleteByQuery=*:*} 0 3
[junit4:junit4]   2> ASYNC  NEW_CORE C13 name=collection1 org.apache.solr.core.SolrCore@a505e06
[junit4:junit4]   2> 2178 T106 C13 oasu.DirectUpdateHandler2.deleteAll [collection1] REMOVING ALL DOCUMENTS FROM INDEX
[junit4:junit4]   2> 2179 T106 C13 oasc.SolrDeletionPolicy.onInit SolrDeletionPolicy.onInit: commits:num=1
[junit4:junit4]   2> 		commit{dir=MockDirWrapper(org.apache.lucene.store.RAMDirectory@4caabc8c lockFactory=org.apache.lucene.store.SingleInstanceLockFactory@4290e01e),segFN=segments_1,generation=1,filenames=[segments_1]
[junit4:junit4]   2> 2179 T106 C13 oasc.SolrDeletionPolicy.updateCommits newest commit = 1
[junit4:junit4]   2> 2179 T106 C13 UPDATE [collection1] webapp=/solr path=/update params={version=2&wt=javabin} {deleteByQuery=*:*} 0 2
[junit4:junit4]   2> 2185 T76 C10 UPDATE [collection1] webapp=/solr path=/update params={version=2&wt=javabin} {add=[1]} 0 2
[junit4:junit4]   2> 2189 T86 C11 UPDATE [collection1] webapp=/solr path=/update params={version=2&wt=javabin} {add=[1]} 0 1
[junit4:junit4]   2> 2193 T76 C10 UPDATE [collection1] webapp=/solr path=/update params={version=2&wt=javabin} {add=[2]} 0 1
[junit4:junit4]   2> 2196 T96 C12 UPDATE [collection1] webapp=/solr path=/update params={version=2&wt=javabin} {add=[2]} 0 1
[junit4:junit4]   2> 2199 T76 C10 UPDATE [collection1] webapp=/solr path=/update params={version=2&wt=javabin} {add=[3]} 0 0
[junit4:junit4]   2> 2220 T106 C13 UPDATE [collection1] webapp=/solr path=/update params={version=2&wt=javabin} {add=[3]} 0 2
[junit4:junit4]   2> 2224 T76 C10 UPDATE [collection1] webapp=/solr path=/update params={version=2&wt=javabin} {add=[4]} 0 0
[junit4:junit4]   2> 2229 T86 C11 UPDATE [collection1] webapp=/solr path=/update params={version=2&wt=javabin} {add=[4]} 0 0
[junit4:junit4]   2> 2233 T76 C10 UPDATE [collection1] webapp=/solr path=/update params={version=2&wt=javabin} {add=[5]} 0 0
[junit4:junit4]   2> 2237 T96 C12 UPDATE [collection1] webapp=/solr path=/update params={version=2&wt=javabin} {add=[5]} 0 0
[junit4:junit4]   2> 2241 T76 C10 UPDATE [collection1] webapp=/solr path=/update params={version=2&wt=javabin} {add=[6]} 0 1
[junit4:junit4]   2> 2246 T106 C13 UPDATE [collection1] webapp=/solr path=/update params={version=2&wt=javabin} {add=[6]} 0 1
[junit4:junit4]   2> 2249 T76 C10 UPDATE [collection1] webapp=/solr path=/update params={version=2&wt=javabin} {add=[7]} 0 0
[junit4:junit4]   2> 2253 T106 C13 UPDATE [collection1] webapp=/solr path=/update params={version=2&wt=javabin} {add=[7]} 0 1
[junit4:junit4]   2> 2261 T76 C10 oasu.DirectUpdateHandler2.commit start commit{flags=0,_version_=0,optimize=false,openSearcher=true,waitSearcher=true,expungeDeletes=false,softCommit=false}
[junit4:junit4]   2> 2263 T76 C10 oasc.SolrDeletionPolicy.onCommit SolrDeletionPolicy.onCommit: commits:num=2
[junit4:junit4]   2> 		commit{dir=MockDirWrapper(org.apache.lucene.store.RAMDirectory@2fefb21c lockFactory=org.apache.lucene.store.SingleInstanceLockFactory@18b73570),segFN=segments_1,generation=1,filenames=[segments_1]
[junit4:junit4]   2> 		commit{dir=MockDirWrapper(org.apache.lucene.store.RAMDirectory@2fefb21c lockFactory=org.apache.lucene.store.SingleInstanceLockFactory@18b73570),segFN=segments_2,generation=2,filenames=[_0.fdt, _0.prx, _0.frq, _0_nrm.cfe, segments_2, _0.fdx, _0.tip, _0_nrm.cfs, _0.tim, _0.fnm, _0.si]
[junit4:junit4]   2> 2264 T76 C10 oasc.SolrDeletionPolicy.updateCommits newest commit = 2
[junit4:junit4]   2> 2265 T76 C10 oass.SolrIndexSearcher.<init> Opening Searcher@547f5496 main
[junit4:junit4]   2> 2265 T76 C10 oass.SolrIndexSearcher.getIndexDir WARNING WARNING: Directory impl does not support setting indexDir: org.apache.lucene.store.MockDirectoryWrapper
[junit4:junit4]   2> 2267 T76 C10 oasu.DirectUpdateHandler2.commit end_commit_flush
[junit4:junit4]   2> 2267 T83 oasc.SolrCore.registerSearcher [collection1] Registered new searcher Searcher@547f5496 main{StandardDirectoryReader(segments_2:4 _0(4.0.0.1):C7)}
[junit4:junit4]   2> 2268 T76 C10 UPDATE [collection1] webapp=/solr path=/update params={version=2&waitSearcher=true&wt=javabin&softCommit=false&commit=true} {commit=} 0 7
[junit4:junit4]   2> 2271 T86 C11 oasu.DirectUpdateHandler2.commit start commit{flags=0,_version_=0,optimize=false,openSearcher=true,waitSearcher=true,expungeDeletes=false,softCommit=false}
[junit4:junit4]   2> 2273 T86 C11 oasc.SolrDeletionPolicy.onCommit SolrDeletionPolicy.onCommit: commits:num=2
[junit4:junit4]   2> 		commit{dir=MockDirWrapper(org.apache.lucene.store.RAMDirectory@393ddcaf lockFactory=org.apache.lucene.store.SingleInstanceLockFactory@590df01d),segFN=segments_1,generation=1,filenames=[segments_1]
[junit4:junit4]   2> 		commit{dir=MockDirWrapper(org.apache.lucene.store.RAMDirectory@393ddcaf lockFactory=org.apache.lucene.store.SingleInstanceLockFactory@590df01d),segFN=segments_2,generation=2,filenames=[_0.fdt, _0.prx, _0.frq, _0_nrm.cfe, segments_2, _0.fdx, _0.tip, _0_nrm.cfs, _0.tim, _0.fnm, _0.si]
[junit4:junit4]   2> 2273 T86 C11 oasc.SolrDeletionPolicy.updateCommits newest commit = 2
[junit4:junit4]   2> 2275 T86 C11 oass.SolrIndexSearcher.<init> Opening Searcher@55401592 main
[junit4:junit4]   2> 2275 T86 C11 oass.SolrIndexSearcher.getIndexDir WARNING WARNING: Directory impl does not support setting indexDir: org.apache.lucene.store.MockDirectoryWrapper
[junit4:junit4]   2> 2275 T86 C11 oasu.DirectUpdateHandler2.commit end_commit_flush
[junit4:junit4]   2> 2276 T93 oasc.SolrCore.registerSearcher [collection1] Registered new searcher Searcher@55401592 main{StandardDirectoryReader(segments_2:4 _0(4.0.0.1):C2)}
[junit4:junit4]   2> 2277 T86 C11 UPDATE [collection1] webapp=/solr path=/update params={version=2&waitSearcher=true&wt=javabin&softCommit=false&commit=true} {commit=} 0 6
[junit4:junit4]   2> 2288 T96 C12 oasu.DirectUpdateHandler2.commit start commit{flags=0,_version_=0,optimize=false,openSearcher=true,waitSearcher=true,expungeDeletes=false,softCommit=false}
[junit4:junit4]   2> 2295 T96 C12 oasc.SolrDeletionPolicy.onCommit SolrDeletionPolicy.onCommit: commits:num=2
[junit4:junit4]   2> 		commit{dir=MockDirWrapper(org.apache.lucene.store.RAMDirectory@339a13e5 lockFactory=org.apache.lucene.store.SingleInstanceLockFactory@74c63c6d),segFN=segments_1,generation=1,filenames=[segments_1]
[junit4:junit4]   2> 		commit{dir=MockDirWrapper(org.apache.lucene.store.RAMDirectory@339a13e5 lockFactory=org.apache.lucene.store.SingleInstanceLockFactory@74c63c6d),segFN=segments_2,generation=2,filenames=[_0.fdt, _0.prx, _0.frq, _0_nrm.cfe, segments_2, _0.fdx, _0.tip, _0_nrm.cfs, _0.tim, _0.fnm, _0.si]
[junit4:junit4]   2> 2296 T96 C12 oasc.SolrDeletionPolicy.updateCommits newest commit = 2
[junit4:junit4]   2> 2298 T96 C12 oass.SolrIndexSearcher.<init> Opening Searcher@3d510eb6 main
[junit4:junit4]   2> 2298 T96 C12 oass.SolrIndexSearcher.getIndexDir WARNING WARNING: Directory impl does not support setting indexDir: org.apache.lucene.store.MockDirectoryWrapper
[junit4:junit4]   2> 2299 T96 C12 oasu.DirectUpdateHandler2.commit end_commit_flush
[junit4:junit4]   2> 2299 T103 oasc.SolrCore.registerSearcher [collection1] Registered new searcher Searcher@3d510eb6 main{StandardDirectoryReader(segments_2:4 _0(4.0.0.1):C2)}
[junit4:junit4]   2> 2301 T96 C12 UPDATE [collection1] webapp=/solr path=/update params={version=2&waitSearcher=true&wt=javabin&softCommit=false&commit=true} {commit=} 0 14
[junit4:junit4]   2> 2304 T106 C13 oasu.DirectUpdateHandler2.commit start commit{flags=0,_version_=0,optimize=false,openSearcher=true,waitSearcher=true,expungeDeletes=false,softCommit=false}
[junit4:junit4]   2> 2306 T106 C13 oasc.SolrDeletionPolicy.onCommit SolrDeletionPolicy.onCommit: commits:num=2
[junit4:junit4]   2> 		commit{dir=MockDirWrapper(org.apache.lucene.store.RAMDirectory@4caabc8c lockFactory=org.apache.lucene.store.SingleInstanceLockFactory@4290e01e),segFN=segments_1,generation=1,filenames=[segments_1]
[junit4:junit4]   2> 		commit{dir=MockDirWrapper(org.apache.lucene.store.RAMDirectory@4caabc8c lockFactory=org.apache.lucene.store.SingleInstanceLockFactory@4290e01e),segFN=segments_2,generation=2,filenames=[_0.fdt, _0.prx, _0.frq, _0_nrm.cfe, segments_2, _0.fdx, _0.tip, _0_nrm.cfs, _0.tim, _0.fnm, _0.si]
[junit4:junit4]   2> 2306 T106 C13 oasc.SolrDeletionPolicy.updateCommits newest commit = 2
[junit4:junit4]   2> 2307 T106 C13 oass.SolrIndexSearcher.<init> Opening Searcher@a5843f5 main
[junit4:junit4]   2> 2308 T106 C13 oass.SolrIndexSearcher.getIndexDir WARNING WARNING: Directory impl does not support setting indexDir: org.apache.lucene.store.MockDirectoryWrapper
[junit4:junit4]   2> 2308 T106 C13 oasu.DirectUpdateHandler2.commit end_commit_flush
[junit4:junit4]   2> 2309 T113 oasc.SolrCore.registerSearcher [collection1] Registered new searcher Searcher@a5843f5 main{StandardDirectoryReader(segments_2:4 _0(4.0.0.1):C3)}
[junit4:junit4]   2> 2312 T106 C13 UPDATE [collection1] webapp=/solr path=/update params={version=2&waitSearcher=true&wt=javabin&softCommit=false&commit=true} {commit=} 0 8
[junit4:junit4]   2> 2373 T76 C10 REQ [collection1] webapp=/solr path=/elevate params={qt=/elevate&fl=id,+score,+[elevated]&rows=500&version=2&q=*:*&wt=javabin&sort=id+desc&shards.qt=/elevate&distrib=false} hits=7 status=0 QTime=52 
[junit4:junit4]   2> 2400 T87 C11 REQ [collection1] webapp=/solr path=/elevate params={start=0&shard.url=[::1]:33332/solr|localhost:37234/solr&NOW=1343887696080&fsv=true&fl=id,score&qt=/elevate&rows=500&distrib=false&isShard=true&version=2&q=*:*&wt=javabin&sort=id+desc&shards.qt=/elevate} hits=2 status=0 QTime=4 
[junit4:junit4]   2> 2401 T97 C12 REQ [collection1] webapp=/solr path=/elevate params={start=0&shard.url=localhost:45985/solr&NOW=1343887696080&fsv=true&fl=id,score&qt=/elevate&rows=500&distrib=false&isShard=true&version=2&q=*:*&wt=javabin&sort=id+desc&shards.qt=/elevate} hits=2 status=0 QTime=5 
[junit4:junit4]   2> 2401 T107 C13 REQ [collection1] webapp=/solr path=/elevate params={start=0&shard.url=localhost:51985/solr&NOW=1343887696080&fsv=true&fl=id,score&qt=/elevate&rows=500&distrib=false&isShard=true&version=2&q=*:*&wt=javabin&sort=id+desc&shards.qt=/elevate} hits=3 status=0 QTime=5 
[junit4:junit4]   2> 2410 T87 C11 REQ [collection1] webapp=/solr path=/elevate params={shard.url=[::1]:33332/solr|localhost:37234/solr&NOW=1343887696080&qt=/elevate&fl=id,+score,+[elevated]&rows=500&distrib=false&isShard=true&ids=4.0,1.0&version=2&q=*:*&wt=javabin&shards.qt=/elevate} status=0 QTime=1 
[junit4:junit4]   2> 2410 T97 C12 REQ [collection1] webapp=/solr path=/elevate params={shard.url=localhost:45985/solr&NOW=1343887696080&qt=/elevate&fl=id,+score,+[elevated]&rows=500&distrib=false&isShard=true&ids=2.0,5.0&version=2&q=*:*&wt=javabin&shards.qt=/elevate} status=0 QTime=1 
[junit4:junit4]   2> 2413 T107 C13 REQ [collection1] webapp=/solr path=/elevate params={shard.url=localhost:51985/solr&NOW=1343887696080&qt=/elevate&fl=id,+score,+[elevated]&rows=500&distrib=false&isShard=true&ids=3.0,7.0,6.0&version=2&q=*:*&wt=javabin&shards.qt=/elevate} status=0 QTime=0 
[junit4:junit4]   2> 2416 T86 C11 REQ [collection1] webapp=/solr path=/elevate params={qt=/elevate&fl=id,+score,+[elevated]&rows=500&shards=[::1]:33332/solr|localhost:37234/solr,localhost:45985/solr,localhost:51985/solr&version=2&q=*:*&wt=javabin&sort=id+desc&shards.qt=/elevate} status=0 QTime=39 
[junit4:junit4]   2> 2418 T72 oas.BaseDistributedSearchTestCase.compareResponses SEVERE Mismatched responses:
[junit4:junit4]   2> 	{responseHeader={status=0,QTime=39,params={qt=/elevate,fl=id, score, [elevated],rows=500,shards=[::1]:33332/solr|localhost:37234/solr,localhost:45985/solr,localhost:51985/solr,version=2,q=*:*,wt=javabin,sort=id desc,shards.qt=/elevate}},response={numFound=7,start=0,maxScore=1.0,docs=[SolrDocument{id=7.0, [elevated]=false, score=1.0}, SolrDocument{id=6.0, [elevated]=false, score=1.0}, SolrDocument{id=5.0, [elevated]=false, score=1.0}, SolrDocument{id=4.0, [elevated]=false, score=1.0}, SolrDocument{id=3.0, [elevated]=false, score=1.0}, SolrDocument{id=2.0, [elevated]=false, score=1.0}, SolrDocument{id=1.0, [elevated]=false, score=1.0}]}}
[junit4:junit4]   2> 	{responseHeader={status=0,QTime=52,params={qt=/elevate,fl=id, score, [elevated],rows=500,version=2,q=*:*,wt=javabin,sort=id desc,shards.qt=/elevate,distrib=false}},response={numFound=7,start=0,maxScore=1.0,docs=[SolrDocument{id=7.0, score=1.0, [elevated]=false}, SolrDocument{id=6.0, score=1.0, [elevated]=false}, SolrDocument{id=5.0, score=1.0, [elevated]=false}, SolrDocument{id=4.0, score=1.0, [elevated]=false}, SolrDocument{id=3.0, score=1.0, [elevated]=false}, SolrDocument{id=2.0, score=1.0, [elevated]=false}, SolrDocument{id=1.0, score=1.0, [elevated]=false}]}}
[junit4:junit4]   2> 2420 T72 oasc.CoreContainer.shutdown Shutting down CoreContainer instance=877728880
[junit4:junit4]   2> 2421 T72 oasc.SolrCore.close [collection1]  CLOSING SolrCore org.apache.solr.core.SolrCore@236aaabe
[junit4:junit4]   2> 2422 T72 oasc.SolrCore.closeSearcher [collection1] Closing main searcher on request.
[junit4:junit4]   2> 2423 T72 oasu.DirectUpdateHandler2.close closing DirectUpdateHandler2{commits=1,autocommits=0,soft autocommits=0,optimizes=0,rollbacks=0,expungeDeletes=0,docsPending=0,adds=0,deletesById=0,deletesByQuery=0,errors=0,cumulative_adds=7,cumulative_deletesById=0,cumulative_deletesByQuery=1,cumulative_errors=0}
[junit4:junit4]   2> 2426 T72 oejsh.ContextHandler.doStop stopped o.e.j.s.ServletContextHandler{/solr,null}
[junit4:junit4]   2> 2481 T72 oasc.CoreContainer.shutdown Shutting down CoreContainer instance=1453605374
[junit4:junit4]   2> 2481 T72 oasc.SolrCore.close [collection1]  CLOSING SolrCore org.apache.solr.core.SolrCore@2a1a9d11
[junit4:junit4]   2> 2483 T72 oasc.SolrCore.closeSearcher [collection1] Closing main searcher on request.
[junit4:junit4]   2> 2484 T72 oasu.DirectUpdateHandler2.close closing DirectUpdateHandler2{commits=1,autocommits=0,soft autocommits=0,optimizes=0,rollbacks=0,expungeDeletes=0,docsPending=0,adds=0,deletesById=0,deletesByQuery=0,errors=0,cumulative_adds=2,cumulative_deletesById=0,cumulative_deletesByQuery=1,cumulative_errors=0}
[junit4:junit4]   2> 2504 T72 oejsh.ContextHandler.doStop stopped o.e.j.s.ServletContextHandler{/solr,null}
[junit4:junit4]   2> 2555 T72 oasc.CoreContainer.shutdown Shutting down CoreContainer instance=2138056720
[junit4:junit4]   2> 2556 T72 oasc.SolrCore.close [collection1]  CLOSING SolrCore org.apache.solr.core.SolrCore@74a7c970
[junit4:junit4]   2> 2557 T72 oasc.SolrCore.closeSearcher [collection1] Closing main searcher on request.
[junit4:junit4]   2> 2557 T72 oasu.DirectUpdateHandler2.close closing DirectUpdateHandler2{commits=1,autocommits=0,soft autocommits=0,optimizes=0,rollbacks=0,expungeDeletes=0,docsPending=0,adds=0,deletesById=0,deletesByQuery=0,errors=0,cumulative_adds=2,cumulative_deletesById=0,cumulative_deletesByQuery=1,cumulative_errors=0}
[junit4:junit4]   2> 2563 T72 oejsh.ContextHandler.doStop stopped o.e.j.s.ServletContextHandler{/solr,null}
[junit4:junit4]   2> 2616 T72 oasc.CoreContainer.shutdown Shutting down CoreContainer instance=1357556021
[junit4:junit4]   2> 2616 T72 oasc.SolrCore.close [collection1]  CLOSING SolrCore org.apache.solr.core.SolrCore@a505e06
[junit4:junit4]   2> 2618 T72 oasc.SolrCore.closeSearcher [collection1] Closing main searcher on request.
[junit4:junit4]   2> 2618 T72 oasu.DirectUpdateHandler2.close closing DirectUpdateHandler2{commits=1,autocommits=0,soft autocommits=0,optimizes=0,rollbacks=0,expungeDeletes=0,docsPending=0,adds=0,deletesById=0,deletesByQuery=0,errors=0,cumulative_adds=3,cumulative_deletesById=0,cumulative_deletesByQuery=1,cumulative_errors=0}
[junit4:junit4]   2> 2623 T72 oejsh.ContextHandler.doStop stopped o.e.j.s.ServletContextHandler{/solr,null}
[junit4:junit4]   2> 2676 T72 oas.SolrTestCaseJ4.tearDown ###Ending testDistribSearch
[junit4:junit4]   2> NOTE: reproduce with: ant test  -Dtestcase=DistributedQueryElevationComponentTest -Dtests.method=testDistribSearch -Dtests.seed=A69D4244CFBDD68C -Dtests.multiplier=3 -Dtests.slow=true -Dtests.locale=ar_MA -Dtests.timezone=Asia/Thimbu -Dtests.file.encoding=UTF-8
[junit4:junit4]   2>
[junit4:junit4]    > (@AfterClass output)
[junit4:junit4]   2> 2732 T72 oas.SolrTestCaseJ4.deleteCore ###deleteCore
[junit4:junit4]   2> NOTE: test params are: codec=Appending, sim=RandomSimilarityProvider(queryNorm=true,coord=false): {}, locale=ar_MA, timezone=Asia/Thimbu
[junit4:junit4]   2> NOTE: Linux 3.2.0-27-generic amd64/Oracle Corporation 1.8.0-ea (64-bit)/cpus=8,threads=1,free=74397520,total=126484480
[junit4:junit4]   2> NOTE: All tests run in this JVM: [SoftAutoCommitTest, TestFaceting, OutputWriterTest, SolrPluginUtilsTest, SampleTest, TestPropInject, CoreContainerCoreInitFailuresTest, TestPropInjectDefaults, QueryEqualityTest, RequiredFieldsTest, FieldMutatingUpdateProcessorTest, TestQueryTypes, DistributedQueryElevationComponentTest]
[junit4:junit4]   2> 
[junit4:junit4] Completed on J1 in 2.75s, 1 test, 1 failure <<< FAILURES!

[...truncated 633 lines...]
BUILD FAILED
/mnt/ssd/jenkins/workspace/Lucene-Solr-4.x-Linux/checkout/build.xml:29: The following error occurred while executing this line:
/mnt/ssd/jenkins/workspace/Lucene-Solr-4.x-Linux/checkout/solr/build.xml:144: The following error occurred while executing this line:
/mnt/ssd/jenkins/workspace/Lucene-Solr-4.x-Linux/checkout/lucene/module-build.xml:62: The following error occurred while executing this line:
/mnt/ssd/jenkins/workspace/Lucene-Solr-4.x-Linux/checkout/lucene/common-build.xml:1095: The following error occurred while executing this line:
/mnt/ssd/jenkins/workspace/Lucene-Solr-4.x-Linux/checkout/lucene/common-build.xml:790: There were test failures: 224 suites, 903 tests, 1 failure, 5 ignored

Total time: 20 minutes 47 seconds
Build step 'Execute shell' marked build as failure
Archiving artifacts
Recording test results
Email was triggered for: Failure
Sending email for trigger: Failure



Mime
View raw message