lucene-dev mailing list archives

Site index · List index
Message view « Date » · « Thread »
Top « Date » · « Thread »
From Policeman Jenkins Server <jenk...@sd-datasolutions.de>
Subject [JENKINS] Lucene-Solr-trunk-Windows (64bit/jdk1.7.0_05) - Build # 189 - Failure!
Date Sat, 11 Aug 2012 03:04:26 GMT
Build: http://jenkins.sd-datasolutions.de/job/Lucene-Solr-trunk-Windows/189/
Java: 64bit/jdk1.7.0_05 -XX:+UseG1GC

1 tests failed.
REGRESSION:  org.apache.solr.spelling.suggest.SuggesterTSTTest.testSuggestions

Error Message:
Exception during query

Stack Trace:
java.lang.RuntimeException: Exception during query
	at __randomizedtesting.SeedInfo.seed([DA0329C9FAAE17A6:7CDF103C349A4058]:0)
	at org.apache.solr.SolrTestCaseJ4.assertQ(SolrTestCaseJ4.java:486)
	at org.apache.solr.SolrTestCaseJ4.assertQ(SolrTestCaseJ4.java:453)
	at org.apache.solr.spelling.suggest.SuggesterTest.testSuggestions(SuggesterTest.java:71)
	at sun.reflect.NativeMethodAccessorImpl.invoke0(Native Method)
	at sun.reflect.NativeMethodAccessorImpl.invoke(NativeMethodAccessorImpl.java:57)
	at sun.reflect.DelegatingMethodAccessorImpl.invoke(DelegatingMethodAccessorImpl.java:43)
	at java.lang.reflect.Method.invoke(Method.java:601)
	at com.carrotsearch.randomizedtesting.RandomizedRunner.invoke(RandomizedRunner.java:1995)
	at com.carrotsearch.randomizedtesting.RandomizedRunner.access$1100(RandomizedRunner.java:132)
	at com.carrotsearch.randomizedtesting.RandomizedRunner$6.evaluate(RandomizedRunner.java:818)
	at com.carrotsearch.randomizedtesting.RandomizedRunner$7.evaluate(RandomizedRunner.java:877)
	at com.carrotsearch.randomizedtesting.RandomizedRunner$8.evaluate(RandomizedRunner.java:891)
	at com.carrotsearch.randomizedtesting.rules.SystemPropertiesRestoreRule$1.evaluate(SystemPropertiesRestoreRule.java:53)
	at org.apache.lucene.util.TestRuleSetupTeardownChained$1.evaluate(TestRuleSetupTeardownChained.java:50)
	at org.apache.lucene.util.TestRuleFieldCacheSanity$1.evaluate(TestRuleFieldCacheSanity.java:32)
	at org.apache.lucene.util.AbstractBeforeAfterRule$1.evaluate(AbstractBeforeAfterRule.java:45)
	at com.carrotsearch.randomizedtesting.rules.SystemPropertiesInvariantRule$1.evaluate(SystemPropertiesInvariantRule.java:55)
	at org.apache.lucene.util.TestRuleReportUncaughtExceptions$1.evaluate(TestRuleReportUncaughtExceptions.java:68)
	at org.apache.lucene.util.TestRuleThreadAndTestName$1.evaluate(TestRuleThreadAndTestName.java:48)
	at org.apache.lucene.util.TestRuleIgnoreAfterMaxFailures$1.evaluate(TestRuleIgnoreAfterMaxFailures.java:70)
	at org.apache.lucene.util.TestRuleMarkFailure$1.evaluate(TestRuleMarkFailure.java:48)
	at com.carrotsearch.randomizedtesting.RandomizedRunner.runSingleTest(RandomizedRunner.java:825)
	at com.carrotsearch.randomizedtesting.RandomizedRunner.access$700(RandomizedRunner.java:132)
	at com.carrotsearch.randomizedtesting.RandomizedRunner$3$1.run(RandomizedRunner.java:671)
	at com.carrotsearch.randomizedtesting.RandomizedRunner$3.evaluate(RandomizedRunner.java:697)
	at com.carrotsearch.randomizedtesting.RandomizedRunner$4.evaluate(RandomizedRunner.java:736)
	at com.carrotsearch.randomizedtesting.RandomizedRunner$5.evaluate(RandomizedRunner.java:747)
	at com.carrotsearch.randomizedtesting.rules.SystemPropertiesRestoreRule$1.evaluate(SystemPropertiesRestoreRule.java:53)
	at org.apache.lucene.util.AbstractBeforeAfterRule$1.evaluate(AbstractBeforeAfterRule.java:45)
	at org.apache.lucene.util.TestRuleReportUncaughtExceptions$1.evaluate(TestRuleReportUncaughtExceptions.java:68)
	at org.apache.lucene.util.TestRuleStoreClassName$1.evaluate(TestRuleStoreClassName.java:38)
	at com.carrotsearch.randomizedtesting.rules.SystemPropertiesInvariantRule$1.evaluate(SystemPropertiesInvariantRule.java:55)
	at org.apache.lucene.util.TestRuleNoInstanceHooksOverrides$1.evaluate(TestRuleNoInstanceHooksOverrides.java:53)
	at org.apache.lucene.util.TestRuleNoStaticHooksShadowing$1.evaluate(TestRuleNoStaticHooksShadowing.java:52)
	at org.apache.lucene.util.TestRuleAssertionsRequired$1.evaluate(TestRuleAssertionsRequired.java:36)
	at org.apache.lucene.util.TestRuleMarkFailure$1.evaluate(TestRuleMarkFailure.java:48)
	at org.apache.lucene.util.TestRuleIgnoreAfterMaxFailures$1.evaluate(TestRuleIgnoreAfterMaxFailures.java:70)
	at org.apache.lucene.util.TestRuleIgnoreTestSuites$1.evaluate(TestRuleIgnoreTestSuites.java:55)
	at com.carrotsearch.randomizedtesting.RandomizedRunner.runSuite(RandomizedRunner.java:605)
	at com.carrotsearch.randomizedtesting.RandomizedRunner.access$400(RandomizedRunner.java:132)
	at com.carrotsearch.randomizedtesting.RandomizedRunner$2.run(RandomizedRunner.java:551)
Caused by: java.lang.RuntimeException: REQUEST FAILED: xpath=//lst[@name='spellcheck']/lst[@name='suggestions']/lst[@name='ac']/int[@name='numFound'][.='2']
	xml response was: <?xml version="1.0" encoding="UTF-8"?>
<response>
<lst name="responseHeader"><int name="status">0</int><int name="QTime">4</int></lst><lst
name="spellcheck"><lst name="suggestions"/></lst>
</response>

	request was:q=ac&spellcheck.count=2&qt=/suggest_tst&spellcheck.onlyMorePopular=true
	at org.apache.solr.SolrTestCaseJ4.assertQ(SolrTestCaseJ4.java:479)
	... 40 more




Build Log:
[...truncated 7042 lines...]
[junit4:junit4] Suite: org.apache.solr.spelling.suggest.SuggesterTSTTest
[junit4:junit4]    > (@BeforeClass output)
[junit4:junit4]   2> 0 T144 oas.SolrTestCaseJ4.initCore ####initCore
[junit4:junit4]   2> Creating dataDir: C:\Jenkins\workspace\Lucene-Solr-trunk-Windows\solr\build\solr-core\test\J0\.\solrtest-SuggesterTSTTest-1344653211782
[junit4:junit4]   2> 1 T144 oasc.SolrResourceLoader.<init> new SolrResourceLoader
for directory: 'C:\Jenkins\workspace\Lucene-Solr-trunk-Windows\solr\build\solr-core\test-files\solr\collection1\'
[junit4:junit4]   2> 3 T144 oasc.SolrResourceLoader.replaceClassLoader Adding 'file:/C:/Jenkins/workspace/Lucene-Solr-trunk-Windows/solr/build/solr-core/test-files/solr/collection1/lib/classes/'
to classloader
[junit4:junit4]   2> 3 T144 oasc.SolrResourceLoader.replaceClassLoader Adding 'file:/C:/Jenkins/workspace/Lucene-Solr-trunk-Windows/solr/build/solr-core/test-files/solr/collection1/lib/README'
to classloader
[junit4:junit4]   2> 52 T144 oasc.SolrConfig.<init> Using Lucene MatchVersion: LUCENE_50
[junit4:junit4]   2> 129 T144 oasc.SolrConfig.<init> Loaded SolrConfig: solrconfig-spellchecker.xml
[junit4:junit4]   2> 130 T144 oass.IndexSchema.readSchema Reading Solr Schema
[junit4:junit4]   2> 134 T144 oass.IndexSchema.readSchema Schema name=Solr SpellCheck Test
[junit4:junit4]   2> 181 T144 oass.IndexSchema.readSchema default search field in schema
is text
[junit4:junit4]   2> 183 T144 oass.IndexSchema.readSchema query parser default operator
is OR
[junit4:junit4]   2> 186 T144 oass.IndexSchema.readSchema unique key field: id
[junit4:junit4]   2> 194 T144 oasc.SolrResourceLoader.locateSolrHome JNDI not configured
for solr (NoInitialContextEx)
[junit4:junit4]   2> 195 T144 oasc.SolrResourceLoader.locateSolrHome using system property
solr.solr.home: C:\Jenkins\workspace\Lucene-Solr-trunk-Windows\solr\build\solr-core\test-files\solr
[junit4:junit4]   2> 195 T144 oasc.SolrResourceLoader.<init> new SolrResourceLoader
for directory: 'C:\Jenkins\workspace\Lucene-Solr-trunk-Windows\solr\build\solr-core\test-files\solr\'
[junit4:junit4]   2> 205 T144 oasc.CoreContainer.<init> New CoreContainer 401222081
[junit4:junit4]   2> 205 T144 oasc.SolrCore.<init> [collection1] Opening new SolrCore
at C:\Jenkins\workspace\Lucene-Solr-trunk-Windows\solr\build\solr-core\test-files\solr\collection1\,
dataDir=C:\Jenkins\workspace\Lucene-Solr-trunk-Windows\solr\build\solr-core\test\J0\.\solrtest-SuggesterTSTTest-1344653211782\
[junit4:junit4]   2> 206 T144 oasc.SolrCore.<init> JMX monitoring not detected for
core: collection1
[junit4:junit4]   2> 236 T144 oasc.SolrCore.getNewIndexDir WARNING New index directory
detected: old=null new=C:\Jenkins\workspace\Lucene-Solr-trunk-Windows\solr\build\solr-core\test\J0\.\solrtest-SuggesterTSTTest-1344653211782\index/
[junit4:junit4]   2> 236 T144 oasc.SolrCore.initIndex WARNING [collection1] Solr index
directory 'C:\Jenkins\workspace\Lucene-Solr-trunk-Windows\solr\build\solr-core\test\J0\.\solrtest-SuggesterTSTTest-1344653211782\index'
doesn't exist. Creating new index...
[junit4:junit4]   2> 473 T144 oasc.SolrDeletionPolicy.onCommit SolrDeletionPolicy.onCommit:
commits:num=1
[junit4:junit4]   2> 		commit{dir=MockDirWrapper(org.apache.lucene.store.SimpleFSDirectory@C:\Jenkins\workspace\Lucene-Solr-trunk-Windows\solr\build\solr-core\test\J0\solrtest-SuggesterTSTTest-1344653211782\index
lockFactory=org.apache.lucene.store.NativeFSLockFactory@5340b667),segFN=segments_1,generation=1,filenames=[segments_1]
[junit4:junit4]   2> 473 T144 oasc.SolrDeletionPolicy.updateCommits newest commit = 1
[junit4:junit4]   2> 487 T144 oasc.RequestHandlers.initHandlersFromConfig created standard:
solr.StandardRequestHandler
[junit4:junit4]   2> 487 T144 oasc.RequestHandlers.initHandlersFromConfig created /suggest:
org.apache.solr.handler.component.SearchHandler
[junit4:junit4]   2> 488 T144 oasc.RequestHandlers.initHandlersFromConfig created /suggest_tst:
org.apache.solr.handler.component.SearchHandler
[junit4:junit4]   2> 488 T144 oasc.RequestHandlers.initHandlersFromConfig created /suggest_fst:
org.apache.solr.handler.component.SearchHandler
[junit4:junit4]   2> 488 T144 oasc.RequestHandlers.initHandlersFromConfig created /suggest_wfst:
org.apache.solr.handler.component.SearchHandler
[junit4:junit4]   2> 594 T144 oass.SolrIndexSearcher.<init> Opening Searcher@5057e2a6
main
[junit4:junit4]   2> 595 T144 oass.SolrIndexSearcher.getIndexDir WARNING WARNING: Directory
impl does not support setting indexDir: org.apache.lucene.store.MockDirectoryWrapper
[junit4:junit4]   2> 595 T144 oasu.CommitTracker.<init> Hard AutoCommit: disabled
[junit4:junit4]   2> 595 T144 oasu.CommitTracker.<init> Soft AutoCommit: disabled
[junit4:junit4]   2> 596 T144 oashc.SpellCheckComponent.inform Initializing spell checkers
[junit4:junit4]   2> 598 T144 oasss.Suggester.init init: {name=suggest,classname=org.apache.solr.spelling.suggest.Suggester,lookupImpl=org.apache.solr.spelling.suggest.jaspell.JaspellLookup,field=suggest,storeDir=suggest,buildOnCommit=true,threshold=0.0}
[junit4:junit4]   2> 602 T144 oasssj.JaspellLookupFactory.create init: {name=suggest,classname=org.apache.solr.spelling.suggest.Suggester,lookupImpl=org.apache.solr.spelling.suggest.jaspell.JaspellLookup,field=suggest,storeDir=suggest,buildOnCommit=true,threshold=0.0}
[junit4:junit4]   2> 607 T144 oashc.SpellCheckComponent.inform Registering newSearcher
listener for spellchecker: suggest
[junit4:junit4]   2> 607 T144 oashc.SpellCheckComponent.inform No queryConverter defined,
using default converter
[junit4:junit4]   2> 608 T144 oashc.SpellCheckComponent.inform Initializing spell checkers
[junit4:junit4]   2> 608 T144 oasss.Suggester.init init: {name=suggest_tst,classname=org.apache.solr.spelling.suggest.Suggester,lookupImpl=org.apache.solr.spelling.suggest.tst.TSTLookup,field=suggest,storeDir=suggest_tst,buildOnCommit=true,threshold=0.0}
[junit4:junit4]   2> 612 T144 oashc.SpellCheckComponent.inform Registering newSearcher
listener for spellchecker: suggest_tst
[junit4:junit4]   2> 613 T144 oashc.SpellCheckComponent.inform No queryConverter defined,
using default converter
[junit4:junit4]   2> 613 T144 oashc.SpellCheckComponent.inform Initializing spell checkers
[junit4:junit4]   2> 613 T144 oasss.Suggester.init init: {name=suggest_fst,classname=org.apache.solr.spelling.suggest.Suggester,lookupImpl=org.apache.solr.spelling.suggest.fst.FSTLookup,field=suggest,storeDir=suggest_fst,buildOnCommit=true,weightBuckets=5,exactMatchFirst=true}
[junit4:junit4]   2> 617 T144 oashc.SpellCheckComponent.inform Registering newSearcher
listener for spellchecker: suggest_fst
[junit4:junit4]   2> 617 T144 oashc.SpellCheckComponent.inform No queryConverter defined,
using default converter
[junit4:junit4]   2> 617 T144 oashc.SpellCheckComponent.inform Initializing spell checkers
[junit4:junit4]   2> 617 T144 oasss.Suggester.init init: {name=suggest_wfst,classname=org.apache.solr.spelling.suggest.Suggester,lookupImpl=org.apache.solr.spelling.suggest.fst.WFSTLookupFactory,field=suggest,storeDir=suggest_wfst,buildOnCommit=true,exactMatchFirst=true}
[junit4:junit4]   2> 622 T144 oashc.SpellCheckComponent.inform Registering newSearcher
listener for spellchecker: suggest_wfst
[junit4:junit4]   2> 622 T144 oashc.SpellCheckComponent.inform No queryConverter defined,
using default converter
[junit4:junit4]   2> 623 T144 oashc.HttpShardHandlerFactory.getParameter Setting socketTimeout
to: 0
[junit4:junit4]   2> 623 T144 oashc.HttpShardHandlerFactory.getParameter Setting urlScheme
to: http://
[junit4:junit4]   2> 623 T144 oashc.HttpShardHandlerFactory.getParameter Setting connTimeout
to: 0
[junit4:junit4]   2> 624 T144 oashc.HttpShardHandlerFactory.getParameter Setting maxConnectionsPerHost
to: 20
[junit4:junit4]   2> 624 T144 oashc.HttpShardHandlerFactory.getParameter Setting corePoolSize
to: 0
[junit4:junit4]   2> 624 T144 oashc.HttpShardHandlerFactory.getParameter Setting maximumPoolSize
to: 2147483647
[junit4:junit4]   2> 625 T144 oashc.HttpShardHandlerFactory.getParameter Setting maxThreadIdleTime
to: 5
[junit4:junit4]   2> 625 T144 oashc.HttpShardHandlerFactory.getParameter Setting sizeOfQueue
to: -1
[junit4:junit4]   2> 626 T144 oashc.HttpShardHandlerFactory.getParameter Setting fairnessPolicy
to: false
[junit4:junit4]   2> 626 T144 oascsi.HttpClientUtil.createClient Creating new http client,
config:maxConnectionsPerHost=20&maxConnections=10000&socketTimeout=0&connTimeout=0&retry=false
[junit4:junit4]   2> 767 T144 oasc.CoreContainer.register registering core: collection1
[junit4:junit4]   2> 768 T144 oas.SolrTestCaseJ4.initCore ####initCore end
[junit4:junit4]   2> 
[junit4:junit4] ERROR   0.60s | SuggesterTSTTest.testSuggestions
[junit4:junit4]    > Throwable #1: java.lang.RuntimeException: Exception during query
[junit4:junit4]    > 	at __randomizedtesting.SeedInfo.seed([DA0329C9FAAE17A6:7CDF103C349A4058]:0)
[junit4:junit4]    > 	at org.apache.solr.SolrTestCaseJ4.assertQ(SolrTestCaseJ4.java:486)
[junit4:junit4]    > 	at org.apache.solr.SolrTestCaseJ4.assertQ(SolrTestCaseJ4.java:453)
[junit4:junit4]    > 	at org.apache.solr.spelling.suggest.SuggesterTest.testSuggestions(SuggesterTest.java:71)
[junit4:junit4]    > 	at sun.reflect.NativeMethodAccessorImpl.invoke0(Native Method)
[junit4:junit4]    > 	at sun.reflect.NativeMethodAccessorImpl.invoke(NativeMethodAccessorImpl.java:57)
[junit4:junit4]    > 	at sun.reflect.DelegatingMethodAccessorImpl.invoke(DelegatingMethodAccessorImpl.java:43)
[junit4:junit4]    > 	at java.lang.reflect.Method.invoke(Method.java:601)
[junit4:junit4]    > 	at com.carrotsearch.randomizedtesting.RandomizedRunner.invoke(RandomizedRunner.java:1995)
[junit4:junit4]    > 	at com.carrotsearch.randomizedtesting.RandomizedRunner.access$1100(RandomizedRunner.java:132)
[junit4:junit4]    > 	at com.carrotsearch.randomizedtesting.RandomizedRunner$6.evaluate(RandomizedRunner.java:818)
[junit4:junit4]    > 	at com.carrotsearch.randomizedtesting.RandomizedRunner$7.evaluate(RandomizedRunner.java:877)
[junit4:junit4]    > 	at com.carrotsearch.randomizedtesting.RandomizedRunner$8.evaluate(RandomizedRunner.java:891)
[junit4:junit4]    > 	at com.carrotsearch.randomizedtesting.rules.SystemPropertiesRestoreRule$1.evaluate(SystemPropertiesRestoreRule.java:53)
[junit4:junit4]    > 	at org.apache.lucene.util.TestRuleSetupTeardownChained$1.evaluate(TestRuleSetupTeardownChained.java:50)
[junit4:junit4]    > 	at org.apache.lucene.util.TestRuleFieldCacheSanity$1.evaluate(TestRuleFieldCacheSanity.java:32)
[junit4:junit4]    > 	at org.apache.lucene.util.AbstractBeforeAfterRule$1.evaluate(AbstractBeforeAfterRule.java:45)
[junit4:junit4]    > 	at com.carrotsearch.randomizedtesting.rules.SystemPropertiesInvariantRule$1.evaluate(SystemPropertiesInvariantRule.java:55)
[junit4:junit4]    > 	at org.apache.lucene.util.TestRuleReportUncaughtExceptions$1.evaluate(TestRuleReportUncaughtExceptions.java:68)
[junit4:junit4]    > 	at org.apache.lucene.util.TestRuleThreadAndTestName$1.evaluate(TestRuleThreadAndTestName.java:48)
[junit4:junit4]    > 	at org.apache.lucene.util.TestRuleIgnoreAfterMaxFailures$1.evaluate(TestRuleIgnoreAfterMaxFailures.java:70)
[junit4:junit4]    > 	at org.apache.lucene.util.TestRuleMarkFailure$1.evaluate(TestRuleMarkFailure.java:48)
[junit4:junit4]    > 	at com.carrotsearch.randomizedtesting.RandomizedRunner.runSingleTest(RandomizedRunner.java:825)
[junit4:junit4]    > 	at com.carrotsearch.randomizedtesting.RandomizedRunner.access$700(RandomizedRunner.java:132)
[junit4:junit4]    > 	at com.carrotsearch.randomizedtesting.RandomizedRunner$3$1.run(RandomizedRunner.java:671)
[junit4:junit4]    > 	at com.carrotsearch.randomizedtesting.RandomizedRunner$3.evaluate(RandomizedRunner.java:697)
[junit4:junit4]    > 	at com.carrotsearch.randomizedtesting.RandomizedRunner$4.evaluate(RandomizedRunner.java:736)
[junit4:junit4]    > 	at com.carrotsearch.randomizedtesting.RandomizedRunner$5.evaluate(RandomizedRunner.java:747)
[junit4:junit4]    > 	at com.carrotsearch.randomizedtesting.rules.SystemPropertiesRestoreRule$1.evaluate(SystemPropertiesRestoreRule.java:53)
[junit4:junit4]    > 	at org.apache.lucene.util.AbstractBeforeAfterRule$1.evaluate(AbstractBeforeAfterRule.java:45)
[junit4:junit4]    > 	at org.apache.lucene.util.TestRuleReportUncaughtExceptions$1.evaluate(TestRuleReportUncaughtExceptions.java:68)
[junit4:junit4]    > 	at org.apache.lucene.util.TestRuleStoreClassName$1.evaluate(TestRuleStoreClassName.java:38)
[junit4:junit4]    > 	at com.carrotsearch.randomizedtesting.rules.SystemPropertiesInvariantRule$1.evaluate(SystemPropertiesInvariantRule.java:55)
[junit4:junit4]    > 	at org.apache.lucene.util.TestRuleNoInstanceHooksOverrides$1.evaluate(TestRuleNoInstanceHooksOverrides.java:53)
[junit4:junit4]    > 	at org.apache.lucene.util.TestRuleNoStaticHooksShadowing$1.evaluate(TestRuleNoStaticHooksShadowing.java:52)
[junit4:junit4]    > 	at org.apache.lucene.util.TestRuleAssertionsRequired$1.evaluate(TestRuleAssertionsRequired.java:36)
[junit4:junit4]    > 	at org.apache.lucene.util.TestRuleMarkFailure$1.evaluate(TestRuleMarkFailure.java:48)
[junit4:junit4]    > 	at org.apache.lucene.util.TestRuleIgnoreAfterMaxFailures$1.evaluate(TestRuleIgnoreAfterMaxFailures.java:70)
[junit4:junit4]    > 	at org.apache.lucene.util.TestRuleIgnoreTestSuites$1.evaluate(TestRuleIgnoreTestSuites.java:55)
[junit4:junit4]    > 	at com.carrotsearch.randomizedtesting.RandomizedRunner.runSuite(RandomizedRunner.java:605)
[junit4:junit4]    > 	at com.carrotsearch.randomizedtesting.RandomizedRunner.access$400(RandomizedRunner.java:132)
[junit4:junit4]    > 	at com.carrotsearch.randomizedtesting.RandomizedRunner$2.run(RandomizedRunner.java:551)
[junit4:junit4]    > Caused by: java.lang.RuntimeException: REQUEST FAILED: xpath=//lst[@name='spellcheck']/lst[@name='suggestions']/lst[@name='ac']/int[@name='numFound'][.='2']
[junit4:junit4]    > 	xml response was: <?xml version="1.0" encoding="UTF-8"?>
[junit4:junit4]    > <response>
[junit4:junit4]    > <lst name="responseHeader"><int name="status">0</int><int
name="QTime">4</int></lst><lst name="spellcheck"><lst name="suggestions"/></lst>
[junit4:junit4]    > </response>
[junit4:junit4]    > 
[junit4:junit4]    > 	request was:q=ac&spellcheck.count=2&qt=/suggest_tst&spellcheck.onlyMorePopular=true
[junit4:junit4]    > 	at org.apache.solr.SolrTestCaseJ4.assertQ(SolrTestCaseJ4.java:479)
[junit4:junit4]    > 	... 40 more
[junit4:junit4]    > 
[junit4:junit4]   2> 774 T144 oas.SolrTestCaseJ4.setUp ###Starting testSuggestions
[junit4:junit4]   2> ASYNC  NEW_CORE C9 name=collection1 org.apache.solr.core.SolrCore@3f65bc68
[junit4:junit4]   2> 856 T144 C9 oasc.SolrDeletionPolicy.onInit SolrDeletionPolicy.onInit:
commits:num=1
[junit4:junit4]   2> 		commit{dir=MockDirWrapper(org.apache.lucene.store.SimpleFSDirectory@C:\Jenkins\workspace\Lucene-Solr-trunk-Windows\solr\build\solr-core\test\J0\solrtest-SuggesterTSTTest-1344653211782\index
lockFactory=org.apache.lucene.store.NativeFSLockFactory@5340b667),segFN=segments_1,generation=1,filenames=[segments_1]
[junit4:junit4]   2> 856 T144 C9 oasc.SolrDeletionPolicy.updateCommits newest commit =
1
[junit4:junit4]   2> 937 T144 C9 UPDATE [collection1] webapp=null path=null params={} {add=[1]}
0 155
[junit4:junit4]   2> 954 T144 C9 UPDATE [collection1] webapp=null path=null params={} {add=[2]}
0 1
[junit4:junit4]   2> 966 T144 C9 UPDATE [collection1] webapp=null path=null params={} {add=[3]}
0 1
[junit4:junit4]   2> 1020 T144 C9 oasu.DirectUpdateHandler2.commit start commit{flags=0,_version_=0,optimize=false,openSearcher=true,waitSearcher=true,expungeDeletes=false,softCommit=false}
[junit4:junit4]   2> 1147 T144 C9 oasc.SolrDeletionPolicy.onCommit SolrDeletionPolicy.onCommit:
commits:num=2
[junit4:junit4]   2> 		commit{dir=MockDirWrapper(org.apache.lucene.store.SimpleFSDirectory@C:\Jenkins\workspace\Lucene-Solr-trunk-Windows\solr\build\solr-core\test\J0\solrtest-SuggesterTSTTest-1344653211782\index
lockFactory=org.apache.lucene.store.NativeFSLockFactory@5340b667),segFN=segments_1,generation=1,filenames=[segments_1]
[junit4:junit4]   2> 		commit{dir=MockDirWrapper(org.apache.lucene.store.SimpleFSDirectory@C:\Jenkins\workspace\Lucene-Solr-trunk-Windows\solr\build\solr-core\test\J0\solrtest-SuggesterTSTTest-1344653211782\index
lockFactory=org.apache.lucene.store.NativeFSLockFactory@5340b667),segFN=segments_2,generation=2,filenames=[_0_MockVariableIntBlock_0.doc,
_0_TestBloomFilteredLucene40Postings_0.prx, _0_MockVariableIntBlock_0.skp, _0_Lucene40_0.prx,
_0_MockVariableIntBlock_0.pyl, _0_Lucene40WithOrds_0.tii, _0_Lucene40WithOrds_0.frq, _0_Lucene40_0.frq,
_0_MockVariableIntBlock_0.tib, _0_MockVariableIntBlock_0.pos, _0_TestBloomFilteredLucene40Postings_0.frq,
_0.si, _0_Lucene40WithOrds_0.tib, _0_MockVariableIntBlock_0.tii, _0_TestBloomFilteredLucene40Postings_0.tim,
_0_Lucene40_0.tim, _0_TestBloomFilteredLucene40Postings_0.tip, _0_TestBloomFilteredLucene40Postings_0.blm,
_0.fnm, _0_nrm.cfs, _0_Lucene40_0.tip, _0_MockVariableIntBlock_0.frq, _0_nrm.cfe, segments_2,
_0.fdx, _0_Lucene40WithOrds_0.prx, _0.fdt]
[junit4:junit4]   2> 1148 T144 C9 oasc.SolrDeletionPolicy.updateCommits newest commit =
2
[junit4:junit4]   2> 1149 T144 C9 oasc.SolrCore.getSearcher WARNING [collection1] PERFORMANCE
WARNING: Overlapping onDeckSearchers=2
[junit4:junit4]   2> 1164 T144 C9 oass.SolrIndexSearcher.<init> Opening Searcher@7a87e2d9
main
[junit4:junit4]   2> 1164 T144 C9 oass.SolrIndexSearcher.getIndexDir WARNING WARNING: Directory
impl does not support setting indexDir: org.apache.lucene.store.MockDirectoryWrapper
[junit4:junit4]   2> 1166 T144 C9 oasu.DirectUpdateHandler2.commit end_commit_flush
[junit4:junit4]   2> 1260 T145 oasc.SolrCore.registerSearcher [collection1] Registered
new searcher Searcher@5057e2a6 main{StandardDirectoryReader(segments_1:1)}
[junit4:junit4]   2> 1263 T145 oashc.SpellCheckComponent$SpellCheckerListener.newSearcher
Loading spell index for spellchecker: suggest
[junit4:junit4]   2> 1263 T145 oasss.Suggester.reload reload()
[junit4:junit4]   2> 1263 T145 oashc.SpellCheckComponent$SpellCheckerListener.newSearcher
SEVERE Exception in reloading spell check index for spellchecker: suggest java.io.FileNotFoundException:
C:\Jenkins\workspace\Lucene-Solr-trunk-Windows\solr\build\solr-core\test\J0\.\solrtest-SuggesterTSTTest-1344653211782\suggest\jaspell.dat
(The system cannot find the file specified)
[junit4:junit4]   2> 	at java.io.FileInputStream.open(Native Method)
[junit4:junit4]   2> 	at java.io.FileInputStream.<init>(FileInputStream.java:138)
[junit4:junit4]   2> 	at org.apache.solr.spelling.suggest.Suggester.reload(Suggester.java:161)
[junit4:junit4]   2> 	at org.apache.solr.handler.component.SpellCheckComponent$SpellCheckerListener.newSearcher(SpellCheckComponent.java:673)
[junit4:junit4]   2> 	at org.apache.solr.core.SolrCore$5.call(SolrCore.java:1436)
[junit4:junit4]   2> 	at java.util.concurrent.FutureTask$Sync.innerRun(FutureTask.java:334)
[junit4:junit4]   2> 	at java.util.concurrent.FutureTask.run(FutureTask.java:166)
[junit4:junit4]   2> 	at java.util.concurrent.ThreadPoolExecutor.runWorker(ThreadPoolExecutor.java:1110)
[junit4:junit4]   2> 	at java.util.concurrent.ThreadPoolExecutor$Worker.run(ThreadPoolExecutor.java:603)
[junit4:junit4]   2> 	at java.lang.Thread.run(Thread.java:722)
[junit4:junit4]   2> 
[junit4:junit4]   2> 1266 T145 oashc.SpellCheckComponent$SpellCheckerListener.newSearcher
Loading spell index for spellchecker: suggest_tst
[junit4:junit4]   2> 1266 T145 oasss.Suggester.reload reload()
[junit4:junit4]   2> 1266 T145 oashc.SpellCheckComponent$SpellCheckerListener.newSearcher
SEVERE Exception in reloading spell check index for spellchecker: suggest_tst java.io.FileNotFoundException:
C:\Jenkins\workspace\Lucene-Solr-trunk-Windows\solr\build\solr-core\test\J0\.\solrtest-SuggesterTSTTest-1344653211782\suggest_tst\tst.dat
(The system cannot find the file specified)
[junit4:junit4]   2> 	at java.io.FileInputStream.open(Native Method)
[junit4:junit4]   2> 	at java.io.FileInputStream.<init>(FileInputStream.java:138)
[junit4:junit4]   2> 	at org.apache.solr.spelling.suggest.Suggester.reload(Suggester.java:161)
[junit4:junit4]   2> 	at org.apache.solr.handler.component.SpellCheckComponent$SpellCheckerListener.newSearcher(SpellCheckComponent.java:673)
[junit4:junit4]   2> 	at org.apache.solr.core.SolrCore$5.call(SolrCore.java:1436)
[junit4:junit4]   2> 	at java.util.concurrent.FutureTask$Sync.innerRun(FutureTask.java:334)
[junit4:junit4]   2> 	at java.util.concurrent.FutureTask.run(FutureTask.java:166)
[junit4:junit4]   2> 	at java.util.concurrent.ThreadPoolExecutor.runWorker(ThreadPoolExecutor.java:1110)
[junit4:junit4]   2> 	at java.util.concurrent.ThreadPoolExecutor$Worker.run(ThreadPoolExecutor.java:603)
[junit4:junit4]   2> 	at java.lang.Thread.run(Thread.java:722)
[junit4:junit4]   2> 
[junit4:junit4]   2> 1267 T145 oashc.SpellCheckComponent$SpellCheckerListener.newSearcher
Loading spell index for spellchecker: suggest_fst
[junit4:junit4]   2> 1267 T145 oasss.Suggester.reload reload()
[junit4:junit4]   2> 1267 T145 oashc.SpellCheckComponent$SpellCheckerListener.newSearcher
SEVERE Exception in reloading spell check index for spellchecker: suggest_fst java.io.FileNotFoundException:
C:\Jenkins\workspace\Lucene-Solr-trunk-Windows\solr\build\solr-core\test\J0\.\solrtest-SuggesterTSTTest-1344653211782\suggest_fst\fst.bin
(The system cannot find the file specified)
[junit4:junit4]   2> 	at java.io.FileInputStream.open(Native Method)
[junit4:junit4]   2> 	at java.io.FileInputStream.<init>(FileInputStream.java:138)
[junit4:junit4]   2> 	at org.apache.solr.spelling.suggest.Suggester.reload(Suggester.java:161)
[junit4:junit4]   2> 	at org.apache.solr.handler.component.SpellCheckComponent$SpellCheckerListener.newSearcher(SpellCheckComponent.java:673)
[junit4:junit4]   2> 	at org.apache.solr.core.SolrCore$5.call(SolrCore.java:1436)
[junit4:junit4]   2> 	at java.util.concurrent.FutureTask$Sync.innerRun(FutureTask.java:334)
[junit4:junit4]   2> 	at java.util.concurrent.FutureTask.run(FutureTask.java:166)
[junit4:junit4]   2> 	at java.util.concurrent.ThreadPoolExecutor.runWorker(ThreadPoolExecutor.java:1110)
[junit4:junit4]   2> 	at java.util.concurrent.ThreadPoolExecutor$Worker.run(ThreadPoolExecutor.java:603)
[junit4:junit4]   2> 	at java.lang.Thread.run(Thread.java:722)
[junit4:junit4]   2> 
[junit4:junit4]   2> 1268 T145 oashc.SpellCheckComponent$SpellCheckerListener.newSearcher
Loading spell index for spellchecker: suggest_wfst
[junit4:junit4]   2> 1268 T145 oasss.Suggester.reload reload()
[junit4:junit4]   2> 1268 T145 oashc.SpellCheckComponent$SpellCheckerListener.newSearcher
SEVERE Exception in reloading spell check index for spellchecker: suggest_wfst java.io.FileNotFoundException:
C:\Jenkins\workspace\Lucene-Solr-trunk-Windows\solr\build\solr-core\test\J0\.\solrtest-SuggesterTSTTest-1344653211782\suggest_wfst\wfst.bin
(The system cannot find the file specified)
[junit4:junit4]   2> 	at java.io.FileInputStream.open(Native Method)
[junit4:junit4]   2> 	at java.io.FileInputStream.<init>(FileInputStream.java:138)
[junit4:junit4]   2> 	at org.apache.solr.spelling.suggest.Suggester.reload(Suggester.java:161)
[junit4:junit4]   2> 	at org.apache.solr.handler.component.SpellCheckComponent$SpellCheckerListener.newSearcher(SpellCheckComponent.java:673)
[junit4:junit4]   2> 	at org.apache.solr.core.SolrCore$5.call(SolrCore.java:1436)
[junit4:junit4]   2> 	at java.util.concurrent.FutureTask$Sync.innerRun(FutureTask.java:334)
[junit4:junit4]   2> 	at java.util.concurrent.FutureTask.run(FutureTask.java:166)
[junit4:junit4]   2> 	at java.util.concurrent.ThreadPoolExecutor.runWorker(ThreadPoolExecutor.java:1110)
[junit4:junit4]   2> 	at java.util.concurrent.ThreadPoolExecutor$Worker.run(ThreadPoolExecutor.java:603)
[junit4:junit4]   2> 	at java.lang.Thread.run(Thread.java:722)
[junit4:junit4]   2> 
[junit4:junit4]   2> 1273 T145 oasc.SolrCore.registerSearcher [collection1] Registered
new searcher Searcher@7a87e2d9 main{StandardDirectoryReader(segments_2:3 _0(5.0):C3)}
[junit4:junit4]   2> 1273 T144 C9 UPDATE [collection1] webapp=null path=null params={}
{commit=} 0 253
[junit4:junit4]   2> 1281 T144 C9 REQ [collection1] webapp=null path=null params={q=ac&spellcheck.count=2&qt=/suggest_tst&spellcheck.onlyMorePopular=true}
status=0 QTime=4 
[junit4:junit4]   2> 1292 T144 oas.SolrTestCaseJ4.assertQ SEVERE REQUEST FAILED: xpath=//lst[@name='spellcheck']/lst[@name='suggestions']/lst[@name='ac']/int[@name='numFound'][.='2']
[junit4:junit4]   2> 		xml response was: <?xml version="1.0" encoding="UTF-8"?>
[junit4:junit4]   2> 	<response>
[junit4:junit4]   2> 	<lst name="responseHeader"><int name="status">0</int><int
name="QTime">4</int></lst><lst name="spellcheck"><lst name="suggestions"/></lst>
[junit4:junit4]   2> 	</response>
[junit4:junit4]   2> 	
[junit4:junit4]   2> 		request was:q=ac&spellcheck.count=2&qt=/suggest_tst&spellcheck.onlyMorePopular=true
[junit4:junit4]   2> 1292 T144 oasc.SolrException.log SEVERE REQUEST FAILED: q=ac&spellcheck.count=2&qt=/suggest_tst&spellcheck.onlyMorePopular=true:java.lang.RuntimeException:
REQUEST FAILED: xpath=//lst[@name='spellcheck']/lst[@name='suggestions']/lst[@name='ac']/int[@name='numFound'][.='2']
[junit4:junit4]   2> 		xml response was: <?xml version="1.0" encoding="UTF-8"?>
[junit4:junit4]   2> 	<response>
[junit4:junit4]   2> 	<lst name="responseHeader"><int name="status">0</int><int
name="QTime">4</int></lst><lst name="spellcheck"><lst name="suggestions"/></lst>
[junit4:junit4]   2> 	</response>
[junit4:junit4]   2> 	
[junit4:junit4]   2> 		request was:q=ac&spellcheck.count=2&qt=/suggest_tst&spellcheck.onlyMorePopular=true
[junit4:junit4]   2> 		at org.apache.solr.SolrTestCaseJ4.assertQ(SolrTestCaseJ4.java:479)
[junit4:junit4]   2> 		at org.apache.solr.SolrTestCaseJ4.assertQ(SolrTestCaseJ4.java:453)
[junit4:junit4]   2> 		at org.apache.solr.spelling.suggest.SuggesterTest.testSuggestions(SuggesterTest.java:71)
[junit4:junit4]   2> 		at sun.reflect.NativeMethodAccessorImpl.invoke0(Native Method)
[junit4:junit4]   2> 		at sun.reflect.NativeMethodAccessorImpl.invoke(NativeMethodAccessorImpl.java:57)
[junit4:junit4]   2> 		at sun.reflect.DelegatingMethodAccessorImpl.invoke(DelegatingMethodAccessorImpl.java:43)
[junit4:junit4]   2> 		at java.lang.reflect.Method.invoke(Method.java:601)
[junit4:junit4]   2> 		at com.carrotsearch.randomizedtesting.RandomizedRunner.invoke(RandomizedRunner.java:1995)
[junit4:junit4]   2> 		at com.carrotsearch.randomizedtesting.RandomizedRunner.access$1100(RandomizedRunner.java:132)
[junit4:junit4]   2> 		at com.carrotsearch.randomizedtesting.RandomizedRunner$6.evaluate(RandomizedRunner.java:818)
[junit4:junit4]   2> 		at com.carrotsearch.randomizedtesting.RandomizedRunner$7.evaluate(RandomizedRunner.java:877)
[junit4:junit4]   2> 		at com.carrotsearch.randomizedtesting.RandomizedRunner$8.evaluate(RandomizedRunner.java:891)
[junit4:junit4]   2> 		at com.carrotsearch.randomizedtesting.rules.SystemPropertiesRestoreRule$1.evaluate(SystemPropertiesRestoreRule.java:53)
[junit4:junit4]   2> 		at org.apache.lucene.util.TestRuleSetupTeardownChained$1.evaluate(TestRuleSetupTeardownChained.java:50)
[junit4:junit4]   2> 		at org.apache.lucene.util.TestRuleFieldCacheSanity$1.evaluate(TestRuleFieldCacheSanity.java:32)
[junit4:junit4]   2> 		at org.apache.lucene.util.AbstractBeforeAfterRule$1.evaluate(AbstractBeforeAfterRule.java:45)
[junit4:junit4]   2> 		at com.carrotsearch.randomizedtesting.rules.SystemPropertiesInvariantRule$1.evaluate(SystemPropertiesInvariantRule.java:55)
[junit4:junit4]   2> 		at org.apache.lucene.util.TestRuleReportUncaughtExceptions$1.evaluate(TestRuleReportUncaughtExceptions.java:68)
[junit4:junit4]   2> 		at org.apache.lucene.util.TestRuleThreadAndTestName$1.evaluate(TestRuleThreadAndTestName.java:48)
[junit4:junit4]   2> 		at org.apache.lucene.util.TestRuleIgnoreAfterMaxFailures$1.evaluate(TestRuleIgnoreAfterMaxFailures.java:70)
[junit4:junit4]   2> 		at org.apache.lucene.util.TestRuleMarkFailure$1.evaluate(TestRuleMarkFailure.java:48)
[junit4:junit4]   2> 		at com.carrotsearch.randomizedtesting.RandomizedRunner.runSingleTest(RandomizedRunner.java:825)
[junit4:junit4]   2> 		at com.carrotsearch.randomizedtesting.RandomizedRunner.access$700(RandomizedRunner.java:132)
[junit4:junit4]   2> 		at com.carrotsearch.randomizedtesting.RandomizedRunner$3$1.run(RandomizedRunner.java:671)
[junit4:junit4]   2> 		at com.carrotsearch.randomizedtesting.RandomizedRunner$3.evaluate(RandomizedRunner.java:697)
[junit4:junit4]   2> 		at com.carrotsearch.randomizedtesting.RandomizedRunner$4.evaluate(RandomizedRunner.java:736)
[junit4:junit4]   2> 		at com.carrotsearch.randomizedtesting.RandomizedRunner$5.evaluate(RandomizedRunner.java:747)
[junit4:junit4]   2> 		at com.carrotsearch.randomizedtesting.rules.SystemPropertiesRestoreRule$1.evaluate(SystemPropertiesRestoreRule.java:53)
[junit4:junit4]   2> 		at org.apache.lucene.util.AbstractBeforeAfterRule$1.evaluate(AbstractBeforeAfterRule.java:45)
[junit4:junit4]   2> 		at org.apache.lucene.util.TestRuleReportUncaughtExceptions$1.evaluate(TestRuleReportUncaughtExceptions.java:68)
[junit4:junit4]   2> 		at org.apache.lucene.util.TestRuleStoreClassName$1.evaluate(TestRuleStoreClassName.java:38)
[junit4:junit4]   2> 		at com.carrotsearch.randomizedtesting.rules.SystemPropertiesInvariantRule$1.evaluate(SystemPropertiesInvariantRule.java:55)
[junit4:junit4]   2> 		at org.apache.lucene.util.TestRuleNoInstanceHooksOverrides$1.evaluate(TestRuleNoInstanceHooksOverrides.java:53)
[junit4:junit4]   2> 		at org.apache.lucene.util.TestRuleNoStaticHooksShadowing$1.evaluate(TestRuleNoStaticHooksShadowing.java:52)
[junit4:junit4]   2> 		at org.apache.lucene.util.TestRuleAssertionsRequired$1.evaluate(TestRuleAssertionsRequired.java:36)
[junit4:junit4]   2> 		at org.apache.lucene.util.TestRuleMarkFailure$1.evaluate(TestRuleMarkFailure.java:48)
[junit4:junit4]   2> 		at org.apache.lucene.util.TestRuleIgnoreAfterMaxFailures$1.evaluate(TestRuleIgnoreAfterMaxFailures.java:70)
[junit4:junit4]   2> 		at org.apache.lucene.util.TestRuleIgnoreTestSuites$1.evaluate(TestRuleIgnoreTestSuites.java:55)
[junit4:junit4]   2> 		at com.carrotsearch.randomizedtesting.RandomizedRunner.runSuite(RandomizedRunner.java:605)
[junit4:junit4]   2> 		at com.carrotsearch.randomizedtesting.RandomizedRunner.access$400(RandomizedRunner.java:132)
[junit4:junit4]   2> 		at com.carrotsearch.randomizedtesting.RandomizedRunner$2.run(RandomizedRunner.java:551)
[junit4:junit4]   2> 	
[junit4:junit4]   2> 1295 T144 oas.SolrTestCaseJ4.tearDown ###Ending testSuggestions
[junit4:junit4]   2> NOTE: reproduce with: ant test  -Dtestcase=SuggesterTSTTest -Dtests.method=testSuggestions
-Dtests.seed=DA0329C9FAAE17A6 -Dtests.slow=true -Dtests.locale=es_CO -Dtests.timezone=Canada/Central
-Dtests.file.encoding=Cp1252
[junit4:junit4]   2>
[junit4:junit4]    > (@AfterClass output)
[junit4:junit4]   2> 3532 T144 oas.SolrTestCaseJ4.deleteCore ###deleteCore
[junit4:junit4]   2> 3532 T144 oasc.CoreContainer.shutdown Shutting down CoreContainer
instance=582405092
[junit4:junit4]   2> 3532 T144 oasc.SolrCore.close [collection1]  CLOSING SolrCore org.apache.solr.core.SolrCore@69880dcf
[junit4:junit4]   2> 3533 T144 oasc.SolrCore.closeSearcher [collection1] Closing main searcher
on request.
[junit4:junit4]   2> 3536 T144 oasu.DirectUpdateHandler2.close closing DirectUpdateHandler2{commits=2,autocommits=0,soft
autocommits=0,optimizes=0,rollbacks=0,expungeDeletes=0,docsPending=0,adds=0,deletesById=0,deletesByQuery=0,errors=0,cumulative_adds=4,cumulative_deletesById=0,cumulative_deletesByQuery=0,cumulative_errors=0}
[junit4:junit4]   2> NOTE: test params are: codec=Lucene40: {timestamp=PostingsFormat(name=Lucene40WithOrds),
range_facet_l=PostingsFormat(name=Lucene40WithOrds), id=MockVariableIntBlock(baseBlockSize=86),
range_facet_sl=MockVariableIntBlock(baseBlockSize=86), range_facet_si=PostingsFormat(name=Lucene40WithOrds),
text=PostingsFormat(name=TestBloomFilteredLucene40Postings), multiDefault=PostingsFormat(name=Lucene40WithOrds),
suggest=PostingsFormat(name=Lucene40WithOrds), intDefault=Lucene40(minBlockSize=23 maxBlockSize=130),
spell=Lucene40(minBlockSize=23 maxBlockSize=130)}, sim=DefaultSimilarity, locale=es_CO, timezone=Canada/Central
[junit4:junit4]   2> NOTE: Windows 7 6.1 amd64/Oracle Corporation 1.7.0_05 (64-bit)/cpus=2,threads=1,free=86949720,total=214958080
[junit4:junit4]   2> NOTE: All tests run in this JVM: [TestDistributedGrouping, SuggesterTSTTest]
[junit4:junit4]   2> 
[junit4:junit4] Completed in 3.65s, 4 tests, 1 error <<< FAILURES!

[...truncated 940 lines...]
BUILD FAILED
C:\Jenkins\workspace\Lucene-Solr-trunk-Windows\build.xml:29: The following error occurred
while executing this line:
C:\Jenkins\workspace\Lucene-Solr-trunk-Windows\solr\build.xml:144: The following error occurred
while executing this line:
C:\Jenkins\workspace\Lucene-Solr-trunk-Windows\lucene\module-build.xml:62: The following error
occurred while executing this line:
C:\Jenkins\workspace\Lucene-Solr-trunk-Windows\lucene\common-build.xml:1095: The following
error occurred while executing this line:
C:\Jenkins\workspace\Lucene-Solr-trunk-Windows\lucene\common-build.xml:790: There were test
failures: 224 suites, 901 tests, 1 error, 11 ignored (6 assumptions)

Total time: 33 minutes 16 seconds
Build step 'Invoke Ant' marked build as failure
Recording test results
Email was triggered for: Failure
Sending email for trigger: Failure



Mime
View raw message