lucene-dev mailing list archives

Site index · List index
Message view « Date » · « Thread »
Top « Date » · « Thread »
From "Uwe Schindler" <...@thetaphi.de>
Subject RE: [JENKINS] Lucene-Solr-Tests-4.x-java7 - Build # 374 - Failure
Date Thu, 30 Aug 2012 15:57:53 GMT
See my fix for now. More will come on issue. I inspected SocketPermission.java source code and was disappointed! 

In fact all Solr servers are listening while tests on 0.0.0.0 and not 127.0.0.1 only. I fixed this for JMX but the issue why this failed there was different:
- SocketPermission in J2EE security model only specifies LISTEN and ACCEPT for server sockets. Unfortunately the host name for LISTEN is not checked at all, only the port. For ACCEPT the host name is checked, but it is the one from the foreign system. If we allow "localhost:1024-" here, we can connect from any to any local IP addresses and accept the connection. We can unfortunately not prevent listening on all IPs (this is why Solr tests pass on Linux). Unfortunately I still have to always click on "Accept" on the Windows Firewall complaining that Solr opens random port numbers to the whole internet :( - We should fix this and bind all sockets to 127.0.0.1 in Solr and only connect to 127.0.0.1

I will later fix part of the JMX changes I committed in hoping localhost is working as it should, will revert parts of that.

Uwe

-----
Uwe Schindler
H.-H.-Meier-Allee 63, D-28213 Bremen
http://www.thetaphi.de
eMail: uwe@thetaphi.de


> -----Original Message-----
> From: Apache Jenkins Server [mailto:jenkins@builds.apache.org]
> Sent: Thursday, August 30, 2012 5:28 PM
> To: dev@lucene.apache.org
> Subject: [JENKINS] Lucene-Solr-Tests-4.x-java7 - Build # 374 - Failure
> 
> Build: https://builds.apache.org/job/Lucene-Solr-Tests-4.x-java7/374/
> 
> 7 tests failed.
> REGRESSION:
> org.apache.solr.AnalysisAfterCoreReloadTest.testStopwordsAfterCoreReload
> 
> Error Message:
> IOException occured when talking to server at:
> http://localhost:52847/solr/collection1
> 
> Stack Trace:
> org.apache.solr.client.solrj.SolrServerException: IOException occured when
> talking to server at: http://localhost:52847/solr/collection1
> 	at
> __randomizedtesting.SeedInfo.seed([E20548CE3E5ACD20:8402663EA6E135E3]:
> 0)
> 	at
> org.apache.solr.client.solrj.impl.HttpSolrServer.request(HttpSolrServer.java:414
> )
> 	at
> org.apache.solr.client.solrj.impl.HttpSolrServer.request(HttpSolrServer.java:182
> )
> 	at
> org.apache.solr.client.solrj.request.AbstractUpdateRequest.process(AbstractUp
> dateRequest.java:117)
> 	at
> org.apache.solr.AnalysisAfterCoreReloadTest.testStopwordsAfterCoreReload(An
> alysisAfterCoreReloadTest.java:79)
> 	at sun.reflect.NativeMethodAccessorImpl.invoke0(Native Method)
> 	at
> sun.reflect.NativeMethodAccessorImpl.invoke(NativeMethodAccessorImpl.java:
> 57)
> 	at
> sun.reflect.DelegatingMethodAccessorImpl.invoke(DelegatingMethodAccessorI
> mpl.java:43)
> 	at java.lang.reflect.Method.invoke(Method.java:601)
> 	at
> com.carrotsearch.randomizedtesting.RandomizedRunner.invoke(RandomizedRu
> nner.java:1559)
> 	at
> com.carrotsearch.randomizedtesting.RandomizedRunner.access$600(Randomiz
> edRunner.java:79)
> 	at
> com.carrotsearch.randomizedtesting.RandomizedRunner$6.evaluate(Randomiz
> edRunner.java:737)
> 	at
> com.carrotsearch.randomizedtesting.RandomizedRunner$7.evaluate(Randomiz
> edRunner.java:773)
> 	at
> com.carrotsearch.randomizedtesting.RandomizedRunner$8.evaluate(Randomiz
> edRunner.java:787)
> 	at
> com.carrotsearch.randomizedtesting.rules.SystemPropertiesRestoreRule$1.eval
> uate(SystemPropertiesRestoreRule.java:53)
> 	at
> org.apache.lucene.util.TestRuleSetupTeardownChained$1.evaluate(TestRuleSet
> upTeardownChained.java:50)
> 	at
> org.apache.lucene.util.TestRuleFieldCacheSanity$1.evaluate(TestRuleFieldCach
> eSanity.java:51)
> 	at
> org.apache.lucene.util.AbstractBeforeAfterRule$1.evaluate(AbstractBeforeAfte
> rRule.java:45)
> 	at
> com.carrotsearch.randomizedtesting.rules.SystemPropertiesInvariantRule$1.ev
> aluate(SystemPropertiesInvariantRule.java:55)
> 	at
> org.apache.lucene.util.TestRuleThreadAndTestName$1.evaluate(TestRuleThrea
> dAndTestName.java:48)
> 	at
> org.apache.lucene.util.TestRuleIgnoreAfterMaxFailures$1.evaluate(TestRuleIgn
> oreAfterMaxFailures.java:70)
> 	at
> org.apache.lucene.util.TestRuleMarkFailure$1.evaluate(TestRuleMarkFailure.ja
> va:48)
> 	at
> com.carrotsearch.randomizedtesting.rules.StatementAdapter.evaluate(Stateme
> ntAdapter.java:36)
> 	at
> com.carrotsearch.randomizedtesting.ThreadLeakControl$StatementRunner.run
> (ThreadLeakControl.java:345)
> 	at
> com.carrotsearch.randomizedtesting.ThreadLeakControl.forkTimeoutingTask(T
> hreadLeakControl.java:769)
> 	at
> com.carrotsearch.randomizedtesting.ThreadLeakControl$3.evaluate(ThreadLea
> kControl.java:429)
> 	at
> com.carrotsearch.randomizedtesting.RandomizedRunner.runSingleTest(Rando
> mizedRunner.java:746)
> 	at
> com.carrotsearch.randomizedtesting.RandomizedRunner$3.evaluate(Randomiz
> edRunner.java:648)
> 	at
> com.carrotsearch.randomizedtesting.RandomizedRunner$4.evaluate(Randomiz
> edRunner.java:682)
> 	at
> com.carrotsearch.randomizedtesting.RandomizedRunner$5.evaluate(Randomiz
> edRunner.java:693)
> 	at
> com.carrotsearch.randomizedtesting.rules.StatementAdapter.evaluate(Stateme
> ntAdapter.java:36)
> 	at
> com.carrotsearch.randomizedtesting.rules.SystemPropertiesRestoreRule$1.eval
> uate(SystemPropertiesRestoreRule.java:53)
> 	at
> org.apache.lucene.util.AbstractBeforeAfterRule$1.evaluate(AbstractBeforeAfte
> rRule.java:45)
> 	at
> org.apache.lucene.util.TestRuleStoreClassName$1.evaluate(TestRuleStoreClass
> Name.java:42)
> 	at
> com.carrotsearch.randomizedtesting.rules.SystemPropertiesInvariantRule$1.ev
> aluate(SystemPropertiesInvariantRule.java:55)
> 	at
> com.carrotsearch.randomizedtesting.rules.NoShadowingOrOverridesOnMethod
> sRule$1.evaluate(NoShadowingOrOverridesOnMethodsRule.java:39)
> 	at
> com.carrotsearch.randomizedtesting.rules.NoShadowingOrOverridesOnMethod
> sRule$1.evaluate(NoShadowingOrOverridesOnMethodsRule.java:39)
> 	at
> org.apache.lucene.util.TestRuleAssertionsRequired$1.evaluate(TestRuleAssertio
> nsRequired.java:40)
> 	at
> org.apache.lucene.util.TestRuleMarkFailure$1.evaluate(TestRuleMarkFailure.ja
> va:48)
> 	at
> org.apache.lucene.util.TestRuleIgnoreAfterMaxFailures$1.evaluate(TestRuleIgn
> oreAfterMaxFailures.java:70)
> 	at
> org.apache.lucene.util.TestRuleIgnoreTestSuites$1.evaluate(TestRuleIgnoreTest
> Suites.java:55)
> 	at
> com.carrotsearch.randomizedtesting.rules.StatementAdapter.evaluate(Stateme
> ntAdapter.java:36)
> 	at
> com.carrotsearch.randomizedtesting.ThreadLeakControl$StatementRunner.run
> (ThreadLeakControl.java:345)
> 	at java.lang.Thread.run(Thread.java:722)
> Caused by: java.net.SocketException: Connection reset
> 	at java.net.SocketInputStream.read(SocketInputStream.java:189)
> 	at java.net.SocketInputStream.read(SocketInputStream.java:121)
> 	at
> org.apache.http.impl.io.AbstractSessionInputBuffer.fillBuffer(AbstractSessionInp
> utBuffer.java:149)
> 	at
> org.apache.http.impl.io.SocketInputBuffer.fillBuffer(SocketInputBuffer.java:111)
> 	at
> org.apache.http.impl.io.AbstractSessionInputBuffer.readLine(AbstractSessionInp
> utBuffer.java:264)
> 	at
> org.apache.http.impl.conn.DefaultResponseParser.parseHead(DefaultResponse
> Parser.java:98)
> 	at
> org.apache.http.impl.io.AbstractMessageParser.parse(AbstractMessageParser.j
> ava:252)
> 	at
> org.apache.http.impl.AbstractHttpClientConnection.receiveResponseHeader(Ab
> stractHttpClientConnection.java:282)
> 	at
> org.apache.http.impl.conn.DefaultClientConnection.receiveResponseHeader(De
> faultClientConnection.java:247)
> 	at
> org.apache.http.impl.conn.AbstractClientConnAdapter.receiveResponseHeader(
> AbstractClientConnAdapter.java:216)
> 	at
> org.apache.http.protocol.HttpRequestExecutor.doReceiveResponse(HttpRequest
> Executor.java:298)
> 	at
> org.apache.http.protocol.HttpRequestExecutor.execute(HttpRequestExecutor.ja
> va:125)
> 	at
> org.apache.http.impl.client.DefaultRequestDirector.tryExecute(DefaultRequest
> Director.java:647)
> 	at
> org.apache.http.impl.client.DefaultRequestDirector.execute(DefaultRequestDir
> ector.java:464)
> 	at
> org.apache.http.impl.client.AbstractHttpClient.execute(AbstractHttpClient.java:
> 820)
> 	at
> org.apache.http.impl.client.AbstractHttpClient.execute(AbstractHttpClient.java:
> 754)
> 	at
> org.apache.http.impl.client.AbstractHttpClient.execute(AbstractHttpClient.java:
> 732)
> 	at
> org.apache.solr.client.solrj.impl.HttpSolrServer.request(HttpSolrServer.java:353
> )
> 	... 42 more
> 
> 
> REGRESSION:  org.apache.solr.TestDistributedGrouping.testDistribSearch
> 
> Error Message:
> IOException occured when talking to server at: http://localhost:18020/solr
> 
> Stack Trace:
> org.apache.solr.client.solrj.SolrServerException: IOException occured when
> talking to server at: http://localhost:18020/solr
> 	at
> __randomizedtesting.SeedInfo.seed([E20548CE3E5ACD20:63E3C6D64905AD1C]
> :0)
> 	at
> org.apache.solr.client.solrj.impl.HttpSolrServer.request(HttpSolrServer.java:414
> )
> 	at
> org.apache.solr.client.solrj.impl.HttpSolrServer.request(HttpSolrServer.java:182
> )
> 	at
> org.apache.solr.client.solrj.request.AbstractUpdateRequest.process(AbstractUp
> dateRequest.java:117)
> 	at
> org.apache.solr.client.solrj.SolrServer.deleteByQuery(SolrServer.java:306)
> 	at
> org.apache.solr.client.solrj.SolrServer.deleteByQuery(SolrServer.java:291)
> 	at
> org.apache.solr.BaseDistributedSearchTestCase.del(BaseDistributedSearchTest
> Case.java:354)
> 	at
> org.apache.solr.TestDistributedGrouping.doTest(TestDistributedGrouping.java:4
> 7)
> 	at
> org.apache.solr.BaseDistributedSearchTestCase.testDistribSearch(BaseDistribut
> edSearchTestCase.java:697)
> 	at sun.reflect.NativeMethodAccessorImpl.invoke0(Native Method)
> 	at
> sun.reflect.NativeMethodAccessorImpl.invoke(NativeMethodAccessorImpl.java:
> 57)
> 	at
> sun.reflect.DelegatingMethodAccessorImpl.invoke(DelegatingMethodAccessorI
> mpl.java:43)
> 	at java.lang.reflect.Method.invoke(Method.java:601)
> 	at
> com.carrotsearch.randomizedtesting.RandomizedRunner.invoke(RandomizedRu
> nner.java:1559)
> 	at
> com.carrotsearch.randomizedtesting.RandomizedRunner.access$600(Randomiz
> edRunner.java:79)
> 	at
> com.carrotsearch.randomizedtesting.RandomizedRunner$6.evaluate(Randomiz
> edRunner.java:737)
> 	at
> com.carrotsearch.randomizedtesting.RandomizedRunner$7.evaluate(Randomiz
> edRunner.java:773)
> 	at
> com.carrotsearch.randomizedtesting.RandomizedRunner$8.evaluate(Randomiz
> edRunner.java:787)
> 	at
> com.carrotsearch.randomizedtesting.rules.SystemPropertiesRestoreRule$1.eval
> uate(SystemPropertiesRestoreRule.java:53)
> 	at
> org.apache.lucene.util.TestRuleSetupTeardownChained$1.evaluate(TestRuleSet
> upTeardownChained.java:50)
> 	at
> org.apache.lucene.util.TestRuleFieldCacheSanity$1.evaluate(TestRuleFieldCach
> eSanity.java:51)
> 	at
> org.apache.lucene.util.AbstractBeforeAfterRule$1.evaluate(AbstractBeforeAfte
> rRule.java:45)
> 	at
> com.carrotsearch.randomizedtesting.rules.SystemPropertiesInvariantRule$1.ev
> aluate(SystemPropertiesInvariantRule.java:55)
> 	at
> org.apache.lucene.util.TestRuleThreadAndTestName$1.evaluate(TestRuleThrea
> dAndTestName.java:48)
> 	at
> org.apache.lucene.util.TestRuleIgnoreAfterMaxFailures$1.evaluate(TestRuleIgn
> oreAfterMaxFailures.java:70)
> 	at
> org.apache.lucene.util.TestRuleMarkFailure$1.evaluate(TestRuleMarkFailure.ja
> va:48)
> 	at
> com.carrotsearch.randomizedtesting.rules.StatementAdapter.evaluate(Stateme
> ntAdapter.java:36)
> 	at
> com.carrotsearch.randomizedtesting.ThreadLeakControl$StatementRunner.run
> (ThreadLeakControl.java:345)
> 	at
> com.carrotsearch.randomizedtesting.ThreadLeakControl.forkTimeoutingTask(T
> hreadLeakControl.java:769)
> 	at
> com.carrotsearch.randomizedtesting.ThreadLeakControl$3.evaluate(ThreadLea
> kControl.java:429)
> 	at
> com.carrotsearch.randomizedtesting.RandomizedRunner.runSingleTest(Rando
> mizedRunner.java:746)
> 	at
> com.carrotsearch.randomizedtesting.RandomizedRunner$3.evaluate(Randomiz
> edRunner.java:648)
> 	at
> com.carrotsearch.randomizedtesting.RandomizedRunner$4.evaluate(Randomiz
> edRunner.java:682)
> 	at
> com.carrotsearch.randomizedtesting.RandomizedRunner$5.evaluate(Randomiz
> edRunner.java:693)
> 	at
> com.carrotsearch.randomizedtesting.rules.StatementAdapter.evaluate(Stateme
> ntAdapter.java:36)
> 	at
> com.carrotsearch.randomizedtesting.rules.SystemPropertiesRestoreRule$1.eval
> uate(SystemPropertiesRestoreRule.java:53)
> 	at
> org.apache.lucene.util.AbstractBeforeAfterRule$1.evaluate(AbstractBeforeAfte
> rRule.java:45)
> 	at
> org.apache.lucene.util.TestRuleStoreClassName$1.evaluate(TestRuleStoreClass
> Name.java:42)
> 	at
> com.carrotsearch.randomizedtesting.rules.SystemPropertiesInvariantRule$1.ev
> aluate(SystemPropertiesInvariantRule.java:55)
> 	at
> com.carrotsearch.randomizedtesting.rules.NoShadowingOrOverridesOnMethod
> sRule$1.evaluate(NoShadowingOrOverridesOnMethodsRule.java:39)
> 	at
> com.carrotsearch.randomizedtesting.rules.NoShadowingOrOverridesOnMethod
> sRule$1.evaluate(NoShadowingOrOverridesOnMethodsRule.java:39)
> 	at
> org.apache.lucene.util.TestRuleAssertionsRequired$1.evaluate(TestRuleAssertio
> nsRequired.java:40)
> 	at
> org.apache.lucene.util.TestRuleMarkFailure$1.evaluate(TestRuleMarkFailure.ja
> va:48)
> 	at
> org.apache.lucene.util.TestRuleIgnoreAfterMaxFailures$1.evaluate(TestRuleIgn
> oreAfterMaxFailures.java:70)
> 	at
> org.apache.lucene.util.TestRuleIgnoreTestSuites$1.evaluate(TestRuleIgnoreTest
> Suites.java:55)
> 	at
> com.carrotsearch.randomizedtesting.rules.StatementAdapter.evaluate(Stateme
> ntAdapter.java:36)
> 	at
> com.carrotsearch.randomizedtesting.ThreadLeakControl$StatementRunner.run
> (ThreadLeakControl.java:345)
> 	at java.lang.Thread.run(Thread.java:722)
> Caused by: java.net.SocketException: Connection reset
> 	at java.net.SocketInputStream.read(SocketInputStream.java:189)
> 	at java.net.SocketInputStream.read(SocketInputStream.java:121)
> 	at
> org.apache.http.impl.io.AbstractSessionInputBuffer.fillBuffer(AbstractSessionInp
> utBuffer.java:149)
> 	at
> org.apache.http.impl.io.SocketInputBuffer.fillBuffer(SocketInputBuffer.java:111)
> 	at
> org.apache.http.impl.io.AbstractSessionInputBuffer.readLine(AbstractSessionInp
> utBuffer.java:264)
> 	at
> org.apache.http.impl.conn.DefaultResponseParser.parseHead(DefaultResponse
> Parser.java:98)
> 	at
> org.apache.http.impl.io.AbstractMessageParser.parse(AbstractMessageParser.j
> ava:252)
> 	at
> org.apache.http.impl.AbstractHttpClientConnection.receiveResponseHeader(Ab
> stractHttpClientConnection.java:282)
> 	at
> org.apache.http.impl.conn.DefaultClientConnection.receiveResponseHeader(De
> faultClientConnection.java:247)
> 	at
> org.apache.http.impl.conn.AbstractClientConnAdapter.receiveResponseHeader(
> AbstractClientConnAdapter.java:216)
> 	at
> org.apache.http.protocol.HttpRequestExecutor.doReceiveResponse(HttpRequest
> Executor.java:298)
> 	at
> org.apache.http.protocol.HttpRequestExecutor.execute(HttpRequestExecutor.ja
> va:125)
> 	at
> org.apache.http.impl.client.DefaultRequestDirector.tryExecute(DefaultRequest
> Director.java:647)
> 	at
> org.apache.http.impl.client.DefaultRequestDirector.execute(DefaultRequestDir
> ector.java:464)
> 	at
> org.apache.http.impl.client.AbstractHttpClient.execute(AbstractHttpClient.java:
> 820)
> 	at
> org.apache.http.impl.client.AbstractHttpClient.execute(AbstractHttpClient.java:
> 754)
> 	at
> org.apache.http.impl.client.AbstractHttpClient.execute(AbstractHttpClient.java:
> 732)
> 	at
> org.apache.solr.client.solrj.impl.HttpSolrServer.request(HttpSolrServer.java:353
> )
> 	... 46 more
> 
> 
> REGRESSION:  org.apache.solr.request.TestRemoteStreaming.testNoUrlAccess
> 
> Error Message:
> IOException occured when talking to server at: http://localhost:13521/solr
> 
> Stack Trace:
> org.apache.solr.client.solrj.SolrServerException: IOException occured when
> talking to server at: http://localhost:13521/solr
> 	at
> __randomizedtesting.SeedInfo.seed([E20548CE3E5ACD20:7C8F0139FE3AAA1C]:
> 0)
> 	at
> org.apache.solr.client.solrj.impl.HttpSolrServer.request(HttpSolrServer.java:414
> )
> 	at
> org.apache.solr.client.solrj.impl.HttpSolrServer.request(HttpSolrServer.java:182
> )
> 	at
> org.apache.solr.client.solrj.request.AbstractUpdateRequest.process(AbstractUp
> dateRequest.java:117)
> 	at org.apache.solr.client.solrj.SolrServer.add(SolrServer.java:122)
> 	at org.apache.solr.client.solrj.SolrServer.add(SolrServer.java:107)
> 	at
> org.apache.solr.request.TestRemoteStreaming.doBefore(TestRemoteStreaming
> .java:59)
> 	at sun.reflect.NativeMethodAccessorImpl.invoke0(Native Method)
> 	at
> sun.reflect.NativeMethodAccessorImpl.invoke(NativeMethodAccessorImpl.java:
> 57)
> 	at
> sun.reflect.DelegatingMethodAccessorImpl.invoke(DelegatingMethodAccessorI
> mpl.java:43)
> 	at java.lang.reflect.Method.invoke(Method.java:601)
> 	at
> com.carrotsearch.randomizedtesting.RandomizedRunner.invoke(RandomizedRu
> nner.java:1559)
> 	at
> com.carrotsearch.randomizedtesting.RandomizedRunner.access$600(Randomiz
> edRunner.java:79)
> 	at
> com.carrotsearch.randomizedtesting.RandomizedRunner$7.evaluate(Randomiz
> edRunner.java:771)
> 	at
> com.carrotsearch.randomizedtesting.RandomizedRunner$8.evaluate(Randomiz
> edRunner.java:787)
> 	at
> com.carrotsearch.randomizedtesting.rules.SystemPropertiesRestoreRule$1.eval
> uate(SystemPropertiesRestoreRule.java:53)
> 	at
> org.apache.lucene.util.TestRuleSetupTeardownChained$1.evaluate(TestRuleSet
> upTeardownChained.java:50)
> 	at
> org.apache.lucene.util.TestRuleFieldCacheSanity$1.evaluate(TestRuleFieldCach
> eSanity.java:51)
> 	at
> org.apache.lucene.util.AbstractBeforeAfterRule$1.evaluate(AbstractBeforeAfte
> rRule.java:45)
> 	at
> com.carrotsearch.randomizedtesting.rules.SystemPropertiesInvariantRule$1.ev
> aluate(SystemPropertiesInvariantRule.java:55)
> 	at
> org.apache.lucene.util.TestRuleThreadAndTestName$1.evaluate(TestRuleThrea
> dAndTestName.java:48)
> 	at
> org.apache.lucene.util.TestRuleIgnoreAfterMaxFailures$1.evaluate(TestRuleIgn
> oreAfterMaxFailures.java:70)
> 	at
> org.apache.lucene.util.TestRuleMarkFailure$1.evaluate(TestRuleMarkFailure.ja
> va:48)
> 	at
> com.carrotsearch.randomizedtesting.rules.StatementAdapter.evaluate(Stateme
> ntAdapter.java:36)
> 	at
> com.carrotsearch.randomizedtesting.ThreadLeakControl$StatementRunner.run
> (ThreadLeakControl.java:345)
> 	at
> com.carrotsearch.randomizedtesting.ThreadLeakControl.forkTimeoutingTask(T
> hreadLeakControl.java:769)
> 	at
> com.carrotsearch.randomizedtesting.ThreadLeakControl$3.evaluate(ThreadLea
> kControl.java:429)
> 	at
> com.carrotsearch.randomizedtesting.RandomizedRunner.runSingleTest(Rando
> mizedRunner.java:746)
> 	at
> com.carrotsearch.randomizedtesting.RandomizedRunner$3.evaluate(Randomiz
> edRunner.java:648)
> 	at
> com.carrotsearch.randomizedtesting.RandomizedRunner$4.evaluate(Randomiz
> edRunner.java:682)
> 	at
> com.carrotsearch.randomizedtesting.RandomizedRunner$5.evaluate(Randomiz
> edRunner.java:693)
> 	at
> com.carrotsearch.randomizedtesting.rules.StatementAdapter.evaluate(Stateme
> ntAdapter.java:36)
> 	at
> com.carrotsearch.randomizedtesting.rules.SystemPropertiesRestoreRule$1.eval
> uate(SystemPropertiesRestoreRule.java:53)
> 	at
> org.apache.lucene.util.AbstractBeforeAfterRule$1.evaluate(AbstractBeforeAfte
> rRule.java:45)
> 	at
> org.apache.lucene.util.TestRuleStoreClassName$1.evaluate(TestRuleStoreClass
> Name.java:42)
> 	at
> com.carrotsearch.randomizedtesting.rules.SystemPropertiesInvariantRule$1.ev
> aluate(SystemPropertiesInvariantRule.java:55)
> 	at
> com.carrotsearch.randomizedtesting.rules.NoShadowingOrOverridesOnMethod
> sRule$1.evaluate(NoShadowingOrOverridesOnMethodsRule.java:39)
> 	at
> com.carrotsearch.randomizedtesting.rules.NoShadowingOrOverridesOnMethod
> sRule$1.evaluate(NoShadowingOrOverridesOnMethodsRule.java:39)
> 	at
> org.apache.lucene.util.TestRuleAssertionsRequired$1.evaluate(TestRuleAssertio
> nsRequired.java:40)
> 	at
> org.apache.lucene.util.TestRuleMarkFailure$1.evaluate(TestRuleMarkFailure.ja
> va:48)
> 	at
> org.apache.lucene.util.TestRuleIgnoreAfterMaxFailures$1.evaluate(TestRuleIgn
> oreAfterMaxFailures.java:70)
> 	at
> org.apache.lucene.util.TestRuleIgnoreTestSuites$1.evaluate(TestRuleIgnoreTest
> Suites.java:55)
> 	at
> com.carrotsearch.randomizedtesting.rules.StatementAdapter.evaluate(Stateme
> ntAdapter.java:36)
> 	at
> com.carrotsearch.randomizedtesting.ThreadLeakControl$StatementRunner.run
> (ThreadLeakControl.java:345)
> 	at java.lang.Thread.run(Thread.java:722)
> Caused by: java.net.SocketException: Connection reset
> 	at java.net.SocketInputStream.read(SocketInputStream.java:189)
> 	at java.net.SocketInputStream.read(SocketInputStream.java:121)
> 	at
> org.apache.http.impl.io.AbstractSessionInputBuffer.fillBuffer(AbstractSessionInp
> utBuffer.java:149)
> 	at
> org.apache.http.impl.io.SocketInputBuffer.fillBuffer(SocketInputBuffer.java:111)
> 	at
> org.apache.http.impl.io.AbstractSessionInputBuffer.readLine(AbstractSessionInp
> utBuffer.java:264)
> 	at
> org.apache.http.impl.conn.DefaultResponseParser.parseHead(DefaultResponse
> Parser.java:98)
> 	at
> org.apache.http.impl.io.AbstractMessageParser.parse(AbstractMessageParser.j
> ava:252)
> 	at
> org.apache.http.impl.AbstractHttpClientConnection.receiveResponseHeader(Ab
> stractHttpClientConnection.java:282)
> 	at
> org.apache.http.impl.conn.DefaultClientConnection.receiveResponseHeader(De
> faultClientConnection.java:247)
> 	at
> org.apache.http.impl.conn.AbstractClientConnAdapter.receiveResponseHeader(
> AbstractClientConnAdapter.java:216)
> 	at
> org.apache.http.protocol.HttpRequestExecutor.doReceiveResponse(HttpRequest
> Executor.java:298)
> 	at
> org.apache.http.protocol.HttpRequestExecutor.execute(HttpRequestExecutor.ja
> va:125)
> 	at
> org.apache.http.impl.client.DefaultRequestDirector.tryExecute(DefaultRequest
> Director.java:647)
> 	at
> org.apache.http.impl.client.DefaultRequestDirector.execute(DefaultRequestDir
> ector.java:464)
> 	at
> org.apache.http.impl.client.AbstractHttpClient.execute(AbstractHttpClient.java:
> 820)
> 	at
> org.apache.http.impl.client.AbstractHttpClient.execute(AbstractHttpClient.java:
> 754)
> 	at
> org.apache.http.impl.client.AbstractHttpClient.execute(AbstractHttpClient.java:
> 732)
> 	at
> org.apache.solr.client.solrj.impl.HttpSolrServer.request(HttpSolrServer.java:353
> )
> 	... 43 more
> 
> 
> REGRESSION:  org.apache.solr.request.TestRemoteStreaming.testQtUpdateFails
> 
> Error Message:
> IOException occured when talking to server at: http://localhost:13521/solr
> 
> Stack Trace:
> org.apache.solr.client.solrj.SolrServerException: IOException occured when
> talking to server at: http://localhost:13521/solr
> 	at
> __randomizedtesting.SeedInfo.seed([E20548CE3E5ACD20:B6075C2BF26A487A]:
> 0)
> 	at
> org.apache.solr.client.solrj.impl.HttpSolrServer.request(HttpSolrServer.java:414
> )
> 	at
> org.apache.solr.client.solrj.impl.HttpSolrServer.request(HttpSolrServer.java:182
> )
> 	at
> org.apache.solr.client.solrj.request.AbstractUpdateRequest.process(AbstractUp
> dateRequest.java:117)
> 	at org.apache.solr.client.solrj.SolrServer.add(SolrServer.java:122)
> 	at org.apache.solr.client.solrj.SolrServer.add(SolrServer.java:107)
> 	at
> org.apache.solr.request.TestRemoteStreaming.doBefore(TestRemoteStreaming
> .java:59)
> 	at sun.reflect.NativeMethodAccessorImpl.invoke0(Native Method)
> 	at
> sun.reflect.NativeMethodAccessorImpl.invoke(NativeMethodAccessorImpl.java:
> 57)
> 	at
> sun.reflect.DelegatingMethodAccessorImpl.invoke(DelegatingMethodAccessorI
> mpl.java:43)
> 	at java.lang.reflect.Method.invoke(Method.java:601)
> 	at
> com.carrotsearch.randomizedtesting.RandomizedRunner.invoke(RandomizedRu
> nner.java:1559)
> 	at
> com.carrotsearch.randomizedtesting.RandomizedRunner.access$600(Randomiz
> edRunner.java:79)
> 	at
> com.carrotsearch.randomizedtesting.RandomizedRunner$7.evaluate(Randomiz
> edRunner.java:771)
> 	at
> com.carrotsearch.randomizedtesting.RandomizedRunner$8.evaluate(Randomiz
> edRunner.java:787)
> 	at
> com.carrotsearch.randomizedtesting.rules.SystemPropertiesRestoreRule$1.eval
> uate(SystemPropertiesRestoreRule.java:53)
> 	at
> org.apache.lucene.util.TestRuleSetupTeardownChained$1.evaluate(TestRuleSet
> upTeardownChained.java:50)
> 	at
> org.apache.lucene.util.TestRuleFieldCacheSanity$1.evaluate(TestRuleFieldCach
> eSanity.java:51)
> 	at
> org.apache.lucene.util.AbstractBeforeAfterRule$1.evaluate(AbstractBeforeAfte
> rRule.java:45)
> 	at
> com.carrotsearch.randomizedtesting.rules.SystemPropertiesInvariantRule$1.ev
> aluate(SystemPropertiesInvariantRule.java:55)
> 	at
> org.apache.lucene.util.TestRuleThreadAndTestName$1.evaluate(TestRuleThrea
> dAndTestName.java:48)
> 	at
> org.apache.lucene.util.TestRuleIgnoreAfterMaxFailures$1.evaluate(TestRuleIgn
> oreAfterMaxFailures.java:70)
> 	at
> org.apache.lucene.util.TestRuleMarkFailure$1.evaluate(TestRuleMarkFailure.ja
> va:48)
> 	at
> com.carrotsearch.randomizedtesting.rules.StatementAdapter.evaluate(Stateme
> ntAdapter.java:36)
> 	at
> com.carrotsearch.randomizedtesting.ThreadLeakControl$StatementRunner.run
> (ThreadLeakControl.java:345)
> 	at
> com.carrotsearch.randomizedtesting.ThreadLeakControl.forkTimeoutingTask(T
> hreadLeakControl.java:769)
> 	at
> com.carrotsearch.randomizedtesting.ThreadLeakControl$3.evaluate(ThreadLea
> kControl.java:429)
> 	at
> com.carrotsearch.randomizedtesting.RandomizedRunner.runSingleTest(Rando
> mizedRunner.java:746)
> 	at
> com.carrotsearch.randomizedtesting.RandomizedRunner$3.evaluate(Randomiz
> edRunner.java:648)
> 	at
> com.carrotsearch.randomizedtesting.RandomizedRunner$4.evaluate(Randomiz
> edRunner.java:682)
> 	at
> com.carrotsearch.randomizedtesting.RandomizedRunner$5.evaluate(Randomiz
> edRunner.java:693)
> 	at
> com.carrotsearch.randomizedtesting.rules.StatementAdapter.evaluate(Stateme
> ntAdapter.java:36)
> 	at
> com.carrotsearch.randomizedtesting.rules.SystemPropertiesRestoreRule$1.eval
> uate(SystemPropertiesRestoreRule.java:53)
> 	at
> org.apache.lucene.util.AbstractBeforeAfterRule$1.evaluate(AbstractBeforeAfte
> rRule.java:45)
> 	at
> org.apache.lucene.util.TestRuleStoreClassName$1.evaluate(TestRuleStoreClass
> Name.java:42)
> 	at
> com.carrotsearch.randomizedtesting.rules.SystemPropertiesInvariantRule$1.ev
> aluate(SystemPropertiesInvariantRule.java:55)
> 	at
> com.carrotsearch.randomizedtesting.rules.NoShadowingOrOverridesOnMethod
> sRule$1.evaluate(NoShadowingOrOverridesOnMethodsRule.java:39)
> 	at
> com.carrotsearch.randomizedtesting.rules.NoShadowingOrOverridesOnMethod
> sRule$1.evaluate(NoShadowingOrOverridesOnMethodsRule.java:39)
> 	at
> org.apache.lucene.util.TestRuleAssertionsRequired$1.evaluate(TestRuleAssertio
> nsRequired.java:40)
> 	at
> org.apache.lucene.util.TestRuleMarkFailure$1.evaluate(TestRuleMarkFailure.ja
> va:48)
> 	at
> org.apache.lucene.util.TestRuleIgnoreAfterMaxFailures$1.evaluate(TestRuleIgn
> oreAfterMaxFailures.java:70)
> 	at
> org.apache.lucene.util.TestRuleIgnoreTestSuites$1.evaluate(TestRuleIgnoreTest
> Suites.java:55)
> 	at
> com.carrotsearch.randomizedtesting.rules.StatementAdapter.evaluate(Stateme
> ntAdapter.java:36)
> 	at
> com.carrotsearch.randomizedtesting.ThreadLeakControl$StatementRunner.run
> (ThreadLeakControl.java:345)
> 	at java.lang.Thread.run(Thread.java:722)
> Caused by: org.apache.http.NoHttpResponseException: The target server failed
> to respond
> 	at
> org.apache.http.impl.conn.DefaultResponseParser.parseHead(DefaultResponse
> Parser.java:101)
> 	at
> org.apache.http.impl.io.AbstractMessageParser.parse(AbstractMessageParser.j
> ava:252)
> 	at
> org.apache.http.impl.AbstractHttpClientConnection.receiveResponseHeader(Ab
> stractHttpClientConnection.java:282)
> 	at
> org.apache.http.impl.conn.DefaultClientConnection.receiveResponseHeader(De
> faultClientConnection.java:247)
> 	at
> org.apache.http.impl.conn.AbstractClientConnAdapter.receiveResponseHeader(
> AbstractClientConnAdapter.java:216)
> 	at
> org.apache.http.protocol.HttpRequestExecutor.doReceiveResponse(HttpRequest
> Executor.java:298)
> 	at
> org.apache.http.protocol.HttpRequestExecutor.execute(HttpRequestExecutor.ja
> va:125)
> 	at
> org.apache.http.impl.client.DefaultRequestDirector.tryExecute(DefaultRequest
> Director.java:647)
> 	at
> org.apache.http.impl.client.DefaultRequestDirector.execute(DefaultRequestDir
> ector.java:464)
> 	at
> org.apache.http.impl.client.AbstractHttpClient.execute(AbstractHttpClient.java:
> 820)
> 	at
> org.apache.http.impl.client.AbstractHttpClient.execute(AbstractHttpClient.java:
> 754)
> 	at
> org.apache.http.impl.client.AbstractHttpClient.execute(AbstractHttpClient.java:
> 732)
> 	at
> org.apache.solr.client.solrj.impl.HttpSolrServer.request(HttpSolrServer.java:353
> )
> 	... 43 more
> 
> 
> REGRESSION:  org.apache.solr.request.TestRemoteStreaming.testStreamUrl
> 
> Error Message:
> IOException occured when talking to server at: http://localhost:13521/solr
> 
> Stack Trace:
> org.apache.solr.client.solrj.SolrServerException: IOException occured when
> talking to server at: http://localhost:13521/solr
> 	at
> __randomizedtesting.SeedInfo.seed([E20548CE3E5ACD20:CF10EC5C68A334CA]
> :0)
> 	at
> org.apache.solr.client.solrj.impl.HttpSolrServer.request(HttpSolrServer.java:414
> )
> 	at
> org.apache.solr.client.solrj.impl.HttpSolrServer.request(HttpSolrServer.java:182
> )
> 	at
> org.apache.solr.client.solrj.request.AbstractUpdateRequest.process(AbstractUp
> dateRequest.java:117)
> 	at org.apache.solr.client.solrj.SolrServer.add(SolrServer.java:122)
> 	at org.apache.solr.client.solrj.SolrServer.add(SolrServer.java:107)
> 	at
> org.apache.solr.request.TestRemoteStreaming.doBefore(TestRemoteStreaming
> .java:59)
> 	at sun.reflect.NativeMethodAccessorImpl.invoke0(Native Method)
> 	at
> sun.reflect.NativeMethodAccessorImpl.invoke(NativeMethodAccessorImpl.java:
> 57)
> 	at
> sun.reflect.DelegatingMethodAccessorImpl.invoke(DelegatingMethodAccessorI
> mpl.java:43)
> 	at java.lang.reflect.Method.invoke(Method.java:601)
> 	at
> com.carrotsearch.randomizedtesting.RandomizedRunner.invoke(RandomizedRu
> nner.java:1559)
> 	at
> com.carrotsearch.randomizedtesting.RandomizedRunner.access$600(Randomiz
> edRunner.java:79)
> 	at
> com.carrotsearch.randomizedtesting.RandomizedRunner$7.evaluate(Randomiz
> edRunner.java:771)
> 	at
> com.carrotsearch.randomizedtesting.RandomizedRunner$8.evaluate(Randomiz
> edRunner.java:787)
> 	at
> com.carrotsearch.randomizedtesting.rules.SystemPropertiesRestoreRule$1.eval
> uate(SystemPropertiesRestoreRule.java:53)
> 	at
> org.apache.lucene.util.TestRuleSetupTeardownChained$1.evaluate(TestRuleSet
> upTeardownChained.java:50)
> 	at
> org.apache.lucene.util.TestRuleFieldCacheSanity$1.evaluate(TestRuleFieldCach
> eSanity.java:51)
> 	at
> org.apache.lucene.util.AbstractBeforeAfterRule$1.evaluate(AbstractBeforeAfte
> rRule.java:45)
> 	at
> com.carrotsearch.randomizedtesting.rules.SystemPropertiesInvariantRule$1.ev
> aluate(SystemPropertiesInvariantRule.java:55)
> 	at
> org.apache.lucene.util.TestRuleThreadAndTestName$1.evaluate(TestRuleThrea
> dAndTestName.java:48)
> 	at
> org.apache.lucene.util.TestRuleIgnoreAfterMaxFailures$1.evaluate(TestRuleIgn
> oreAfterMaxFailures.java:70)
> 	at
> org.apache.lucene.util.TestRuleMarkFailure$1.evaluate(TestRuleMarkFailure.ja
> va:48)
> 	at
> com.carrotsearch.randomizedtesting.rules.StatementAdapter.evaluate(Stateme
> ntAdapter.java:36)
> 	at
> com.carrotsearch.randomizedtesting.ThreadLeakControl$StatementRunner.run
> (ThreadLeakControl.java:345)
> 	at
> com.carrotsearch.randomizedtesting.ThreadLeakControl.forkTimeoutingTask(T
> hreadLeakControl.java:769)
> 	at
> com.carrotsearch.randomizedtesting.ThreadLeakControl$3.evaluate(ThreadLea
> kControl.java:429)
> 	at
> com.carrotsearch.randomizedtesting.RandomizedRunner.runSingleTest(Rando
> mizedRunner.java:746)
> 	at
> com.carrotsearch.randomizedtesting.RandomizedRunner$3.evaluate(Randomiz
> edRunner.java:648)
> 	at
> com.carrotsearch.randomizedtesting.RandomizedRunner$4.evaluate(Randomiz
> edRunner.java:682)
> 	at
> com.carrotsearch.randomizedtesting.RandomizedRunner$5.evaluate(Randomiz
> edRunner.java:693)
> 	at
> com.carrotsearch.randomizedtesting.rules.StatementAdapter.evaluate(Stateme
> ntAdapter.java:36)
> 	at
> com.carrotsearch.randomizedtesting.rules.SystemPropertiesRestoreRule$1.eval
> uate(SystemPropertiesRestoreRule.java:53)
> 	at
> org.apache.lucene.util.AbstractBeforeAfterRule$1.evaluate(AbstractBeforeAfte
> rRule.java:45)
> 	at
> org.apache.lucene.util.TestRuleStoreClassName$1.evaluate(TestRuleStoreClass
> Name.java:42)
> 	at
> com.carrotsearch.randomizedtesting.rules.SystemPropertiesInvariantRule$1.ev
> aluate(SystemPropertiesInvariantRule.java:55)
> 	at
> com.carrotsearch.randomizedtesting.rules.NoShadowingOrOverridesOnMethod
> sRule$1.evaluate(NoShadowingOrOverridesOnMethodsRule.java:39)
> 	at
> com.carrotsearch.randomizedtesting.rules.NoShadowingOrOverridesOnMethod
> sRule$1.evaluate(NoShadowingOrOverridesOnMethodsRule.java:39)
> 	at
> org.apache.lucene.util.TestRuleAssertionsRequired$1.evaluate(TestRuleAssertio
> nsRequired.java:40)
> 	at
> org.apache.lucene.util.TestRuleMarkFailure$1.evaluate(TestRuleMarkFailure.ja
> va:48)
> 	at
> org.apache.lucene.util.TestRuleIgnoreAfterMaxFailures$1.evaluate(TestRuleIgn
> oreAfterMaxFailures.java:70)
> 	at
> org.apache.lucene.util.TestRuleIgnoreTestSuites$1.evaluate(TestRuleIgnoreTest
> Suites.java:55)
> 	at
> com.carrotsearch.randomizedtesting.rules.StatementAdapter.evaluate(Stateme
> ntAdapter.java:36)
> 	at
> com.carrotsearch.randomizedtesting.ThreadLeakControl$StatementRunner.run
> (ThreadLeakControl.java:345)
> 	at java.lang.Thread.run(Thread.java:722)
> Caused by: org.apache.http.NoHttpResponseException: The target server failed
> to respond
> 	at
> org.apache.http.impl.conn.DefaultResponseParser.parseHead(DefaultResponse
> Parser.java:101)
> 	at
> org.apache.http.impl.io.AbstractMessageParser.parse(AbstractMessageParser.j
> ava:252)
> 	at
> org.apache.http.impl.AbstractHttpClientConnection.receiveResponseHeader(Ab
> stractHttpClientConnection.java:282)
> 	at
> org.apache.http.impl.conn.DefaultClientConnection.receiveResponseHeader(De
> faultClientConnection.java:247)
> 	at
> org.apache.http.impl.conn.AbstractClientConnAdapter.receiveResponseHeader(
> AbstractClientConnAdapter.java:216)
> 	at
> org.apache.http.protocol.HttpRequestExecutor.doReceiveResponse(HttpRequest
> Executor.java:298)
> 	at
> org.apache.http.protocol.HttpRequestExecutor.execute(HttpRequestExecutor.ja
> va:125)
> 	at
> org.apache.http.impl.client.DefaultRequestDirector.tryExecute(DefaultRequest
> Director.java:647)
> 	at
> org.apache.http.impl.client.DefaultRequestDirector.execute(DefaultRequestDir
> ector.java:464)
> 	at
> org.apache.http.impl.client.AbstractHttpClient.execute(AbstractHttpClient.java:
> 820)
> 	at
> org.apache.http.impl.client.AbstractHttpClient.execute(AbstractHttpClient.java:
> 754)
> 	at
> org.apache.http.impl.client.AbstractHttpClient.execute(AbstractHttpClient.java:
> 732)
> 	at
> org.apache.solr.client.solrj.impl.HttpSolrServer.request(HttpSolrServer.java:353
> )
> 	... 43 more
> 
> 
> REGRESSION:
> org.apache.solr.request.TestRemoteStreaming.testMakeDeleteAllUrl
> 
> Error Message:
> IOException occured when talking to server at: http://localhost:13521/solr
> 
> Stack Trace:
> org.apache.solr.client.solrj.SolrServerException: IOException occured when
> talking to server at: http://localhost:13521/solr
> 	at
> __randomizedtesting.SeedInfo.seed([E20548CE3E5ACD20:8941C07F36EB7792]:
> 0)
> 	at
> org.apache.solr.client.solrj.impl.HttpSolrServer.request(HttpSolrServer.java:414
> )
> 	at
> org.apache.solr.client.solrj.impl.HttpSolrServer.request(HttpSolrServer.java:182
> )
> 	at
> org.apache.solr.client.solrj.request.AbstractUpdateRequest.process(AbstractUp
> dateRequest.java:117)
> 	at org.apache.solr.client.solrj.SolrServer.add(SolrServer.java:122)
> 	at org.apache.solr.client.solrj.SolrServer.add(SolrServer.java:107)
> 	at
> org.apache.solr.request.TestRemoteStreaming.doBefore(TestRemoteStreaming
> .java:59)
> 	at sun.reflect.NativeMethodAccessorImpl.invoke0(Native Method)
> 	at
> sun.reflect.NativeMethodAccessorImpl.invoke(NativeMethodAccessorImpl.java:
> 57)
> 	at
> sun.reflect.DelegatingMethodAccessorImpl.invoke(DelegatingMethodAccessorI
> mpl.java:43)
> 	at java.lang.reflect.Method.invoke(Method.java:601)
> 	at
> com.carrotsearch.randomizedtesting.RandomizedRunner.invoke(RandomizedRu
> nner.java:1559)
> 	at
> com.carrotsearch.randomizedtesting.RandomizedRunner.access$600(Randomiz
> edRunner.java:79)
> 	at
> com.carrotsearch.randomizedtesting.RandomizedRunner$7.evaluate(Randomiz
> edRunner.java:771)
> 	at
> com.carrotsearch.randomizedtesting.RandomizedRunner$8.evaluate(Randomiz
> edRunner.java:787)
> 	at
> com.carrotsearch.randomizedtesting.rules.SystemPropertiesRestoreRule$1.eval
> uate(SystemPropertiesRestoreRule.java:53)
> 	at
> org.apache.lucene.util.TestRuleSetupTeardownChained$1.evaluate(TestRuleSet
> upTeardownChained.java:50)
> 	at
> org.apache.lucene.util.TestRuleFieldCacheSanity$1.evaluate(TestRuleFieldCach
> eSanity.java:51)
> 	at
> org.apache.lucene.util.AbstractBeforeAfterRule$1.evaluate(AbstractBeforeAfte
> rRule.java:45)
> 	at
> com.carrotsearch.randomizedtesting.rules.SystemPropertiesInvariantRule$1.ev
> aluate(SystemPropertiesInvariantRule.java:55)
> 	at
> org.apache.lucene.util.TestRuleThreadAndTestName$1.evaluate(TestRuleThrea
> dAndTestName.java:48)
> 	at
> org.apache.lucene.util.TestRuleIgnoreAfterMaxFailures$1.evaluate(TestRuleIgn
> oreAfterMaxFailures.java:70)
> 	at
> org.apache.lucene.util.TestRuleMarkFailure$1.evaluate(TestRuleMarkFailure.ja
> va:48)
> 	at
> com.carrotsearch.randomizedtesting.rules.StatementAdapter.evaluate(Stateme
> ntAdapter.java:36)
> 	at
> com.carrotsearch.randomizedtesting.ThreadLeakControl$StatementRunner.run
> (ThreadLeakControl.java:345)
> 	at
> com.carrotsearch.randomizedtesting.ThreadLeakControl.forkTimeoutingTask(T
> hreadLeakControl.java:769)
> 	at
> com.carrotsearch.randomizedtesting.ThreadLeakControl$3.evaluate(ThreadLea
> kControl.java:429)
> 	at
> com.carrotsearch.randomizedtesting.RandomizedRunner.runSingleTest(Rando
> mizedRunner.java:746)
> 	at
> com.carrotsearch.randomizedtesting.RandomizedRunner$3.evaluate(Randomiz
> edRunner.java:648)
> 	at
> com.carrotsearch.randomizedtesting.RandomizedRunner$4.evaluate(Randomiz
> edRunner.java:682)
> 	at
> com.carrotsearch.randomizedtesting.RandomizedRunner$5.evaluate(Randomiz
> edRunner.java:693)
> 	at
> com.carrotsearch.randomizedtesting.rules.StatementAdapter.evaluate(Stateme
> ntAdapter.java:36)
> 	at
> com.carrotsearch.randomizedtesting.rules.SystemPropertiesRestoreRule$1.eval
> uate(SystemPropertiesRestoreRule.java:53)
> 	at
> org.apache.lucene.util.AbstractBeforeAfterRule$1.evaluate(AbstractBeforeAfte
> rRule.java:45)
> 	at
> org.apache.lucene.util.TestRuleStoreClassName$1.evaluate(TestRuleStoreClass
> Name.java:42)
> 	at
> com.carrotsearch.randomizedtesting.rules.SystemPropertiesInvariantRule$1.ev
> aluate(SystemPropertiesInvariantRule.java:55)
> 	at
> com.carrotsearch.randomizedtesting.rules.NoShadowingOrOverridesOnMethod
> sRule$1.evaluate(NoShadowingOrOverridesOnMethodsRule.java:39)
> 	at
> com.carrotsearch.randomizedtesting.rules.NoShadowingOrOverridesOnMethod
> sRule$1.evaluate(NoShadowingOrOverridesOnMethodsRule.java:39)
> 	at
> org.apache.lucene.util.TestRuleAssertionsRequired$1.evaluate(TestRuleAssertio
> nsRequired.java:40)
> 	at
> org.apache.lucene.util.TestRuleMarkFailure$1.evaluate(TestRuleMarkFailure.ja
> va:48)
> 	at
> org.apache.lucene.util.TestRuleIgnoreAfterMaxFailures$1.evaluate(TestRuleIgn
> oreAfterMaxFailures.java:70)
> 	at
> org.apache.lucene.util.TestRuleIgnoreTestSuites$1.evaluate(TestRuleIgnoreTest
> Suites.java:55)
> 	at
> com.carrotsearch.randomizedtesting.rules.StatementAdapter.evaluate(Stateme
> ntAdapter.java:36)
> 	at
> com.carrotsearch.randomizedtesting.ThreadLeakControl$StatementRunner.run
> (ThreadLeakControl.java:345)
> 	at java.lang.Thread.run(Thread.java:722)
> Caused by: org.apache.http.NoHttpResponseException: The target server failed
> to respond
> 	at
> org.apache.http.impl.conn.DefaultResponseParser.parseHead(DefaultResponse
> Parser.java:101)
> 	at
> org.apache.http.impl.io.AbstractMessageParser.parse(AbstractMessageParser.j
> ava:252)
> 	at
> org.apache.http.impl.AbstractHttpClientConnection.receiveResponseHeader(Ab
> stractHttpClientConnection.java:282)
> 	at
> org.apache.http.impl.conn.DefaultClientConnection.receiveResponseHeader(De
> faultClientConnection.java:247)
> 	at
> org.apache.http.impl.conn.AbstractClientConnAdapter.receiveResponseHeader(
> AbstractClientConnAdapter.java:216)
> 	at
> org.apache.http.protocol.HttpRequestExecutor.doReceiveResponse(HttpRequest
> Executor.java:298)
> 	at
> org.apache.http.protocol.HttpRequestExecutor.execute(HttpRequestExecutor.ja
> va:125)
> 	at
> org.apache.http.impl.client.DefaultRequestDirector.tryExecute(DefaultRequest
> Director.java:647)
> 	at
> org.apache.http.impl.client.DefaultRequestDirector.execute(DefaultRequestDir
> ector.java:464)
> 	at
> org.apache.http.impl.client.AbstractHttpClient.execute(AbstractHttpClient.java:
> 820)
> 	at
> org.apache.http.impl.client.AbstractHttpClient.execute(AbstractHttpClient.java:
> 754)
> 	at
> org.apache.http.impl.client.AbstractHttpClient.execute(AbstractHttpClient.java:
> 732)
> 	at
> org.apache.solr.client.solrj.impl.HttpSolrServer.request(HttpSolrServer.java:353
> )
> 	... 43 more
> 
> 
> REGRESSION:  org.apache.solr.schema.TestBinaryField.testSimple
> 
> Error Message:
> IOException occured when talking to server at: http://localhost:17122/example
> 
> Stack Trace:
> org.apache.solr.client.solrj.SolrServerException: IOException occured when
> talking to server at: http://localhost:17122/example
> 	at
> __randomizedtesting.SeedInfo.seed([E20548CE3E5ACD20:DAB66C3019A919F1]
> :0)
> 	at
> org.apache.solr.client.solrj.impl.HttpSolrServer.request(HttpSolrServer.java:414
> )
> 	at
> org.apache.solr.client.solrj.impl.HttpSolrServer.request(HttpSolrServer.java:182
> )
> 	at
> org.apache.solr.client.solrj.request.AbstractUpdateRequest.process(AbstractUp
> dateRequest.java:117)
> 	at org.apache.solr.client.solrj.SolrServer.add(SolrServer.java:122)
> 	at org.apache.solr.client.solrj.SolrServer.add(SolrServer.java:107)
> 	at
> org.apache.solr.schema.TestBinaryField.testSimple(TestBinaryField.java:97)
> 	at sun.reflect.NativeMethodAccessorImpl.invoke0(Native Method)
> 	at
> sun.reflect.NativeMethodAccessorImpl.invoke(NativeMethodAccessorImpl.java:
> 57)
> 	at
> sun.reflect.DelegatingMethodAccessorImpl.invoke(DelegatingMethodAccessorI
> mpl.java:43)
> 	at java.lang.reflect.Method.invoke(Method.java:601)
> 	at
> com.carrotsearch.randomizedtesting.RandomizedRunner.invoke(RandomizedRu
> nner.java:1559)
> 	at
> com.carrotsearch.randomizedtesting.RandomizedRunner.access$600(Randomiz
> edRunner.java:79)
> 	at
> com.carrotsearch.randomizedtesting.RandomizedRunner$6.evaluate(Randomiz
> edRunner.java:737)
> 	at
> com.carrotsearch.randomizedtesting.RandomizedRunner$7.evaluate(Randomiz
> edRunner.java:773)
> 	at
> com.carrotsearch.randomizedtesting.RandomizedRunner$8.evaluate(Randomiz
> edRunner.java:787)
> 	at
> com.carrotsearch.randomizedtesting.rules.SystemPropertiesRestoreRule$1.eval
> uate(SystemPropertiesRestoreRule.java:53)
> 	at
> org.apache.lucene.util.TestRuleSetupTeardownChained$1.evaluate(TestRuleSet
> upTeardownChained.java:50)
> 	at
> org.apache.lucene.util.TestRuleFieldCacheSanity$1.evaluate(TestRuleFieldCach
> eSanity.java:51)
> 	at
> org.apache.lucene.util.AbstractBeforeAfterRule$1.evaluate(AbstractBeforeAfte
> rRule.java:45)
> 	at
> com.carrotsearch.randomizedtesting.rules.SystemPropertiesInvariantRule$1.ev
> aluate(SystemPropertiesInvariantRule.java:55)
> 	at
> org.apache.lucene.util.TestRuleThreadAndTestName$1.evaluate(TestRuleThrea
> dAndTestName.java:48)
> 	at
> org.apache.lucene.util.TestRuleIgnoreAfterMaxFailures$1.evaluate(TestRuleIgn
> oreAfterMaxFailures.java:70)
> 	at
> org.apache.lucene.util.TestRuleMarkFailure$1.evaluate(TestRuleMarkFailure.ja
> va:48)
> 	at
> com.carrotsearch.randomizedtesting.rules.StatementAdapter.evaluate(Stateme
> ntAdapter.java:36)
> 	at
> com.carrotsearch.randomizedtesting.ThreadLeakControl$StatementRunner.run
> (ThreadLeakControl.java:345)
> 	at
> com.carrotsearch.randomizedtesting.ThreadLeakControl.forkTimeoutingTask(T
> hreadLeakControl.java:769)
> 	at
> com.carrotsearch.randomizedtesting.ThreadLeakControl$3.evaluate(ThreadLea
> kControl.java:429)
> 	at
> com.carrotsearch.randomizedtesting.RandomizedRunner.runSingleTest(Rando
> mizedRunner.java:746)
> 	at
> com.carrotsearch.randomizedtesting.RandomizedRunner$3.evaluate(Randomiz
> edRunner.java:648)
> 	at
> com.carrotsearch.randomizedtesting.RandomizedRunner$4.evaluate(Randomiz
> edRunner.java:682)
> 	at
> com.carrotsearch.randomizedtesting.RandomizedRunner$5.evaluate(Randomiz
> edRunner.java:693)
> 	at
> org.apache.lucene.util.AbstractBeforeAfterRule$1.evaluate(AbstractBeforeAfte
> rRule.java:45)
> 	at
> org.apache.lucene.util.TestRuleStoreClassName$1.evaluate(TestRuleStoreClass
> Name.java:42)
> 	at
> com.carrotsearch.randomizedtesting.rules.SystemPropertiesInvariantRule$1.ev
> aluate(SystemPropertiesInvariantRule.java:55)
> 	at
> com.carrotsearch.randomizedtesting.rules.NoShadowingOrOverridesOnMethod
> sRule$1.evaluate(NoShadowingOrOverridesOnMethodsRule.java:39)
> 	at
> com.carrotsearch.randomizedtesting.rules.NoShadowingOrOverridesOnMethod
> sRule$1.evaluate(NoShadowingOrOverridesOnMethodsRule.java:39)
> 	at
> org.apache.lucene.util.TestRuleAssertionsRequired$1.evaluate(TestRuleAssertio
> nsRequired.java:40)
> 	at
> org.apache.lucene.util.TestRuleMarkFailure$1.evaluate(TestRuleMarkFailure.ja
> va:48)
> 	at
> org.apache.lucene.util.TestRuleIgnoreAfterMaxFailures$1.evaluate(TestRuleIgn
> oreAfterMaxFailures.java:70)
> 	at
> org.apache.lucene.util.TestRuleIgnoreTestSuites$1.evaluate(TestRuleIgnoreTest
> Suites.java:55)
> 	at
> com.carrotsearch.randomizedtesting.rules.StatementAdapter.evaluate(Stateme
> ntAdapter.java:36)
> 	at
> com.carrotsearch.randomizedtesting.ThreadLeakControl$StatementRunner.run
> (ThreadLeakControl.java:345)
> 	at java.lang.Thread.run(Thread.java:722)
> Caused by: java.net.SocketException: Connection reset
> 	at java.net.SocketInputStream.read(SocketInputStream.java:189)
> 	at java.net.SocketInputStream.read(SocketInputStream.java:121)
> 	at
> org.apache.http.impl.io.AbstractSessionInputBuffer.fillBuffer(AbstractSessionInp
> utBuffer.java:149)
> 	at
> org.apache.http.impl.io.SocketInputBuffer.fillBuffer(SocketInputBuffer.java:111)
> 	at
> org.apache.http.impl.io.AbstractSessionInputBuffer.readLine(AbstractSessionInp
> utBuffer.java:264)
> 	at
> org.apache.http.impl.conn.DefaultResponseParser.parseHead(DefaultResponse
> Parser.java:98)
> 	at
> org.apache.http.impl.io.AbstractMessageParser.parse(AbstractMessageParser.j
> ava:252)
> 	at
> org.apache.http.impl.AbstractHttpClientConnection.receiveResponseHeader(Ab
> stractHttpClientConnection.java:282)
> 	at
> org.apache.http.impl.conn.DefaultClientConnection.receiveResponseHeader(De
> faultClientConnection.java:247)
> 	at
> org.apache.http.impl.conn.AbstractClientConnAdapter.receiveResponseHeader(
> AbstractClientConnAdapter.java:216)
> 	at
> org.apache.http.protocol.HttpRequestExecutor.doReceiveResponse(HttpRequest
> Executor.java:298)
> 	at
> org.apache.http.protocol.HttpRequestExecutor.execute(HttpRequestExecutor.ja
> va:125)
> 	at
> org.apache.http.impl.client.DefaultRequestDirector.tryExecute(DefaultRequest
> Director.java:647)
> 	at
> org.apache.http.impl.client.DefaultRequestDirector.execute(DefaultRequestDir
> ector.java:464)
> 	at
> org.apache.http.impl.client.AbstractHttpClient.execute(AbstractHttpClient.java:
> 820)
> 	at
> org.apache.http.impl.client.AbstractHttpClient.execute(AbstractHttpClient.java:
> 754)
> 	at
> org.apache.http.impl.client.AbstractHttpClient.execute(AbstractHttpClient.java:
> 732)
> 	at
> org.apache.solr.client.solrj.impl.HttpSolrServer.request(HttpSolrServer.java:353
> )
> 	... 42 more
> 
> 
> 
> 
> Build Log:
> [...truncated 6798 lines...]
> [junit4:junit4] Suite: org.apache.solr.request.TestRemoteStreaming
> [junit4:junit4]   2> 243 T11 oas.SolrTestCaseJ4.initCore ####initCore
> [junit4:junit4]   2> Creating dataDir: /usr/home/hudson/hudson-
> slave/workspace/Lucene-Solr-Tests-4.x-java7/solr/build/solr-
> core/test/J1/./solrtest-TestRemoteStreaming-1346340246142
> [junit4:junit4]   2> 262 T11 oas.SolrTestCaseJ4.initCore ####initCore end
> [junit4:junit4]   2> 881 T11 oejs.Server.doStart jetty-8.1.2.v20120308
> [junit4:junit4]   2> 1216 T11 oejs.AbstractConnector.doStart Started
> SocketConnector@0.0.0.0:13521
> [junit4:junit4]   2> 1396 T11 oasc.SolrResourceLoader.locateSolrHome JNDI not
> configured for solr (NoInitialContextEx)
> [junit4:junit4]   2> 1397 T11 oasc.SolrResourceLoader.locateSolrHome using
> system property solr.solr.home: solr/
> [junit4:junit4]   2> 1398 T11 oasc.SolrResourceLoader.<init> new
> SolrResourceLoader for deduced Solr Home: 'solr/'
> [junit4:junit4]   2> 1962 T11 oass.SolrDispatchFilter.init SolrDispatchFilter.init()
> [junit4:junit4]   2> 1967 T11 oasc.SolrResourceLoader.locateSolrHome JNDI not
> configured for solr (NoInitialContextEx)
> [junit4:junit4]   2> 1967 T11 oasc.SolrResourceLoader.locateSolrHome using
> system property solr.solr.home: solr/
> [junit4:junit4]   2> 2005 T11 oasc.CoreContainer$Initializer.initialize looking for
> solr.xml: /usr/home/hudson/hudson-slave/workspace/Lucene-Solr-Tests-4.x-
> java7/solr/build/solr-core/test/J1/solr/solr.xml
> [junit4:junit4]   2> 2011 T11 oasc.CoreContainer.<init> New CoreContainer
> 1160712213
> [junit4:junit4]   2> 2012 T11 oasc.CoreContainer$Initializer.initialize no solr.xml
> file found - using default
> [junit4:junit4]   2> 2012 T11 oasc.CoreContainer.load Loading CoreContainer
> using Solr Home: 'solr/'
> [junit4:junit4]   2> 2013 T11 oasc.SolrResourceLoader.<init> new
> SolrResourceLoader for directory: 'solr/'
> [junit4:junit4]   2> 2117 T11 oasc.CoreContainer.load Registering Log Listener
> [junit4:junit4]   2> 2208 T11 oasc.CoreContainer.create Creating SolrCore
> 'collection1' using instanceDir: solr/collection1
> [junit4:junit4]   2> 2209 T11 oasc.SolrResourceLoader.<init> new
> SolrResourceLoader for directory: 'solr/collection1/'
> [junit4:junit4]   2> 2443 T11 oasc.SolrConfig.<init> Using Lucene MatchVersion:
> LUCENE_40
> [junit4:junit4]   2> 2697 T11 oasc.SolrConfig.<init> Loaded SolrConfig:
> solrconfig.xml
> [junit4:junit4]   2> 2733 T11 oass.IndexSchema.readSchema Reading Solr
> Schema
> [junit4:junit4]   2> 2807 T11 oass.IndexSchema.readSchema Schema name=test
> [junit4:junit4]   2> 4667 T11 oass.OpenExchangeRatesOrgProvider.init
> Initialized with rates=open-exchange-rates.json, refreshInterval=1440.
> [junit4:junit4]   2> 4705 T11 oass.IndexSchema.readSchema default search field
> in schema is text
> [junit4:junit4]   2> 4711 T11 oass.IndexSchema.readSchema unique key field: id
> [junit4:junit4]   2> 5228 T11 oass.FileExchangeRateProvider.reload Reloading
> exchange rates from file currency.xml
> [junit4:junit4]   2> 5257 T11 oass.FileExchangeRateProvider.reload Reloading
> exchange rates from file currency.xml
> [junit4:junit4]   2> 5265 T11 oass.OpenExchangeRatesOrgProvider.reload
> Reloading exchange rates from open-exchange-rates.json
> [junit4:junit4]   2> 5295 T11 oass.OpenExchangeRatesOrgProvider.reload
> Reloading exchange rates from open-exchange-rates.json
> [junit4:junit4]   2> 5455 T11 oasc.SolrCore.<init> [collection1] Opening new
> SolrCore at solr/collection1/, dataDir=/usr/home/hudson/hudson-
> slave/workspace/Lucene-Solr-Tests-4.x-java7/solr/build/solr-
> core/test/J1/solrtest-TestRemoteStreaming-1346340246142/
> [junit4:junit4]   2> 5461 T11 oasc.JmxMonitoredMap.<init> JMX monitoring is
> enabled. Adding Solr mbeans to JMX Server:
> com.sun.jmx.mbeanserver.JmxMBeanServer@4fe88181
> [junit4:junit4]   2> 5707 T11 oasc.SolrCore.getNewIndexDir WARNING New
> index directory detected: old=null new=/usr/home/hudson/hudson-
> slave/workspace/Lucene-Solr-Tests-4.x-java7/solr/build/solr-
> core/test/J1/solrtest-TestRemoteStreaming-1346340246142/index/
> [junit4:junit4]   2> 5708 T11 oasc.SolrCore.initIndex WARNING [collection1] Solr
> index directory '/usr/home/hudson/hudson-slave/workspace/Lucene-Solr-Tests-
> 4.x-java7/solr/build/solr-core/test/J1/solrtest-TestRemoteStreaming-
> 1346340246142/index' doesn't exist. Creating new index...
> [junit4:junit4]   2> 5838 T11 oasc.CachingDirectoryFactory.get return new
> directory for /usr/home/hudson/hudson-slave/workspace/Lucene-Solr-Tests-
> 4.x-java7/solr/build/solr-core/test/J1/solrtest-TestRemoteStreaming-
> 1346340246142/index forceNew:false
> [junit4:junit4]   2> 6281 T11 oasc.SolrDeletionPolicy.onCommit
> SolrDeletionPolicy.onCommit: commits:num=1
> [junit4:junit4]   2>
> 	commit{dir=MockDirWrapper(NRTCachingDirectory(org.apache.lucene
> .store.RAMDirectory@836d2b3
> lockFactory=org.apache.lucene.store.NativeFSLockFactory@2d16083;
> maxCacheMB=0.75
> maxMergeSizeMB=0.5751953125)),segFN=segments_1,generation=1,filenames
> =[segments_1]
> [junit4:junit4]   2> 6283 T11 oasc.SolrDeletionPolicy.updateCommits newest
> commit = 1
> [junit4:junit4]   2> 6367 T11 oasc.SolrCore.initWriters created xml:
> solr.XMLResponseWriter
> [junit4:junit4]   2> 7451 T11 oasup.UpdateRequestProcessorChain.init inserting
> DistributedUpdateProcessorFactory into updateRequestProcessorChain
> "dedupe"
> [junit4:junit4]   2> 7452 T11 oasup.UpdateRequestProcessorChain.init inserting
> DistributedUpdateProcessorFactory into updateRequestProcessorChain
> "dedupe-allfields"
> [junit4:junit4]   2> 7453 T11 oasup.UpdateRequestProcessorChain.init inserting
> DistributedUpdateProcessorFactory into updateRequestProcessorChain
> "stored_sig"
> [junit4:junit4]   2> 7463 T11 oasup.UpdateRequestProcessorChain.init inserting
> DistributedUpdateProcessorFactory into updateRequestProcessorChain "uniq-
> fields"
> [junit4:junit4]   2> 7558 T11 oasup.UpdateRequestProcessorChain.init inserting
> DistributedUpdateProcessorFactory into updateRequestProcessorChain "distrib-
> dup-test-chain-implicit"
> [junit4:junit4]   2> 7570 T11 oasc.RequestHandlers.initHandlersFromConfig
> adding lazy requestHandler: solr.ReplicationHandler
> [junit4:junit4]   2> 7573 T11 oasc.RequestHandlers.initHandlersFromConfig
> created /replication: solr.ReplicationHandler
> [junit4:junit4]   2> 7601 T11 oasc.RequestHandlers.initHandlersFromConfig
> created standard: solr.StandardRequestHandler
> [junit4:junit4]   2> 7618 T11 oasc.RequestHandlers.initHandlersFromConfig
> created /get: solr.RealTimeGetHandler
> [junit4:junit4]   2> 7666 T11 oasc.RequestHandlers.initHandlersFromConfig
> created dismax: solr.SearchHandler
> [junit4:junit4]   2> 7668 T11 oasc.RequestHandlers.initHandlersFromConfig
> created mock: org.apache.solr.core.MockQuerySenderListenerReqHandler
> [junit4:junit4]   2> 7673 T11 oasc.RequestHandlers.initHandlersFromConfig
> created /admin/: org.apache.solr.handler.admin.AdminHandlers
> [junit4:junit4]   2> 7674 T11 oasc.RequestHandlers.initHandlersFromConfig
> created defaults: solr.StandardRequestHandler
> [junit4:junit4]   2> 7675 T11 oasc.RequestHandlers.initHandlersFromConfig
> adding lazy requestHandler: solr.StandardRequestHandler
> [junit4:junit4]   2> 7676 T11 oasc.RequestHandlers.initHandlersFromConfig
> created lazy: solr.StandardRequestHandler
> [junit4:junit4]   2> 7702 T11 oasc.RequestHandlers.initHandlersFromConfig
> created /update: solr.UpdateRequestHandler
> [junit4:junit4]   2> 7703 T11 oasc.RequestHandlers.initHandlersFromConfig
> created /terms: org.apache.solr.handler.component.SearchHandler
> [junit4:junit4]   2> 7704 T11 oasc.RequestHandlers.initHandlersFromConfig
> created spellCheckCompRH:
> org.apache.solr.handler.component.SearchHandler
> [junit4:junit4]   2> 7706 T11 oasc.RequestHandlers.initHandlersFromConfig
> created spellCheckCompRH_Direct:
> org.apache.solr.handler.component.SearchHandler
> [junit4:junit4]   2> 7707 T11 oasc.RequestHandlers.initHandlersFromConfig
> created spellCheckWithWordbreak:
> org.apache.solr.handler.component.SearchHandler
> [junit4:junit4]   2> 7708 T11 oasc.RequestHandlers.initHandlersFromConfig
> created spellCheckWithWordbreak_Direct:
> org.apache.solr.handler.component.SearchHandler
> [junit4:junit4]   2> 7709 T11 oasc.RequestHandlers.initHandlersFromConfig
> created spellCheckCompRH1:
> org.apache.solr.handler.component.SearchHandler
> [junit4:junit4]   2> 7710 T11 oasc.RequestHandlers.initHandlersFromConfig
> created tvrh: org.apache.solr.handler.component.SearchHandler
> [junit4:junit4]   2> 7738 T11 oasc.RequestHandlers.initHandlersFromConfig
> created /mlt: solr.MoreLikeThisHandler
> [junit4:junit4]   2> 7760 T11 oasc.RequestHandlers.initHandlersFromConfig
> created /debug/dump: solr.DumpRequestHandler
> [junit4:junit4]   2> 7897 T11 oashl.XMLLoader.init xsltCacheLifetimeSeconds=60
> [junit4:junit4]   2> 7925 T11 oasc.SolrCore.initDeprecatedSupport WARNING
> solrconfig.xml uses deprecated <admin/gettableFiles>, Please update your
> config to use the ShowFileRequestHandler.
> [junit4:junit4]   2> 7933 T11 oasc.SolrCore.initDeprecatedSupport WARNING
> adding ShowFileRequestHandler with hidden files: []
> [junit4:junit4]   2> 8007 T11 oass.SolrIndexSearcher.<init> Opening
> Searcher@616e6f28 main
> [junit4:junit4]   2> 8007 T11 oass.SolrIndexSearcher.getIndexDir WARNING
> WARNING: Directory impl does not support setting indexDir:
> org.apache.lucene.store.MockDirectoryWrapper
> [junit4:junit4]   2> 8106 T11 oasu.CommitTracker.<init> Hard AutoCommit:
> disabled
> [junit4:junit4]   2> 8107 T11 oasu.CommitTracker.<init> Soft AutoCommit:
> disabled
> [junit4:junit4]   2> 8109 T11 oashc.SpellCheckComponent.inform Initializing
> spell checkers
> [junit4:junit4]   2> 8331 T11 oass.DirectSolrSpellChecker.init init:
> {name=direct,classname=DirectSolrSpellChecker,field=lowerfilt,minQueryLengt
> h=3}
> [junit4:junit4]   2> 8685 T11 oashc.HttpShardHandlerFactory.getParameter
> Setting socketTimeout to: 0
> [junit4:junit4]   2> 8686 T11 oashc.HttpShardHandlerFactory.getParameter
> Setting urlScheme to: http://
> [junit4:junit4]   2> 8687 T11 oashc.HttpShardHandlerFactory.getParameter
> Setting connTimeout to: 0
> [junit4:junit4]   2> 8688 T11 oashc.HttpShardHandlerFactory.getParameter
> Setting maxConnectionsPerHost to: 20
> [junit4:junit4]   2> 8689 T11 oashc.HttpShardHandlerFactory.getParameter
> Setting corePoolSize to: 0
> [junit4:junit4]   2> 8689 T11 oashc.HttpShardHandlerFactory.getParameter
> Setting maximumPoolSize to: 2147483647
> [junit4:junit4]   2> 8690 T11 oashc.HttpShardHandlerFactory.getParameter
> Setting maxThreadIdleTime to: 5
> [junit4:junit4]   2> 8691 T11 oashc.HttpShardHandlerFactory.getParameter
> Setting sizeOfQueue to: -1
> [junit4:junit4]   2> 8692 T11 oashc.HttpShardHandlerFactory.getParameter
> Setting fairnessPolicy to: false
> [junit4:junit4]   2> 8753 T11 oascsi.HttpClientUtil.createClient Creating new
> http client,
> config:maxConnectionsPerHost=20&maxConnections=10000&socketTimeout=0
> &connTimeout=0&retry=false
> [junit4:junit4]   2> 9418 T22 oasc.SolrCore.registerSearcher [collection1]
> Registered new searcher Searcher@616e6f28
> main{StandardDirectoryReader(segments_1:1)}
> [junit4:junit4]   2> 9431 T11 oasc.CoreContainer.register registering core:
> collection1
> [junit4:junit4]   2> 9431 T11 oass.SolrDispatchFilter.init
> user.dir=/usr/home/hudson/hudson-slave/workspace/Lucene-Solr-Tests-4.x-
> java7/solr/build/solr-core/test/J1
> [junit4:junit4]   2> 9432 T11 oass.SolrDispatchFilter.init SolrDispatchFilter.init()
> done
> [junit4:junit4]   2> 9433 T11 oas.SolrJettyTestBase.createJetty Jetty Assigned
> Port#13521
> [junit4:junit4]   2> 9483 T11 oas.SolrTestCaseJ4.setUp ###Starting
> testNoUrlAccess
> [junit4:junit4]   2> 9551 T11 oascsi.HttpClientUtil.createClient Creating new
> http client,
> config:maxConnections=128&maxConnectionsPerHost=32&followRedirects=fals
> e
> [junit4:junit4]   2> 10200 T14 oejs.AbstractConnector$Acceptor.run WARNING
> java.security.AccessControlException: access denied
> ("java.net.SocketPermission" "140.211.11.196:24258" "accept,resolve")
> [junit4:junit4]   2> 	at
> java.security.AccessControlContext.checkPermission(AccessControlContext.java
> :366)
> [junit4:junit4]   2> 	at
> java.security.AccessController.checkPermission(AccessController.java:555)
> [junit4:junit4]   2> 	at
> java.lang.SecurityManager.checkPermission(SecurityManager.java:549)
> [junit4:junit4]   2> 	at
> java.lang.SecurityManager.checkAccept(SecurityManager.java:1174)
> [junit4:junit4]   2> 	at
> java.net.ServerSocket.implAccept(ServerSocket.java:526)
> [junit4:junit4]   2> 	at java.net.ServerSocket.accept(ServerSocket.java:490)
> [junit4:junit4]   2> 	at
> org.eclipse.jetty.server.bio.SocketConnector.accept(SocketConnector.java:112)
> [junit4:junit4]   2> 	at
> org.eclipse.jetty.server.AbstractConnector$Acceptor.run(AbstractConnector.jav
> a:933)
> [junit4:junit4]   2> 	at
> org.eclipse.jetty.util.thread.QueuedThreadPool.runJob(QueuedThreadPool.java:
> 599)
> [junit4:junit4]   2> 	at
> org.eclipse.jetty.util.thread.QueuedThreadPool$3.run(QueuedThreadPool.java:
> 534)
> [junit4:junit4]   2> 	at java.lang.Thread.run(Thread.java:722)
> [junit4:junit4]   2>
> [junit4:junit4]   2> 10451 T11 oas.SolrTestCaseJ4.tearDown ###Ending
> testNoUrlAccess
> [junit4:junit4]   2> NOTE: reproduce with: ant test  -
> Dtestcase=TestRemoteStreaming -Dtests.method=testNoUrlAccess -
> Dtests.seed=E20548CE3E5ACD20 -Dtests.multiplier=3 -Dtests.slow=true -
> Dtests.locale=ar_IQ -Dtests.timezone=America/Eirunepe -
> Dtests.file.encoding=ISO-8859-1
> [junit4:junit4] ERROR   1.17s J1 | TestRemoteStreaming.testNoUrlAccess <<<
> [junit4:junit4]    > Throwable #1:
> org.apache.solr.client.solrj.SolrServerException: IOException occured when
> talking to server at: http://localhost:13521/solr
> [junit4:junit4]    > 	at
> __randomizedtesting.SeedInfo.seed([E20548CE3E5ACD20:7C8F0139FE3AAA1C]:
> 0)
> [junit4:junit4]    > 	at
> org.apache.solr.client.solrj.impl.HttpSolrServer.request(HttpSolrServer.java:414
> )
> [junit4:junit4]    > 	at
> org.apache.solr.client.solrj.impl.HttpSolrServer.request(HttpSolrServer.java:182
> )
> [junit4:junit4]    > 	at
> org.apache.solr.client.solrj.request.AbstractUpdateRequest.process(AbstractUp
> dateRequest.java:117)
> [junit4:junit4]    > 	at
> org.apache.solr.client.solrj.SolrServer.add(SolrServer.java:122)
> [junit4:junit4]    > 	at
> org.apache.solr.client.solrj.SolrServer.add(SolrServer.java:107)
> [junit4:junit4]    > 	at
> org.apache.solr.request.TestRemoteStreaming.doBefore(TestRemoteStreaming
> .java:59)
> [junit4:junit4]    > 	at
> sun.reflect.NativeMethodAccessorImpl.invoke0(Native Method)
> [junit4:junit4]    > 	at
> sun.reflect.NativeMethodAccessorImpl.invoke(NativeMethodAccessorImpl.java:
> 57)
> [junit4:junit4]    > 	at
> sun.reflect.DelegatingMethodAccessorImpl.invoke(DelegatingMethodAccessorI
> mpl.java:43)
> [junit4:junit4]    > 	at java.lang.reflect.Method.invoke(Method.java:601)
> [junit4:junit4]    > 	at
> com.carrotsearch.randomizedtesting.RandomizedRunner.invoke(RandomizedRu
> nner.java:1559)
> [junit4:junit4]    > 	at
> com.carrotsearch.randomizedtesting.RandomizedRunner.access$600(Randomiz
> edRunner.java:79)
> [junit4:junit4]    > 	at
> com.carrotsearch.randomizedtesting.RandomizedRunner$7.evaluate(Randomiz
> edRunner.java:771)
> [junit4:junit4]    > 	at
> com.carrotsearch.randomizedtesting.RandomizedRunner$8.evaluate(Randomiz
> edRunner.java:787)
> [junit4:junit4]    > 	at
> com.carrotsearch.randomizedtesting.rules.SystemPropertiesRestoreRule$1.eval
> uate(SystemPropertiesRestoreRule.java:53)
> [junit4:junit4]    > 	at
> org.apache.lucene.util.TestRuleSetupTeardownChained$1.evaluate(TestRuleSet
> upTeardownChained.java:50)
> [junit4:junit4]    > 	at
> org.apache.lucene.util.TestRuleFieldCacheSanity$1.evaluate(TestRuleFieldCach
> eSanity.java:51)
> [junit4:junit4]    > 	at
> org.apache.lucene.util.AbstractBeforeAfterRule$1.evaluate(AbstractBeforeAfte
> rRule.java:45)
> [junit4:junit4]    > 	at
> com.carrotsearch.randomizedtesting.rules.SystemPropertiesInvariantRule$1.ev
> aluate(SystemPropertiesInvariantRule.java:55)
> [junit4:junit4]    > 	at
> org.apache.lucene.util.TestRuleThreadAndTestName$1.evaluate(TestRuleThrea
> dAndTestName.java:48)
> [junit4:junit4]    > 	at
> org.apache.lucene.util.TestRuleIgnoreAfterMaxFailures$1.evaluate(TestRuleIgn
> oreAfterMaxFailures.java:70)
> [junit4:junit4]    > 	at
> org.apache.lucene.util.TestRuleMarkFailure$1.evaluate(TestRuleMarkFailure.ja
> va:48)
> [junit4:junit4]    > 	at
> com.carrotsearch.randomizedtesting.rules.StatementAdapter.evaluate(Stateme
> ntAdapter.java:36)
> [junit4:junit4]    > 	at
> com.carrotsearch.randomizedtesting.ThreadLeakControl$StatementRunner.run
> (ThreadLeakControl.java:345)
> [junit4:junit4]    > 	at
> com.carrotsearch.randomizedtesting.ThreadLeakControl.forkTimeoutingTask(T
> hreadLeakControl.java:769)
> [junit4:junit4]    > 	at
> com.carrotsearch.randomizedtesting.ThreadLeakControl$3.evaluate(ThreadLea
> kControl.java:429)
> [junit4:junit4]    > 	at
> com.carrotsearch.randomizedtesting.RandomizedRunner.runSingleTest(Rando
> mizedRunner.java:746)
> [junit4:junit4]    > 	at
> com.carrotsearch.randomizedtesting.RandomizedRunner$3.evaluate(Randomiz
> edRunner.java:648)
> [junit4:junit4]    > 	at
> com.carrotsearch.randomizedtesting.RandomizedRunner$4.evaluate(Randomiz
> edRunner.java:682)
> [junit4:junit4]    > 	at
> com.carrotsearch.randomizedtesting.RandomizedRunner$5.evaluate(Randomiz
> edRunner.java:693)
> [junit4:junit4]    > 	at
> com.carrotsearch.randomizedtesting.rules.StatementAdapter.evaluate(Stateme
> ntAdapter.java:36)
> [junit4:junit4]    > 	at
> com.carrotsearch.randomizedtesting.rules.SystemPropertiesRestoreRule$1.eval
> uate(SystemPropertiesRestoreRule.java:53)
> [junit4:junit4]    > 	at
> org.apache.lucene.util.AbstractBeforeAfterRule$1.evaluate(AbstractBeforeAfte
> rRule.java:45)
> [junit4:junit4]    > 	at
> org.apache.lucene.util.TestRuleStoreClassName$1.evaluate(TestRuleStoreClass
> Name.java:42)
> [junit4:junit4]    > 	at
> com.carrotsearch.randomizedtesting.rules.SystemPropertiesInvariantRule$1.ev
> aluate(SystemPropertiesInvariantRule.java:55)
> [junit4:junit4]    > 	at
> com.carrotsearch.randomizedtesting.rules.NoShadowingOrOverridesOnMethod
> sRule$1.evaluate(NoShadowingOrOverridesOnMethodsRule.java:39)
> [junit4:junit4]    > 	at
> com.carrotsearch.randomizedtesting.rules.NoShadowingOrOverridesOnMethod
> sRule$1.evaluate(NoShadowingOrOverridesOnMethodsRule.java:39)
> [junit4:junit4]    > 	at
> org.apache.lucene.util.TestRuleAssertionsRequired$1.evaluate(TestRuleAssertio
> nsRequired.java:40)
> [junit4:junit4]    > 	at
> org.apache.lucene.util.TestRuleMarkFailure$1.evaluate(TestRuleMarkFailure.ja
> va:48)
> [junit4:junit4]    > 	at
> org.apache.lucene.util.TestRuleIgnoreAfterMaxFailures$1.evaluate(TestRuleIgn
> oreAfterMaxFailures.java:70)
> [junit4:junit4]    > 	at
> org.apache.lucene.util.TestRuleIgnoreTestSuites$1.evaluate(TestRuleIgnoreTest
> Suites.java:55)
> [junit4:junit4]    > 	at
> com.carrotsearch.randomizedtesting.rules.StatementAdapter.evaluate(Stateme
> ntAdapter.java:36)
> [junit4:junit4]    > 	at
> com.carrotsearch.randomizedtesting.ThreadLeakControl$StatementRunner.run
> (ThreadLeakControl.java:345)
> [junit4:junit4]    > 	at java.lang.Thread.run(Thread.java:722)
> [junit4:junit4]    > Caused by: java.net.SocketException: Connection reset
> [junit4:junit4]    > 	at
> java.net.SocketInputStream.read(SocketInputStream.java:189)
> [junit4:junit4]    > 	at
> java.net.SocketInputStream.read(SocketInputStream.java:121)
> [junit4:junit4]    > 	at
> org.apache.http.impl.io.AbstractSessionInputBuffer.fillBuffer(AbstractSessionInp
> utBuffer.java:149)
> [junit4:junit4]    > 	at
> org.apache.http.impl.io.SocketInputBuffer.fillBuffer(SocketInputBuffer.java:111)
> [junit4:junit4]    > 	at
> org.apache.http.impl.io.AbstractSessionInputBuffer.readLine(AbstractSessionInp
> utBuffer.java:264)
> [junit4:junit4]    > 	at
> org.apache.http.impl.conn.DefaultResponseParser.parseHead(DefaultResponse
> Parser.java:98)
> [junit4:junit4]    > 	at
> org.apache.http.impl.io.AbstractMessageParser.parse(AbstractMessageParser.j
> ava:252)
> [junit4:junit4]    > 	at
> org.apache.http.impl.AbstractHttpClientConnection.receiveResponseHeader(Ab
> stractHttpClientConnection.java:282)
> [junit4:junit4]    > 	at
> org.apache.http.impl.conn.DefaultClientConnection.receiveResponseHeader(De
> faultClientConnection.java:247)
> [junit4:junit4]    > 	at
> org.apache.http.impl.conn.AbstractClientConnAdapter.receiveResponseHeader(
> AbstractClientConnAdapter.java:216)
> [junit4:junit4]    > 	at
> org.apache.http.protocol.HttpRequestExecutor.doReceiveResponse(HttpRequest
> Executor.java:298)
> [junit4:junit4]    > 	at
> org.apache.http.protocol.HttpRequestExecutor.execute(HttpRequestExecutor.ja
> va:125)
> [junit4:junit4]    > 	at
> org.apache.http.impl.client.DefaultRequestDirector.tryExecute(DefaultRequest
> Director.java:647)
> [junit4:junit4]    > 	at
> org.apache.http.impl.client.DefaultRequestDirector.execute(DefaultRequestDir
> ector.java:464)
> [junit4:junit4]    > 	at
> org.apache.http.impl.client.AbstractHttpClient.execute(AbstractHttpClient.java:
> 820)
> [junit4:junit4]    > 	at
> org.apache.http.impl.client.AbstractHttpClient.execute(AbstractHttpClient.java:
> 754)
> [junit4:junit4]    > 	at
> org.apache.http.impl.client.AbstractHttpClient.execute(AbstractHttpClient.java:
> 732)
> [junit4:junit4]    > 	at
> org.apache.solr.client.solrj.impl.HttpSolrServer.request(HttpSolrServer.java:353
> )
> [junit4:junit4]    > 	... 43 more
> [junit4:junit4]   2> 10618 T11 oas.SolrTestCaseJ4.setUp ###Starting
> testQtUpdateFails
> [junit4:junit4]   2> 10620 T14 oejs.AbstractConnector$Acceptor.run WARNING
> java.security.AccessControlException: access denied
> ("java.net.SocketPermission" "140.211.11.196:60146" "accept,resolve")
> [junit4:junit4]   2> 	at
> java.security.AccessControlContext.checkPermission(AccessControlContext.java
> :366)
> [junit4:junit4]   2> 	at
> java.security.AccessController.checkPermission(AccessController.java:555)
> [junit4:junit4]   2> 	at
> java.lang.SecurityManager.checkPermission(SecurityManager.java:549)
> [junit4:junit4]   2> 	at
> java.lang.SecurityManager.checkAccept(SecurityManager.java:1174)
> [junit4:junit4]   2> 	at
> java.net.ServerSocket.implAccept(ServerSocket.java:526)
> [junit4:junit4]   2> 	at java.net.ServerSocket.accept(ServerSocket.java:490)
> [junit4:junit4]   2> 	at
> org.eclipse.jetty.server.bio.SocketConnector.accept(SocketConnector.java:112)
> [junit4:junit4]   2> 	at
> org.eclipse.jetty.server.AbstractConnector$Acceptor.run(AbstractConnector.jav
> a:933)
> [junit4:junit4]   2> 	at
> org.eclipse.jetty.util.thread.QueuedThreadPool.runJob(QueuedThreadPool.java:
> 599)
> [junit4:junit4]   2> 	at
> org.eclipse.jetty.util.thread.QueuedThreadPool$3.run(QueuedThreadPool.java:
> 534)
> [junit4:junit4]   2> 	at java.lang.Thread.run(Thread.java:722)
> [junit4:junit4]   2>
> [junit4:junit4]   2> 10621 T11 oas.SolrTestCaseJ4.tearDown ###Ending
> testQtUpdateFails
> [junit4:junit4]   2> NOTE: reproduce with: ant test  -
> Dtestcase=TestRemoteStreaming -Dtests.method=testQtUpdateFails -
> Dtests.seed=E20548CE3E5ACD20 -Dtests.multiplier=3 -Dtests.slow=true -
> Dtests.locale=ar_IQ -Dtests.timezone=America/Eirunepe -
> Dtests.file.encoding=ISO-8859-1
> [junit4:junit4] ERROR   0.03s J1 | TestRemoteStreaming.testQtUpdateFails <<<
> [junit4:junit4]    > Throwable #1:
> org.apache.solr.client.solrj.SolrServerException: IOException occured when
> talking to server at: http://localhost:13521/solr
> [junit4:junit4]    > 	at
> __randomizedtesting.SeedInfo.seed([E20548CE3E5ACD20:B6075C2BF26A487A]:
> 0)
> [junit4:junit4]    > 	at
> org.apache.solr.client.solrj.impl.HttpSolrServer.request(HttpSolrServer.java:414
> )
> [junit4:junit4]    > 	at
> org.apache.solr.client.solrj.impl.HttpSolrServer.request(HttpSolrServer.java:182
> )
> [junit4:junit4]    > 	at
> org.apache.solr.client.solrj.request.AbstractUpdateRequest.process(AbstractUp
> dateRequest.java:117)
> [junit4:junit4]    > 	at
> org.apache.solr.client.solrj.SolrServer.add(SolrServer.java:122)
> [junit4:junit4]    > 	at
> org.apache.solr.client.solrj.SolrServer.add(SolrServer.java:107)
> [junit4:junit4]    > 	at
> org.apache.solr.request.TestRemoteStreaming.doBefore(TestRemoteStreaming
> .java:59)
> [junit4:junit4]    > 	at
> sun.reflect.NativeMethodAccessorImpl.invoke0(Native Method)
> [junit4:junit4]    > 	at
> sun.reflect.NativeMethodAccessorImpl.invoke(NativeMethodAccessorImpl.java:
> 57)
> [junit4:junit4]    > 	at
> sun.reflect.DelegatingMethodAccessorImpl.invoke(DelegatingMethodAccessorI
> mpl.java:43)
> [junit4:junit4]    > 	at java.lang.reflect.Method.invoke(Method.java:601)
> [junit4:junit4]    > 	at
> com.carrotsearch.randomizedtesting.RandomizedRunner.invoke(RandomizedRu
> nner.java:1559)
> [junit4:junit4]    > 	at
> com.carrotsearch.randomizedtesting.RandomizedRunner.access$600(Randomiz
> edRunner.java:79)
> [junit4:junit4]    > 	at
> com.carrotsearch.randomizedtesting.RandomizedRunner$7.evaluate(Randomiz
> edRunner.java:771)
> [junit4:junit4]    > 	at
> com.carrotsearch.randomizedtesting.RandomizedRunner$8.evaluate(Randomiz
> edRunner.java:787)
> [junit4:junit4]    > 	at
> com.carrotsearch.randomizedtesting.rules.SystemPropertiesRestoreRule$1.eval
> uate(SystemPropertiesRestoreRule.java:53)
> [junit4:junit4]    > 	at
> org.apache.lucene.util.TestRuleSetupTeardownChained$1.evaluate(TestRuleSet
> upTeardownChained.java:50)
> [junit4:junit4]    > 	at
> org.apache.lucene.util.TestRuleFieldCacheSanity$1.evaluate(TestRuleFieldCach
> eSanity.java:51)
> [junit4:junit4]    > 	at
> org.apache.lucene.util.AbstractBeforeAfterRule$1.evaluate(AbstractBeforeAfte
> rRule.java:45)
> [junit4:junit4]    > 	at
> com.carrotsearch.randomizedtesting.rules.SystemPropertiesInvariantRule$1.ev
> aluate(SystemPropertiesInvariantRule.java:55)
> [junit4:junit4]    > 	at
> org.apache.lucene.util.TestRuleThreadAndTestName$1.evaluate(TestRuleThrea
> dAndTestName.java:48)
> [junit4:junit4]    > 	at
> org.apache.lucene.util.TestRuleIgnoreAfterMaxFailures$1.evaluate(TestRuleIgn
> oreAfterMaxFailures.java:70)
> [junit4:junit4]    > 	at
> org.apache.lucene.util.TestRuleMarkFailure$1.evaluate(TestRuleMarkFailure.ja
> va:48)
> [junit4:junit4]    > 	at
> com.carrotsearch.randomizedtesting.rules.StatementAdapter.evaluate(Stateme
> ntAdapter.java:36)
> [junit4:junit4]    > 	at
> com.carrotsearch.randomizedtesting.ThreadLeakControl$StatementRunner.run
> (ThreadLeakControl.java:345)
> [junit4:junit4]    > 	at
> com.carrotsearch.randomizedtesting.ThreadLeakControl.forkTimeoutingTask(T
> hreadLeakControl.java:769)
> [junit4:junit4]    > 	at
> com.carrotsearch.randomizedtesting.ThreadLeakControl$3.evaluate(ThreadLea
> kControl.java:429)
> [junit4:junit4]    > 	at
> com.carrotsearch.randomizedtesting.RandomizedRunner.runSingleTest(Rando
> mizedRunner.java:746)
> [junit4:junit4]    > 	at
> com.carrotsearch.randomizedtesting.RandomizedRunner$3.evaluate(Randomiz
> edRunner.java:648)
> [junit4:junit4]    > 	at
> com.carrotsearch.randomizedtesting.RandomizedRunner$4.evaluate(Randomiz
> edRunner.java:682)
> [junit4:junit4]    > 	at
> com.carrotsearch.randomizedtesting.RandomizedRunner$5.evaluate(Randomiz
> edRunner.java:693)
> [junit4:junit4]    > 	at
> com.carrotsearch.randomizedtesting.rules.StatementAdapter.evaluate(Stateme
> ntAdapter.java:36)
> [junit4:junit4]    > 	at
> com.carrotsearch.randomizedtesting.rules.SystemPropertiesRestoreRule$1.eval
> uate(SystemPropertiesRestoreRule.java:53)
> [junit4:junit4]    > 	at
> org.apache.lucene.util.AbstractBeforeAfterRule$1.evaluate(AbstractBeforeAfte
> rRule.java:45)
> [junit4:junit4]    > 	at
> org.apache.lucene.util.TestRuleStoreClassName$1.evaluate(TestRuleStoreClass
> Name.java:42)
> [junit4:junit4]    > 	at
> com.carrotsearch.randomizedtesting.rules.SystemPropertiesInvariantRule$1.ev
> aluate(SystemPropertiesInvariantRule.java:55)
> [junit4:junit4]    > 	at
> com.carrotsearch.randomizedtesting.rules.NoShadowingOrOverridesOnMethod
> sRule$1.evaluate(NoShadowingOrOverridesOnMethodsRule.java:39)
> [junit4:junit4]    > 	at
> com.carrotsearch.randomizedtesting.rules.NoShadowingOrOverridesOnMethod
> sRule$1.evaluate(NoShadowingOrOverridesOnMethodsRule.java:39)
> [junit4:junit4]    > 	at
> org.apache.lucene.util.TestRuleAssertionsRequired$1.evaluate(TestRuleAssertio
> nsRequired.java:40)
> [junit4:junit4]    > 	at
> org.apache.lucene.util.TestRuleMarkFailure$1.evaluate(TestRuleMarkFailure.ja
> va:48)
> [junit4:junit4]    > 	at
> org.apache.lucene.util.TestRuleIgnoreAfterMaxFailures$1.evaluate(TestRuleIgn
> oreAfterMaxFailures.java:70)
> [junit4:junit4]    > 	at
> org.apache.lucene.util.TestRuleIgnoreTestSuites$1.evaluate(TestRuleIgnoreTest
> Suites.java:55)
> [junit4:junit4]    > 	at
> com.carrotsearch.randomizedtesting.rules.StatementAdapter.evaluate(Stateme
> ntAdapter.java:36)
> [junit4:junit4]    > 	at
> com.carrotsearch.randomizedtesting.ThreadLeakControl$StatementRunner.run
> (ThreadLeakControl.java:345)
> [junit4:junit4]    > 	at java.lang.Thread.run(Thread.java:722)
> [junit4:junit4]    > Caused by: org.apache.http.NoHttpResponseException: The
> target server failed to respond
> [junit4:junit4]    > 	at
> org.apache.http.impl.conn.DefaultResponseParser.parseHead(DefaultResponse
> Parser.java:101)
> [junit4:junit4]    > 	at
> org.apache.http.impl.io.AbstractMessageParser.parse(AbstractMessageParser.j
> ava:252)
> [junit4:junit4]    > 	at
> org.apache.http.impl.AbstractHttpClientConnection.receiveResponseHeader(Ab
> stractHttpClientConnection.java:282)
> [junit4:junit4]    > 	at
> org.apache.http.impl.conn.DefaultClientConnection.receiveResponseHeader(De
> faultClientConnection.java:247)
> [junit4:junit4]    > 	at
> org.apache.http.impl.conn.AbstractClientConnAdapter.receiveResponseHeader(
> AbstractClientConnAdapter.java:216)
> [junit4:junit4]    > 	at
> org.apache.http.protocol.HttpRequestExecutor.doReceiveResponse(HttpRequest
> Executor.java:298)
> [junit4:junit4]    > 	at
> org.apache.http.protocol.HttpRequestExecutor.execute(HttpRequestExecutor.ja
> va:125)
> [junit4:junit4]    > 	at
> org.apache.http.impl.client.DefaultRequestDirector.tryExecute(DefaultRequest
> Director.java:647)
> [junit4:junit4]    > 	at
> org.apache.http.impl.client.DefaultRequestDirector.execute(DefaultRequestDir
> ector.java:464)
> [junit4:junit4]    > 	at
> org.apache.http.impl.client.AbstractHttpClient.execute(AbstractHttpClient.java:
> 820)
> [junit4:junit4]    > 	at
> org.apache.http.impl.client.AbstractHttpClient.execute(AbstractHttpClient.java:
> 754)
> [junit4:junit4]    > 	at
> org.apache.http.impl.client.AbstractHttpClient.execute(AbstractHttpClient.java:
> 732)
> [junit4:junit4]    > 	at
> org.apache.solr.client.solrj.impl.HttpSolrServer.request(HttpSolrServer.java:353
> )
> [junit4:junit4]    > 	... 43 more
> [junit4:junit4]   2> 10644 T11 oas.SolrTestCaseJ4.setUp ###Starting
> testStreamUrl
> [junit4:junit4]   2> 10646 T14 oejs.AbstractConnector$Acceptor.run WARNING
> java.security.AccessControlException: access denied
> ("java.net.SocketPermission" "140.211.11.196:56357" "accept,resolve")
> [junit4:junit4]   2> 	at
> java.security.AccessControlContext.checkPermission(AccessControlContext.java
> :366)
> [junit4:junit4]   2> 	at
> java.security.AccessController.checkPermission(AccessController.java:555)
> [junit4:junit4]   2> 	at
> java.lang.SecurityManager.checkPermission(SecurityManager.java:549)
> [junit4:junit4]   2> 	at
> java.lang.SecurityManager.checkAccept(SecurityManager.java:1174)
> [junit4:junit4]   2> 	at
> java.net.ServerSocket.implAccept(ServerSocket.java:526)
> [junit4:junit4]   2> 	at java.net.ServerSocket.accept(ServerSocket.java:490)
> [junit4:junit4]   2> 	at
> org.eclipse.jetty.server.bio.SocketConnector.accept(SocketConnector.java:112)
> [junit4:junit4]   2> 	at
> org.eclipse.jetty.server.AbstractConnector$Acceptor.run(AbstractConnector.jav
> a:933)
> [junit4:junit4]   2> 	at
> org.eclipse.jetty.util.thread.QueuedThreadPool.runJob(QueuedThreadPool.java:
> 599)
> [junit4:junit4]   2> 	at
> org.eclipse.jetty.util.thread.QueuedThreadPool$3.run(QueuedThreadPool.java:
> 534)
> [junit4:junit4]   2> 	at java.lang.Thread.run(Thread.java:722)
> [junit4:junit4]   2>
> [junit4:junit4]   2> 10646 T11 oas.SolrTestCaseJ4.tearDown ###Ending
> testStreamUrl
> [junit4:junit4]   2> NOTE: reproduce with: ant test  -
> Dtestcase=TestRemoteStreaming -Dtests.method=testStreamUrl -
> Dtests.seed=E20548CE3E5ACD20 -Dtests.multiplier=3 -Dtests.slow=true -
> Dtests.locale=ar_IQ -Dtests.timezone=America/Eirunepe -
> Dtests.file.encoding=ISO-8859-1
> [junit4:junit4] ERROR   0.02s J1 | TestRemoteStreaming.testStreamUrl <<<
> [junit4:junit4]    > Throwable #1:
> org.apache.solr.client.solrj.SolrServerException: IOException occured when
> talking to server at: http://localhost:13521/solr
> [junit4:junit4]    > 	at
> __randomizedtesting.SeedInfo.seed([E20548CE3E5ACD20:CF10EC5C68A334CA]
> :0)
> [junit4:junit4]    > 	at
> org.apache.solr.client.solrj.impl.HttpSolrServer.request(HttpSolrServer.java:414
> )
> [junit4:junit4]    > 	at
> org.apache.solr.client.solrj.impl.HttpSolrServer.request(HttpSolrServer.java:182
> )
> [junit4:junit4]    > 	at
> org.apache.solr.client.solrj.request.AbstractUpdateRequest.process(AbstractUp
> dateRequest.java:117)
> [junit4:junit4]    > 	at
> org.apache.solr.client.solrj.SolrServer.add(SolrServer.java:122)
> [junit4:junit4]    > 	at
> org.apache.solr.client.solrj.SolrServer.add(SolrServer.java:107)
> [junit4:junit4]    > 	at
> org.apache.solr.request.TestRemoteStreaming.doBefore(TestRemoteStreaming
> .java:59)
> [junit4:junit4]    > 	at
> sun.reflect.NativeMethodAccessorImpl.invoke0(Native Method)
> [junit4:junit4]    > 	at
> sun.reflect.NativeMethodAccessorImpl.invoke(NativeMethodAccessorImpl.java:
> 57)
> [junit4:junit4]    > 	at
> sun.reflect.DelegatingMethodAccessorImpl.invoke(DelegatingMethodAccessorI
> mpl.java:43)
> [junit4:junit4]    > 	at java.lang.reflect.Method.invoke(Method.java:601)
> [junit4:junit4]    > 	at
> com.carrotsearch.randomizedtesting.RandomizedRunner.invoke(RandomizedRu
> nner.java:1559)
> [junit4:junit4]    > 	at
> com.carrotsearch.randomizedtesting.RandomizedRunner.access$600(Randomiz
> edRunner.java:79)
> [junit4:junit4]    > 	at
> com.carrotsearch.randomizedtesting.RandomizedRunner$7.evaluate(Randomiz
> edRunner.java:771)
> [junit4:junit4]    > 	at
> com.carrotsearch.randomizedtesting.RandomizedRunner$8.evaluate(Randomiz
> edRunner.java:787)
> [junit4:junit4]    > 	at
> com.carrotsearch.randomizedtesting.rules.SystemPropertiesRestoreRule$1.eval
> uate(SystemPropertiesRestoreRule.java:53)
> [junit4:junit4]    > 	at
> org.apache.lucene.util.TestRuleSetupTeardownChained$1.evaluate(TestRuleSet
> upTeardownChained.java:50)
> [junit4:junit4]    > 	at
> org.apache.lucene.util.TestRuleFieldCacheSanity$1.evaluate(TestRuleFieldCach
> eSanity.java:51)
> [junit4:junit4]    > 	at
> org.apache.lucene.util.AbstractBeforeAfterRule$1.evaluate(AbstractBeforeAfte
> rRule.java:45)
> [junit4:junit4]    > 	at
> com.carrotsearch.randomizedtesting.rules.SystemPropertiesInvariantRule$1.ev
> aluate(SystemPropertiesInvariantRule.java:55)
> [junit4:junit4]    > 	at
> org.apache.lucene.util.TestRuleThreadAndTestName$1.evaluate(TestRuleThrea
> dAndTestName.java:48)
> [junit4:junit4]    > 	at
> org.apache.lucene.util.TestRuleIgnoreAfterMaxFailures$1.evaluate(TestRuleIgn
> oreAfterMaxFailures.java:70)
> [junit4:junit4]    > 	at
> org.apache.lucene.util.TestRuleMarkFailure$1.evaluate(TestRuleMarkFailure.ja
> va:48)
> [junit4:junit4]    > 	at
> com.carrotsearch.randomizedtesting.rules.StatementAdapter.evaluate(Stateme
> ntAdapter.java:36)
> [junit4:junit4]    > 	at
> com.carrotsearch.randomizedtesting.ThreadLeakControl$StatementRunner.run
> (ThreadLeakControl.java:345)
> [junit4:junit4]    > 	at
> com.carrotsearch.randomizedtesting.ThreadLeakControl.forkTimeoutingTask(T
> hreadLeakControl.java:769)
> [junit4:junit4]    > 	at
> com.carrotsearch.randomizedtesting.ThreadLeakControl$3.evaluate(ThreadLea
> kControl.java:429)
> [junit4:junit4]    > 	at
> com.carrotsearch.randomizedtesting.RandomizedRunner.runSingleTest(Rando
> mizedRunner.java:746)
> [junit4:junit4]    > 	at
> com.carrotsearch.randomizedtesting.RandomizedRunner$3.evaluate(Randomiz
> edRunner.java:648)
> [junit4:junit4]    > 	at
> com.carrotsearch.randomizedtesting.RandomizedRunner$4.evaluate(Randomiz
> edRunner.java:682)
> [junit4:junit4]    > 	at
> com.carrotsearch.randomizedtesting.RandomizedRunner$5.evaluate(Randomiz
> edRunner.java:693)
> [junit4:junit4]    > 	at
> com.carrotsearch.randomizedtesting.rules.StatementAdapter.evaluate(Stateme
> ntAdapter.java:36)
> [junit4:junit4]    > 	at
> com.carrotsearch.randomizedtesting.rules.SystemPropertiesRestoreRule$1.eval
> uate(SystemPropertiesRestoreRule.java:53)
> [junit4:junit4]    > 	at
> org.apache.lucene.util.AbstractBeforeAfterRule$1.evaluate(AbstractBeforeAfte
> rRule.java:45)
> [junit4:junit4]    > 	at
> org.apache.lucene.util.TestRuleStoreClassName$1.evaluate(TestRuleStoreClass
> Name.java:42)
> [junit4:junit4]    > 	at
> com.carrotsearch.randomizedtesting.rules.SystemPropertiesInvariantRule$1.ev
> aluate(SystemPropertiesInvariantRule.java:55)
> [junit4:junit4]    > 	at
> com.carrotsearch.randomizedtesting.rules.NoShadowingOrOverridesOnMethod
> sRule$1.evaluate(NoShadowingOrOverridesOnMethodsRule.java:39)
> [junit4:junit4]    > 	at
> com.carrotsearch.randomizedtesting.rules.NoShadowingOrOverridesOnMethod
> sRule$1.evaluate(NoShadowingOrOverridesOnMethodsRule.java:39)
> [junit4:junit4]    > 	at
> org.apache.lucene.util.TestRuleAssertionsRequired$1.evaluate(TestRuleAssertio
> nsRequired.java:40)
> [junit4:junit4]    > 	at
> org.apache.lucene.util.TestRuleMarkFailure$1.evaluate(TestRuleMarkFailure.ja
> va:48)
> [junit4:junit4]    > 	at
> org.apache.lucene.util.TestRuleIgnoreAfterMaxFailures$1.evaluate(TestRuleIgn
> oreAfterMaxFailures.java:70)
> [junit4:junit4]    > 	at
> org.apache.lucene.util.TestRuleIgnoreTestSuites$1.evaluate(TestRuleIgnoreTest
> Suites.java:55)
> [junit4:junit4]    > 	at
> com.carrotsearch.randomizedtesting.rules.StatementAdapter.evaluate(Stateme
> ntAdapter.java:36)
> [junit4:junit4]    > 	at
> com.carrotsearch.randomizedtesting.ThreadLeakControl$StatementRunner.run
> (ThreadLeakControl.java:345)
> [junit4:junit4]    > 	at java.lang.Thread.run(Thread.java:722)
> [junit4:junit4]    > Caused by: org.apache.http.NoHttpResponseException: The
> target server failed to respond
> [junit4:junit4]    > 	at
> org.apache.http.impl.conn.DefaultResponseParser.parseHead(DefaultResponse
> Parser.java:101)
> [junit4:junit4]    > 	at
> org.apache.http.impl.io.AbstractMessageParser.parse(AbstractMessageParser.j
> ava:252)
> [junit4:junit4]    > 	at
> org.apache.http.impl.AbstractHttpClientConnection.receiveResponseHeader(Ab
> stractHttpClientConnection.java:282)
> [junit4:junit4]    > 	at
> org.apache.http.impl.conn.DefaultClientConnection.receiveResponseHeader(De
> faultClientConnection.java:247)
> [junit4:junit4]    > 	at
> org.apache.http.impl.conn.AbstractClientConnAdapter.receiveResponseHeader(
> AbstractClientConnAdapter.java:216)
> [junit4:junit4]    > 	at
> org.apache.http.protocol.HttpRequestExecutor.doReceiveResponse(HttpRequest
> Executor.java:298)
> [junit4:junit4]    > 	at
> org.apache.http.protocol.HttpRequestExecutor.execute(HttpRequestExecutor.ja
> va:125)
> [junit4:junit4]    > 	at
> org.apache.http.impl.client.DefaultRequestDirector.tryExecute(DefaultRequest
> Director.java:647)
> [junit4:junit4]    > 	at
> org.apache.http.impl.client.DefaultRequestDirector.execute(DefaultRequestDir
> ector.java:464)
> [junit4:junit4]    > 	at
> org.apache.http.impl.client.AbstractHttpClient.execute(AbstractHttpClient.java:
> 820)
> [junit4:junit4]    > 	at
> org.apache.http.impl.client.AbstractHttpClient.execute(AbstractHttpClient.java:
> 754)
> [junit4:junit4]    > 	at
> org.apache.http.impl.client.AbstractHttpClient.execute(AbstractHttpClient.java:
> 732)
> [junit4:junit4]    > 	at
> org.apache.solr.client.solrj.impl.HttpSolrServer.request(HttpSolrServer.java:353
> )
> [junit4:junit4]    > 	... 43 more
> [junit4:junit4]   2> 10668 T11 oas.SolrTestCaseJ4.setUp ###Starting
> testMakeDeleteAllUrl
> [junit4:junit4]   2> 10669 T14 oejs.AbstractConnector$Acceptor.run WARNING
> java.security.AccessControlException: access denied
> ("java.net.SocketPermission" "140.211.11.196:37734" "accept,resolve")
> [junit4:junit4]   2> 	at
> java.security.AccessControlContext.checkPermission(AccessControlContext.java
> :366)
> [junit4:junit4]   2> 	at
> java.security.AccessController.checkPermission(AccessController.java:555)
> [junit4:junit4]   2> 	at
> java.lang.SecurityManager.checkPermission(SecurityManager.java:549)
> [junit4:junit4]   2> 	at
> java.lang.SecurityManager.checkAccept(SecurityManager.java:1174)
> [junit4:junit4]   2> 	at
> java.net.ServerSocket.implAccept(ServerSocket.java:526)
> [junit4:junit4]   2> 	at java.net.ServerSocket.accept(ServerSocket.java:490)
> [junit4:junit4]   2> 	at
> org.eclipse.jetty.server.bio.SocketConnector.accept(SocketConnector.java:112)
> [junit4:junit4]   2> 	at
> org.eclipse.jetty.server.AbstractConnector$Acceptor.run(AbstractConnector.jav
> a:933)
> [junit4:junit4]   2> 	at
> org.eclipse.jetty.util.thread.QueuedThreadPool.runJob(QueuedThreadPool.java:
> 599)
> [junit4:junit4]   2> 	at
> org.eclipse.jetty.util.thread.QueuedThreadPool$3.run(QueuedThreadPool.java:
> 534)
> [junit4:junit4]   2> 	at java.lang.Thread.run(Thread.java:722)
> [junit4:junit4]   2>
> [junit4:junit4]   2> 10670 T11 oas.SolrTestCaseJ4.tearDown ###Ending
> testMakeDeleteAllUrl
> [junit4:junit4]   2> NOTE: reproduce with: ant test  -
> Dtestcase=TestRemoteStreaming -Dtests.method=testMakeDeleteAllUrl -
> Dtests.seed=E20548CE3E5ACD20 -Dtests.multiplier=3 -Dtests.slow=true -
> Dtests.locale=ar_IQ -Dtests.timezone=America/Eirunepe -
> Dtests.file.encoding=ISO-8859-1
> [junit4:junit4] ERROR   0.02s J1 | TestRemoteStreaming.testMakeDeleteAllUrl
> <<<
> [junit4:junit4]    > Throwable #1:
> org.apache.solr.client.solrj.SolrServerException: IOException occured when
> talking to server at: http://localhost:13521/solr
> [junit4:junit4]    > 	at
> __randomizedtesting.SeedInfo.seed([E20548CE3E5ACD20:8941C07F36EB7792]:
> 0)
> [junit4:junit4]    > 	at
> org.apache.solr.client.solrj.impl.HttpSolrServer.request(HttpSolrServer.java:414
> )
> [junit4:junit4]    > 	at
> org.apache.solr.client.solrj.impl.HttpSolrServer.request(HttpSolrServer.java:182
> )
> [junit4:junit4]    > 	at
> org.apache.solr.client.solrj.request.AbstractUpdateRequest.process(AbstractUp
> dateRequest.java:117)
> [junit4:junit4]    > 	at
> org.apache.solr.client.solrj.SolrServer.add(SolrServer.java:122)
> [junit4:junit4]    > 	at
> org.apache.solr.client.solrj.SolrServer.add(SolrServer.java:107)
> [junit4:junit4]    > 	at
> org.apache.solr.request.TestRemoteStreaming.doBefore(TestRemoteStreaming
> .java:59)
> [junit4:junit4]    > 	at
> sun.reflect.NativeMethodAccessorImpl.invoke0(Native Method)
> [junit4:junit4]    > 	at
> sun.reflect.NativeMethodAccessorImpl.invoke(NativeMethodAccessorImpl.java:
> 57)
> [junit4:junit4]    > 	at
> sun.reflect.DelegatingMethodAccessorImpl.invoke(DelegatingMethodAccessorI
> mpl.java:43)
> [junit4:junit4]    > 	at java.lang.reflect.Method.invoke(Method.java:601)
> [junit4:junit4]    > 	at
> com.carrotsearch.randomizedtesting.RandomizedRunner.invoke(RandomizedRu
> nner.java:1559)
> [junit4:junit4]    > 	at
> com.carrotsearch.randomizedtesting.RandomizedRunner.access$600(Randomiz
> edRunner.java:79)
> [junit4:junit4]    > 	at
> com.carrotsearch.randomizedtesting.RandomizedRunner$7.evaluate(Randomiz
> edRunner.java:771)
> [junit4:junit4]    > 	at
> com.carrotsearch.randomizedtesting.RandomizedRunner$8.evaluate(Randomiz
> edRunner.java:787)
> [junit4:junit4]    > 	at
> com.carrotsearch.randomizedtesting.rules.SystemPropertiesRestoreRule$1.eval
> uate(SystemPropertiesRestoreRule.java:53)
> [junit4:junit4]    > 	at
> org.apache.lucene.util.TestRuleSetupTeardownChained$1.evaluate(TestRuleSet
> upTeardownChained.java:50)
> [junit4:junit4]    > 	at
> org.apache.lucene.util.TestRuleFieldCacheSanity$1.evaluate(TestRuleFieldCach
> eSanity.java:51)
> [junit4:junit4]    > 	at
> org.apache.lucene.util.AbstractBeforeAfterRule$1.evaluate(AbstractBeforeAfte
> rRule.java:45)
> [junit4:junit4]    > 	at
> com.carrotsearch.randomizedtesting.rules.SystemPropertiesInvariantRule$1.ev
> aluate(SystemPropertiesInvariantRule.java:55)
> [junit4:junit4]    > 	at
> org.apache.lucene.util.TestRuleThreadAndTestName$1.evaluate(TestRuleThrea
> dAndTestName.java:48)
> [junit4:junit4]    > 	at
> org.apache.lucene.util.TestRuleIgnoreAfterMaxFailures$1.evaluate(TestRuleIgn
> oreAfterMaxFailures.java:70)
> [junit4:junit4]    > 	at
> org.apache.lucene.util.TestRuleMarkFailure$1.evaluate(TestRuleMarkFailure.ja
> va:48)
> [junit4:junit4]    > 	at
> com.carrotsearch.randomizedtesting.rules.StatementAdapter.evaluate(Stateme
> ntAdapter.java:36)
> [junit4:junit4]    > 	at
> com.carrotsearch.randomizedtesting.ThreadLeakControl$StatementRunner.run
> (ThreadLeakControl.java:345)
> [junit4:junit4]    > 	at
> com.carrotsearch.randomizedtesting.ThreadLeakControl.forkTimeoutingTask(T
> hreadLeakControl.java:769)
> [junit4:junit4]    > 	at
> com.carrotsearch.randomizedtesting.ThreadLeakControl$3.evaluate(ThreadLea
> kControl.java:429)
> [junit4:junit4]    > 	at
> com.carrotsearch.randomizedtesting.RandomizedRunner.runSingleTest(Rando
> mizedRunner.java:746)
> [junit4:junit4]    > 	at
> com.carrotsearch.randomizedtesting.RandomizedRunner$3.evaluate(Randomiz
> edRunner.java:648)
> [junit4:junit4]    > 	at
> com.carrotsearch.randomizedtesting.RandomizedRunner$4.evaluate(Randomiz
> edRunner.java:682)
> [junit4:junit4]    > 	at
> com.carrotsearch.randomizedtesting.RandomizedRunner$5.evaluate(Randomiz
> edRunner.java:693)
> [junit4:junit4]    > 	at
> com.carrotsearch.randomizedtesting.rules.StatementAdapter.evaluate(Stateme
> ntAdapter.java:36)
> [junit4:junit4]    > 	at
> com.carrotsearch.randomizedtesting.rules.SystemPropertiesRestoreRule$1.eval
> uate(SystemPropertiesRestoreRule.java:53)
> [junit4:junit4]    > 	at
> org.apache.lucene.util.AbstractBeforeAfterRule$1.evaluate(AbstractBeforeAfte
> rRule.java:45)
> [junit4:junit4]    > 	at
> org.apache.lucene.util.TestRuleStoreClassName$1.evaluate(TestRuleStoreClass
> Name.java:42)
> [junit4:junit4]    > 	at
> com.carrotsearch.randomizedtesting.rules.SystemPropertiesInvariantRule$1.ev
> aluate(SystemPropertiesInvariantRule.java:55)
> [junit4:junit4]    > 	at
> com.carrotsearch.randomizedtesting.rules.NoShadowingOrOverridesOnMethod
> sRule$1.evaluate(NoShadowingOrOverridesOnMethodsRule.java:39)
> [junit4:junit4]    > 	at
> com.carrotsearch.randomizedtesting.rules.NoShadowingOrOverridesOnMethod
> sRule$1.evaluate(NoShadowingOrOverridesOnMethodsRule.java:39)
> [junit4:junit4]    > 	at
> org.apache.lucene.util.TestRuleAssertionsRequired$1.evaluate(TestRuleAssertio
> nsRequired.java:40)
> [junit4:junit4]    > 	at
> org.apache.lucene.util.TestRuleMarkFailure$1.evaluate(TestRuleMarkFailure.ja
> va:48)
> [junit4:junit4]    > 	at
> org.apache.lucene.util.TestRuleIgnoreAfterMaxFailures$1.evaluate(TestRuleIgn
> oreAfterMaxFailures.java:70)
> [junit4:junit4]    > 	at
> org.apache.lucene.util.TestRuleIgnoreTestSuites$1.evaluate(TestRuleIgnoreTest
> Suites.java:55)
> [junit4:junit4]    > 	at
> com.carrotsearch.randomizedtesting.rules.StatementAdapter.evaluate(Stateme
> ntAdapter.java:36)
> [junit4:junit4]    > 	at
> com.carrotsearch.randomizedtesting.ThreadLeakControl$StatementRunner.run
> (ThreadLeakControl.java:345)
> [junit4:junit4]    > 	at java.lang.Thread.run(Thread.java:722)
> [junit4:junit4]    > Caused by: org.apache.http.NoHttpResponseException: The
> target server failed to respond
> [junit4:junit4]    > 	at
> org.apache.http.impl.conn.DefaultResponseParser.parseHead(DefaultResponse
> Parser.java:101)
> [junit4:junit4]    > 	at
> org.apache.http.impl.io.AbstractMessageParser.parse(AbstractMessageParser.j
> ava:252)
> [junit4:junit4]    > 	at
> org.apache.http.impl.AbstractHttpClientConnection.receiveResponseHeader(Ab
> stractHttpClientConnection.java:282)
> [junit4:junit4]    > 	at
> org.apache.http.impl.conn.DefaultClientConnection.receiveResponseHeader(De
> faultClientConnection.java:247)
> [junit4:junit4]    > 	at
> org.apache.http.impl.conn.AbstractClientConnAdapter.receiveResponseHeader(
> AbstractClientConnAdapter.java:216)
> [junit4:junit4]    > 	at
> org.apache.http.protocol.HttpRequestExecutor.doReceiveResponse(HttpRequest
> Executor.java:298)
> [junit4:junit4]    > 	at
> org.apache.http.protocol.HttpRequestExecutor.execute(HttpRequestExecutor.ja
> va:125)
> [junit4:junit4]    > 	at
> org.apache.http.impl.client.DefaultRequestDirector.tryExecute(DefaultRequest
> Director.java:647)
> [junit4:junit4]    > 	at
> org.apache.http.impl.client.DefaultRequestDirector.execute(DefaultRequestDir
> ector.java:464)
> [junit4:junit4]    > 	at
> org.apache.http.impl.client.AbstractHttpClient.execute(AbstractHttpClient.java:
> 820)
> [junit4:junit4]    > 	at
> org.apache.http.impl.client.AbstractHttpClient.execute(AbstractHttpClient.java:
> 754)
> [junit4:junit4]    > 	at
> org.apache.http.impl.client.AbstractHttpClient.execute(AbstractHttpClient.java:
> 732)
> [junit4:junit4]    > 	at
> org.apache.solr.client.solrj.impl.HttpSolrServer.request(HttpSolrServer.java:353
> )
> [junit4:junit4]    > 	... 43 more
> [junit4:junit4]   2> 10683 T11 oasc.CoreContainer.shutdown Shutting down
> CoreContainer instance=1160712213
> [junit4:junit4]   2> 10683 T11 oasc.SolrCore.close [collection1]  CLOSING
> SolrCore org.apache.solr.core.SolrCore@1d420b4f
> [junit4:junit4]   2> 10723 T11 oasc.SolrCore.closeSearcher [collection1] Closing
> main searcher on request.
> [junit4:junit4]   2> 10724 T11 oasu.DirectUpdateHandler2.close closing
> DirectUpdateHandler2{commits=0,autocommits=0,soft
> autocommits=0,optimizes=0,rollbacks=0,expungeDeletes=0,docsPending=0,add
> s=0,deletesById=0,deletesByQuery=0,errors=0,cumulative_adds=0,cumulative_
> deletesById=0,cumulative_deletesByQuery=0,cumulative_errors=0}
> [junit4:junit4]   2> 10725 T11 oasu.DefaultSolrCoreState.decref SolrCoreState
> ref count has reached 0 - closing IndexWriter
> [junit4:junit4]   2> 10920 T11 oejsh.ContextHandler.doStop stopped
> o.e.j.s.ServletContextHandler{/solr,null}
> [junit4:junit4]   2> 10978 T11 oas.SolrTestCaseJ4.deleteCore ###deleteCore
> [junit4:junit4]   2> NOTE: test params are: codec=Lucene3x,
> sim=DefaultSimilarity, locale=ar_IQ, timezone=America/Eirunepe
> [junit4:junit4]   2> NOTE: FreeBSD 9.0-RELEASE amd64/Oracle Corporation
> 1.7.0_06 (64-bit)/cpus=16,threads=1,free=94501288,total=104857600
> [junit4:junit4]   2> NOTE: All tests run in this JVM: [TestRemoteStreaming]
> [junit4:junit4] Completed on J1 in 12.51s, 4 tests, 4 errors <<< FAILURES!
> 
> [...truncated 7 lines...]
> [junit4:junit4] Suite: org.apache.solr.schema.TestBinaryField
> [junit4:junit4]   2> 14122 T27 oasc.SolrResourceLoader.<init> new
> SolrResourceLoader for directory: 'solr/collection1/'
> [junit4:junit4]   2> 14153 T27 oejs.Server.doStart jetty-8.1.2.v20120308
> [junit4:junit4]   2> 14159 T27 oejs.AbstractConnector.doStart Started
> SocketConnector@0.0.0.0:17122
> [junit4:junit4]   2> 14160 T27 oasc.SolrResourceLoader.locateSolrHome JNDI
> not configured for solr (NoInitialContextEx)
> [junit4:junit4]   2> 14161 T27 oasc.SolrResourceLoader.locateSolrHome using
> system property solr.solr.home: /usr/home/hudson/hudson-
> slave/workspace/Lucene-Solr-Tests-4.x-java7/solr/build/solr-
> core/test/J1/./solrtest-TestBinaryField-1346340260011/example
> [junit4:junit4]   2> 14161 T27 oasc.SolrResourceLoader.<init> new
> SolrResourceLoader for deduced Solr Home: '/usr/home/hudson/hudson-
> slave/workspace/Lucene-Solr-Tests-4.x-java7/solr/build/solr-
> core/test/J1/./solrtest-TestBinaryField-1346340260011/example/'
> [junit4:junit4]   2> 14183 T27 oass.SolrDispatchFilter.init SolrDispatchFilter.init()
> [junit4:junit4]   2> 14184 T27 oasc.SolrResourceLoader.locateSolrHome JNDI
> not configured for solr (NoInitialContextEx)
> [junit4:junit4]   2> 14185 T27 oasc.SolrResourceLoader.locateSolrHome using
> system property solr.solr.home: /usr/home/hudson/hudson-
> slave/workspace/Lucene-Solr-Tests-4.x-java7/solr/build/solr-
> core/test/J1/./solrtest-TestBinaryField-1346340260011/example
> [junit4:junit4]   2> 14185 T27 oasc.CoreContainer$Initializer.initialize looking
> for solr.xml: /usr/home/hudson/hudson-slave/workspace/Lucene-Solr-Tests-4.x-
> java7/solr/build/solr-core/test/J1/./solrtest-TestBinaryField-
> 1346340260011/example/solr.xml
> [junit4:junit4]   2> 14186 T27 oasc.CoreContainer.<init> New CoreContainer
> 216901597
> [junit4:junit4]   2> 14187 T27 oasc.CoreContainer$Initializer.initialize no
> solr.xml file found - using default
> [junit4:junit4]   2> 14188 T27 oasc.CoreContainer.load Loading CoreContainer
> using Solr Home: '/usr/home/hudson/hudson-slave/workspace/Lucene-Solr-
> Tests-4.x-java7/solr/build/solr-core/test/J1/./solrtest-TestBinaryField-
> 1346340260011/example/'
> [junit4:junit4]   2> 14188 T27 oasc.SolrResourceLoader.<init> new
> SolrResourceLoader for directory: '/usr/home/hudson/hudson-
> slave/workspace/Lucene-Solr-Tests-4.x-java7/solr/build/solr-
> core/test/J1/./solrtest-TestBinaryField-1346340260011/example/'
> [junit4:junit4]   2> 14214 T27 oasc.CoreContainer.load Registering Log Listener
> [junit4:junit4]   2> 14231 T27 oasc.CoreContainer.create Creating SolrCore
> 'collection1' using instanceDir: /usr/home/hudson/hudson-
> slave/workspace/Lucene-Solr-Tests-4.x-java7/solr/build/solr-
> core/test/J1/./solrtest-TestBinaryField-1346340260011/example/collection1
> [junit4:junit4]   2> 14232 T27 oasc.SolrResourceLoader.<init> new
> SolrResourceLoader for directory: '/usr/home/hudson/hudson-
> slave/workspace/Lucene-Solr-Tests-4.x-java7/solr/build/solr-
> core/test/J1/./solrtest-TestBinaryField-1346340260011/example/collection1/'
> [junit4:junit4]   2> 14275 T27 oasc.SolrConfig.<init> Using Lucene
> MatchVersion: LUCENE_40
> [junit4:junit4]   2> 14328 T27 oasc.SolrConfig.<init> Loaded SolrConfig:
> solrconfig.xml
> [junit4:junit4]   2> 14329 T27 oass.IndexSchema.readSchema Reading Solr
> Schema
> [junit4:junit4]   2> 14335 T27 oass.IndexSchema.readSchema Schema
> name=test
> [junit4:junit4]   2> 14541 T27 oass.IndexSchema.readSchema unique key field:
> id
> [junit4:junit4]   2> 14543 T27 oasc.SolrCore.<init> [collection1] Opening new
> SolrCore at /usr/home/hudson/hudson-slave/workspace/Lucene-Solr-Tests-4.x-
> java7/solr/build/solr-core/test/J1/./solrtest-TestBinaryField-
> 1346340260011/example/collection1/, dataDir=/usr/home/hudson/hudson-
> slave/workspace/Lucene-Solr-Tests-4.x-java7/solr/build/solr-
> core/test/J1/./solrtest-TestBinaryField-
> 1346340260011/example/collection1/data/
> [junit4:junit4]   2> 14544 T27 oasc.SolrCore.<init> JMX monitoring not detected
> for core: collection1
> [junit4:junit4]   2> 14545 T27 oasc.SolrCore.getNewIndexDir WARNING New
> index directory detected: old=null new=/usr/home/hudson/hudson-
> slave/workspace/Lucene-Solr-Tests-4.x-java7/solr/build/solr-
> core/test/J1/./solrtest-TestBinaryField-
> 1346340260011/example/collection1/data/index/
> [junit4:junit4]   2> 14547 T27 oasc.SolrCore.initIndex WARNING [collection1]
> Solr index directory '/usr/home/hudson/hudson-slave/workspace/Lucene-Solr-
> Tests-4.x-java7/solr/build/solr-core/test/J1/./solrtest-TestBinaryField-
> 1346340260011/example/collection1/data/index' doesn't exist. Creating new
> index...
> [junit4:junit4]   2> 14548 T27 oasc.CachingDirectoryFactory.get return new
> directory for /usr/home/hudson/hudson-slave/workspace/Lucene-Solr-Tests-
> 4.x-java7/solr/build/solr-core/test/J1/./solrtest-TestBinaryField-
> 1346340260011/example/collection1/data/index forceNew:false
> [junit4:junit4]   2> 14551 T27 oasc.SolrDeletionPolicy.onCommit
> SolrDeletionPolicy.onCommit: commits:num=1
> [junit4:junit4]   2>
> 	commit{dir=MockDirWrapper(org.apache.lucene.store.RAMDirectory
> @3782a3ca
> lockFactory=org.apache.lucene.store.SingleInstanceLockFactory@6d41319c),se
> gFN=segments_1,generation=1,filenames=[segments_1]
> [junit4:junit4]   2> 14552 T27 oasc.SolrDeletionPolicy.updateCommits newest
> commit = 1
> [junit4:junit4]   2> 14554 T27 oasc.RequestHandlers.initHandlersFromConfig
> created standard: solr.StandardRequestHandler
> [junit4:junit4]   2> 14554 T27 oasc.RequestHandlers.initHandlersFromConfig
> created defaults: solr.StandardRequestHandler
> [junit4:junit4]   2> 14555 T27 oasc.RequestHandlers.initHandlersFromConfig
> adding lazy requestHandler: solr.StandardRequestHandler
> [junit4:junit4]   2> 14556 T27 oasc.RequestHandlers.initHandlersFromConfig
> created lazy: solr.StandardRequestHandler
> [junit4:junit4]   2> 14557 T27 oasc.RequestHandlers.initHandlersFromConfig
> created /update: solr.UpdateRequestHandler
> [junit4:junit4]   2> 14603 T27 oasc.RequestHandlers.initHandlersFromConfig
> created /replication: solr.ReplicationHandler
> [junit4:junit4]   2> 14607 T27 oashl.XMLLoader.init
> xsltCacheLifetimeSeconds=60
> [junit4:junit4]   2> 14612 T27 oass.SolrIndexSearcher.<init> Opening
> Searcher@1c89a3dd main
> [junit4:junit4]   2> 14613 T27 oass.SolrIndexSearcher.getIndexDir WARNING
> WARNING: Directory impl does not support setting indexDir:
> org.apache.lucene.store.MockDirectoryWrapper
> [junit4:junit4]   2> 14615 T27 oasu.CommitTracker.<init> Hard AutoCommit:
> disabled
> [junit4:junit4]   2> 14615 T27 oasu.CommitTracker.<init> Soft AutoCommit:
> disabled
> [junit4:junit4]   2> 14616 T27 oashc.HttpShardHandlerFactory.getParameter
> Setting socketTimeout to: 0
> [junit4:junit4]   2> 14617 T27 oashc.HttpShardHandlerFactory.getParameter
> Setting urlScheme to: http://
> [junit4:junit4]   2> 14618 T27 oashc.HttpShardHandlerFactory.getParameter
> Setting connTimeout to: 0
> [junit4:junit4]   2> 14619 T27 oashc.HttpShardHandlerFactory.getParameter
> Setting maxConnectionsPerHost to: 20
> [junit4:junit4]   2> 14619 T27 oashc.HttpShardHandlerFactory.getParameter
> Setting corePoolSize to: 0
> [junit4:junit4]   2> 14620 T27 oashc.HttpShardHandlerFactory.getParameter
> Setting maximumPoolSize to: 2147483647
> [junit4:junit4]   2> 14621 T27 oashc.HttpShardHandlerFactory.getParameter
> Setting maxThreadIdleTime to: 5
> [junit4:junit4]   2> 14622 T27 oashc.HttpShardHandlerFactory.getParameter
> Setting sizeOfQueue to: -1
> [junit4:junit4]   2> 14622 T27 oashc.HttpShardHandlerFactory.getParameter
> Setting fairnessPolicy to: false
> [junit4:junit4]   2> 14623 T27 oascsi.HttpClientUtil.createClient Creating new
> http client,
> config:maxConnectionsPerHost=20&maxConnections=10000&socketTimeout=0
> &connTimeout=0&retry=false
> [junit4:junit4]   2> 14644 T27 oash.ReplicationHandler.inform Commits will be
> reserved for  10000
> [junit4:junit4]   2> 14645 T27 oasc.CoreContainer.register registering core:
> collection1
> [junit4:junit4]   2> 14645 T37 oasc.SolrCore.registerSearcher [collection1]
> Registered new searcher Searcher@1c89a3dd
> main{StandardDirectoryReader(segments_1:1)}
> [junit4:junit4]   2> 14646 T27 oass.SolrDispatchFilter.init
> user.dir=/usr/home/hudson/hudson-slave/workspace/Lucene-Solr-Tests-4.x-
> java7/solr/build/solr-core/test/J1
> [junit4:junit4]   2> 14647 T27 oass.SolrDispatchFilter.init SolrDispatchFilter.init()
> done
> [junit4:junit4]   2> 14647 T27 oascsi.HttpClientUtil.createClient Creating new
> http client,
> config:maxConnections=128&maxConnectionsPerHost=32&followRedirects=fals
> e
> [junit4:junit4]   2> 14663 T29 oejs.AbstractConnector$Acceptor.run WARNING
> java.security.AccessControlException: access denied
> ("java.net.SocketPermission" "140.211.11.196:28328" "accept,resolve")
> [junit4:junit4]   2> 	at
> java.security.AccessControlContext.checkPermission(AccessControlContext.java
> :366)
> [junit4:junit4]   2> 	at
> java.security.AccessController.checkPermission(AccessController.java:555)
> [junit4:junit4]   2> 	at
> java.lang.SecurityManager.checkPermission(SecurityManager.java:549)
> [junit4:junit4]   2> 	at
> java.lang.SecurityManager.checkAccept(SecurityManager.java:1174)
> [junit4:junit4]   2> 	at
> java.net.ServerSocket.implAccept(ServerSocket.java:526)
> [junit4:junit4]   2> 	at java.net.ServerSocket.accept(ServerSocket.java:490)
> [junit4:junit4]   2> 	at
> org.eclipse.jetty.server.bio.SocketConnector.accept(SocketConnector.java:112)
> [junit4:junit4]   2> 	at
> org.eclipse.jetty.server.AbstractConnector$Acceptor.run(AbstractConnector.jav
> a:933)
> [junit4:junit4]   2> 	at
> org.eclipse.jetty.util.thread.QueuedThreadPool.runJob(QueuedThreadPool.java:
> 599)
> [junit4:junit4]   2> 	at
> org.eclipse.jetty.util.thread.QueuedThreadPool$3.run(QueuedThreadPool.java:
> 534)
> [junit4:junit4]   2> 	at java.lang.Thread.run(Thread.java:722)
> [junit4:junit4]   2>
> [junit4:junit4]   2> 14664 T27 oasc.CoreContainer.shutdown Shutting down
> CoreContainer instance=216901597
> [junit4:junit4]   2> 14666 T27 oasc.SolrCore.close [collection1]  CLOSING
> SolrCore org.apache.solr.core.SolrCore@2a491adf
> [junit4:junit4]   2> 14667 T27 oasc.SolrCore.closeSearcher [collection1] Closing
> main searcher on request.
> [junit4:junit4]   2> 14668 T27 oasu.DirectUpdateHandler2.close closing
> DirectUpdateHandler2{commits=0,autocommits=0,soft
> autocommits=0,optimizes=0,rollbacks=0,expungeDeletes=0,docsPending=0,add
> s=0,deletesById=0,deletesByQuery=0,errors=0,cumulative_adds=0,cumulative_
> deletesById=0,cumulative_deletesByQuery=0,cumulative_errors=0}
> [junit4:junit4]   2> 14669 T27 oasu.DefaultSolrCoreState.decref SolrCoreState
> ref count has reached 0 - closing IndexWriter
> [junit4:junit4]   2> 14672 T27 oejsh.ContextHandler.doStop stopped
> o.e.j.s.ServletContextHandler{/example,null}
> [junit4:junit4]   2> NOTE: reproduce with: ant test  -Dtestcase=TestBinaryField -
> Dtests.method=testSimple -Dtests.seed=E20548CE3E5ACD20 -
> Dtests.multiplier=3 -Dtests.slow=true -Dtests.locale=zh_SG -
> Dtests.timezone=Africa/Tunis -Dtests.file.encoding=ISO-8859-1
> [junit4:junit4] ERROR   0.63s J1 | TestBinaryField.testSimple <<<
> [junit4:junit4]    > Throwable #1:
> org.apache.solr.client.solrj.SolrServerException: IOException occured when
> talking to server at: http://localhost:17122/example
> [junit4:junit4]    > 	at
> __randomizedtesting.SeedInfo.seed([E20548CE3E5ACD20:DAB66C3019A919F1]
> :0)
> [junit4:junit4]    > 	at
> org.apache.solr.client.solrj.impl.HttpSolrServer.request(HttpSolrServer.java:414
> )
> [junit4:junit4]    > 	at
> org.apache.solr.client.solrj.impl.HttpSolrServer.request(HttpSolrServer.java:182
> )
> [junit4:junit4]    > 	at
> org.apache.solr.client.solrj.request.AbstractUpdateRequest.process(AbstractUp
> dateRequest.java:117)
> [junit4:junit4]    > 	at
> org.apache.solr.client.solrj.SolrServer.add(SolrServer.java:122)
> [junit4:junit4]    > 	at
> org.apache.solr.client.solrj.SolrServer.add(SolrServer.java:107)
> [junit4:junit4]    > 	at
> org.apache.solr.schema.TestBinaryField.testSimple(TestBinaryField.java:97)
> [junit4:junit4]    > 	at
> sun.reflect.NativeMethodAccessorImpl.invoke0(Native Method)
> [junit4:junit4]    > 	at
> sun.reflect.NativeMethodAccessorImpl.invoke(NativeMethodAccessorImpl.java:
> 57)
> [junit4:junit4]    > 	at
> sun.reflect.DelegatingMethodAccessorImpl.invoke(DelegatingMethodAccessorI
> mpl.java:43)
> [junit4:junit4]    > 	at java.lang.reflect.Method.invoke(Method.java:601)
> [junit4:junit4]    > 	at
> com.carrotsearch.randomizedtesting.RandomizedRunner.invoke(RandomizedRu
> nner.java:1559)
> [junit4:junit4]    > 	at
> com.carrotsearch.randomizedtesting.RandomizedRunner.access$600(Randomiz
> edRunner.java:79)
> [junit4:junit4]    > 	at
> com.carrotsearch.randomizedtesting.RandomizedRunner$6.evaluate(Randomiz
> edRunner.java:737)
> [junit4:junit4]    > 	at
> com.carrotsearch.randomizedtesting.RandomizedRunner$7.evaluate(Randomiz
> edRunner.java:773)
> [junit4:junit4]    > 	at
> com.carrotsearch.randomizedtesting.RandomizedRunner$8.evaluate(Randomiz
> edRunner.java:787)
> [junit4:junit4]    > 	at
> com.carrotsearch.randomizedtesting.rules.SystemPropertiesRestoreRule$1.eval
> uate(SystemPropertiesRestoreRule.java:53)
> [junit4:junit4]    > 	at
> org.apache.lucene.util.TestRuleSetupTeardownChained$1.evaluate(TestRuleSet
> upTeardownChained.java:50)
> [junit4:junit4]    > 	at
> org.apache.lucene.util.TestRuleFieldCacheSanity$1.evaluate(TestRuleFieldCach
> eSanity.java:51)
> [junit4:junit4]    > 	at
> org.apache.lucene.util.AbstractBeforeAfterRule$1.evaluate(AbstractBeforeAfte
> rRule.java:45)
> [junit4:junit4]    > 	at
> com.carrotsearch.randomizedtesting.rules.SystemPropertiesInvariantRule$1.ev
> aluate(SystemPropertiesInvariantRule.java:55)
> [junit4:junit4]    > 	at
> org.apache.lucene.util.TestRuleThreadAndTestName$1.evaluate(TestRuleThrea
> dAndTestName.java:48)
> [junit4:junit4]    > 	at
> org.apache.lucene.util.TestRuleIgnoreAfterMaxFailures$1.evaluate(TestRuleIgn
> oreAfterMaxFailures.java:70)
> [junit4:junit4]    > 	at
> org.apache.lucene.util.TestRuleMarkFailure$1.evaluate(TestRuleMarkFailure.ja
> va:48)
> [junit4:junit4]    > 	at
> com.carrotsearch.randomizedtesting.rules.StatementAdapter.evaluate(Stateme
> ntAdapter.java:36)
> [junit4:junit4]    > 	at
> com.carrotsearch.randomizedtesting.ThreadLeakControl$StatementRunner.run
> (ThreadLeakControl.java:345)
> [junit4:junit4]    > 	at
> com.carrotsearch.randomizedtesting.ThreadLeakControl.forkTimeoutingTask(T
> hreadLeakControl.java:769)
> [junit4:junit4]    > 	at
> com.carrotsearch.randomizedtesting.ThreadLeakControl$3.evaluate(ThreadLea
> kControl.java:429)
> [junit4:junit4]    > 	at
> com.carrotsearch.randomizedtesting.RandomizedRunner.runSingleTest(Rando
> mizedRunner.java:746)
> [junit4:junit4]    > 	at
> com.carrotsearch.randomizedtesting.RandomizedRunner$3.evaluate(Randomiz
> edRunner.java:648)
> [junit4:junit4]    > 	at
> com.carrotsearch.randomizedtesting.RandomizedRunner$4.evaluate(Randomiz
> edRunner.java:682)
> [junit4:junit4]    > 	at
> com.carrotsearch.randomizedtesting.RandomizedRunner$5.evaluate(Randomiz
> edRunner.java:693)
> [junit4:junit4]    > 	at
> org.apache.lucene.util.AbstractBeforeAfterRule$1.evaluate(AbstractBeforeAfte
> rRule.java:45)
> [junit4:junit4]    > 	at
> org.apache.lucene.util.TestRuleStoreClassName$1.evaluate(TestRuleStoreClass
> Name.java:42)
> [junit4:junit4]    > 	at
> com.carrotsearch.randomizedtesting.rules.SystemPropertiesInvariantRule$1.ev
> aluate(SystemPropertiesInvariantRule.java:55)
> [junit4:junit4]    > 	at
> com.carrotsearch.randomizedtesting.rules.NoShadowingOrOverridesOnMethod
> sRule$1.evaluate(NoShadowingOrOverridesOnMethodsRule.java:39)
> [junit4:junit4]    > 	at
> com.carrotsearch.randomizedtesting.rules.NoShadowingOrOverridesOnMethod
> sRule$1.evaluate(NoShadowingOrOverridesOnMethodsRule.java:39)
> [junit4:junit4]    > 	at
> org.apache.lucene.util.TestRuleAssertionsRequired$1.evaluate(TestRuleAssertio
> nsRequired.java:40)
> [junit4:junit4]    > 	at
> org.apache.lucene.util.TestRuleMarkFailure$1.evaluate(TestRuleMarkFailure.ja
> va:48)
> [junit4:junit4]    > 	at
> org.apache.lucene.util.TestRuleIgnoreAfterMaxFailures$1.evaluate(TestRuleIgn
> oreAfterMaxFailures.java:70)
> [junit4:junit4]    > 	at
> org.apache.lucene.util.TestRuleIgnoreTestSuites$1.evaluate(TestRuleIgnoreTest
> Suites.java:55)
> [junit4:junit4]    > 	at
> com.carrotsearch.randomizedtesting.rules.StatementAdapter.evaluate(Stateme
> ntAdapter.java:36)
> [junit4:junit4]    > 	at
> com.carrotsearch.randomizedtesting.ThreadLeakControl$StatementRunner.run
> (ThreadLeakControl.java:345)
> [junit4:junit4]    > 	at java.lang.Thread.run(Thread.java:722)
> [junit4:junit4]    > Caused by: java.net.SocketException: Connection reset
> [junit4:junit4]    > 	at
> java.net.SocketInputStream.read(SocketInputStream.java:189)
> [junit4:junit4]    > 	at
> java.net.SocketInputStream.read(SocketInputStream.java:121)
> [junit4:junit4]    > 	at
> org.apache.http.impl.io.AbstractSessionInputBuffer.fillBuffer(AbstractSessionInp
> utBuffer.java:149)
> [junit4:junit4]    > 	at
> org.apache.http.impl.io.SocketInputBuffer.fillBuffer(SocketInputBuffer.java:111)
> [junit4:junit4]    > 	at
> org.apache.http.impl.io.AbstractSessionInputBuffer.readLine(AbstractSessionInp
> utBuffer.java:264)
> [junit4:junit4]    > 	at
> org.apache.http.impl.conn.DefaultResponseParser.parseHead(DefaultResponse
> Parser.java:98)
> [junit4:junit4]    > 	at
> org.apache.http.impl.io.AbstractMessageParser.parse(AbstractMessageParser.j
> ava:252)
> [junit4:junit4]    > 	at
> org.apache.http.impl.AbstractHttpClientConnection.receiveResponseHeader(Ab
> stractHttpClientConnection.java:282)
> [junit4:junit4]    > 	at
> org.apache.http.impl.conn.DefaultClientConnection.receiveResponseHeader(De
> faultClientConnection.java:247)
> [junit4:junit4]    > 	at
> org.apache.http.impl.conn.AbstractClientConnAdapter.receiveResponseHeader(
> AbstractClientConnAdapter.java:216)
> [junit4:junit4]    > 	at
> org.apache.http.protocol.HttpRequestExecutor.doReceiveResponse(HttpRequest
> Executor.java:298)
> [junit4:junit4]    > 	at
> org.apache.http.protocol.HttpRequestExecutor.execute(HttpRequestExecutor.ja
> va:125)
> [junit4:junit4]    > 	at
> org.apache.http.impl.client.DefaultRequestDirector.tryExecute(DefaultRequest
> Director.java:647)
> [junit4:junit4]    > 	at
> org.apache.http.impl.client.DefaultRequestDirector.execute(DefaultRequestDir
> ector.java:464)
> [junit4:junit4]    > 	at
> org.apache.http.impl.client.AbstractHttpClient.execute(AbstractHttpClient.java:
> 820)
> [junit4:junit4]    > 	at
> org.apache.http.impl.client.AbstractHttpClient.execute(AbstractHttpClient.java:
> 754)
> [junit4:junit4]    > 	at
> org.apache.http.impl.client.AbstractHttpClient.execute(AbstractHttpClient.java:
> 732)
> [junit4:junit4]    > 	at
> org.apache.solr.client.solrj.impl.HttpSolrServer.request(HttpSolrServer.java:353
> )
> [junit4:junit4]    > 	... 42 more
> [junit4:junit4]   2> NOTE: test params are: codec=Lucene3x,
> sim=DefaultSimilarity, locale=zh_SG, timezone=Africa/Tunis
> [junit4:junit4]   2> NOTE: FreeBSD 9.0-RELEASE amd64/Oracle Corporation
> 1.7.0_06 (64-bit)/cpus=16,threads=1,free=60446712,total=104857600
> [junit4:junit4]   2> NOTE: All tests run in this JVM: [TestRemoteStreaming,
> TestQueryUtils, TestBinaryField]
> [junit4:junit4] Completed on J1 in 0.66s, 1 test, 1 error <<< FAILURES!
> 
> [...truncated 10 lines...]
> [junit4:junit4] Suite: org.apache.solr.TestDistributedGrouping
> [junit4:junit4]   2> 5 T42 oas.SolrTestCaseJ4.setUp ###Starting testDistribSearch
> [junit4:junit4]   2> 7 T42 oejs.Server.doStart jetty-8.1.2.v20120308
> [junit4:junit4]   2> 11 T42 oejs.AbstractConnector.doStart Started
> SocketConnector@0.0.0.0:18020
> [junit4:junit4]   2> 12 T42 oasc.SolrResourceLoader.locateSolrHome JNDI not
> configured for solr (NoInitialContextEx)
> [junit4:junit4]   2> 12 T42 oasc.SolrResourceLoader.locateSolrHome using
> system property solr.solr.home: /usr/home/hudson/hudson-
> slave/workspace/Lucene-Solr-Tests-4.x-java7/solr/build/solr-core/test-files/solr
> [junit4:junit4]   2> 13 T42 oasc.SolrResourceLoader.<init> new
> SolrResourceLoader for deduced Solr Home: '/usr/home/hudson/hudson-
> slave/workspace/Lucene-Solr-Tests-4.x-java7/solr/build/solr-core/test-
> files/solr/'
> [junit4:junit4]   2> 49 T42 oass.SolrDispatchFilter.init SolrDispatchFilter.init()
> [junit4:junit4]   2> 50 T42 oasc.SolrResourceLoader.locateSolrHome JNDI not
> configured for solr (NoInitialContextEx)
> [junit4:junit4]   2> 50 T42 oasc.SolrResourceLoader.locateSolrHome using
> system property solr.solr.home: /usr/home/hudson/hudson-
> slave/workspace/Lucene-Solr-Tests-4.x-java7/solr/build/solr-core/test-files/solr
> [junit4:junit4]   2> 51 T42 oasc.CoreContainer$Initializer.initialize looking for
> solr.xml: /usr/home/hudson/hudson-slave/workspace/Lucene-Solr-Tests-4.x-
> java7/solr/build/solr-core/test-files/solr/solr.xml
> [junit4:junit4]   2> 52 T42 oasc.CoreContainer.<init> New CoreContainer
> 1483669095
> [junit4:junit4]   2> 53 T42 oasc.CoreContainer.load Loading CoreContainer
> using Solr Home: '/usr/home/hudson/hudson-slave/workspace/Lucene-Solr-
> Tests-4.x-java7/solr/build/solr-core/test-files/solr/'
> [junit4:junit4]   2> 53 T42 oasc.SolrResourceLoader.<init> new
> SolrResourceLoader for directory: '/usr/home/hudson/hudson-
> slave/workspace/Lucene-Solr-Tests-4.x-java7/solr/build/solr-core/test-
> files/solr/'
> [junit4:junit4]   2> 93 T42 oasc.CoreContainer.load Registering Log Listener
> [junit4:junit4]   2> 187 T42 oasc.CoreContainer.create Creating SolrCore
> 'collection1' using instanceDir: /usr/home/hudson/hudson-
> slave/workspace/Lucene-Solr-Tests-4.x-java7/solr/build/solr-core/test-
> files/solr/collection1
> [junit4:junit4]   2> 188 T42 oasc.SolrResourceLoader.<init> new
> SolrResourceLoader for directory: '/usr/home/hudson/hudson-
> slave/workspace/Lucene-Solr-Tests-4.x-java7/solr/build/solr-core/test-
> files/solr/collection1/'
> [junit4:junit4]   2> 190 T42 oasc.SolrResourceLoader.replaceClassLoader Adding
> 'file:/usr/home/hudson/hudson-slave/workspace/Lucene-Solr-Tests-4.x-
> java7/solr/build/solr-core/test-files/solr/collection1/lib/README' to
> classloader
> [junit4:junit4]   2> 191 T42 oasc.SolrResourceLoader.replaceClassLoader Adding
> 'file:/usr/home/hudson/hudson-slave/workspace/Lucene-Solr-Tests-4.x-
> java7/solr/build/solr-core/test-files/solr/collection1/lib/classes/' to classloader
> [junit4:junit4]   2> 266 T42 oasc.SolrConfig.<init> Using Lucene MatchVersion:
> LUCENE_40
> [junit4:junit4]   2> 348 T42 oasc.SolrConfig.<init> Loaded SolrConfig:
> solrconfig.xml
> [junit4:junit4]   2> 349 T42 oass.IndexSchema.readSchema Reading Solr
> Schema
> [junit4:junit4]   2> 393 T42 oass.IndexSchema.readSchema Schema name=test
> [junit4:junit4]   2> 971 T42 oass.OpenExchangeRatesOrgProvider.init Initialized
> with rates=open-exchange-rates.json, refreshInterval=1440.
> [junit4:junit4]   2> 995 T42 oass.IndexSchema.readSchema default search field
> in schema is text
> [junit4:junit4]   2> 1000 T42 oass.IndexSchema.readSchema unique key field: id
> [junit4:junit4]   2> 1025 T42 oass.FileExchangeRateProvider.reload Reloading
> exchange rates from file currency.xml
> [junit4:junit4]   2> 1032 T42 oass.FileExchangeRateProvider.reload Reloading
> exchange rates from file currency.xml
> [junit4:junit4]   2> 1038 T42 oass.OpenExchangeRatesOrgProvider.reload
> Reloading exchange rates from open-exchange-rates.json
> [junit4:junit4]   2> 1041 T42 oass.OpenExchangeRatesOrgProvider.reload
> Reloading exchange rates from open-exchange-rates.json
> [junit4:junit4]   2> 1045 T42 oasc.SolrCore.<init> [collection1] Opening new
> SolrCore at /usr/home/hudson/hudson-slave/workspace/Lucene-Solr-Tests-4.x-
> java7/solr/build/solr-core/test-files/solr/collection1/,
> dataDir=./org.apache.solr.TestDistributedGrouping-
> 1346340262039/control/data/
> [junit4:junit4]   2> 1046 T42 oasc.JmxMonitoredMap.<init> JMX monitoring is
> enabled. Adding Solr mbeans to JMX Server:
> com.sun.jmx.mbeanserver.JmxMBeanServer@4fe88181
> [junit4:junit4]   2> 1048 T42 oasc.SolrCore.getNewIndexDir WARNING New
> index directory detected: old=null
> new=./org.apache.solr.TestDistributedGrouping-
> 1346340262039/control/data/index/
> [junit4:junit4]   2> 1050 T42 oasc.SolrCore.initIndex WARNING [collection1] Solr
> index directory './org.apache.solr.TestDistributedGrouping-
> 1346340262039/control/data/index' doesn't exist. Creating new index...
> [junit4:junit4]   2> 1051 T42 oasc.CachingDirectoryFactory.get return new
> directory for /usr/home/hudson/hudson-slave/workspace/Lucene-Solr-Tests-
> 4.x-java7/solr/build/solr-
> core/test/J1/./org.apache.solr.TestDistributedGrouping-
> 1346340262039/control/data/index forceNew:false
> [junit4:junit4]   2> 1056 T42 oasc.SolrDeletionPolicy.onCommit
> SolrDeletionPolicy.onCommit: commits:num=1
> [junit4:junit4]   2>
> 	commit{dir=MockDirWrapper(org.apache.lucene.store.RAMDirectory
> @57711189
> lockFactory=org.apache.lucene.store.NativeFSLockFactory@33710777),segFN=s
> egments_1,generation=1,filenames=[segments_1]
> [junit4:junit4]   2> 1056 T42 oasc.SolrDeletionPolicy.updateCommits newest
> commit = 1
> [junit4:junit4]   2> 1058 T42 oasc.SolrCore.initWriters created xml:
> solr.XMLResponseWriter
> [junit4:junit4]   2> 1061 T42 oasup.UpdateRequestProcessorChain.init inserting
> DistributedUpdateProcessorFactory into updateRequestProcessorChain
> "dedupe"
> [junit4:junit4]   2> 1062 T42 oasup.UpdateRequestProcessorChain.init inserting
> DistributedUpdateProcessorFactory into updateRequestProcessorChain
> "dedupe-allfields"
> [junit4:junit4]   2> 1063 T42 oasup.UpdateRequestProcessorChain.init inserting
> DistributedUpdateProcessorFactory into updateRequestProcessorChain
> "stored_sig"
> [junit4:junit4]   2> 1065 T42 oasup.UpdateRequestProcessorChain.init inserting
> DistributedUpdateProcessorFactory into updateRequestProcessorChain "uniq-
> fields"
> [junit4:junit4]   2> 1066 T42 oasup.UpdateRequestProcessorChain.init inserting
> DistributedUpdateProcessorFactory into updateRequestProcessorChain "distrib-
> dup-test-chain-implicit"
> [junit4:junit4]   2> 1067 T42 oasc.RequestHandlers.initHandlersFromConfig
> adding lazy requestHandler: solr.ReplicationHandler
> [junit4:junit4]   2> 1068 T42 oasc.RequestHandlers.initHandlersFromConfig
> created /replication: solr.ReplicationHandler
> [junit4:junit4]   2> 1069 T42 oasc.RequestHandlers.initHandlersFromConfig
> created standard: solr.StandardRequestHandler
> [junit4:junit4]   2> 1071 T42 oasc.RequestHandlers.initHandlersFromConfig
> created /get: solr.RealTimeGetHandler
> [junit4:junit4]   2> 1072 T42 oasc.RequestHandlers.initHandlersFromConfig
> created dismax: solr.SearchHandler
> [junit4:junit4]   2> 1073 T42 oasc.RequestHandlers.initHandlersFromConfig
> created mock: org.apache.solr.core.MockQuerySenderListenerReqHandler
> [junit4:junit4]   2> 1074 T42 oasc.RequestHandlers.initHandlersFromConfig
> created /admin/: org.apache.solr.handler.admin.AdminHandlers
> [junit4:junit4]   2> 1075 T42 oasc.RequestHandlers.initHandlersFromConfig
> created defaults: solr.StandardRequestHandler
> [junit4:junit4]   2> 1076 T42 oasc.RequestHandlers.initHandlersFromConfig
> adding lazy requestHandler: solr.StandardRequestHandler
> [junit4:junit4]   2> 1077 T42 oasc.RequestHandlers.initHandlersFromConfig
> created lazy: solr.StandardRequestHandler
> [junit4:junit4]   2> 1078 T42 oasc.RequestHandlers.initHandlersFromConfig
> created /update: solr.UpdateRequestHandler
> [junit4:junit4]   2> 1079 T42 oasc.RequestHandlers.initHandlersFromConfig
> created /terms: org.apache.solr.handler.component.SearchHandler
> [junit4:junit4]   2> 1080 T42 oasc.RequestHandlers.initHandlersFromConfig
> created spellCheckCompRH:
> org.apache.solr.handler.component.SearchHandler
> [junit4:junit4]   2> 1082 T42 oasc.RequestHandlers.initHandlersFromConfig
> created spellCheckCompRH_Direct:
> org.apache.solr.handler.component.SearchHandler
> [junit4:junit4]   2> 1083 T42 oasc.RequestHandlers.initHandlersFromConfig
> created spellCheckWithWordbreak:
> org.apache.solr.handler.component.SearchHandler
> [junit4:junit4]   2> 1084 T42 oasc.RequestHandlers.initHandlersFromConfig
> created spellCheckWithWordbreak_Direct:
> org.apache.solr.handler.component.SearchHandler
> [junit4:junit4]   2> 1085 T42 oasc.RequestHandlers.initHandlersFromConfig
> created spellCheckCompRH1:
> org.apache.solr.handler.component.SearchHandler
> [junit4:junit4]   2> 1086 T42 oasc.RequestHandlers.initHandlersFromConfig
> created tvrh: org.apache.solr.handler.component.SearchHandler
> [junit4:junit4]   2> 1087 T42 oasc.RequestHandlers.initHandlersFromConfig
> created /mlt: solr.MoreLikeThisHandler
> [junit4:junit4]   2> 1088 T42 oasc.RequestHandlers.initHandlersFromConfig
> created /debug/dump: solr.DumpRequestHandler
> [junit4:junit4]   2> 1093 T42 oashl.XMLLoader.init xsltCacheLifetimeSeconds=60
> [junit4:junit4]   2> 1098 T42 oasc.SolrCore.initDeprecatedSupport WARNING
> solrconfig.xml uses deprecated <admin/gettableFiles>, Please update your
> config to use the ShowFileRequestHandler.
> [junit4:junit4]   2> 1101 T42 oasc.SolrCore.initDeprecatedSupport WARNING
> adding ShowFileRequestHandler with hidden files:
> [THROW.ERROR.ON.ADD.UPDATEPROCESSOR.JS, SOLRCONFIG-
> HIGHLIGHT.XML, SCHEMA-REQUIRED-FIELDS.XML,
> TRIVIAL.UPDATEPROCESSOR1.JS, BAD-SCHEMA-DUP-DYNAMICFIELD.XML,
> SCHEMA-REPLICATION2.XML, SCHEMA-MINIMAL.XML, SOLRCONFIG-
> CACHING.XML, SOLRCONFIG-REPEATER.XML, SOLRCONFIG-
> MERGEPOLICY.XML, CURRENCY.XML, BAD-SCHEMA-NONTEXT-ANALYZER.XML,
> SOLRCONFIG-TLOG.XML, SOLRCONFIG-MASTER.XML, BAD-SCHEMA-
> UNIQUEKEY-MULTIVALUED.XML, SCHEMA11.XML, SOLRCONFIG-BASIC.XML,
> DA_COMPOUNDDICTIONARY.TXT,
> MISSLEADING.EXTENSION.UPDATEPROCESSOR.JS.TXT, SCHEMA-COPYFIELD-
> TEST.XML, SOLRCONFIG-SLAVE.XML, SOLRCONFIG-PROPINJECT-
> INDEXDEFAULT.XML, ELEVATE.XML, TRIVIAL.UPDATEPROCESSOR0.JS, BAD-
> SOLRCONFIG-BOGUS-SCRIPTENGINE-NAME.XML, SCHEMA-CHARFILTERS.XML,
> SCHEMA-IB.XML, SOLRCONFIG-QUERYSENDER.XML, SCHEMA-
> REPLICATION1.XML, DA_UTF8.XML, CONDITIONAL.UPDATEPROCESSOR.JS,
> MISSING.FUNCTIONS.UPDATEPROCESSOR.JS, SOLRCONFIG-
> ENABLEPLUGIN.XML, HYPHENATION.DTD, STEMDICT.TXT, SCHEMA-
> PHRASESUGGEST.XML, HUNSPELL-TEST.AFF, STOPTYPES-1.TXT,
> STOPWORDSWRONGENCODING.TXT, SCHEMA-NUMERIC.XML, SOLRCONFIG-
> TRANSFORMERS.XML, SOLRCONFIG-PROPINJECT.XML, BAD-SCHEMA-NOT-
> INDEXED-BUT-TF.XML, SOLRCONFIG-SIMPLELOCK.XML, WDFTYPES.TXT,
> SCHEMA-REVERSED.XML, STOPTYPES-2.TXT, SOLRCONFIG-
> SPELLCHECKCOMPONENT.XML, SCHEMA-DFR.XML, SOLRCONFIG-
> PHRASESUGGEST.XML, BAD-SCHEMA-NOT-INDEXED-BUT-POS.XML, KEEP-
> 1.TXT, OPEN-EXCHANGE-RATES.JSON, STOPWITHBOM.TXT, SCHEMA-
> BINARYFIELD.XML, SOLRCONFIG-SPELLCHECKER.XML, SOLRCONFIG-UPDATE-
> PROCESSOR-CHAINS.XML, BAD-SCHEMA-OMIT-TF-BUT-NOT-POS.XML, BAD-
> SCHEMA-DUP-FIELDTYPE.XML, SOLRCONFIG-MASTER1.XML, SYNONYMS.TXT,
> SCHEMA_CODEC.XML, SCHEMA.XML, SOLRCONFIG-SOLR-749.XML,
> SOLRCONFIG-MASTER1-KEEPONEBACKUP.XML, SOLRCONFIG-
> FUNCTIONQUERY.XML, STOP-2.TXT, SOLRCONFIG-TERMINDEX.XML, SCHEMA-
> LMDIRICHLET.XML, SOLRCONFIG-ELEVATE.XML, SCHEMA-FOLDING.XML,
> STOPWORDS.TXT, SCHEMA-STOP-KEEP.XML, BAD-SCHEMA-NOT-INDEXED-BUT-
> NORMS.XML, SOLRCONFIG-SOLCOREPROPERTIES.XML, STOP-1.TXT,
> SOLRCONFIG-MASTER2.XML, SCHEMA-SPELLCHECKER.XML, SOLRCONFIG-
> LAZYWRITER.XML, SCHEMA-LUCENEMATCHVERSION.XML, BAD-MP-
> SOLRCONFIG.XML, FRENCHARTICLES.TXT, SCHEMA15.XML, SOLRCONFIG-
> REQHANDLER.INCL, SCHEMASURROUND.XML, SCHEMA-COLLATEFILTER.XML,
> SOLRCONFIG-MASTER3.XML, HUNSPELL-TEST.DIC, SOLRCONFIG-
> XINCLUDE.XML, BAD-SCHEMA-CODEC-GLOBAL-VS-FT-MISMATCH.XML,
> SOLRCONFIG-DELPOLICY1.XML, SOLRCONFIG-SLAVE1.XML, SCHEMA-SIM.XML,
> SCHEMA-COLLATE.XML, STOP-SNOWBALL.TXT, BAD-SCHEMA-SIM-GLOBAL-VS-
> FT-MISMATCH.XML, PROTWORDS.TXT, SCHEMA-TRIE.XML,
> SOLRCONFIG_CODEC.XML, BAD-SOLRCONFIG-INVALID-SCRIPTFILE.XML,
> SCHEMA-TFIDF.XML, SOLRCONFIG-SCRIPT-UPDATEPROCESSOR.XML, SCHEMA-
> LMJELINEKMERCER.XML, PHRASESUGGEST.TXT, BAD-SOLRCONFIG-MISSING-
> SCRIPTFILE.XML, SOLRCONFIG-BASIC-LUCENEVERSION31.XML, BAD-SCHEMA-
> UNIQUEKEY-USES-DEFAULT.XML, OLD_SYNONYMS.TXT, SOLRCONFIG-
> DELPOLICY2.XML, XSLT, SOLRCONFIG-NATIVELOCK.XML, BAD-SCHEMA-DUP-
> FIELD.XML, SOLRCONFIG-NOCACHE.XML, SCHEMA-BM25.XML,
> ADDFIELDS.UPDATEPROCESSOR.JS, SOLRCONFIG-ALTDIRECTORY.XML,
> SOLRCONFIG-QUERYSENDER-NOQUERY.XML, COMPOUNDDICTIONARY.TXT,
> SOLRCONFIG_PERF.XML, BAD-SCHEMA-ANALYZER-CLASS-AND-NESTED.XML,
> SCHEMA-NOT-REQUIRED-UNIQUE-KEY.XML, KEEP-2.TXT, BAD-SCHEMA-
> UNIQUEKEY-IS-COPYFIELD-DEST.XML, SCHEMA12.XML, MAPPING-
> ISOLATIN1ACCENT.TXT, BAD_SOLRCONFIG.XML, BAD-SCHEMA-EXTERNAL-
> FILEFIELD.XML]
> [junit4:junit4]   2> 1106 T42 oass.SolrIndexSearcher.<init> Opening
> Searcher@154b37e5 main
> [junit4:junit4]   2> 1107 T42 oass.SolrIndexSearcher.getIndexDir WARNING
> WARNING: Directory impl does not support setting indexDir:
> org.apache.lucene.store.MockDirectoryWrapper
> [junit4:junit4]   2> 1108 T42 oasu.CommitTracker.<init> Hard AutoCommit:
> disabled
> [junit4:junit4]   2> 1109 T42 oasu.CommitTracker.<init> Soft AutoCommit:
> disabled
> [junit4:junit4]   2> 1110 T42 oashc.SpellCheckComponent.inform Initializing
> spell checkers
> [junit4:junit4]   2> 1120 T42 oass.DirectSolrSpellChecker.init init:
> {name=direct,classname=DirectSolrSpellChecker,field=lowerfilt,minQueryLengt
> h=3}
> [junit4:junit4]   2> 1176 T42 oashc.HttpShardHandlerFactory.getParameter
> Setting socketTimeout to: 0
> [junit4:junit4]   2> 1177 T42 oashc.HttpShardHandlerFactory.getParameter
> Setting urlScheme to: http://
> [junit4:junit4]   2> 1177 T42 oashc.HttpShardHandlerFactory.getParameter
> Setting connTimeout to: 0
> [junit4:junit4]   2> 1178 T42 oashc.HttpShardHandlerFactory.getParameter
> Setting maxConnectionsPerHost to: 20
> [junit4:junit4]   2> 1179 T42 oashc.HttpShardHandlerFactory.getParameter
> Setting corePoolSize to: 0
> [junit4:junit4]   2> 1179 T42 oashc.HttpShardHandlerFactory.getParameter
> Setting maximumPoolSize to: 2147483647
> [junit4:junit4]   2> 1180 T42 oashc.HttpShardHandlerFactory.getParameter
> Setting maxThreadIdleTime to: 5
> [junit4:junit4]   2> 1181 T42 oashc.HttpShardHandlerFactory.getParameter
> Setting sizeOfQueue to: -1
> [junit4:junit4]   2> 1182 T42 oashc.HttpShardHandlerFactory.getParameter
> Setting fairnessPolicy to: false
> [junit4:junit4]   2> 1182 T42 oascsi.HttpClientUtil.createClient Creating new
> http client,
> config:maxConnectionsPerHost=20&maxConnections=10000&socketTimeout=0
> &connTimeout=0&retry=false
> [junit4:junit4]   2> 1205 T52 oasc.SolrCore.registerSearcher [collection1]
> Registered new searcher Searcher@154b37e5
> main{StandardDirectoryReader(segments_1:1)}
> [junit4:junit4]   2> 1218 T42 oasc.CoreContainer.register registering core:
> collection1
> [junit4:junit4]   2> 1219 T42 oass.SolrDispatchFilter.init
> user.dir=/usr/home/hudson/hudson-slave/workspace/Lucene-Solr-Tests-4.x-
> java7/solr/build/solr-core/test/J1
> [junit4:junit4]   2> 1219 T42 oass.SolrDispatchFilter.init SolrDispatchFilter.init()
> done
> [junit4:junit4]   2> 1220 T42 oascsi.HttpClientUtil.createClient Creating new
> http client,
> config:maxConnections=128&maxConnectionsPerHost=32&followRedirects=fals
> e
> [junit4:junit4]   2> 1235 T42 oejs.Server.doStart jetty-8.1.2.v20120308
> [junit4:junit4]   2> 1238 T42 oejs.AbstractConnector.doStart Started
> SocketConnector@0.0.0.0:54738
> [junit4:junit4]   2> 1239 T42 oasc.SolrResourceLoader.locateSolrHome JNDI not
> configured for solr (NoInitialContextEx)
> [junit4:junit4]   2> 1239 T42 oasc.SolrResourceLoader.locateSolrHome using
> system property solr.solr.home: /usr/home/hudson/hudson-
> slave/workspace/Lucene-Solr-Tests-4.x-java7/solr/build/solr-core/test-files/solr
> [junit4:junit4]   2> 1240 T42 oasc.SolrResourceLoader.<init> new
> SolrResourceLoader for deduced Solr Home: '/usr/home/hudson/hudson-
> slave/workspace/Lucene-Solr-Tests-4.x-java7/solr/build/solr-core/test-
> files/solr/'
> [junit4:junit4]   2> 1295 T42 oass.SolrDispatchFilter.init SolrDispatchFilter.init()
> [junit4:junit4]   2> 1296 T42 oasc.SolrResourceLoader.locateSolrHome JNDI not
> configured for solr (NoInitialContextEx)
> [junit4:junit4]   2> 1297 T42 oasc.SolrResourceLoader.locateSolrHome using
> system property solr.solr.home: /usr/home/hudson/hudson-
> slave/workspace/Lucene-Solr-Tests-4.x-java7/solr/build/solr-core/test-files/solr
> [junit4:junit4]   2> 1298 T42 oasc.CoreContainer$Initializer.initialize looking for
> solr.xml: /usr/home/hudson/hudson-slave/workspace/Lucene-Solr-Tests-4.x-
> java7/solr/build/solr-core/test-files/solr/solr.xml
> [junit4:junit4]   2> 1299 T42 oasc.CoreContainer.<init> New CoreContainer
> 2097053221
> [junit4:junit4]   2> 1300 T42 oasc.CoreContainer.load Loading CoreContainer
> using Solr Home: '/usr/home/hudson/hudson-slave/workspace/Lucene-Solr-
> Tests-4.x-java7/solr/build/solr-core/test-files/solr/'
> [junit4:junit4]   2> 1300 T42 oasc.SolrResourceLoader.<init> new
> SolrResourceLoader for directory: '/usr/home/hudson/hudson-
> slave/workspace/Lucene-Solr-Tests-4.x-java7/solr/build/solr-core/test-
> files/solr/'
> [junit4:junit4]   2> 1339 T42 oasc.CoreContainer.load Registering Log Listener
> [junit4:junit4]   2> 1361 T42 oasc.CoreContainer.create Creating SolrCore
> 'collection1' using instanceDir: /usr/home/hudson/hudson-
> slave/workspace/Lucene-Solr-Tests-4.x-java7/solr/build/solr-core/test-
> files/solr/collection1
> [junit4:junit4]   2> 1363 T42 oasc.SolrResourceLoader.<init> new
> SolrResourceLoader for directory: '/usr/home/hudson/hudson-
> slave/workspace/Lucene-Solr-Tests-4.x-java7/solr/build/solr-core/test-
> files/solr/collection1/'
> [junit4:junit4]   2> 1364 T42 oasc.SolrResourceLoader.replaceClassLoader
> Adding 'file:/usr/home/hudson/hudson-slave/workspace/Lucene-Solr-Tests-4.x-
> java7/solr/build/solr-core/test-files/solr/collection1/lib/README' to
> classloader
> [junit4:junit4]   2> 1366 T42 oasc.SolrResourceLoader.replaceClassLoader
> Adding 'file:/usr/home/hudson/hudson-slave/workspace/Lucene-Solr-Tests-4.x-
> java7/solr/build/solr-core/test-files/solr/collection1/lib/classes/' to classloader
> [junit4:junit4]   2> 1423 T42 oasc.SolrConfig.<init> Using Lucene MatchVersion:
> LUCENE_40
> [junit4:junit4]   2> 1485 T42 oasc.SolrConfig.<init> Loaded SolrConfig:
> solrconfig.xml
> [junit4:junit4]   2> 1486 T42 oass.IndexSchema.readSchema Reading Solr
> Schema
> [junit4:junit4]   2> 1506 T42 oass.IndexSchema.readSchema Schema name=test
> [junit4:junit4]   2> 2167 T42 oass.OpenExchangeRatesOrgProvider.init
> Initialized with rates=open-exchange-rates.json, refreshInterval=1440.
> [junit4:junit4]   2> 2185 T42 oass.IndexSchema.readSchema default search field
> in schema is text
> [junit4:junit4]   2> 2190 T42 oass.IndexSchema.readSchema unique key field: id
> [junit4:junit4]   2> 2217 T42 oass.FileExchangeRateProvider.reload Reloading
> exchange rates from file currency.xml
> [junit4:junit4]   2> 2223 T42 oass.FileExchangeRateProvider.reload Reloading
> exchange rates from file currency.xml
> [junit4:junit4]   2> 2229 T42 oass.OpenExchangeRatesOrgProvider.reload
> Reloading exchange rates from open-exchange-rates.json
> [junit4:junit4]   2> 2232 T42 oass.OpenExchangeRatesOrgProvider.reload
> Reloading exchange rates from open-exchange-rates.json
> [junit4:junit4]   2> 2235 T42 oasc.SolrCore.<init> [collection1] Opening new
> SolrCore at /usr/home/hudson/hudson-slave/workspace/Lucene-Solr-Tests-4.x-
> java7/solr/build/solr-core/test-files/solr/collection1/,
> dataDir=./org.apache.solr.TestDistributedGrouping-
> 1346340262039/shard0/data/
> [junit4:junit4]   2> 2236 T42 oasc.JmxMonitoredMap.<init> JMX monitoring is
> enabled. Adding Solr mbeans to JMX Server:
> com.sun.jmx.mbeanserver.JmxMBeanServer@4fe88181
> [junit4:junit4]   2> 2238 T42 oasc.SolrCore.getNewIndexDir WARNING New
> index directory detected: old=null
> new=./org.apache.solr.TestDistributedGrouping-
> 1346340262039/shard0/data/index/
> [junit4:junit4]   2> 2239 T42 oasc.SolrCore.initIndex WARNING [collection1] Solr
> index directory './org.apache.solr.TestDistributedGrouping-
> 1346340262039/shard0/data/index' doesn't exist. Creating new index...
> [junit4:junit4]   2> 2240 T42 oasc.CachingDirectoryFactory.get return new
> directory for /usr/home/hudson/hudson-slave/workspace/Lucene-Solr-Tests-
> 4.x-java7/solr/build/solr-
> core/test/J1/./org.apache.solr.TestDistributedGrouping-
> 1346340262039/shard0/data/index forceNew:false
> [junit4:junit4]   2> 2245 T42 oasc.SolrDeletionPolicy.onCommit
> SolrDeletionPolicy.onCommit: commits:num=1
> [junit4:junit4]   2>
> 	commit{dir=MockDirWrapper(org.apache.lucene.store.RAMDirectory
> @58465d50
> lockFactory=org.apache.lucene.store.NativeFSLockFactory@17de8244),segFN=s
> egments_1,generation=1,filenames=[segments_1]
> [junit4:junit4]   2> 2245 T42 oasc.SolrDeletionPolicy.updateCommits newest
> commit = 1
> [junit4:junit4]   2> 2247 T42 oasc.SolrCore.initWriters created xml:
> solr.XMLResponseWriter
> [junit4:junit4]   2> 2251 T42 oasup.UpdateRequestProcessorChain.init inserting
> DistributedUpdateProcessorFactory into updateRequestProcessorChain
> "dedupe"
> [junit4:junit4]   2> 2252 T42 oasup.UpdateRequestProcessorChain.init inserting
> DistributedUpdateProcessorFactory into updateRequestProcessorChain
> "dedupe-allfields"
> [junit4:junit4]   2> 2252 T42 oasup.UpdateRequestProcessorChain.init inserting
> DistributedUpdateProcessorFactory into updateRequestProcessorChain
> "stored_sig"
> [junit4:junit4]   2> 2253 T42 oasup.UpdateRequestProcessorChain.init inserting
> DistributedUpdateProcessorFactory into updateRequestProcessorChain "uniq-
> fields"
> [junit4:junit4]   2> 2255 T42 oasup.UpdateRequestProcessorChain.init inserting
> DistributedUpdateProcessorFactory into updateRequestProcessorChain "distrib-
> dup-test-chain-implicit"
> [junit4:junit4]   2> 2256 T42 oasc.RequestHandlers.initHandlersFromConfig
> adding lazy requestHandler: solr.ReplicationHandler
> [junit4:junit4]   2> 2257 T42 oasc.RequestHandlers.initHandlersFromConfig
> created /replication: solr.ReplicationHandler
> [junit4:junit4]   2> 2258 T42 oasc.RequestHandlers.initHandlersFromConfig
> created standard: solr.StandardRequestHandler
> [junit4:junit4]   2> 2259 T42 oasc.RequestHandlers.initHandlersFromConfig
> created /get: solr.RealTimeGetHandler
> [junit4:junit4]   2> 2261 T42 oasc.RequestHandlers.initHandlersFromConfig
> created dismax: solr.SearchHandler
> [junit4:junit4]   2> 2262 T42 oasc.RequestHandlers.initHandlersFromConfig
> created mock: org.apache.solr.core.MockQuerySenderListenerReqHandler
> [junit4:junit4]   2> 2263 T42 oasc.RequestHandlers.initHandlersFromConfig
> created /admin/: org.apache.solr.handler.admin.AdminHandlers
> [junit4:junit4]   2> 2264 T42 oasc.RequestHandlers.initHandlersFromConfig
> created defaults: solr.StandardRequestHandler
> [junit4:junit4]   2> 2265 T42 oasc.RequestHandlers.initHandlersFromConfig
> adding lazy requestHandler: solr.StandardRequestHandler
> [junit4:junit4]   2> 2266 T42 oasc.RequestHandlers.initHandlersFromConfig
> created lazy: solr.StandardRequestHandler
> [junit4:junit4]   2> 2267 T42 oasc.RequestHandlers.initHandlersFromConfig
> created /update: solr.UpdateRequestHandler
> [junit4:junit4]   2> 2268 T42 oasc.RequestHandlers.initHandlersFromConfig
> created /terms: org.apache.solr.handler.component.SearchHandler
> [junit4:junit4]   2> 2270 T42 oasc.RequestHandlers.initHandlersFromConfig
> created spellCheckCompRH:
> org.apache.solr.handler.component.SearchHandler
> [junit4:junit4]   2> 2271 T42 oasc.RequestHandlers.initHandlersFromConfig
> created spellCheckCompRH_Direct:
> org.apache.solr.handler.component.SearchHandler
> [junit4:junit4]   2> 2272 T42 oasc.RequestHandlers.initHandlersFromConfig
> created spellCheckWithWordbreak:
> org.apache.solr.handler.component.SearchHandler
> [junit4:junit4]   2> 2274 T42 oasc.RequestHandlers.initHandlersFromConfig
> created spellCheckWithWordbreak_Direct:
> org.apache.solr.handler.component.SearchHandler
> [junit4:junit4]   2> 2275 T42 oasc.RequestHandlers.initHandlersFromConfig
> created spellCheckCompRH1:
> org.apache.solr.handler.component.SearchHandler
> [junit4:junit4]   2> 2276 T42 oasc.RequestHandlers.initHandlersFromConfig
> created tvrh: org.apache.solr.handler.component.SearchHandler
> [junit4:junit4]   2> 2277 T42 oasc.RequestHandlers.initHandlersFromConfig
> created /mlt: solr.MoreLikeThisHandler
> [junit4:junit4]   2> 2279 T42 oasc.RequestHandlers.initHandlersFromConfig
> created /debug/dump: solr.DumpRequestHandler
> [junit4:junit4]   2> 2283 T42 oashl.XMLLoader.init xsltCacheLifetimeSeconds=60
> [junit4:junit4]   2> 2288 T42 oasc.SolrCore.initDeprecatedSupport WARNING
> solrconfig.xml uses deprecated <admin/gettableFiles>, Please update your
> config to use the ShowFileRequestHandler.
> [junit4:junit4]   2> 2291 T42 oasc.SolrCore.initDeprecatedSupport WARNING
> adding ShowFileRequestHandler with hidden files:
> [THROW.ERROR.ON.ADD.UPDATEPROCESSOR.JS, SOLRCONFIG-
> HIGHLIGHT.XML, SCHEMA-REQUIRED-FIELDS.XML,
> TRIVIAL.UPDATEPROCESSOR1.JS, BAD-SCHEMA-DUP-DYNAMICFIELD.XML,
> SCHEMA-REPLICATION2.XML, SCHEMA-MINIMAL.XML, SOLRCONFIG-
> CACHING.XML, SOLRCONFIG-REPEATER.XML, SOLRCONFIG-
> MERGEPOLICY.XML, CURRENCY.XML, BAD-SCHEMA-NONTEXT-ANALYZER.XML,
> SOLRCONFIG-TLOG.XML, SOLRCONFIG-MASTER.XML, BAD-SCHEMA-
> UNIQUEKEY-MULTIVALUED.XML, SCHEMA11.XML, SOLRCONFIG-BASIC.XML,
> DA_COMPOUNDDICTIONARY.TXT,
> MISSLEADING.EXTENSION.UPDATEPROCESSOR.JS.TXT, SCHEMA-COPYFIELD-
> TEST.XML, SOLRCONFIG-SLAVE.XML, SOLRCONFIG-PROPINJECT-
> INDEXDEFAULT.XML, ELEVATE.XML, TRIVIAL.UPDATEPROCESSOR0.JS, BAD-
> SOLRCONFIG-BOGUS-SCRIPTENGINE-NAME.XML, SCHEMA-CHARFILTERS.XML,
> SCHEMA-IB.XML, SOLRCONFIG-QUERYSENDER.XML, SCHEMA-
> REPLICATION1.XML, DA_UTF8.XML, CONDITIONAL.UPDATEPROCESSOR.JS,
> MISSING.FUNCTIONS.UPDATEPROCESSOR.JS, SOLRCONFIG-
> ENABLEPLUGIN.XML, HYPHENATION.DTD, STEMDICT.TXT, SCHEMA-
> PHRASESUGGEST.XML, HUNSPELL-TEST.AFF, STOPTYPES-1.TXT,
> STOPWORDSWRONGENCODING.TXT, SCHEMA-NUMERIC.XML, SOLRCONFIG-
> TRANSFORMERS.XML, SOLRCONFIG-PROPINJECT.XML, BAD-SCHEMA-NOT-
> INDEXED-BUT-TF.XML, SOLRCONFIG-SIMPLELOCK.XML, WDFTYPES.TXT,
> SCHEMA-REVERSED.XML, STOPTYPES-2.TXT, SOLRCONFIG-
> SPELLCHECKCOMPONENT.XML, SCHEMA-DFR.XML, SOLRCONFIG-
> PHRASESUGGEST.XML, BAD-SCHEMA-NOT-INDEXED-BUT-POS.XML, KEEP-
> 1.TXT, OPEN-EXCHANGE-RATES.JSON, STOPWITHBOM.TXT, SCHEMA-
> BINARYFIELD.XML, SOLRCONFIG-SPELLCHECKER.XML, SOLRCONFIG-UPDATE-
> PROCESSOR-CHAINS.XML, BAD-SCHEMA-OMIT-TF-BUT-NOT-POS.XML, BAD-
> SCHEMA-DUP-FIELDTYPE.XML, SOLRCONFIG-MASTER1.XML, SYNONYMS.TXT,
> SCHEMA_CODEC.XML, SCHEMA.XML, SOLRCONFIG-SOLR-749.XML,
> SOLRCONFIG-MASTER1-KEEPONEBACKUP.XML, SOLRCONFIG-
> FUNCTIONQUERY.XML, STOP-2.TXT, SOLRCONFIG-TERMINDEX.XML, SCHEMA-
> LMDIRICHLET.XML, SOLRCONFIG-ELEVATE.XML, SCHEMA-FOLDING.XML,
> STOPWORDS.TXT, SCHEMA-STOP-KEEP.XML, BAD-SCHEMA-NOT-INDEXED-BUT-
> NORMS.XML, SOLRCONFIG-SOLCOREPROPERTIES.XML, STOP-1.TXT,
> SOLRCONFIG-MASTER2.XML, SCHEMA-SPELLCHECKER.XML, SOLRCONFIG-
> LAZYWRITER.XML, SCHEMA-LUCENEMATCHVERSION.XML, BAD-MP-
> SOLRCONFIG.XML, FRENCHARTICLES.TXT, SCHEMA15.XML, SOLRCONFIG-
> REQHANDLER.INCL, SCHEMASURROUND.XML, SCHEMA-COLLATEFILTER.XML,
> SOLRCONFIG-MASTER3.XML, HUNSPELL-TEST.DIC, SOLRCONFIG-
> XINCLUDE.XML, BAD-SCHEMA-CODEC-GLOBAL-VS-FT-MISMATCH.XML,
> SOLRCONFIG-DELPOLICY1.XML, SOLRCONFIG-SLAVE1.XML, SCHEMA-SIM.XML,
> SCHEMA-COLLATE.XML, STOP-SNOWBALL.TXT, BAD-SCHEMA-SIM-GLOBAL-VS-
> FT-MISMATCH.XML, PROTWORDS.TXT, SCHEMA-TRIE.XML,
> SOLRCONFIG_CODEC.XML, BAD-SOLRCONFIG-INVALID-SCRIPTFILE.XML,
> SCHEMA-TFIDF.XML, SOLRCONFIG-SCRIPT-UPDATEPROCESSOR.XML, SCHEMA-
> LMJELINEKMERCER.XML, PHRASESUGGEST.TXT, BAD-SOLRCONFIG-MISSING-
> SCRIPTFILE.XML, SOLRCONFIG-BASIC-LUCENEVERSION31.XML, BAD-SCHEMA-
> UNIQUEKEY-USES-DEFAULT.XML, OLD_SYNONYMS.TXT, SOLRCONFIG-
> DELPOLICY2.XML, XSLT, SOLRCONFIG-NATIVELOCK.XML, BAD-SCHEMA-DUP-
> FIELD.XML, SOLRCONFIG-NOCACHE.XML, SCHEMA-BM25.XML,
> ADDFIELDS.UPDATEPROCESSOR.JS, SOLRCONFIG-ALTDIRECTORY.XML,
> SOLRCONFIG-QUERYSENDER-NOQUERY.XML, COMPOUNDDICTIONARY.TXT,
> SOLRCONFIG_PERF.XML, BAD-SCHEMA-ANALYZER-CLASS-AND-NESTED.XML,
> SCHEMA-NOT-REQUIRED-UNIQUE-KEY.XML, KEEP-2.TXT, BAD-SCHEMA-
> UNIQUEKEY-IS-COPYFIELD-DEST.XML, SCHEMA12.XML, MAPPING-
> ISOLATIN1ACCENT.TXT, BAD_SOLRCONFIG.XML, BAD-SCHEMA-EXTERNAL-
> FILEFIELD.XML]
> [junit4:junit4]   2> 2296 T42 oass.SolrIndexSearcher.<init> Opening
> Searcher@62da57c9 main
> [junit4:junit4]   2> 2296 T42 oass.SolrIndexSearcher.getIndexDir WARNING
> WARNING: Directory impl does not support setting indexDir:
> org.apache.lucene.store.MockDirectoryWrapper
> [junit4:junit4]   2> 2297 T42 oasu.CommitTracker.<init> Hard AutoCommit:
> disabled
> [junit4:junit4]   2> 2298 T42 oasu.CommitTracker.<init> Soft AutoCommit:
> disabled
> [junit4:junit4]   2> 2299 T42 oashc.SpellCheckComponent.inform Initializing
> spell checkers
> [junit4:junit4]   2> 2310 T42 oass.DirectSolrSpellChecker.init init:
> {name=direct,classname=DirectSolrSpellChecker,field=lowerfilt,minQueryLengt
> h=3}
> [junit4:junit4]   2> 2356 T42 oashc.HttpShardHandlerFactory.getParameter
> Setting socketTimeout to: 0
> [junit4:junit4]   2> 2357 T42 oashc.HttpShardHandlerFactory.getParameter
> Setting urlScheme to: http://
> [junit4:junit4]   2> 2358 T42 oashc.HttpShardHandlerFactory.getParameter
> Setting connTimeout to: 0
> [junit4:junit4]   2> 2358 T42 oashc.HttpShardHandlerFactory.getParameter
> Setting maxConnectionsPerHost to: 20
> [junit4:junit4]   2> 2359 T42 oashc.HttpShardHandlerFactory.getParameter
> Setting corePoolSize to: 0
> [junit4:junit4]   2> 2360 T42 oashc.HttpShardHandlerFactory.getParameter
> Setting maximumPoolSize to: 2147483647
> [junit4:junit4]   2> 2360 T42 oashc.HttpShardHandlerFactory.getParameter
> Setting maxThreadIdleTime to: 5
> [junit4:junit4]   2> 2361 T42 oashc.HttpShardHandlerFactory.getParameter
> Setting sizeOfQueue to: -1
> [junit4:junit4]   2> 2361 T42 oashc.HttpShardHandlerFactory.getParameter
> Setting fairnessPolicy to: false
> [junit4:junit4]   2> 2362 T42 oascsi.HttpClientUtil.createClient Creating new
> http client,
> config:maxConnectionsPerHost=20&maxConnections=10000&socketTimeout=0
> &connTimeout=0&retry=false
> [junit4:junit4]   2> 2386 T62 oasc.SolrCore.registerSearcher [collection1]
> Registered new searcher Searcher@62da57c9
> main{StandardDirectoryReader(segments_1:1)}
> [junit4:junit4]   2> 2400 T42 oasc.CoreContainer.register registering core:
> collection1
> [junit4:junit4]   2> 2400 T42 oass.SolrDispatchFilter.init
> user.dir=/usr/home/hudson/hudson-slave/workspace/Lucene-Solr-Tests-4.x-
> java7/solr/build/solr-core/test/J1
> [junit4:junit4]   2> 2401 T42 oass.SolrDispatchFilter.init SolrDispatchFilter.init()
> done
> [junit4:junit4]   2> 2402 T42 oascsi.HttpClientUtil.createClient Creating new
> http client,
> config:maxConnections=128&maxConnectionsPerHost=32&followRedirects=fals
> e
> [junit4:junit4]   2> 2417 T44 oejs.AbstractConnector$Acceptor.run WARNING
> java.security.AccessControlException: access denied
> ("java.net.SocketPermission" "140.211.11.196:53526" "accept,resolve")
> [junit4:junit4]   2> 	at
> java.security.AccessControlContext.checkPermission(AccessControlContext.java
> :366)
> [junit4:junit4]   2> 	at
> java.security.AccessController.checkPermission(AccessController.java:555)
> [junit4:junit4]   2> 	at
> java.lang.SecurityManager.checkPermission(SecurityManager.java:549)
> [junit4:junit4]   2> 	at
> java.lang.SecurityManager.checkAccept(SecurityManager.java:1174)
> [junit4:junit4]   2> 	at
> java.net.ServerSocket.implAccept(ServerSocket.java:526)
> [junit4:junit4]   2> 	at java.net.ServerSocket.accept(ServerSocket.java:490)
> [junit4:junit4]   2> 	at
> org.eclipse.jetty.server.bio.SocketConnector.accept(SocketConnector.java:112)
> [junit4:junit4]   2> 	at
> org.eclipse.jetty.server.AbstractConnector$Acceptor.run(AbstractConnector.jav
> a:933)
> [junit4:junit4]   2> 	at
> org.eclipse.jetty.util.thread.QueuedThreadPool.runJob(QueuedThreadPool.java:
> 599)
> [junit4:junit4]   2> 	at
> org.eclipse.jetty.util.thread.QueuedThreadPool$3.run(QueuedThreadPool.java:
> 534)
> [junit4:junit4]   2> 	at java.lang.Thread.run(Thread.java:722)
> [junit4:junit4]   2>
> [junit4:junit4]   2> 2417 T42 oasc.CoreContainer.shutdown Shutting down
> CoreContainer instance=1483669095
> [junit4:junit4]   2> 2419 T42 oasc.SolrCore.close [collection1]  CLOSING
> SolrCore org.apache.solr.core.SolrCore@27790e56
> [junit4:junit4]   2> 2436 T42 oasc.SolrCore.closeSearcher [collection1] Closing
> main searcher on request.
> [junit4:junit4]   2> 2436 T42 oasu.DirectUpdateHandler2.close closing
> DirectUpdateHandler2{commits=0,autocommits=0,soft
> autocommits=0,optimizes=0,rollbacks=0,expungeDeletes=0,docsPending=0,add
> s=0,deletesById=0,deletesByQuery=0,errors=0,cumulative_adds=0,cumulative_
> deletesById=0,cumulative_deletesByQuery=0,cumulative_errors=0}
> [junit4:junit4]   2> 2437 T42 oasu.DefaultSolrCoreState.decref SolrCoreState ref
> count has reached 0 - closing IndexWriter
> [junit4:junit4]   2> 2438 T42 oejsh.ContextHandler.doStop stopped
> o.e.j.s.ServletContextHandler{/solr,null}
> [junit4:junit4]   2> 2491 T42 oasc.CoreContainer.shutdown Shutting down
> CoreContainer instance=2097053221
> [junit4:junit4]   2> 2492 T42 oasc.SolrCore.close [collection1]  CLOSING
> SolrCore org.apache.solr.core.SolrCore@6651ccf
> [junit4:junit4]   2> 2519 T42 oasc.SolrCore.closeSearcher [collection1] Closing
> main searcher on request.
> [junit4:junit4]   2> 2520 T42 oasu.DirectUpdateHandler2.close closing
> DirectUpdateHandler2{commits=0,autocommits=0,soft
> autocommits=0,optimizes=0,rollbacks=0,expungeDeletes=0,docsPending=0,add
> s=0,deletesById=0,deletesByQuery=0,errors=0,cumulative_adds=0,cumulative_
> deletesById=0,cumulative_deletesByQuery=0,cumulative_errors=0}
> [junit4:junit4]   2> 2521 T42 oasu.DefaultSolrCoreState.decref SolrCoreState ref
> count has reached 0 - closing IndexWriter
> [junit4:junit4]   2> 2522 T42 oejsh.ContextHandler.doStop stopped
> o.e.j.s.ServletContextHandler{/solr,null}
> [junit4:junit4]   2> 2599 T42 oas.SolrTestCaseJ4.tearDown ###Ending
> testDistribSearch
> [junit4:junit4]   2> NOTE: reproduce with: ant test  -
> Dtestcase=TestDistributedGrouping -Dtests.method=testDistribSearch -
> Dtests.seed=E20548CE3E5ACD20 -Dtests.multiplier=3 -Dtests.slow=true -
> Dtests.locale=sk_SK -Dtests.timezone=Asia/Katmandu -Dtests.file.encoding=ISO-
> 8859-1
> [junit4:junit4] ERROR   2.61s J1 | TestDistributedGrouping.testDistribSearch <<<
> [junit4:junit4]    > Throwable #1:
> org.apache.solr.client.solrj.SolrServerException: IOException occured when
> talking to server at: http://localhost:18020/solr
> [junit4:junit4]    > 	at
> __randomizedtesting.SeedInfo.seed([E20548CE3E5ACD20:63E3C6D64905AD1C]
> :0)
> [junit4:junit4]    > 	at
> org.apache.solr.client.solrj.impl.HttpSolrServer.request(HttpSolrServer.java:414
> )
> [junit4:junit4]    > 	at
> org.apache.solr.client.solrj.impl.HttpSolrServer.request(HttpSolrServer.java:182
> )
> [junit4:junit4]    > 	at
> org.apache.solr.client.solrj.request.AbstractUpdateRequest.process(AbstractUp
> dateRequest.java:117)
> [junit4:junit4]    > 	at
> org.apache.solr.client.solrj.SolrServer.deleteByQuery(SolrServer.java:306)
> [junit4:junit4]    > 	at
> org.apache.solr.client.solrj.SolrServer.deleteByQuery(SolrServer.java:291)
> [junit4:junit4]    > 	at
> org.apache.solr.BaseDistributedSearchTestCase.del(BaseDistributedSearchTest
> Case.java:354)
> [junit4:junit4]    > 	at
> org.apache.solr.TestDistributedGrouping.doTest(TestDistributedGrouping.java:4
> 7)
> [junit4:junit4]    > 	at
> org.apache.solr.BaseDistributedSearchTestCase.testDistribSearch(BaseDistribut
> edSearchTestCase.java:697)
> [junit4:junit4]    > 	at
> sun.reflect.NativeMethodAccessorImpl.invoke0(Native Method)
> [junit4:junit4]    > 	at
> sun.reflect.NativeMethodAccessorImpl.invoke(NativeMethodAccessorImpl.java:
> 57)
> [junit4:junit4]    > 	at
> sun.reflect.DelegatingMethodAccessorImpl.invoke(DelegatingMethodAccessorI
> mpl.java:43)
> [junit4:junit4]    > 	at java.lang.reflect.Method.invoke(Method.java:601)
> [junit4:junit4]    > 	at
> com.carrotsearch.randomizedtesting.RandomizedRunner.invoke(RandomizedRu
> nner.java:1559)
> [junit4:junit4]    > 	at
> com.carrotsearch.randomizedtesting.RandomizedRunner.access$600(Randomiz
> edRunner.java:79)
> [junit4:junit4]    > 	at
> com.carrotsearch.randomizedtesting.RandomizedRunner$6.evaluate(Randomiz
> edRunner.java:737)
> [junit4:junit4]    > 	at
> com.carrotsearch.randomizedtesting.RandomizedRunner$7.evaluate(Randomiz
> edRunner.java:773)
> [junit4:junit4]    > 	at
> com.carrotsearch.randomizedtesting.RandomizedRunner$8.evaluate(Randomiz
> edRunner.java:787)
> [junit4:junit4]    > 	at
> com.carrotsearch.randomizedtesting.rules.SystemPropertiesRestoreRule$1.eval
> uate(SystemPropertiesRestoreRule.java:53)
> [junit4:junit4]    > 	at
> org.apache.lucene.util.TestRuleSetupTeardownChained$1.evaluate(TestRuleSet
> upTeardownChained.java:50)
> [junit4:junit4]    > 	at
> org.apache.lucene.util.TestRuleFieldCacheSanity$1.evaluate(TestRuleFieldCach
> eSanity.java:51)
> [junit4:junit4]    > 	at
> org.apache.lucene.util.AbstractBeforeAfterRule$1.evaluate(AbstractBeforeAfte
> rRule.java:45)
> [junit4:junit4]    > 	at
> com.carrotsearch.randomizedtesting.rules.SystemPropertiesInvariantRule$1.ev
> aluate(SystemPropertiesInvariantRule.java:55)
> [junit4:junit4]    > 	at
> org.apache.lucene.util.TestRuleThreadAndTestName$1.evaluate(TestRuleThrea
> dAndTestName.java:48)
> [junit4:junit4]    > 	at
> org.apache.lucene.util.TestRuleIgnoreAfterMaxFailures$1.evaluate(TestRuleIgn
> oreAfterMaxFailures.java:70)
> [junit4:junit4]    > 	at
> org.apache.lucene.util.TestRuleMarkFailure$1.evaluate(TestRuleMarkFailure.ja
> va:48)
> [junit4:junit4]    > 	at
> com.carrotsearch.randomizedtesting.rules.StatementAdapter.evaluate(Stateme
> ntAdapter.java:36)
> [junit4:junit4]    > 	at
> com.carrotsearch.randomizedtesting.ThreadLeakControl$StatementRunner.run
> (ThreadLeakControl.java:345)
> [junit4:junit4]    > 	at
> com.carrotsearch.randomizedtesting.ThreadLeakControl.forkTimeoutingTask(T
> hreadLeakControl.java:769)
> [junit4:junit4]    > 	at
> com.carrotsearch.randomizedtesting.ThreadLeakControl$3.evaluate(ThreadLea
> kControl.java:429)
> [junit4:junit4]    > 	at
> com.carrotsearch.randomizedtesting.RandomizedRunner.runSingleTest(Rando
> mizedRunner.java:746)
> [junit4:junit4]    > 	at
> com.carrotsearch.randomizedtesting.RandomizedRunner$3.evaluate(Randomiz
> edRunner.java:648)
> [junit4:junit4]    > 	at
> com.carrotsearch.randomizedtesting.RandomizedRunner$4.evaluate(Randomiz
> edRunner.java:682)
> [junit4:junit4]    > 	at
> com.carrotsearch.randomizedtesting.RandomizedRunner$5.evaluate(Randomiz
> edRunner.java:693)
> [junit4:junit4]    > 	at
> com.carrotsearch.randomizedtesting.rules.StatementAdapter.evaluate(Stateme
> ntAdapter.java:36)
> [junit4:junit4]    > 	at
> com.carrotsearch.randomizedtesting.rules.SystemPropertiesRestoreRule$1.eval
> uate(SystemPropertiesRestoreRule.java:53)
> [junit4:junit4]    > 	at
> org.apache.lucene.util.AbstractBeforeAfterRule$1.evaluate(AbstractBeforeAfte
> rRule.java:45)
> [junit4:junit4]    > 	at
> org.apache.lucene.util.TestRuleStoreClassName$1.evaluate(TestRuleStoreClass
> Name.java:42)
> [junit4:junit4]    > 	at
> com.carrotsearch.randomizedtesting.rules.SystemPropertiesInvariantRule$1.ev
> aluate(SystemPropertiesInvariantRule.java:55)
> [junit4:junit4]    > 	at
> com.carrotsearch.randomizedtesting.rules.NoShadowingOrOverridesOnMethod
> sRule$1.evaluate(NoShadowingOrOverridesOnMethodsRule.java:39)
> [junit4:junit4]    > 	at
> com.carrotsearch.randomizedtesting.rules.NoShadowingOrOverridesOnMethod
> sRule$1.evaluate(NoShadowingOrOverridesOnMethodsRule.java:39)
> [junit4:junit4]    > 	at
> org.apache.lucene.util.TestRuleAssertionsRequired$1.evaluate(TestRuleAssertio
> nsRequired.java:40)
> [junit4:junit4]    > 	at
> org.apache.lucene.util.TestRuleMarkFailure$1.evaluate(TestRuleMarkFailure.ja
> va:48)
> [junit4:junit4]    > 	at
> org.apache.lucene.util.TestRuleIgnoreAfterMaxFailures$1.evaluate(TestRuleIgn
> oreAfterMaxFailures.java:70)
> [junit4:junit4]    > 	at
> org.apache.lucene.util.TestRuleIgnoreTestSuites$1.evaluate(TestRuleIgnoreTest
> Suites.java:55)
> [junit4:junit4]    > 	at
> com.carrotsearch.randomizedtesting.rules.StatementAdapter.evaluate(Stateme
> ntAdapter.java:36)
> [junit4:junit4]    > 	at
> com.carrotsearch.randomizedtesting.ThreadLeakControl$StatementRunner.run
> (ThreadLeakControl.java:345)
> [junit4:junit4]    > 	at java.lang.Thread.run(Thread.java:722)
> [junit4:junit4]    > Caused by: java.net.SocketException: Connection reset
> [junit4:junit4]    > 	at
> java.net.SocketInputStream.read(SocketInputStream.java:189)
> [junit4:junit4]    > 	at
> java.net.SocketInputStream.read(SocketInputStream.java:121)
> [junit4:junit4]    > 	at
> org.apache.http.impl.io.AbstractSessionInputBuffer.fillBuffer(AbstractSessionInp
> utBuffer.java:149)
> [junit4:junit4]    > 	at
> org.apache.http.impl.io.SocketInputBuffer.fillBuffer(SocketInputBuffer.java:111)
> [junit4:junit4]    > 	at
> org.apache.http.impl.io.AbstractSessionInputBuffer.readLine(AbstractSessionInp
> utBuffer.java:264)
> [junit4:junit4]    > 	at
> org.apache.http.impl.conn.DefaultResponseParser.parseHead(DefaultResponse
> Parser.java:98)
> [junit4:junit4]    > 	at
> org.apache.http.impl.io.AbstractMessageParser.parse(AbstractMessageParser.j
> ava:252)
> [junit4:junit4]    > 	at
> org.apache.http.impl.AbstractHttpClientConnection.receiveResponseHeader(Ab
> stractHttpClientConnection.java:282)
> [junit4:junit4]    > 	at
> org.apache.http.impl.conn.DefaultClientConnection.receiveResponseHeader(De
> faultClientConnection.java:247)
> [junit4:junit4]    > 	at
> org.apache.http.impl.conn.AbstractClientConnAdapter.receiveResponseHeader(
> AbstractClientConnAdapter.java:216)
> [junit4:junit4]    > 	at
> org.apache.http.protocol.HttpRequestExecutor.doReceiveResponse(HttpRequest
> Executor.java:298)
> [junit4:junit4]    > 	at
> org.apache.http.protocol.HttpRequestExecutor.execute(HttpRequestExecutor.ja
> va:125)
> [junit4:junit4]    > 	at
> org.apache.http.impl.client.DefaultRequestDirector.tryExecute(DefaultRequest
> Director.java:647)
> [junit4:junit4]    > 	at
> org.apache.http.impl.client.DefaultRequestDirector.execute(DefaultRequestDir
> ector.java:464)
> [junit4:junit4]    > 	at
> org.apache.http.impl.client.AbstractHttpClient.execute(AbstractHttpClient.java:
> 820)
> [junit4:junit4]    > 	at
> org.apache.http.impl.client.AbstractHttpClient.execute(AbstractHttpClient.java:
> 754)
> [junit4:junit4]    > 	at
> org.apache.http.impl.client.AbstractHttpClient.execute(AbstractHttpClient.java:
> 732)
> [junit4:junit4]    > 	at
> org.apache.solr.client.solrj.impl.HttpSolrServer.request(HttpSolrServer.java:353
> )
> [junit4:junit4]    > 	... 46 more
> [junit4:junit4]   2> 2614 T42 oas.SolrTestCaseJ4.deleteCore ###deleteCore
> [junit4:junit4]   2> NOTE: test params are: codec=Lucene3x,
> sim=RandomSimilarityProvider(queryNorm=false,coord=no): {}, locale=sk_SK,
> timezone=Asia/Katmandu
> [junit4:junit4]   2> NOTE: FreeBSD 9.0-RELEASE amd64/Oracle Corporation
> 1.7.0_06 (64-bit)/cpus=16,threads=1,free=40159664,total=104857600
> [junit4:junit4]   2> NOTE: All tests run in this JVM: [TestRemoteStreaming,
> TestQueryUtils, TestBinaryField, TestPropInjectDefaults,
> TestDistributedGrouping]
> [junit4:junit4] Completed on J1 in 2.65s, 1 test, 1 error <<< FAILURES!
> 
> [...truncated 10 lines...]
> [junit4:junit4] Suite: org.apache.solr.AnalysisAfterCoreReloadTest
> [junit4:junit4]   2> 1397 T41 oasu.AbstractSolrTestCase.setUp
> ####SETUP_START testStopwordsAfterCoreReload
> [junit4:junit4]   2> 1398 T41 oasc.SolrResourceLoader.<init> new
> SolrResourceLoader for directory: '/usr/home/hudson/hudson-
> slave/workspace/Lucene-Solr-Tests-4.x-java7/solr/build/solr-core/test/J0/./solr-
> test-home-15307150783267788/collection1/'
> [junit4:junit4]   2> 1400 T41 oasc.SolrResourceLoader.replaceClassLoader
> Adding 'file:/usr/home/hudson/hudson-slave/workspace/Lucene-Solr-Tests-4.x-
> java7/solr/build/solr-core/test/J0/solr-test-home-
> 15307150783267788/collection1/lib/README' to classloader
> [junit4:junit4]   2> 1401 T41 oasc.SolrResourceLoader.replaceClassLoader
> Adding 'file:/usr/home/hudson/hudson-slave/workspace/Lucene-Solr-Tests-4.x-
> java7/solr/build/solr-core/test/J0/solr-test-home-
> 15307150783267788/collection1/lib/classes/' to classloader
> [junit4:junit4]   2> 1475 T41 oasc.SolrConfig.<init> Using Lucene MatchVersion:
> LUCENE_40
> [junit4:junit4]   2> 1535 T41 oasc.SolrConfig.<init> Loaded SolrConfig:
> solrconfig.xml
> [junit4:junit4]   2> 1535 T41 oass.IndexSchema.readSchema Reading Solr
> Schema
> [junit4:junit4]   2> 1554 T41 oass.IndexSchema.readSchema Schema name=test
> [junit4:junit4]   2> 2196 T41 oass.OpenExchangeRatesOrgProvider.init
> Initialized with rates=open-exchange-rates.json, refreshInterval=1440.
> [junit4:junit4]   2> 2209 T41 oass.IndexSchema.readSchema default search field
> in schema is text
> [junit4:junit4]   2> 2212 T41 oass.IndexSchema.readSchema unique key field: id
> [junit4:junit4]   2> 2226 T41 oass.FileExchangeRateProvider.reload Reloading
> exchange rates from file currency.xml
> [junit4:junit4]   2> 2232 T41 oass.FileExchangeRateProvider.reload Reloading
> exchange rates from file currency.xml
> [junit4:junit4]   2> 2236 T41 oass.OpenExchangeRatesOrgProvider.reload
> Reloading exchange rates from open-exchange-rates.json
> [junit4:junit4]   2> 2238 T41 oass.OpenExchangeRatesOrgProvider.reload
> Reloading exchange rates from open-exchange-rates.json
> [junit4:junit4]   2> 2241 T41 oasc.SolrResourceLoader.locateSolrHome JNDI not
> configured for solr (NoInitialContextEx)
> [junit4:junit4]   2> 2241 T41 oasc.SolrResourceLoader.locateSolrHome using
> system property solr.solr.home: /usr/home/hudson/hudson-
> slave/workspace/Lucene-Solr-Tests-4.x-java7/solr/build/solr-core/test/J0/./solr-
> test-home-15307150783267788
> [junit4:junit4]   2> 2241 T41 oasc.SolrResourceLoader.<init> new
> SolrResourceLoader for directory: '/usr/home/hudson/hudson-
> slave/workspace/Lucene-Solr-Tests-4.x-java7/solr/build/solr-core/test/J0/./solr-
> test-home-15307150783267788/'
> [junit4:junit4]   2> 2257 T41 oasc.CoreContainer.<init> New CoreContainer
> 678768258
> [junit4:junit4]   2> 2258 T41 oasc.SolrCore.<init> [collection1] Opening new
> SolrCore at /usr/home/hudson/hudson-slave/workspace/Lucene-Solr-Tests-4.x-
> java7/solr/build/solr-core/test/J0/./solr-test-home-
> 15307150783267788/collection1/, dataDir=/usr/home/hudson/hudson-
> slave/workspace/Lucene-Solr-Tests-4.x-java7/solr/build/solr-
> core/test/J0/./org.apache.solr.AnalysisAfterCoreReloadTest-1346340266883/
> [junit4:junit4]   2> 2258 T41 oasc.JmxMonitoredMap.<init> JMX monitoring is
> enabled. Adding Solr mbeans to JMX Server:
> com.sun.jmx.mbeanserver.JmxMBeanServer@1457b484
> [junit4:junit4]   2> 2259 T41 oasc.SolrCore.getNewIndexDir WARNING New
> index directory detected: old=null new=/usr/home/hudson/hudson-
> slave/workspace/Lucene-Solr-Tests-4.x-java7/solr/build/solr-
> core/test/J0/./org.apache.solr.AnalysisAfterCoreReloadTest-
> 1346340266883/index/
> [junit4:junit4]   2> 2260 T41 oasc.SolrCore.initIndex WARNING [collection1] Solr
> index directory '/usr/home/hudson/hudson-slave/workspace/Lucene-Solr-Tests-
> 4.x-java7/solr/build/solr-
> core/test/J0/./org.apache.solr.AnalysisAfterCoreReloadTest-
> 1346340266883/index' doesn't exist. Creating new index...
> [junit4:junit4]   2> 2261 T41 oasc.CachingDirectoryFactory.get return new
> directory for /usr/home/hudson/hudson-slave/workspace/Lucene-Solr-Tests-
> 4.x-java7/solr/build/solr-
> core/test/J0/./org.apache.solr.AnalysisAfterCoreReloadTest-
> 1346340266883/index forceNew:false
> [junit4:junit4]   2> 2263 T41 oasc.SolrDeletionPolicy.onCommit
> SolrDeletionPolicy.onCommit: commits:num=1
> [junit4:junit4]   2>
> 	commit{dir=BaseDirectoryWrapper(org.apache.lucene.store.RAMDirec
> tory@2413b53e
> lockFactory=org.apache.lucene.store.NativeFSLockFactory@54308395),segFN=s
> egments_1,generation=1,filenames=[segments_1]
> [junit4:junit4]   2> 2263 T41 oasc.SolrDeletionPolicy.updateCommits newest
> commit = 1
> [junit4:junit4]   2> 2264 T41 oasc.SolrCore.initWriters created xml:
> solr.XMLResponseWriter
> [junit4:junit4]   2> 2266 T41 oasup.UpdateRequestProcessorChain.init inserting
> DistributedUpdateProcessorFactory into updateRequestProcessorChain
> "dedupe"
> [junit4:junit4]   2> 2266 T41 oasup.UpdateRequestProcessorChain.init inserting
> DistributedUpdateProcessorFactory into updateRequestProcessorChain
> "dedupe-allfields"
> [junit4:junit4]   2> 2267 T41 oasup.UpdateRequestProcessorChain.init inserting
> DistributedUpdateProcessorFactory into updateRequestProcessorChain
> "stored_sig"
> [junit4:junit4]   2> 2267 T41 oasup.UpdateRequestProcessorChain.init inserting
> DistributedUpdateProcessorFactory into updateRequestProcessorChain "uniq-
> fields"
> [junit4:junit4]   2> 2268 T41 oasup.UpdateRequestProcessorChain.init inserting
> DistributedUpdateProcessorFactory into updateRequestProcessorChain "distrib-
> dup-test-chain-implicit"
> [junit4:junit4]   2> 2268 T41 oasc.RequestHandlers.initHandlersFromConfig
> adding lazy requestHandler: solr.ReplicationHandler
> [junit4:junit4]   2> 2269 T41 oasc.RequestHandlers.initHandlersFromConfig
> created /replication: solr.ReplicationHandler
> [junit4:junit4]   2> 2270 T41 oasc.RequestHandlers.initHandlersFromConfig
> created standard: solr.StandardRequestHandler
> [junit4:junit4]   2> 2270 T41 oasc.RequestHandlers.initHandlersFromConfig
> created /get: solr.RealTimeGetHandler
> [junit4:junit4]   2> 2271 T41 oasc.RequestHandlers.initHandlersFromConfig
> created dismax: solr.SearchHandler
> [junit4:junit4]   2> 2271 T41 oasc.RequestHandlers.initHandlersFromConfig
> created mock: org.apache.solr.core.MockQuerySenderListenerReqHandler
> [junit4:junit4]   2> 2272 T41 oasc.RequestHandlers.initHandlersFromConfig
> created /admin/: org.apache.solr.handler.admin.AdminHandlers
> [junit4:junit4]   2> 2272 T41 oasc.RequestHandlers.initHandlersFromConfig
> created defaults: solr.StandardRequestHandler
> [junit4:junit4]   2> 2273 T41 oasc.RequestHandlers.initHandlersFromConfig
> adding lazy requestHandler: solr.StandardRequestHandler
> [junit4:junit4]   2> 2273 T41 oasc.RequestHandlers.initHandlersFromConfig
> created lazy: solr.StandardRequestHandler
> [junit4:junit4]   2> 2274 T41 oasc.RequestHandlers.initHandlersFromConfig
> created /update: solr.UpdateRequestHandler
> [junit4:junit4]   2> 2275 T41 oasc.RequestHandlers.initHandlersFromConfig
> created /terms: org.apache.solr.handler.component.SearchHandler
> [junit4:junit4]   2> 2275 T41 oasc.RequestHandlers.initHandlersFromConfig
> created spellCheckCompRH:
> org.apache.solr.handler.component.SearchHandler
> [junit4:junit4]   2> 2276 T41 oasc.RequestHandlers.initHandlersFromConfig
> created spellCheckCompRH_Direct:
> org.apache.solr.handler.component.SearchHandler
> [junit4:junit4]   2> 2276 T41 oasc.RequestHandlers.initHandlersFromConfig
> created spellCheckWithWordbreak:
> org.apache.solr.handler.component.SearchHandler
> [junit4:junit4]   2> 2277 T41 oasc.RequestHandlers.initHandlersFromConfig
> created spellCheckWithWordbreak_Direct:
> org.apache.solr.handler.component.SearchHandler
> [junit4:junit4]   2> 2278 T41 oasc.RequestHandlers.initHandlersFromConfig
> created spellCheckCompRH1:
> org.apache.solr.handler.component.SearchHandler
> [junit4:junit4]   2> 2278 T41 oasc.RequestHandlers.initHandlersFromConfig
> created tvrh: org.apache.solr.handler.component.SearchHandler
> [junit4:junit4]   2> 2279 T41 oasc.RequestHandlers.initHandlersFromConfig
> created /mlt: solr.MoreLikeThisHandler
> [junit4:junit4]   2> 2279 T41 oasc.RequestHandlers.initHandlersFromConfig
> created /debug/dump: solr.DumpRequestHandler
> [junit4:junit4]   2> 2283 T41 oashl.XMLLoader.init xsltCacheLifetimeSeconds=60
> [junit4:junit4]   2> 2286 T41 oasc.SolrCore.initDeprecatedSupport WARNING
> solrconfig.xml uses deprecated <admin/gettableFiles>, Please update your
> config to use the ShowFileRequestHandler.
> [junit4:junit4]   2> 2288 T41 oasc.SolrCore.initDeprecatedSupport WARNING
> adding ShowFileRequestHandler with hidden files:
> [THROW.ERROR.ON.ADD.UPDATEPROCESSOR.JS, SOLRCONFIG-
> HIGHLIGHT.XML, SCHEMA-REQUIRED-FIELDS.XML, SCHEMA-MINIMAL.XML,
> TRIVIAL.UPDATEPROCESSOR1.JS, BAD-SCHEMA-DUP-DYNAMICFIELD.XML,
> SCHEMA-REPLICATION2.XML, SOLRCONFIG-CACHING.XML, SOLRCONFIG-
> REPEATER.XML, BAD-SCHEMA-NONTEXT-ANALYZER.XML, SOLRCONFIG-
> MERGEPOLICY.XML, CURRENCY.XML, SOLRCONFIG-TLOG.XML, SOLRCONFIG-
> MASTER.XML, BAD-SCHEMA-UNIQUEKEY-MULTIVALUED.XML,
> SCHEMA11.XML, SOLRCONFIG-BASIC.XML, DA_COMPOUNDDICTIONARY.TXT,
> MISSLEADING.EXTENSION.UPDATEPROCESSOR.JS.TXT, SCHEMA-COPYFIELD-
> TEST.XML, SOLRCONFIG-SLAVE.XML, SOLRCONFIG-PROPINJECT-
> INDEXDEFAULT.XML, ELEVATE.XML, TRIVIAL.UPDATEPROCESSOR0.JS, BAD-
> SOLRCONFIG-BOGUS-SCRIPTENGINE-NAME.XML, SCHEMA-IB.XML, SCHEMA-
> CHARFILTERS.XML, SOLRCONFIG-QUERYSENDER.XML, DA_UTF8.XML,
> SCHEMA-REPLICATION1.XML, CONDITIONAL.UPDATEPROCESSOR.JS,
> MISSING.FUNCTIONS.UPDATEPROCESSOR.JS, HYPHENATION.DTD,
> SOLRCONFIG-ENABLEPLUGIN.XML, STEMDICT.TXT, SCHEMA-
> PHRASESUGGEST.XML, HUNSPELL-TEST.AFF, STOPTYPES-1.TXT,
> STOPWORDSWRONGENCODING.TXT, SCHEMA-NUMERIC.XML, SOLRCONFIG-
> TRANSFORMERS.XML, SOLRCONFIG-PROPINJECT.XML, BAD-SCHEMA-NOT-
> INDEXED-BUT-TF.XML, SOLRCONFIG-SIMPLELOCK.XML, WDFTYPES.TXT,
> SCHEMA-REVERSED.XML, STOPTYPES-2.TXT, SOLRCONFIG-
> SPELLCHECKCOMPONENT.XML, SOLRCONFIG-PHRASESUGGEST.XML, SCHEMA-
> DFR.XML, BAD-SCHEMA-NOT-INDEXED-BUT-POS.XML, KEEP-1.TXT, OPEN-
> EXCHANGE-RATES.JSON, STOPWITHBOM.TXT, SOLRCONFIG-
> SPELLCHECKER.XML, SCHEMA-BINARYFIELD.XML, SOLRCONFIG-UPDATE-
> PROCESSOR-CHAINS.XML, BAD-SCHEMA-OMIT-TF-BUT-NOT-POS.XML, BAD-
> SCHEMA-DUP-FIELDTYPE.XML, SOLRCONFIG-MASTER1.XML, SYNONYMS.TXT,
> SCHEMA_CODEC.XML, SCHEMA.XML, SOLRCONFIG-SOLR-749.XML,
> SOLRCONFIG-MASTER1-KEEPONEBACKUP.XML, SOLRCONFIG-
> FUNCTIONQUERY.XML, STOP-2.TXT, SCHEMA-LMDIRICHLET.XML,
> SOLRCONFIG-TERMINDEX.XML, SOLRCONFIG-ELEVATE.XML, SCHEMA-
> FOLDING.XML, STOPWORDS.TXT, SCHEMA-STOP-KEEP.XML, BAD-SCHEMA-
> NOT-INDEXED-BUT-NORMS.XML, SOLRCONFIG-SOLCOREPROPERTIES.XML,
> STOP-1.TXT, SOLRCONFIG-MASTER2.XML, SCHEMA-SPELLCHECKER.XML,
> SOLRCONFIG-LAZYWRITER.XML, SCHEMA-LUCENEMATCHVERSION.XML, BAD-
> MP-SOLRCONFIG.XML, FRENCHARTICLES.TXT, SCHEMA15.XML, SOLRCONFIG-
> REQHANDLER.INCL, SCHEMASURROUND.XML, SCHEMA-COLLATEFILTER.XML,
> SOLRCONFIG-MASTER3.XML, HUNSPELL-TEST.DIC, BAD-SCHEMA-CODEC-
> GLOBAL-VS-FT-MISMATCH.XML, SOLRCONFIG-XINCLUDE.XML, SOLRCONFIG-
> SLAVE1.XML, SOLRCONFIG-DELPOLICY1.XML, SCHEMA-SIM.XML, SCHEMA-
> COLLATE.XML, STOP-SNOWBALL.TXT, BAD-SCHEMA-SIM-GLOBAL-VS-FT-
> MISMATCH.XML, PROTWORDS.TXT, SCHEMA-TRIE.XML,
> SOLRCONFIG_CODEC.XML, BAD-SOLRCONFIG-INVALID-SCRIPTFILE.XML,
> SCHEMA-TFIDF.XML, SOLRCONFIG-SCRIPT-UPDATEPROCESSOR.XML, SCHEMA-
> LMJELINEKMERCER.XML, PHRASESUGGEST.TXT, BAD-SOLRCONFIG-MISSING-
> SCRIPTFILE.XML, SOLRCONFIG-BASIC-LUCENEVERSION31.XML, BAD-SCHEMA-
> UNIQUEKEY-USES-DEFAULT.XML, OLD_SYNONYMS.TXT, SOLRCONFIG-
> DELPOLICY2.XML, SOLRCONFIG-NATIVELOCK.XML, XSLT, BAD-SCHEMA-DUP-
> FIELD.XML, SOLRCONFIG-NOCACHE.XML, SCHEMA-BM25.XML,
> ADDFIELDS.UPDATEPROCESSOR.JS, SOLRCONFIG-QUERYSENDER-
> NOQUERY.XML, SOLRCONFIG-ALTDIRECTORY.XML,
> COMPOUNDDICTIONARY.TXT, SOLRCONFIG_PERF.XML, SCHEMA-NOT-
> REQUIRED-UNIQUE-KEY.XML, BAD-SCHEMA-ANALYZER-CLASS-AND-
> NESTED.XML, KEEP-2.TXT, BAD-SCHEMA-UNIQUEKEY-IS-COPYFIELD-DEST.XML,
> SCHEMA12.XML, MAPPING-ISOLATIN1ACCENT.TXT, BAD_SOLRCONFIG.XML,
> BAD-SCHEMA-EXTERNAL-FILEFIELD.XML]
> [junit4:junit4]   2> 2291 T41 oass.SolrIndexSearcher.<init> Opening
> Searcher@52fc275f main
> [junit4:junit4]   2> 2291 T41 oass.SolrIndexSearcher.getIndexDir WARNING
> WARNING: Directory impl does not support setting indexDir:
> org.apache.lucene.store.BaseDirectoryWrapper
> [junit4:junit4]   2> 2292 T41 oasu.CommitTracker.<init> Hard AutoCommit:
> disabled
> [junit4:junit4]   2> 2292 T41 oasu.CommitTracker.<init> Soft AutoCommit:
> disabled
> [junit4:junit4]   2> 2293 T41 oashc.SpellCheckComponent.inform Initializing
> spell checkers
> [junit4:junit4]   2> 2317 T41 oass.DirectSolrSpellChecker.init init:
> {name=direct,classname=DirectSolrSpellChecker,field=lowerfilt,minQueryLengt
> h=3}
> [junit4:junit4]   2> 2423 T41 oashc.HttpShardHandlerFactory.getParameter
> Setting socketTimeout to: 0
> [junit4:junit4]   2> 2423 T41 oashc.HttpShardHandlerFactory.getParameter
> Setting urlScheme to: http://
> [junit4:junit4]   2> 2424 T41 oashc.HttpShardHandlerFactory.getParameter
> Setting connTimeout to: 0
> [junit4:junit4]   2> 2424 T41 oashc.HttpShardHandlerFactory.getParameter
> Setting maxConnectionsPerHost to: 20
> [junit4:junit4]   2> 2424 T41 oashc.HttpShardHandlerFactory.getParameter
> Setting corePoolSize to: 0
> [junit4:junit4]   2> 2425 T41 oashc.HttpShardHandlerFactory.getParameter
> Setting maximumPoolSize to: 2147483647
> [junit4:junit4]   2> 2425 T41 oashc.HttpShardHandlerFactory.getParameter
> Setting maxThreadIdleTime to: 5
> [junit4:junit4]   2> 2425 T41 oashc.HttpShardHandlerFactory.getParameter
> Setting sizeOfQueue to: -1
> [junit4:junit4]   2> 2426 T41 oashc.HttpShardHandlerFactory.getParameter
> Setting fairnessPolicy to: false
> [junit4:junit4]   2> 2426 T41 oascsi.HttpClientUtil.createClient Creating new
> http client,
> config:maxConnectionsPerHost=20&maxConnections=10000&socketTimeout=0
> &connTimeout=0&retry=false
> [junit4:junit4]   2> 2440 T42 oasc.SolrCore.registerSearcher [collection1]
> Registered new searcher Searcher@52fc275f
> main{StandardDirectoryReader(segments_1:1)}
> [junit4:junit4]   2> 2445 T41 oasc.CoreContainer.register registering core:
> collection1
> [junit4:junit4]   2> 2447 T41 oasu.AbstractSolrTestCase.setUp ####SETUP_END
> testStopwordsAfterCoreReload
> [junit4:junit4]   2> 2812 T41 oejs.Server.doStart jetty-8.1.2.v20120308
> [junit4:junit4]   2> 3020 T41 oejs.AbstractConnector.doStart Started
> SocketConnector@0.0.0.0:52847
> [junit4:junit4]   2> 3047 T41 oasc.SolrResourceLoader.locateSolrHome JNDI not
> configured for solr (NoInitialContextEx)
> [junit4:junit4]   2> 3047 T41 oasc.SolrResourceLoader.locateSolrHome using
> system property solr.solr.home: /usr/home/hudson/hudson-
> slave/workspace/Lucene-Solr-Tests-4.x-java7/solr/build/solr-core/test/J0/./solr-
> test-home-15307150783267788
> [junit4:junit4]   2> 3048 T41 oasc.SolrResourceLoader.<init> new
> SolrResourceLoader for deduced Solr Home: '/usr/home/hudson/hudson-
> slave/workspace/Lucene-Solr-Tests-4.x-java7/solr/build/solr-core/test/J0/./solr-
> test-home-15307150783267788/'
> [junit4:junit4]   2> 3090 T41 oass.SolrDispatchFilter.init SolrDispatchFilter.init()
> [junit4:junit4]   2> 3091 T41 oasc.SolrResourceLoader.locateSolrHome JNDI not
> configured for solr (NoInitialContextEx)
> [junit4:junit4]   2> 3092 T41 oasc.SolrResourceLoader.locateSolrHome using
> system property solr.solr.home: /usr/home/hudson/hudson-
> slave/workspace/Lucene-Solr-Tests-4.x-java7/solr/build/solr-core/test/J0/./solr-
> test-home-15307150783267788
> [junit4:junit4]   2> 3092 T41 oasc.CoreContainer$Initializer.initialize looking for
> solr.xml: /usr/home/hudson/hudson-slave/workspace/Lucene-Solr-Tests-4.x-
> java7/solr/build/solr-core/test/J0/./solr-test-home-
> 15307150783267788/solr.xml
> [junit4:junit4]   2> 3093 T41 oasc.CoreContainer.<init> New CoreContainer
> 1741663741
> [junit4:junit4]   2> 3093 T41 oasc.CoreContainer.load Loading CoreContainer
> using Solr Home: '/usr/home/hudson/hudson-slave/workspace/Lucene-Solr-
> Tests-4.x-java7/solr/build/solr-core/test/J0/./solr-test-home-
> 15307150783267788/'
> [junit4:junit4]   2> 3094 T41 oasc.SolrResourceLoader.<init> new
> SolrResourceLoader for directory: '/usr/home/hudson/hudson-
> slave/workspace/Lucene-Solr-Tests-4.x-java7/solr/build/solr-core/test/J0/./solr-
> test-home-15307150783267788/'
> [junit4:junit4]   2> 3136 T41 oasc.CoreContainer.load Registering Log Listener
> [junit4:junit4]   2> 3188 T41 oasc.CoreContainer.create Creating SolrCore
> 'collection1' using instanceDir: /usr/home/hudson/hudson-
> slave/workspace/Lucene-Solr-Tests-4.x-java7/solr/build/solr-core/test/J0/./solr-
> test-home-15307150783267788/collection1
> [junit4:junit4]   2> 3189 T41 oasc.SolrResourceLoader.<init> new
> SolrResourceLoader for directory: '/usr/home/hudson/hudson-
> slave/workspace/Lucene-Solr-Tests-4.x-java7/solr/build/solr-core/test/J0/./solr-
> test-home-15307150783267788/collection1/'
> [junit4:junit4]   2> 3190 T41 oasc.SolrResourceLoader.replaceClassLoader
> Adding 'file:/usr/home/hudson/hudson-slave/workspace/Lucene-Solr-Tests-4.x-
> java7/solr/build/solr-core/test/J0/solr-test-home-
> 15307150783267788/collection1/lib/README' to classloader
> [junit4:junit4]   2> 3191 T41 oasc.SolrResourceLoader.replaceClassLoader
> Adding 'file:/usr/home/hudson/hudson-slave/workspace/Lucene-Solr-Tests-4.x-
> java7/solr/build/solr-core/test/J0/solr-test-home-
> 15307150783267788/collection1/lib/classes/' to classloader
> [junit4:junit4]   2> 3252 T41 oasc.SolrConfig.<init> Using Lucene MatchVersion:
> LUCENE_40
> [junit4:junit4]   2> 3309 T41 oasc.SolrConfig.<init> Loaded SolrConfig:
> solrconfig.xml
> [junit4:junit4]   2> 3310 T41 oass.IndexSchema.readSchema Reading Solr
> Schema
> [junit4:junit4]   2> 3326 T41 oass.IndexSchema.readSchema Schema name=test
> [junit4:junit4]   2> 3817 T41 oass.OpenExchangeRatesOrgProvider.init
> Initialized with rates=open-exchange-rates.json, refreshInterval=1440.
> [junit4:junit4]   2> 3829 T41 oass.IndexSchema.readSchema default search field
> in schema is text
> [junit4:junit4]   2> 3833 T41 oass.IndexSchema.readSchema unique key field: id
> [junit4:junit4]   2> 3848 T41 oass.FileExchangeRateProvider.reload Reloading
> exchange rates from file currency.xml
> [junit4:junit4]   2> 3852 T41 oass.FileExchangeRateProvider.reload Reloading
> exchange rates from file currency.xml
> [junit4:junit4]   2> 3857 T41 oass.OpenExchangeRatesOrgProvider.reload
> Reloading exchange rates from open-exchange-rates.json
> [junit4:junit4]   2> 3860 T41 oass.OpenExchangeRatesOrgProvider.reload
> Reloading exchange rates from open-exchange-rates.json
> [junit4:junit4]   2> 3862 T41 oasc.SolrCore.<init> [collection1] Opening new
> SolrCore at /usr/home/hudson/hudson-slave/workspace/Lucene-Solr-Tests-4.x-
> java7/solr/build/solr-core/test/J0/./solr-test-home-
> 15307150783267788/collection1/, dataDir=/usr/home/hudson/hudson-
> slave/workspace/Lucene-Solr-Tests-4.x-java7/solr/build/solr-core/test/J0/./solr-
> test-home-15307150783267788/collection1/data/
> [junit4:junit4]   2> 3863 T41 oasc.JmxMonitoredMap.<init> JMX monitoring is
> enabled. Adding Solr mbeans to JMX Server:
> com.sun.jmx.mbeanserver.JmxMBeanServer@1457b484
> [junit4:junit4]   2> 3864 T41 oasc.SolrCore.getNewIndexDir WARNING New
> index directory detected: old=null new=/usr/home/hudson/hudson-
> slave/workspace/Lucene-Solr-Tests-4.x-java7/solr/build/solr-core/test/J0/./solr-
> test-home-15307150783267788/collection1/data/index/
> [junit4:junit4]   2> 3865 T41 oasc.SolrCore.initIndex WARNING [collection1] Solr
> index directory '/usr/home/hudson/hudson-slave/workspace/Lucene-Solr-Tests-
> 4.x-java7/solr/build/solr-core/test/J0/./solr-test-home-
> 15307150783267788/collection1/data/index' doesn't exist. Creating new
> index...
> [junit4:junit4]   2> 3865 T41 oasc.CachingDirectoryFactory.get return new
> directory for /usr/home/hudson/hudson-slave/workspace/Lucene-Solr-Tests-
> 4.x-java7/solr/build/solr-core/test/J0/./solr-test-home-
> 15307150783267788/collection1/data/index forceNew:false
> [junit4:junit4]   2> 3868 T41 oasc.SolrDeletionPolicy.onCommit
> SolrDeletionPolicy.onCommit: commits:num=1
> [junit4:junit4]   2>
> 	commit{dir=MockDirWrapper(org.apache.lucene.store.RAMDirectory
> @556dfe7c
> lockFactory=org.apache.lucene.store.NativeFSLockFactory@5f1965c7),segFN=s
> egments_1,generation=1,filenames=[segments_1]
> [junit4:junit4]   2> 3868 T41 oasc.SolrDeletionPolicy.updateCommits newest
> commit = 1
> [junit4:junit4]   2> 3869 T41 oasc.SolrCore.initWriters created xml:
> solr.XMLResponseWriter
> [junit4:junit4]   2> 3872 T41 oasup.UpdateRequestProcessorChain.init inserting
> DistributedUpdateProcessorFactory into updateRequestProcessorChain
> "dedupe"
> [junit4:junit4]   2> 3873 T41 oasup.UpdateRequestProcessorChain.init inserting
> DistributedUpdateProcessorFactory into updateRequestProcessorChain
> "dedupe-allfields"
> [junit4:junit4]   2> 3873 T41 oasup.UpdateRequestProcessorChain.init inserting
> DistributedUpdateProcessorFactory into updateRequestProcessorChain
> "stored_sig"
> [junit4:junit4]   2> 3874 T41 oasup.UpdateRequestProcessorChain.init inserting
> DistributedUpdateProcessorFactory into updateRequestProcessorChain "uniq-
> fields"
> [junit4:junit4]   2> 3875 T41 oasup.UpdateRequestProcessorChain.init inserting
> DistributedUpdateProcessorFactory into updateRequestProcessorChain "distrib-
> dup-test-chain-implicit"
> [junit4:junit4]   2> 3875 T41 oasc.RequestHandlers.initHandlersFromConfig
> adding lazy requestHandler: solr.ReplicationHandler
> [junit4:junit4]   2> 3876 T41 oasc.RequestHandlers.initHandlersFromConfig
> created /replication: solr.ReplicationHandler
> [junit4:junit4]   2> 3876 T41 oasc.RequestHandlers.initHandlersFromConfig
> created standard: solr.StandardRequestHandler
> [junit4:junit4]   2> 3877 T41 oasc.RequestHandlers.initHandlersFromConfig
> created /get: solr.RealTimeGetHandler
> [junit4:junit4]   2> 3878 T41 oasc.RequestHandlers.initHandlersFromConfig
> created dismax: solr.SearchHandler
> [junit4:junit4]   2> 3879 T41 oasc.RequestHandlers.initHandlersFromConfig
> created mock: org.apache.solr.core.MockQuerySenderListenerReqHandler
> [junit4:junit4]   2> 3879 T41 oasc.RequestHandlers.initHandlersFromConfig
> created /admin/: org.apache.solr.handler.admin.AdminHandlers
> [junit4:junit4]   2> 3880 T41 oasc.RequestHandlers.initHandlersFromConfig
> created defaults: solr.StandardRequestHandler
> [junit4:junit4]   2> 3881 T41 oasc.RequestHandlers.initHandlersFromConfig
> adding lazy requestHandler: solr.StandardRequestHandler
> [junit4:junit4]   2> 3881 T41 oasc.RequestHandlers.initHandlersFromConfig
> created lazy: solr.StandardRequestHandler
> [junit4:junit4]   2> 3882 T41 oasc.RequestHandlers.initHandlersFromConfig
> created /update: solr.UpdateRequestHandler
> [junit4:junit4]   2> 3883 T41 oasc.RequestHandlers.initHandlersFromConfig
> created /terms: org.apache.solr.handler.component.SearchHandler
> [junit4:junit4]   2> 3883 T41 oasc.RequestHandlers.initHandlersFromConfig
> created spellCheckCompRH:
> org.apache.solr.handler.component.SearchHandler
> [junit4:junit4]   2> 3884 T41 oasc.RequestHandlers.initHandlersFromConfig
> created spellCheckCompRH_Direct:
> org.apache.solr.handler.component.SearchHandler
> [junit4:junit4]   2> 3885 T41 oasc.RequestHandlers.initHandlersFromConfig
> created spellCheckWithWordbreak:
> org.apache.solr.handler.component.SearchHandler
> [junit4:junit4]   2> 3886 T41 oasc.RequestHandlers.initHandlersFromConfig
> created spellCheckWithWordbreak_Direct:
> org.apache.solr.handler.component.SearchHandler
> [junit4:junit4]   2> 3886 T41 oasc.RequestHandlers.initHandlersFromConfig
> created spellCheckCompRH1:
> org.apache.solr.handler.component.SearchHandler
> [junit4:junit4]   2> 3887 T41 oasc.RequestHandlers.initHandlersFromConfig
> created tvrh: org.apache.solr.handler.component.SearchHandler
> [junit4:junit4]   2> 3888 T41 oasc.RequestHandlers.initHandlersFromConfig
> created /mlt: solr.MoreLikeThisHandler
> [junit4:junit4]   2> 3888 T41 oasc.RequestHandlers.initHandlersFromConfig
> created /debug/dump: solr.DumpRequestHandler
> [junit4:junit4]   2> 3891 T41 oashl.XMLLoader.init xsltCacheLifetimeSeconds=60
> [junit4:junit4]   2> 3895 T41 oasc.SolrCore.initDeprecatedSupport WARNING
> solrconfig.xml uses deprecated <admin/gettableFiles>, Please update your
> config to use the ShowFileRequestHandler.
> [junit4:junit4]   2> 3898 T41 oasc.SolrCore.initDeprecatedSupport WARNING
> adding ShowFileRequestHandler with hidden files:
> [THROW.ERROR.ON.ADD.UPDATEPROCESSOR.JS, SOLRCONFIG-
> HIGHLIGHT.XML, SCHEMA-REQUIRED-FIELDS.XML, SCHEMA-MINIMAL.XML,
> TRIVIAL.UPDATEPROCESSOR1.JS, BAD-SCHEMA-DUP-DYNAMICFIELD.XML,
> SCHEMA-REPLICATION2.XML, SOLRCONFIG-CACHING.XML, SOLRCONFIG-
> REPEATER.XML, BAD-SCHEMA-NONTEXT-ANALYZER.XML, SOLRCONFIG-
> MERGEPOLICY.XML, CURRENCY.XML, SOLRCONFIG-TLOG.XML, SOLRCONFIG-
> MASTER.XML, BAD-SCHEMA-UNIQUEKEY-MULTIVALUED.XML,
> SCHEMA11.XML, SOLRCONFIG-BASIC.XML, DA_COMPOUNDDICTIONARY.TXT,
> MISSLEADING.EXTENSION.UPDATEPROCESSOR.JS.TXT, SCHEMA-COPYFIELD-
> TEST.XML, SOLRCONFIG-SLAVE.XML, SOLRCONFIG-PROPINJECT-
> INDEXDEFAULT.XML, ELEVATE.XML, TRIVIAL.UPDATEPROCESSOR0.JS, BAD-
> SOLRCONFIG-BOGUS-SCRIPTENGINE-NAME.XML, SCHEMA-IB.XML, SCHEMA-
> CHARFILTERS.XML, SOLRCONFIG-QUERYSENDER.XML, DA_UTF8.XML,
> SCHEMA-REPLICATION1.XML, CONDITIONAL.UPDATEPROCESSOR.JS,
> MISSING.FUNCTIONS.UPDATEPROCESSOR.JS, HYPHENATION.DTD,
> SOLRCONFIG-ENABLEPLUGIN.XML, STEMDICT.TXT, SCHEMA-
> PHRASESUGGEST.XML, HUNSPELL-TEST.AFF, STOPTYPES-1.TXT,
> STOPWORDSWRONGENCODING.TXT, SCHEMA-NUMERIC.XML, SOLRCONFIG-
> TRANSFORMERS.XML, SOLRCONFIG-PROPINJECT.XML, BAD-SCHEMA-NOT-
> INDEXED-BUT-TF.XML, SOLRCONFIG-SIMPLELOCK.XML, WDFTYPES.TXT,
> SCHEMA-REVERSED.XML, STOPTYPES-2.TXT, SOLRCONFIG-
> SPELLCHECKCOMPONENT.XML, SOLRCONFIG-PHRASESUGGEST.XML, SCHEMA-
> DFR.XML, BAD-SCHEMA-NOT-INDEXED-BUT-POS.XML, KEEP-1.TXT, OPEN-
> EXCHANGE-RATES.JSON, STOPWITHBOM.TXT, SOLRCONFIG-
> SPELLCHECKER.XML, SCHEMA-BINARYFIELD.XML, SOLRCONFIG-UPDATE-
> PROCESSOR-CHAINS.XML, BAD-SCHEMA-OMIT-TF-BUT-NOT-POS.XML, BAD-
> SCHEMA-DUP-FIELDTYPE.XML, SOLRCONFIG-MASTER1.XML, SYNONYMS.TXT,
> SCHEMA_CODEC.XML, SCHEMA.XML, SOLRCONFIG-SOLR-749.XML,
> SOLRCONFIG-MASTER1-KEEPONEBACKUP.XML, SOLRCONFIG-
> FUNCTIONQUERY.XML, STOP-2.TXT, SCHEMA-LMDIRICHLET.XML,
> SOLRCONFIG-TERMINDEX.XML, SOLRCONFIG-ELEVATE.XML, SCHEMA-
> FOLDING.XML, STOPWORDS.TXT, SCHEMA-STOP-KEEP.XML, BAD-SCHEMA-
> NOT-INDEXED-BUT-NORMS.XML, SOLRCONFIG-SOLCOREPROPERTIES.XML,
> STOP-1.TXT, SOLRCONFIG-MASTER2.XML, SCHEMA-SPELLCHECKER.XML,
> SOLRCONFIG-LAZYWRITER.XML, SCHEMA-LUCENEMATCHVERSION.XML, BAD-
> MP-SOLRCONFIG.XML, FRENCHARTICLES.TXT, SCHEMA15.XML, SOLRCONFIG-
> REQHANDLER.INCL, SCHEMASURROUND.XML, SCHEMA-COLLATEFILTER.XML,
> SOLRCONFIG-MASTER3.XML, HUNSPELL-TEST.DIC, BAD-SCHEMA-CODEC-
> GLOBAL-VS-FT-MISMATCH.XML, SOLRCONFIG-XINCLUDE.XML, SOLRCONFIG-
> SLAVE1.XML, SOLRCONFIG-DELPOLICY1.XML, SCHEMA-SIM.XML, SCHEMA-
> COLLATE.XML, STOP-SNOWBALL.TXT, BAD-SCHEMA-SIM-GLOBAL-VS-FT-
> MISMATCH.XML, PROTWORDS.TXT, SCHEMA-TRIE.XML,
> SOLRCONFIG_CODEC.XML, BAD-SOLRCONFIG-INVALID-SCRIPTFILE.XML,
> SCHEMA-TFIDF.XML, SOLRCONFIG-SCRIPT-UPDATEPROCESSOR.XML, SCHEMA-
> LMJELINEKMERCER.XML, PHRASESUGGEST.TXT, BAD-SOLRCONFIG-MISSING-
> SCRIPTFILE.XML, SOLRCONFIG-BASIC-LUCENEVERSION31.XML, BAD-SCHEMA-
> UNIQUEKEY-USES-DEFAULT.XML, OLD_SYNONYMS.TXT, SOLRCONFIG-
> DELPOLICY2.XML, SOLRCONFIG-NATIVELOCK.XML, XSLT, BAD-SCHEMA-DUP-
> FIELD.XML, SOLRCONFIG-NOCACHE.XML, SCHEMA-BM25.XML,
> ADDFIELDS.UPDATEPROCESSOR.JS, SOLRCONFIG-QUERYSENDER-
> NOQUERY.XML, SOLRCONFIG-ALTDIRECTORY.XML,
> COMPOUNDDICTIONARY.TXT, SOLRCONFIG_PERF.XML, SCHEMA-NOT-
> REQUIRED-UNIQUE-KEY.XML, BAD-SCHEMA-ANALYZER-CLASS-AND-
> NESTED.XML, KEEP-2.TXT, BAD-SCHEMA-UNIQUEKEY-IS-COPYFIELD-DEST.XML,
> SCHEMA12.XML, MAPPING-ISOLATIN1ACCENT.TXT, BAD_SOLRCONFIG.XML,
> BAD-SCHEMA-EXTERNAL-FILEFIELD.XML]
> [junit4:junit4]   2> 3901 T41 oass.SolrIndexSearcher.<init> Opening
> Searcher@6a38ceb8 main
> [junit4:junit4]   2> 3902 T41 oass.SolrIndexSearcher.getIndexDir WARNING
> WARNING: Directory impl does not support setting indexDir:
> org.apache.lucene.store.MockDirectoryWrapper
> [junit4:junit4]   2> 3902 T41 oasu.CommitTracker.<init> Hard AutoCommit:
> disabled
> [junit4:junit4]   2> 3903 T41 oasu.CommitTracker.<init> Soft AutoCommit:
> disabled
> [junit4:junit4]   2> 3904 T41 oashc.SpellCheckComponent.inform Initializing
> spell checkers
> [junit4:junit4]   2> 3920 T41 oass.DirectSolrSpellChecker.init init:
> {name=direct,classname=DirectSolrSpellChecker,field=lowerfilt,minQueryLengt
> h=3}
> [junit4:junit4]   2> 3971 T41 oashc.HttpShardHandlerFactory.getParameter
> Setting socketTimeout to: 0
> [junit4:junit4]   2> 3972 T41 oashc.HttpShardHandlerFactory.getParameter
> Setting urlScheme to: http://
> [junit4:junit4]   2> 3972 T41 oashc.HttpShardHandlerFactory.getParameter
> Setting connTimeout to: 0
> [junit4:junit4]   2> 3973 T41 oashc.HttpShardHandlerFactory.getParameter
> Setting maxConnectionsPerHost to: 20
> [junit4:junit4]   2> 3973 T41 oashc.HttpShardHandlerFactory.getParameter
> Setting corePoolSize to: 0
> [junit4:junit4]   2> 3974 T41 oashc.HttpShardHandlerFactory.getParameter
> Setting maximumPoolSize to: 2147483647
> [junit4:junit4]   2> 3974 T41 oashc.HttpShardHandlerFactory.getParameter
> Setting maxThreadIdleTime to: 5
> [junit4:junit4]   2> 3974 T41 oashc.HttpShardHandlerFactory.getParameter
> Setting sizeOfQueue to: -1
> [junit4:junit4]   2> 3975 T41 oashc.HttpShardHandlerFactory.getParameter
> Setting fairnessPolicy to: false
> [junit4:junit4]   2> 3975 T41 oascsi.HttpClientUtil.createClient Creating new
> http client,
> config:maxConnectionsPerHost=20&maxConnections=10000&socketTimeout=0
> &connTimeout=0&retry=false
> [junit4:junit4]   2> 3990 T53 oasc.SolrCore.registerSearcher [collection1]
> Registered new searcher Searcher@6a38ceb8
> main{StandardDirectoryReader(segments_1:1)}
> [junit4:junit4]   2> 3995 T41 oasc.CoreContainer.register registering core:
> collection1
> [junit4:junit4]   2> 3996 T41 oass.SolrDispatchFilter.init
> user.dir=/usr/home/hudson/hudson-slave/workspace/Lucene-Solr-Tests-4.x-
> java7/solr/build/solr-core/test/J0
> [junit4:junit4]   2> 3996 T41 oass.SolrDispatchFilter.init SolrDispatchFilter.init()
> done
> [junit4:junit4]   2> 4069 T41 oascsi.HttpClientUtil.createClient Creating new
> http client,
> config:maxConnections=128&maxConnectionsPerHost=32&followRedirects=fals
> e
> [junit4:junit4]   2> 4523 T46 oejs.AbstractConnector$Acceptor.run WARNING
> java.security.AccessControlException: access denied
> ("java.net.SocketPermission" "140.211.11.196:12882" "accept,resolve")
> [junit4:junit4]   2> 	at
> java.security.AccessControlContext.checkPermission(AccessControlContext.java
> :366)
> [junit4:junit4]   2> 	at
> java.security.AccessController.checkPermission(AccessController.java:555)
> [junit4:junit4]   2> 	at
> java.lang.SecurityManager.checkPermission(SecurityManager.java:549)
> [junit4:junit4]   2> 	at
> java.lang.SecurityManager.checkAccept(SecurityManager.java:1174)
> [junit4:junit4]   2> 	at
> java.net.ServerSocket.implAccept(ServerSocket.java:526)
> [junit4:junit4]   2> 	at java.net.ServerSocket.accept(ServerSocket.java:490)
> [junit4:junit4]   2> 	at
> org.eclipse.jetty.server.bio.SocketConnector.accept(SocketConnector.java:112)
> [junit4:junit4]   2> 	at
> org.eclipse.jetty.server.AbstractConnector$Acceptor.run(AbstractConnector.jav
> a:933)
> [junit4:junit4]   2> 	at
> org.eclipse.jetty.util.thread.QueuedThreadPool.runJob(QueuedThreadPool.java:
> 599)
> [junit4:junit4]   2> 	at
> org.eclipse.jetty.util.thread.QueuedThreadPool$3.run(QueuedThreadPool.java:
> 534)
> [junit4:junit4]   2> 	at java.lang.Thread.run(Thread.java:722)
> [junit4:junit4]   2>
> [junit4:junit4]   2> 4720 T41 oasc.CoreContainer.shutdown Shutting down
> CoreContainer instance=1741663741
> [junit4:junit4]   2> 4721 T41 oasc.SolrCore.close [collection1]  CLOSING
> SolrCore org.apache.solr.core.SolrCore@102696ac
> [junit4:junit4]   2> 4733 T41 oasc.SolrCore.closeSearcher [collection1] Closing
> main searcher on request.
> [junit4:junit4]   2> 4734 T41 oasu.DirectUpdateHandler2.close closing
> DirectUpdateHandler2{commits=0,autocommits=0,soft
> autocommits=0,optimizes=0,rollbacks=0,expungeDeletes=0,docsPending=0,add
> s=0,deletesById=0,deletesByQuery=0,errors=0,cumulative_adds=0,cumulative_
> deletesById=0,cumulative_deletesByQuery=0,cumulative_errors=0}
> [junit4:junit4]   2> 4734 T41 oasu.DefaultSolrCoreState.decref SolrCoreState ref
> count has reached 0 - closing IndexWriter
> [junit4:junit4]   2> 4735 T41 oejsh.ContextHandler.doStop stopped
> o.e.j.s.ServletContextHandler{/solr,null}
> [junit4:junit4]   2> 4841 T41 oasu.AbstractSolrTestCase.tearDown
> ####TEARDOWN_START testStopwordsAfterCoreReload
> [junit4:junit4]   2> 4841 T41 oasc.CoreContainer.shutdown Shutting down
> CoreContainer instance=678768258
> [junit4:junit4]   2> 4842 T41 oasc.SolrCore.close [collection1]  CLOSING
> SolrCore org.apache.solr.core.SolrCore@25406d8e
> [junit4:junit4]   2> 4844 T41 oasc.SolrCore.closeSearcher [collection1] Closing
> main searcher on request.
> [junit4:junit4]   2> 4845 T41 oasu.DirectUpdateHandler2.close closing
> DirectUpdateHandler2{commits=0,autocommits=0,soft
> autocommits=0,optimizes=0,rollbacks=0,expungeDeletes=0,docsPending=0,add
> s=0,deletesById=0,deletesByQuery=0,errors=0,cumulative_adds=0,cumulative_
> deletesById=0,cumulative_deletesByQuery=0,cumulative_errors=0}
> [junit4:junit4]   2> 4845 T41 oasu.DefaultSolrCoreState.decref SolrCoreState ref
> count has reached 0 - closing IndexWriter
> [junit4:junit4]   2> NOTE: reproduce with: ant test  -
> Dtestcase=AnalysisAfterCoreReloadTest -
> Dtests.method=testStopwordsAfterCoreReload -
> Dtests.seed=E20548CE3E5ACD20 -Dtests.multiplier=3 -Dtests.slow=true -
> Dtests.locale=sk -Dtests.timezone=America/Mazatlan -Dtests.file.encoding=ISO-
> 8859-1
> [junit4:junit4] ERROR   3.68s J0 |
> AnalysisAfterCoreReloadTest.testStopwordsAfterCoreReload <<<
> [junit4:junit4]    > Throwable #1:
> org.apache.solr.client.solrj.SolrServerException: IOException occured when
> talking to server at: http://localhost:52847/solr/collection1
> [junit4:junit4]    > 	at
> __randomizedtesting.SeedInfo.seed([E20548CE3E5ACD20:8402663EA6E135E3]:
> 0)
> [junit4:junit4]    > 	at
> org.apache.solr.client.solrj.impl.HttpSolrServer.request(HttpSolrServer.java:414
> )
> [junit4:junit4]    > 	at
> org.apache.solr.client.solrj.impl.HttpSolrServer.request(HttpSolrServer.java:182
> )
> [junit4:junit4]    > 	at
> org.apache.solr.client.solrj.request.AbstractUpdateRequest.process(AbstractUp
> dateRequest.java:117)
> [junit4:junit4]    > 	at
> org.apache.solr.AnalysisAfterCoreReloadTest.testStopwordsAfterCoreReload(An
> alysisAfterCoreReloadTest.java:79)
> [junit4:junit4]    > 	at
> sun.reflect.NativeMethodAccessorImpl.invoke0(Native Method)
> [junit4:junit4]    > 	at
> sun.reflect.NativeMethodAccessorImpl.invoke(NativeMethodAccessorImpl.java:
> 57)
> [junit4:junit4]    > 	at
> sun.reflect.DelegatingMethodAccessorImpl.invoke(DelegatingMethodAccessorI
> mpl.java:43)
> [junit4:junit4]    > 	at java.lang.reflect.Method.invoke(Method.java:601)
> [junit4:junit4]    > 	at
> com.carrotsearch.randomizedtesting.RandomizedRunner.invoke(RandomizedRu
> nner.java:1559)
> [junit4:junit4]    > 	at
> com.carrotsearch.randomizedtesting.RandomizedRunner.access$600(Randomiz
> edRunner.java:79)
> [junit4:junit4]    > 	at
> com.carrotsearch.randomizedtesting.RandomizedRunner$6.evaluate(Randomiz
> edRunner.java:737)
> [junit4:junit4]    > 	at
> com.carrotsearch.randomizedtesting.RandomizedRunner$7.evaluate(Randomiz
> edRunner.java:773)
> [junit4:junit4]    > 	at
> com.carrotsearch.randomizedtesting.RandomizedRunner$8.evaluate(Randomiz
> edRunner.java:787)
> [junit4:junit4]    > 	at
> com.carrotsearch.randomizedtesting.rules.SystemPropertiesRestoreRule$1.eval
> uate(SystemPropertiesRestoreRule.java:53)
> [junit4:junit4]    > 	at
> org.apache.lucene.util.TestRuleSetupTeardownChained$1.evaluate(TestRuleSet
> upTeardownChained.java:50)
> [junit4:junit4]    > 	at
> org.apache.lucene.util.TestRuleFieldCacheSanity$1.evaluate(TestRuleFieldCach
> eSanity.java:51)
> [junit4:junit4]    > 	at
> org.apache.lucene.util.AbstractBeforeAfterRule$1.evaluate(AbstractBeforeAfte
> rRule.java:45)
> [junit4:junit4]    > 	at
> com.carrotsearch.randomizedtesting.rules.SystemPropertiesInvariantRule$1.ev
> aluate(SystemPropertiesInvariantRule.java:55)
> [junit4:junit4]    > 	at
> org.apache.lucene.util.TestRuleThreadAndTestName$1.evaluate(TestRuleThrea
> dAndTestName.java:48)
> [junit4:junit4]    > 	at
> org.apache.lucene.util.TestRuleIgnoreAfterMaxFailures$1.evaluate(TestRuleIgn
> oreAfterMaxFailures.java:70)
> [junit4:junit4]    > 	at
> org.apache.lucene.util.TestRuleMarkFailure$1.evaluate(TestRuleMarkFailure.ja
> va:48)
> [junit4:junit4]    > 	at
> com.carrotsearch.randomizedtesting.rules.StatementAdapter.evaluate(Stateme
> ntAdapter.java:36)
> [junit4:junit4]    > 	at
> com.carrotsearch.randomizedtesting.ThreadLeakControl$StatementRunner.run
> (ThreadLeakControl.java:345)
> [junit4:junit4]    > 	at
> com.carrotsearch.randomizedtesting.ThreadLeakControl.forkTimeoutingTask(T
> hreadLeakControl.java:769)
> [junit4:junit4]    > 	at
> com.carrotsearch.randomizedtesting.ThreadLeakControl$3.evaluate(ThreadLea
> kControl.java:429)
> [junit4:junit4]    > 	at
> com.carrotsearch.randomizedtesting.RandomizedRunner.runSingleTest(Rando
> mizedRunner.java:746)
> [junit4:junit4]    > 	at
> com.carrotsearch.randomizedtesting.RandomizedRunner$3.evaluate(Randomiz
> edRunner.java:648)
> [junit4:junit4]    > 	at
> com.carrotsearch.randomizedtesting.RandomizedRunner$4.evaluate(Randomiz
> edRunner.java:682)
> [junit4:junit4]    > 	at
> com.carrotsearch.randomizedtesting.RandomizedRunner$5.evaluate(Randomiz
> edRunner.java:693)
> [junit4:junit4]    > 	at
> com.carrotsearch.randomizedtesting.rules.StatementAdapter.evaluate(Stateme
> ntAdapter.java:36)
> [junit4:junit4]    > 	at
> com.carrotsearch.randomizedtesting.rules.SystemPropertiesRestoreRule$1.eval
> uate(SystemPropertiesRestoreRule.java:53)
> [junit4:junit4]    > 	at
> org.apache.lucene.util.AbstractBeforeAfterRule$1.evaluate(AbstractBeforeAfte
> rRule.java:45)
> [junit4:junit4]    > 	at
> org.apache.lucene.util.TestRuleStoreClassName$1.evaluate(TestRuleStoreClass
> Name.java:42)
> [junit4:junit4]    > 	at
> com.carrotsearch.randomizedtesting.rules.SystemPropertiesInvariantRule$1.ev
> aluate(SystemPropertiesInvariantRule.java:55)
> [junit4:junit4]    > 	at
> com.carrotsearch.randomizedtesting.rules.NoShadowingOrOverridesOnMethod
> sRule$1.evaluate(NoShadowingOrOverridesOnMethodsRule.java:39)
> [junit4:junit4]    > 	at
> com.carrotsearch.randomizedtesting.rules.NoShadowingOrOverridesOnMethod
> sRule$1.evaluate(NoShadowingOrOverridesOnMethodsRule.java:39)
> [junit4:junit4]    > 	at
> org.apache.lucene.util.TestRuleAssertionsRequired$1.evaluate(TestRuleAssertio
> nsRequired.java:40)
> [junit4:junit4]    > 	at
> org.apache.lucene.util.TestRuleMarkFailure$1.evaluate(TestRuleMarkFailure.ja
> va:48)
> [junit4:junit4]    > 	at
> org.apache.lucene.util.TestRuleIgnoreAfterMaxFailures$1.evaluate(TestRuleIgn
> oreAfterMaxFailures.java:70)
> [junit4:junit4]    > 	at
> org.apache.lucene.util.TestRuleIgnoreTestSuites$1.evaluate(TestRuleIgnoreTest
> Suites.java:55)
> [junit4:junit4]    > 	at
> com.carrotsearch.randomizedtesting.rules.StatementAdapter.evaluate(Stateme
> ntAdapter.java:36)
> [junit4:junit4]    > 	at
> com.carrotsearch.randomizedtesting.ThreadLeakControl$StatementRunner.run
> (ThreadLeakControl.java:345)
> [junit4:junit4]    > 	at java.lang.Thread.run(Thread.java:722)
> [junit4:junit4]    > Caused by: java.net.SocketException: Connection reset
> [junit4:junit4]    > 	at
> java.net.SocketInputStream.read(SocketInputStream.java:189)
> [junit4:junit4]    > 	at
> java.net.SocketInputStream.read(SocketInputStream.java:121)
> [junit4:junit4]    > 	at
> org.apache.http.impl.io.AbstractSessionInputBuffer.fillBuffer(AbstractSessionInp
> utBuffer.java:149)
> [junit4:junit4]    > 	at
> org.apache.http.impl.io.SocketInputBuffer.fillBuffer(SocketInputBuffer.java:111)
> [junit4:junit4]    > 	at
> org.apache.http.impl.io.AbstractSessionInputBuffer.readLine(AbstractSessionInp
> utBuffer.java:264)
> [junit4:junit4]    > 	at
> org.apache.http.impl.conn.DefaultResponseParser.parseHead(DefaultResponse
> Parser.java:98)
> [junit4:junit4]    > 	at
> org.apache.http.impl.io.AbstractMessageParser.parse(AbstractMessageParser.j
> ava:252)
> [junit4:junit4]    > 	at
> org.apache.http.impl.AbstractHttpClientConnection.receiveResponseHeader(Ab
> stractHttpClientConnection.java:282)
> [junit4:junit4]    > 	at
> org.apache.http.impl.conn.DefaultClientConnection.receiveResponseHeader(De
> faultClientConnection.java:247)
> [junit4:junit4]    > 	at
> org.apache.http.impl.conn.AbstractClientConnAdapter.receiveResponseHeader(
> AbstractClientConnAdapter.java:216)
> [junit4:junit4]    > 	at
> org.apache.http.protocol.HttpRequestExecutor.doReceiveResponse(HttpRequest
> Executor.java:298)
> [junit4:junit4]    > 	at
> org.apache.http.protocol.HttpRequestExecutor.execute(HttpRequestExecutor.ja
> va:125)
> [junit4:junit4]    > 	at
> org.apache.http.impl.client.DefaultRequestDirector.tryExecute(DefaultRequest
> Director.java:647)
> [junit4:junit4]    > 	at
> org.apache.http.impl.client.DefaultRequestDirector.execute(DefaultRequestDir
> ector.java:464)
> [junit4:junit4]    > 	at
> org.apache.http.impl.client.AbstractHttpClient.execute(AbstractHttpClient.java:
> 820)
> [junit4:junit4]    > 	at
> org.apache.http.impl.client.AbstractHttpClient.execute(AbstractHttpClient.java:
> 754)
> [junit4:junit4]    > 	at
> org.apache.http.impl.client.AbstractHttpClient.execute(AbstractHttpClient.java:
> 732)
> [junit4:junit4]    > 	at
> org.apache.solr.client.solrj.impl.HttpSolrServer.request(HttpSolrServer.java:353
> )
> [junit4:junit4]    > 	... 42 more
> [junit4:junit4]   2> NOTE: test params are: codec=Lucene40: {},
> sim=RandomSimilarityProvider(queryNorm=true,coord=no): {}, locale=sk,
> timezone=America/Mazatlan
> [junit4:junit4]   2> NOTE: FreeBSD 9.0-RELEASE amd64/Oracle Corporation
> 1.7.0_06 (64-bit)/cpus=16,threads=1,free=32765104,total=103809024
> [junit4:junit4]   2> NOTE: All tests run in this JVM: [TestIndexSearcher,
> TestConfig, FastVectorHighlighterTest, DistanceFunctionTest,
> TestSolrQueryParser, AnalysisAfterCoreReloadTest]
> [junit4:junit4] Completed on J0 in 3.69s, 1 test, 1 error <<< FAILURES!
> 
> [...truncated 104 lines...]
> [junit4:junit4] ERROR: JVM J0 ended with an exception, command line:
> /usr/local/openjdk7/jre/bin/java -XX:+UseG1GC -Dtests.prefix=tests -
> Dtests.seed=E20548CE3E5ACD20 -Xmx512M -Dtests.iters= -
> Dtests.verbose=false -Dtests.infostream=false -
> Dtests.lockdir=/usr/home/hudson/hudson-slave/workspace/Lucene-Solr-Tests-
> 4.x-java7/lucene/build -Dtests.codec=random -Dtests.postingsformat=random -
> Dtests.locale=random -Dtests.timezone=random -Dtests.directory=random -
> Dtests.linedocsfile=europarl.lines.txt.gz -Dtests.luceneMatchVersion=4.0 -
> Dtests.cleanthreads=perClass -
> Djava.util.logging.config.file=/usr/home/hudson/hudson-
> slave/workspace/Lucene-Solr-Tests-4.x-java7/solr/testlogging.properties -
> Dtests.nightly=false -Dtests.weekly=false -Dtests.slow=true -
> Dtests.asserts.gracious=false -Dtests.multiplier=3 -DtempDir=. -
> Djava.io.tmpdir=. -Dtests.sandbox.dir=/usr/home/hudson/hudson-
> slave/workspace/Lucene-Solr-Tests-4.x-java7/solr/build/solr-core -
> Djava.security.manager=java.lang.SecurityManager -
> Djava.security.policy=/usr/home/hudson/hudson-slave/workspace/Lucene-Solr-
> Tests-4.x-java7/lucene/tools/junit4/tests.policy -Dlucene.version=4.0-
> SNAPSHOT -Djetty.testMode=1 -Djetty.insecurerandom=1 -
> Dsolr.directoryFactory=org.apache.solr.core.MockDirectoryFactory -
> Dfile.encoding=ISO-8859-1 -classpath /usr/home/hudson/hudson-
> slave/workspace/Lucene-Solr-Tests-4.x-java7/solr/build/solr-
> core/classes/test:/usr/home/hudson/hudson-slave/workspace/Lucene-Solr-
> Tests-4.x-java7/solr/build/solr-test-
> framework/classes/java:/usr/home/hudson/hudson-slave/workspace/Lucene-
> Solr-Tests-4.x-java7/solr/build/solr-core/test-files:/usr/home/hudson/hudson-
> slave/workspace/Lucene-Solr-Tests-4.x-java7/lucene/build/test-
> framework/classes/java:/usr/home/hudson/hudson-slave/workspace/Lucene-
> Solr-Tests-4.x-java7/solr/build/solr-
> solrj/classes/java:/usr/home/hudson/hudson-slave/workspace/Lucene-Solr-
> Tests-4.x-java7/solr/build/solr-core/classes/java:/usr/home/hudson/hudson-
> slave/workspace/Lucene-Solr-Tests-4.x-
> java7/lucene/build/analysis/common/lucene-analyzers-common-4.0-
> SNAPSHOT.jar:/usr/home/hudson/hudson-slave/workspace/Lucene-Solr-Tests-
> 4.x-java7/lucene/build/analysis/kuromoji/lucene-analyzers-kuromoji-4.0-
> SNAPSHOT.jar:/usr/home/hudson/hudson-slave/workspace/Lucene-Solr-Tests-
> 4.x-java7/lucene/build/analysis/phonetic/lucene-analyzers-phonetic-4.0-
> SNAPSHOT.jar:/usr/home/hudson/hudson-slave/workspace/Lucene-Solr-Tests-
> 4.x-java7/lucene/build/highlighter/lucene-highlighter-4.0-
> SNAPSHOT.jar:/usr/home/hudson/hudson-slave/workspace/Lucene-Solr-Tests-
> 4.x-java7/lucene/build/memory/lucene-memory-4.0-
> SNAPSHOT.jar:/usr/home/hudson/hudson-slave/workspace/Lucene-Solr-Tests-
> 4.x-java7/lucene/build/misc/lucene-misc-4.0-
> SNAPSHOT.jar:/usr/home/hudson/hudson-slave/workspace/Lucene-Solr-Tests-
> 4.x-java7/lucene/build/spatial/lucene-spatial-4.0-
> SNAPSHOT.jar:/usr/home/hudson/hudson-slave/workspace/Lucene-Solr-Tests-
> 4.x-java7/lucene/build/suggest/lucene-suggest-4.0-
> SNAPSHOT.jar:/usr/home/hudson/hudson-slave/workspace/Lucene-Solr-Tests-
> 4.x-java7/lucene/build/grouping/lucene-grouping-4.0-
> SNAPSHOT.jar:/usr/home/hudson/hudson-slave/workspace/Lucene-Solr-Tests-
> 4.x-java7/lucene/build/queries/lucene-queries-4.0-
> SNAPSHOT.jar:/usr/home/hudson/hudson-slave/workspace/Lucene-Solr-Tests-
> 4.x-java7/lucene/build/queryparser/lucene-queryparser-4.0-
> SNAPSHOT.jar:/usr/home/hudson/hudson-slave/workspace/Lucene-Solr-Tests-
> 4.x-java7/solr/lib/commons-cli-1.2.jar:/usr/home/hudson/hudson-
> slave/workspace/Lucene-Solr-Tests-4.x-java7/solr/lib/commons-codec-
> 1.6.jar:/usr/home/hudson/hudson-slave/workspace/Lucene-Solr-Tests-4.x-
> java7/solr/lib/commons-fileupload-1.2.1.jar:/usr/home/hudson/hudson-
> slave/workspace/Lucene-Solr-Tests-4.x-java7/solr/lib/commons-io-
> 2.1.jar:/usr/home/hudson/hudson-slave/workspace/Lucene-Solr-Tests-4.x-
> java7/solr/lib/commons-lang-2.6.jar:/usr/home/hudson/hudson-
> slave/workspace/Lucene-Solr-Tests-4.x-java7/solr/lib/easymock-
> 2.2.jar:/usr/home/hudson/hudson-slave/workspace/Lucene-Solr-Tests-4.x-
> java7/solr/lib/guava-r05.jar:/usr/home/hudson/hudson-
> slave/workspace/Lucene-Solr-Tests-4.x-java7/solr/lib/httpclient-
> 4.1.3.jar:/usr/home/hudson/hudson-slave/workspace/Lucene-Solr-Tests-4.x-
> java7/solr/lib/httpcore-4.1.4.jar:/usr/home/hudson/hudson-
> slave/workspace/Lucene-Solr-Tests-4.x-java7/solr/lib/httpmime-
> 4.1.3.jar:/usr/home/hudson/hudson-slave/workspace/Lucene-Solr-Tests-4.x-
> java7/solr/lib/javax.servlet-api-3.0.1.jar:/usr/home/hudson/hudson-
> slave/workspace/Lucene-Solr-Tests-4.x-java7/solr/lib/jcl-over-slf4j-
> 1.6.4.jar:/usr/home/hudson/hudson-slave/workspace/Lucene-Solr-Tests-4.x-
> java7/solr/lib/log4j-over-slf4j-1.6.4.jar:/usr/home/hudson/hudson-
> slave/workspace/Lucene-Solr-Tests-4.x-java7/solr/lib/slf4j-api-
> 1.6.4.jar:/usr/home/hudson/hudson-slave/workspace/Lucene-Solr-Tests-4.x-
> java7/solr/lib/slf4j-jdk14-1.6.4.jar:/usr/home/hudson/hudson-
> slave/workspace/Lucene-Solr-Tests-4.x-java7/solr/lib/spatial4j-
> 0.2.jar:/usr/home/hudson/hudson-slave/workspace/Lucene-Solr-Tests-4.x-
> java7/solr/lib/wstx-asl-3.2.7.jar:/usr/home/hudson/hudson-
> slave/workspace/Lucene-Solr-Tests-4.x-java7/solr/lib/zookeeper-
> 3.3.6.jar:/usr/home/hudson/hudson-slave/workspace/Lucene-Solr-Tests-4.x-
> java7/solr/example/lib/jetty-continuation-
> 8.1.2.v20120308.jar:/usr/home/hudson/hudson-slave/workspace/Lucene-Solr-
> Tests-4.x-java7/solr/example/lib/jetty-deploy-
> 8.1.2.v20120308.jar:/usr/home/hudson/hudson-slave/workspace/Lucene-Solr-
> Tests-4.x-java7/solr/example/lib/jetty-http-
> 8.1.2.v20120308.jar:/usr/home/hudson/hudson-slave/workspace/Lucene-Solr-
> Tests-4.x-java7/solr/example/lib/jetty-io-
> 8.1.2.v20120308.jar:/usr/home/hudson/hudson-slave/workspace/Lucene-Solr-
> Tests-4.x-java7/solr/example/lib/jetty-jmx-
> 8.1.2.v20120308.jar:/usr/home/hudson/hudson-slave/workspace/Lucene-Solr-
> Tests-4.x-java7/solr/example/lib/jetty-security-
> 8.1.2.v20120308.jar:/usr/home/hudson/hudson-slave/workspace/Lucene-Solr-
> Tests-4.x-java7/solr/example/lib/jetty-server-
> 8.1.2.v20120308.jar:/usr/home/hudson/hudson-slave/workspace/Lucene-Solr-
> Tests-4.x-java7/solr/example/lib/jetty-servlet-
> 8.1.2.v20120308.jar:/usr/home/hudson/hudson-slave/workspace/Lucene-Solr-
> Tests-4.x-java7/solr/example/lib/jetty-util-
> 8.1.2.v20120308.jar:/usr/home/hudson/hudson-slave/workspace/Lucene-Solr-
> Tests-4.x-java7/solr/example/lib/jetty-webapp-
> 8.1.2.v20120308.jar:/usr/home/hudson/hudson-slave/workspace/Lucene-Solr-
> Tests-4.x-java7/solr/example/lib/jetty-xml-
> 8.1.2.v20120308.jar:/usr/home/hudson/hudson-slave/workspace/Lucene-Solr-
> Tests-4.x-java7/solr/example/lib/servlet-api-3.0.jar:/usr/home/hudson/hudson-
> slave/workspace/Lucene-Solr-Tests-4.x-java7/solr/example/example-
> DIH/solr/db/lib/hsqldb-1.8.0.10.jar:/usr/home/hudson/hudson-
> slave/workspace/Lucene-Solr-Tests-4.x-
> java7/lucene/build/core/classes/java:/usr/home/hudson/hudson-
> slave/workspace/Lucene-Solr-Tests-4.x-java7/lucene/test-framework/lib/junit-
> 4.10.jar:/usr/home/hudson/hudson-slave/workspace/Lucene-Solr-Tests-4.x-
> java7/lucene/test-framework/lib/randomizedtesting-runner-
> 2.0.0.rc5.jar:/home/hudson/hudson-slave/tools/Ant/ant-1.8.2/lib/ant-
> launcher.jar:/home/hudson/.ant/lib/ivy-2.2.0.jar:/home/hudson/hudson-
> slave/tools/Ant/ant-1.8.2/lib/ant-apache-regexp.jar:/home/hudson/hudson-
> slave/tools/Ant/ant-1.8.2/lib/ant-junit.jar:/home/hudson/hudson-
> slave/tools/Ant/ant-1.8.2/lib/ant-apache-bsf.jar:/home/hudson/hudson-
> slave/tools/Ant/ant-1.8.2/lib/ant-commons-net.jar:/home/hudson/hudson-
> slave/tools/Ant/ant-1.8.2/lib/ant-antlr.jar:/home/hudson/hudson-
> slave/tools/Ant/ant-1.8.2/lib/ant-apache-log4j.jar:/home/hudson/hudson-
> slave/tools/Ant/ant-1.8.2/lib/ant-commons-logging.jar:/home/hudson/hudson-
> slave/tools/Ant/ant-1.8.2/lib/ant-apache-xalan2.jar:/home/hudson/hudson-
> slave/tools/Ant/ant-1.8.2/lib/ant-apache-oro.jar:/home/hudson/hudson-
> slave/tools/Ant/ant-1.8.2/lib/ant-junit4.jar:/home/hudson/hudson-
> slave/tools/Ant/ant-1.8.2/lib/ant-netrexx.jar:/home/hudson/hudson-
> slave/tools/Ant/ant-1.8.2/lib/ant-swing.jar:/home/hudson/hudson-
> slave/tools/Ant/ant-1.8.2/lib/ant-javamail.jar:/home/hudson/hudson-
> slave/tools/Ant/ant-1.8.2/lib/ant-jsch.jar:/home/hudson/hudson-
> slave/tools/Ant/ant-1.8.2/lib/ant-jmf.jar:/home/hudson/hudson-
> slave/tools/Ant/ant-1.8.2/lib/ant.jar:/home/hudson/hudson-slave/tools/Ant/ant-
> 1.8.2/lib/ant-apache-bcel.jar:/home/hudson/hudson-slave/tools/Ant/ant-
> 1.8.2/lib/ant-jai.jar:/home/hudson/hudson-slave/tools/Ant/ant-1.8.2/lib/ant-
> testutil.jar:/home/hudson/hudson-slave/tools/Ant/ant-1.8.2/lib/ant-apache-
> resolver.jar:/home/hudson/hudson-slave/tools/Ant/ant-1.8.2/lib/ant-
> jdepend.jar:/usr/local/openjdk7/lib/tools.jar:/home/hudson/.ivy2/cache/com.ca
> rrotsearch.randomizedtesting/junit4-ant/jars/junit4-ant-2.0.0.rc5.jar -
> ea:org.apache.lucene... -ea:org.apache.solr...
> com.carrotsearch.ant.tasks.junit4.slave.SlaveMainSafe -eventsfile
> /usr/home/hudson/hudson-slave/workspace/Lucene-Solr-Tests-4.x-
> java7/solr/build/solr-core/test/junit4-J0-20120830_152359_886.events
> @/usr/home/hudson/hudson-slave/workspace/Lucene-Solr-Tests-4.x-
> java7/solr/build/solr-core/test/junit4-J0-20120830_152359_886.suites
> [junit4:junit4] ERROR: JVM J0 ended with an exception: Forked process exited
> with an error code: 11
> [junit4:junit4] 	at
> com.carrotsearch.ant.tasks.junit4.JUnit4.forkProcess(JUnit4.java:1312)
> [junit4:junit4] 	at
> com.carrotsearch.ant.tasks.junit4.JUnit4.executeSlave(JUnit4.java:1178)
> [junit4:junit4] 	at
> com.carrotsearch.ant.tasks.junit4.JUnit4.access$000(JUnit4.java:65)
> [junit4:junit4] 	at
> com.carrotsearch.ant.tasks.junit4.JUnit4$2.call(JUnit4.java:813)
> [junit4:junit4] 	at
> com.carrotsearch.ant.tasks.junit4.JUnit4$2.call(JUnit4.java:810)
> [junit4:junit4] 	at
> java.util.concurrent.FutureTask$Sync.innerRun(FutureTask.java:334)
> [junit4:junit4] 	at java.util.concurrent.FutureTask.run(FutureTask.java:166)
> [junit4:junit4] 	at
> java.util.concurrent.ThreadPoolExecutor.runWorker(ThreadPoolExecutor.java:1
> 110)
> [junit4:junit4] 	at
> java.util.concurrent.ThreadPoolExecutor$Worker.run(ThreadPoolExecutor.java:
> 603)
> [junit4:junit4] 	at java.lang.Thread.run(Thread.java:722)
> [junit4:junit4] ERROR: JVM J1 ended with an exception, command line:
> /usr/local/openjdk7/jre/bin/java -XX:+UseG1GC -Dtests.prefix=tests -
> Dtests.seed=E20548CE3E5ACD20 -Xmx512M -Dtests.iters= -
> Dtests.verbose=false -Dtests.infostream=false -
> Dtests.lockdir=/usr/home/hudson/hudson-slave/workspace/Lucene-Solr-Tests-
> 4.x-java7/lucene/build -Dtests.codec=random -Dtests.postingsformat=random -
> Dtests.locale=random -Dtests.timezone=random -Dtests.directory=random -
> Dtests.linedocsfile=europarl.lines.txt.gz -Dtests.luceneMatchVersion=4.0 -
> Dtests.cleanthreads=perClass -
> Djava.util.logging.config.file=/usr/home/hudson/hudson-
> slave/workspace/Lucene-Solr-Tests-4.x-java7/solr/testlogging.properties -
> Dtests.nightly=false -Dtests.weekly=false -Dtests.slow=true -
> Dtests.asserts.gracious=false -Dtests.multiplier=3 -DtempDir=. -
> Djava.io.tmpdir=. -Dtests.sandbox.dir=/usr/home/hudson/hudson-
> slave/workspace/Lucene-Solr-Tests-4.x-java7/solr/build/solr-core -
> Djava.security.manager=java.lang.SecurityManager -
> Djava.security.policy=/usr/home/hudson/hudson-slave/workspace/Lucene-Solr-
> Tests-4.x-java7/lucene/tools/junit4/tests.policy -Dlucene.version=4.0-
> SNAPSHOT -Djetty.testMode=1 -Djetty.insecurerandom=1 -
> Dsolr.directoryFactory=org.apache.solr.core.MockDirectoryFactory -
> Dfile.encoding=ISO-8859-1 -classpath /usr/home/hudson/hudson-
> slave/workspace/Lucene-Solr-Tests-4.x-java7/solr/build/solr-
> core/classes/test:/usr/home/hudson/hudson-slave/workspace/Lucene-Solr-
> Tests-4.x-java7/solr/build/solr-test-
> framework/classes/java:/usr/home/hudson/hudson-slave/workspace/Lucene-
> Solr-Tests-4.x-java7/solr/build/solr-core/test-files:/usr/home/hudson/hudson-
> slave/workspace/Lucene-Solr-Tests-4.x-java7/lucene/build/test-
> framework/classes/java:/usr/home/hudson/hudson-slave/workspace/Lucene-
> Solr-Tests-4.x-java7/solr/build/solr-
> solrj/classes/java:/usr/home/hudson/hudson-slave/workspace/Lucene-Solr-
> Tests-4.x-java7/solr/build/solr-core/classes/java:/usr/home/hudson/hudson-
> slave/workspace/Lucene-Solr-Tests-4.x-
> java7/lucene/build/analysis/common/lucene-analyzers-common-4.0-
> SNAPSHOT.jar:/usr/home/hudson/hudson-slave/workspace/Lucene-Solr-Tests-
> 4.x-java7/lucene/build/analysis/kuromoji/lucene-analyzers-kuromoji-4.0-
> SNAPSHOT.jar:/usr/home/hudson/hudson-slave/workspace/Lucene-Solr-Tests-
> 4.x-java7/lucene/build/analysis/phonetic/lucene-analyzers-phonetic-4.0-
> SNAPSHOT.jar:/usr/home/hudson/hudson-slave/workspace/Lucene-Solr-Tests-
> 4.x-java7/lucene/build/highlighter/lucene-highlighter-4.0-
> SNAPSHOT.jar:/usr/home/hudson/hudson-slave/workspace/Lucene-Solr-Tests-
> 4.x-java7/lucene/build/memory/lucene-memory-4.0-
> SNAPSHOT.jar:/usr/home/hudson/hudson-slave/workspace/Lucene-Solr-Tests-
> 4.x-java7/lucene/build/misc/lucene-misc-4.0-
> SNAPSHOT.jar:/usr/home/hudson/hudson-slave/workspace/Lucene-Solr-Tests-
> 4.x-java7/lucene/build/spatial/lucene-spatial-4.0-
> SNAPSHOT.jar:/usr/home/hudson/hudson-slave/workspace/Lucene-Solr-Tests-
> 4.x-java7/lucene/build/suggest/lucene-suggest-4.0-
> SNAPSHOT.jar:/usr/home/hudson/hudson-slave/workspace/Lucene-Solr-Tests-
> 4.x-java7/lucene/build/grouping/lucene-grouping-4.0-
> SNAPSHOT.jar:/usr/home/hudson/hudson-slave/workspace/Lucene-Solr-Tests-
> 4.x-java7/lucene/build/queries/lucene-queries-4.0-
> SNAPSHOT.jar:/usr/home/hudson/hudson-slave/workspace/Lucene-Solr-Tests-
> 4.x-java7/lucene/build/queryparser/lucene-queryparser-4.0-
> SNAPSHOT.jar:/usr/home/hudson/hudson-slave/workspace/Lucene-Solr-Tests-
> 4.x-java7/solr/lib/commons-cli-1.2.jar:/usr/home/hudson/hudson-
> slave/workspace/Lucene-Solr-Tests-4.x-java7/solr/lib/commons-codec-
> 1.6.jar:/usr/home/hudson/hudson-slave/workspace/Lucene-Solr-Tests-4.x-
> java7/solr/lib/commons-fileupload-1.2.1.jar:/usr/home/hudson/hudson-
> slave/workspace/Lucene-Solr-Tests-4.x-java7/solr/lib/commons-io-
> 2.1.jar:/usr/home/hudson/hudson-slave/workspace/Lucene-Solr-Tests-4.x-
> java7/solr/lib/commons-lang-2.6.jar:/usr/home/hudson/hudson-
> slave/workspace/Lucene-Solr-Tests-4.x-java7/solr/lib/easymock-
> 2.2.jar:/usr/home/hudson/hudson-slave/workspace/Lucene-Solr-Tests-4.x-
> java7/solr/lib/guava-r05.jar:/usr/home/hudson/hudson-
> slave/workspace/Lucene-Solr-Tests-4.x-java7/solr/lib/httpclient-
> 4.1.3.jar:/usr/home/hudson/hudson-slave/workspace/Lucene-Solr-Tests-4.x-
> java7/solr/lib/httpcore-4.1.4.jar:/usr/home/hudson/hudson-
> slave/workspace/Lucene-Solr-Tests-4.x-java7/solr/lib/httpmime-
> 4.1.3.jar:/usr/home/hudson/hudson-slave/workspace/Lucene-Solr-Tests-4.x-
> java7/solr/lib/javax.servlet-api-3.0.1.jar:/usr/home/hudson/hudson-
> slave/workspace/Lucene-Solr-Tests-4.x-java7/solr/lib/jcl-over-slf4j-
> 1.6.4.jar:/usr/home/hudson/hudson-slave/workspace/Lucene-Solr-Tests-4.x-
> java7/solr/lib/log4j-over-slf4j-1.6.4.jar:/usr/home/hudson/hudson-
> slave/workspace/Lucene-Solr-Tests-4.x-java7/solr/lib/slf4j-api-
> 1.6.4.jar:/usr/home/hudson/hudson-slave/workspace/Lucene-Solr-Tests-4.x-
> java7/solr/lib/slf4j-jdk14-1.6.4.jar:/usr/home/hudson/hudson-
> slave/workspace/Lucene-Solr-Tests-4.x-java7/solr/lib/spatial4j-
> 0.2.jar:/usr/home/hudson/hudson-slave/workspace/Lucene-Solr-Tests-4.x-
> java7/solr/lib/wstx-asl-3.2.7.jar:/usr/home/hudson/hudson-
> slave/workspace/Lucene-Solr-Tests-4.x-java7/solr/lib/zookeeper-
> 3.3.6.jar:/usr/home/hudson/hudson-slave/workspace/Lucene-Solr-Tests-4.x-
> java7/solr/example/lib/jetty-continuation-
> 8.1.2.v20120308.jar:/usr/home/hudson/hudson-slave/workspace/Lucene-Solr-
> Tests-4.x-java7/solr/example/lib/jetty-deploy-
> 8.1.2.v20120308.jar:/usr/home/hudson/hudson-slave/workspace/Lucene-Solr-
> Tests-4.x-java7/solr/example/lib/jetty-http-
> 8.1.2.v20120308.jar:/usr/home/hudson/hudson-slave/workspace/Lucene-Solr-
> Tests-4.x-java7/solr/example/lib/jetty-io-
> 8.1.2.v20120308.jar:/usr/home/hudson/hudson-slave/workspace/Lucene-Solr-
> Tests-4.x-java7/solr/example/lib/jetty-jmx-
> 8.1.2.v20120308.jar:/usr/home/hudson/hudson-slave/workspace/Lucene-Solr-
> Tests-4.x-java7/solr/example/lib/jetty-security-
> 8.1.2.v20120308.jar:/usr/home/hudson/hudson-slave/workspace/Lucene-Solr-
> Tests-4.x-java7/solr/example/lib/jetty-server-
> 8.1.2.v20120308.jar:/usr/home/hudson/hudson-slave/workspace/Lucene-Solr-
> Tests-4.x-java7/solr/example/lib/jetty-servlet-
> 8.1.2.v20120308.jar:/usr/home/hudson/hudson-slave/workspace/Lucene-Solr-
> Tests-4.x-java7/solr/example/lib/jetty-util-
> 8.1.2.v20120308.jar:/usr/home/hudson/hudson-slave/workspace/Lucene-Solr-
> Tests-4.x-java7/solr/example/lib/jetty-webapp-
> 8.1.2.v20120308.jar:/usr/home/hudson/hudson-slave/workspace/Lucene-Solr-
> Tests-4.x-java7/solr/example/lib/jetty-xml-
> 8.1.2.v20120308.jar:/usr/home/hudson/hudson-slave/workspace/Lucene-Solr-
> Tests-4.x-java7/solr/example/lib/servlet-api-3.0.jar:/usr/home/hudson/hudson-
> slave/workspace/Lucene-Solr-Tests-4.x-java7/solr/example/example-
> DIH/solr/db/lib/hsqldb-1.8.0.10.jar:/usr/home/hudson/hudson-
> slave/workspace/Lucene-Solr-Tests-4.x-
> java7/lucene/build/core/classes/java:/usr/home/hudson/hudson-
> slave/workspace/Lucene-Solr-Tests-4.x-java7/lucene/test-framework/lib/junit-
> 4.10.jar:/usr/home/hudson/hudson-slave/workspace/Lucene-Solr-Tests-4.x-
> java7/lucene/test-framework/lib/randomizedtesting-runner-
> 2.0.0.rc5.jar:/home/hudson/hudson-slave/tools/Ant/ant-1.8.2/lib/ant-
> launcher.jar:/home/hudson/.ant/lib/ivy-2.2.0.jar:/home/hudson/hudson-
> slave/tools/Ant/ant-1.8.2/lib/ant-apache-regexp.jar:/home/hudson/hudson-
> slave/tools/Ant/ant-1.8.2/lib/ant-junit.jar:/home/hudson/hudson-
> slave/tools/Ant/ant-1.8.2/lib/ant-apache-bsf.jar:/home/hudson/hudson-
> slave/tools/Ant/ant-1.8.2/lib/ant-commons-net.jar:/home/hudson/hudson-
> slave/tools/Ant/ant-1.8.2/lib/ant-antlr.jar:/home/hudson/hudson-
> slave/tools/Ant/ant-1.8.2/lib/ant-apache-log4j.jar:/home/hudson/hudson-
> slave/tools/Ant/ant-1.8.2/lib/ant-commons-logging.jar:/home/hudson/hudson-
> slave/tools/Ant/ant-1.8.2/lib/ant-apache-xalan2.jar:/home/hudson/hudson-
> slave/tools/Ant/ant-1.8.2/lib/ant-apache-oro.jar:/home/hudson/hudson-
> slave/tools/Ant/ant-1.8.2/lib/ant-junit4.jar:/home/hudson/hudson-
> slave/tools/Ant/ant-1.8.2/lib/ant-netrexx.jar:/home/hudson/hudson-
> slave/tools/Ant/ant-1.8.2/lib/ant-swing.jar:/home/hudson/hudson-
> slave/tools/Ant/ant-1.8.2/lib/ant-javamail.jar:/home/hudson/hudson-
> slave/tools/Ant/ant-1.8.2/lib/ant-jsch.jar:/home/hudson/hudson-
> slave/tools/Ant/ant-1.8.2/lib/ant-jmf.jar:/home/hudson/hudson-
> slave/tools/Ant/ant-1.8.2/lib/ant.jar:/home/hudson/hudson-slave/tools/Ant/ant-
> 1.8.2/lib/ant-apache-bcel.jar:/home/hudson/hudson-slave/tools/Ant/ant-
> 1.8.2/lib/ant-jai.jar:/home/hudson/hudson-slave/tools/Ant/ant-1.8.2/lib/ant-
> testutil.jar:/home/hudson/hudson-slave/tools/Ant/ant-1.8.2/lib/ant-apache-
> resolver.jar:/home/hudson/hudson-slave/tools/Ant/ant-1.8.2/lib/ant-
> jdepend.jar:/usr/local/openjdk7/lib/tools.jar:/home/hudson/.ivy2/cache/com.ca
> rrotsearch.randomizedtesting/junit4-ant/jars/junit4-ant-2.0.0.rc5.jar -
> ea:org.apache.lucene... -ea:org.apache.solr...
> com.carrotsearch.ant.tasks.junit4.slave.SlaveMainSafe -eventsfile
> /usr/home/hudson/hudson-slave/workspace/Lucene-Solr-Tests-4.x-
> java7/solr/build/solr-core/test/junit4-J1-20120830_152359_886.events
> @/usr/home/hudson/hudson-slave/workspace/Lucene-Solr-Tests-4.x-
> java7/solr/build/solr-core/test/junit4-J1-20120830_152359_886.suites
> [junit4:junit4] ERROR: JVM J1 ended with an exception: Forked process exited
> with an error code: 11
> [junit4:junit4] 	at
> com.carrotsearch.ant.tasks.junit4.JUnit4.forkProcess(JUnit4.java:1312)
> [junit4:junit4] 	at
> com.carrotsearch.ant.tasks.junit4.JUnit4.executeSlave(JUnit4.java:1178)
> [junit4:junit4] 	at
> com.carrotsearch.ant.tasks.junit4.JUnit4.access$000(JUnit4.java:65)
> [junit4:junit4] 	at
> com.carrotsearch.ant.tasks.junit4.JUnit4$2.call(JUnit4.java:813)
> [junit4:junit4] 	at
> com.carrotsearch.ant.tasks.junit4.JUnit4$2.call(JUnit4.java:810)
> [junit4:junit4] 	at
> java.util.concurrent.FutureTask$Sync.innerRun(FutureTask.java:334)
> [junit4:junit4] 	at java.util.concurrent.FutureTask.run(FutureTask.java:166)
> [junit4:junit4] 	at
> java.util.concurrent.ThreadPoolExecutor.runWorker(ThreadPoolExecutor.java:1
> 110)
> [junit4:junit4] 	at
> java.util.concurrent.ThreadPoolExecutor$Worker.run(ThreadPoolExecutor.java:
> 603)
> [junit4:junit4] 	at java.lang.Thread.run(Thread.java:722)
> 
> BUILD FAILED
> /usr/home/hudson/hudson-slave/workspace/Lucene-Solr-Tests-4.x-
> java7/build.xml:29: The following error occurred while executing this line:
> /usr/home/hudson/hudson-slave/workspace/Lucene-Solr-Tests-4.x-
> java7/solr/build.xml:144: The following error occurred while executing this
> line:
> /usr/home/hudson/hudson-slave/workspace/Lucene-Solr-Tests-4.x-
> java7/lucene/module-build.xml:62: The following error occurred while
> executing this line:
> /usr/home/hudson/hudson-slave/workspace/Lucene-Solr-Tests-4.x-
> java7/lucene/common-build.xml:1055: The following error occurred while
> executing this line:
> /usr/home/hudson/hudson-slave/workspace/Lucene-Solr-Tests-4.x-
> java7/lucene/common-build.xml:741: At least one slave process threw an
> unexpected exception, first: Forked process exited with an error code: 11
> 
> Total time: 20 minutes 59 seconds
> Build step 'Invoke Ant' marked build as failure
> Recording test results
> Email was triggered for: Failure
> Sending email for trigger: Failure
> 



---------------------------------------------------------------------
To unsubscribe, e-mail: dev-unsubscribe@lucene.apache.org
For additional commands, e-mail: dev-help@lucene.apache.org


Mime
View raw message