lucene-dev mailing list archives

Site index · List index
Message view « Date » · « Thread »
Top « Date » · « Thread »
From "Uwe Schindler" <...@thetaphi.de>
Subject RE: [JENKINS-MAVEN] Lucene-Solr-Maven-trunk #577: POMs out of sync
Date Mon, 13 Aug 2012 00:06:50 GMT
Should be fixed now.

-----
Uwe Schindler
H.-H.-Meier-Allee 63, D-28213 Bremen
http://www.thetaphi.de
eMail: uwe@thetaphi.de


> -----Original Message-----
> From: Apache Jenkins Server [mailto:jenkins@builds.apache.org]
> Sent: Monday, August 13, 2012 1:13 AM
> To: dev@lucene.apache.org
> Subject: [JENKINS-MAVEN] Lucene-Solr-Maven-trunk #577: POMs out of sync
> 
> Build: https://builds.apache.org/job/Lucene-Solr-Maven-trunk/577/
> 
> 2 tests failed.
> REGRESSION:
> org.apache.lucene.analysis.core.TestAllAnalyzersHaveFactories.test
> 
> Error Message:
> URI is not hierarchical
> 
> Stack Trace:
> java.lang.IllegalArgumentException: URI is not hierarchical
> 	at
> __randomizedtesting.SeedInfo.seed([7F4E423A46F828E9:F71A7DE0E8044511]:0
> )
> 	at java.io.File.<init>(File.java:380)
> 	at
> org.apache.lucene.analysis.core.TestRandomChains.getClassesForPackage(Test
> RandomChains.java:243)
> 	at
> org.apache.lucene.analysis.core.TestAllAnalyzersHaveFactories.test(TestAllAnal
> yzersHaveFactories.java:104)
> 	at sun.reflect.NativeMethodAccessorImpl.invoke0(Native Method)
> 	at
> sun.reflect.NativeMethodAccessorImpl.invoke(NativeMethodAccessorImpl.java:
> 57)
> 	at
> sun.reflect.DelegatingMethodAccessorImpl.invoke(DelegatingMethodAccessorI
> mpl.java:43)
> 	at java.lang.reflect.Method.invoke(Method.java:616)
> 	at
> com.carrotsearch.randomizedtesting.RandomizedRunner.invoke(RandomizedRu
> nner.java:1559)
> 	at
> com.carrotsearch.randomizedtesting.RandomizedRunner.access$600(Randomiz
> edRunner.java:79)
> 	at
> com.carrotsearch.randomizedtesting.RandomizedRunner$6.evaluate(Randomiz
> edRunner.java:737)
> 	at
> com.carrotsearch.randomizedtesting.RandomizedRunner$7.evaluate(Randomiz
> edRunner.java:773)
> 	at
> com.carrotsearch.randomizedtesting.RandomizedRunner$8.evaluate(Randomiz
> edRunner.java:787)
> 	at
> org.apache.lucene.util.TestRuleSetupTeardownChained$1.evaluate(TestRuleSet
> upTeardownChained.java:50)
> 	at
> org.apache.lucene.util.TestRuleFieldCacheSanity$1.evaluate(TestRuleFieldCach
> eSanity.java:32)
> 	at
> org.apache.lucene.util.AbstractBeforeAfterRule$1.evaluate(AbstractBeforeAfte
> rRule.java:45)
> 	at
> com.carrotsearch.randomizedtesting.rules.SystemPropertiesInvariantRule$1.ev
> aluate(SystemPropertiesInvariantRule.java:55)
> 	at
> org.apache.lucene.util.TestRuleThreadAndTestName$1.evaluate(TestRuleThrea
> dAndTestName.java:48)
> 	at
> org.apache.lucene.util.TestRuleIgnoreAfterMaxFailures$1.evaluate(TestRuleIgn
> oreAfterMaxFailures.java:70)
> 	at
> org.apache.lucene.util.TestRuleMarkFailure$1.evaluate(TestRuleMarkFailure.ja
> va:48)
> 	at
> com.carrotsearch.randomizedtesting.rules.StatementAdapter.evaluate(Stateme
> ntAdapter.java:36)
> 	at
> com.carrotsearch.randomizedtesting.ThreadLeakControl$StatementRunner.run
> (ThreadLeakControl.java:345)
> 	at
> com.carrotsearch.randomizedtesting.ThreadLeakControl.forkTimeoutingTask(T
> hreadLeakControl.java:769)
> 	at
> com.carrotsearch.randomizedtesting.ThreadLeakControl$3.evaluate(ThreadLea
> kControl.java:429)
> 	at
> com.carrotsearch.randomizedtesting.RandomizedRunner.runSingleTest(Rando
> mizedRunner.java:746)
> 	at
> com.carrotsearch.randomizedtesting.RandomizedRunner$3.evaluate(Randomiz
> edRunner.java:648)
> 	at
> com.carrotsearch.randomizedtesting.RandomizedRunner$4.evaluate(Randomiz
> edRunner.java:682)
> 	at
> com.carrotsearch.randomizedtesting.RandomizedRunner$5.evaluate(Randomiz
> edRunner.java:693)
> 	at
> org.apache.lucene.util.AbstractBeforeAfterRule$1.evaluate(AbstractBeforeAfte
> rRule.java:45)
> 	at
> org.apache.lucene.util.TestRuleStoreClassName$1.evaluate(TestRuleStoreClass
> Name.java:38)
> 	at
> com.carrotsearch.randomizedtesting.rules.SystemPropertiesInvariantRule$1.ev
> aluate(SystemPropertiesInvariantRule.java:55)
> 	at
> com.carrotsearch.randomizedtesting.rules.NoShadowingOrOverridesOnMethod
> sRule$1.evaluate(NoShadowingOrOverridesOnMethodsRule.java:39)
> 	at
> com.carrotsearch.randomizedtesting.rules.NoShadowingOrOverridesOnMethod
> sRule$1.evaluate(NoShadowingOrOverridesOnMethodsRule.java:39)
> 	at
> org.apache.lucene.util.TestRuleAssertionsRequired$1.evaluate(TestRuleAssertio
> nsRequired.java:40)
> 	at
> org.apache.lucene.util.TestRuleMarkFailure$1.evaluate(TestRuleMarkFailure.ja
> va:48)
> 	at
> org.apache.lucene.util.TestRuleIgnoreAfterMaxFailures$1.evaluate(TestRuleIgn
> oreAfterMaxFailures.java:70)
> 	at
> org.apache.lucene.util.TestRuleIgnoreTestSuites$1.evaluate(TestRuleIgnoreTest
> Suites.java:55)
> 	at
> com.carrotsearch.randomizedtesting.rules.StatementAdapter.evaluate(Stateme
> ntAdapter.java:36)
> 	at
> com.carrotsearch.randomizedtesting.ThreadLeakControl$StatementRunner.run
> (ThreadLeakControl.java:345)
> 	at java.lang.Thread.run(Thread.java:679)
> 
> 
> FAILED:
> org.apache.lucene.analysis.core.TestRandomChains.org.apache.lucene.analysis.
> core.TestRandomChains
> 
> Error Message:
> URI is not hierarchical
> 
> Stack Trace:
> java.lang.IllegalArgumentException: URI is not hierarchical
> 	at __randomizedtesting.SeedInfo.seed([FA87A9B277BAD750]:0)
> 	at java.io.File.<init>(File.java:380)
> 	at
> org.apache.lucene.analysis.core.TestRandomChains.getClassesForPackage(Test
> RandomChains.java:243)
> 	at
> org.apache.lucene.analysis.core.TestRandomChains.beforeClass(TestRandomCh
> ains.java:169)
> 	at sun.reflect.NativeMethodAccessorImpl.invoke0(Native Method)
> 	at
> sun.reflect.NativeMethodAccessorImpl.invoke(NativeMethodAccessorImpl.java:
> 57)
> 	at
> sun.reflect.DelegatingMethodAccessorImpl.invoke(DelegatingMethodAccessorI
> mpl.java:43)
> 	at java.lang.reflect.Method.invoke(Method.java:616)
> 	at
> com.carrotsearch.randomizedtesting.RandomizedRunner.invoke(RandomizedRu
> nner.java:1559)
> 	at
> com.carrotsearch.randomizedtesting.RandomizedRunner.access$600(Randomiz
> edRunner.java:79)
> 	at
> com.carrotsearch.randomizedtesting.RandomizedRunner$4.evaluate(Randomiz
> edRunner.java:677)
> 	at
> com.carrotsearch.randomizedtesting.RandomizedRunner$5.evaluate(Randomiz
> edRunner.java:693)
> 	at
> org.apache.lucene.util.AbstractBeforeAfterRule$1.evaluate(AbstractBeforeAfte
> rRule.java:45)
> 	at
> org.apache.lucene.util.TestRuleStoreClassName$1.evaluate(TestRuleStoreClass
> Name.java:38)
> 	at
> com.carrotsearch.randomizedtesting.rules.SystemPropertiesInvariantRule$1.ev
> aluate(SystemPropertiesInvariantRule.java:55)
> 	at
> com.carrotsearch.randomizedtesting.rules.NoShadowingOrOverridesOnMethod
> sRule$1.evaluate(NoShadowingOrOverridesOnMethodsRule.java:39)
> 	at
> com.carrotsearch.randomizedtesting.rules.NoShadowingOrOverridesOnMethod
> sRule$1.evaluate(NoShadowingOrOverridesOnMethodsRule.java:39)
> 	at
> org.apache.lucene.util.TestRuleAssertionsRequired$1.evaluate(TestRuleAssertio
> nsRequired.java:40)
> 	at
> org.apache.lucene.util.TestRuleMarkFailure$1.evaluate(TestRuleMarkFailure.ja
> va:48)
> 	at
> org.apache.lucene.util.TestRuleIgnoreAfterMaxFailures$1.evaluate(TestRuleIgn
> oreAfterMaxFailures.java:70)
> 	at
> org.apache.lucene.util.TestRuleIgnoreTestSuites$1.evaluate(TestRuleIgnoreTest
> Suites.java:55)
> 	at
> com.carrotsearch.randomizedtesting.rules.StatementAdapter.evaluate(Stateme
> ntAdapter.java:36)
> 	at
> com.carrotsearch.randomizedtesting.ThreadLeakControl$StatementRunner.run
> (ThreadLeakControl.java:345)
> 	at java.lang.Thread.run(Thread.java:679)
> 
> 
> 
> 
> Build Log:
> [...truncated 1103 lines...]
> Running org.apache.lucene.analysis.core.TestAllAnalyzersHaveFactories
> NOTE: reproduce with: ant test  -Dtestcase=TestAllAnalyzersHaveFactories -
> Dtests.method=test -Dtests.seed=7F4E423A46F828E9 -Dtests.locale=es_CR -
> Dtests.timezone=Africa/Nouakchott -Dtests.file.encoding=ISO8859-1
> NOTE: test params are: codec=Lucene40: {},
> sim=RandomSimilarityProvider(queryNorm=true,coord=yes): {}, locale=es_CR,
> timezone=Africa/Nouakchott
> NOTE: FreeBSD 9.0-RELEASE amd64/Sun Microsystems Inc. 1.6.0_32 (64-
> bit)/cpus=16,threads=1,free=49006600,total=251330560
> NOTE: All tests run in this JVM: [TestSnowballPorterFilterFactory,
> TestShingleFilterFactory, PositionFilterTest,
> TestEnglishMinimalStemFilterFactory, TestMappingCharFilterFactory,
> TestWordDelimiterFilter, TestPatternReplaceCharFilterFactory,
> TestNorwegianMinimalStemFilter, TestPorterStemFilter, TestCharArrayMap,
> TestPatternReplaceFilterFactory, TestSynonymFilterFactory,
> TestEnglishAnalyzer, TestGalicianStemFilterFactory, TestThaiAnalyzer,
> TestSpanishLightStemFilter, TestRussianAnalyzer, TestHindiAnalyzer,
> DateRecognizerSinkTokenizerTest, TestIndonesianStemFilterFactory,
> TestItalianLightStemFilter, TestIrishAnalyzer, TestSingleTokenTokenFilter,
> TestCzechStemFilterFactory, TestFrenchLightStemFilterFactory,
> TestRemoveDuplicatesTokenFilterFactory, TestCzechStemmer,
> TestElisionFilterFactory, TestAnalysisSPILoader, TestGalicianAnalyzer,
> TestPortugueseLightStemFilterFactory, TestCharTokenizers,
> TestEnglishMinimalStemFilter, TestASCIIFoldingFilter,
> DelimitedPayloadTokenFilterTest, TestNorwegianAnalyzer,
> TestIrishLowerCaseFilter, TestGermanMinimalStemFilterFactory,
> TestBugInSomething, TestFrenchMinimalStemFilterFactory,
> TestStopFilterFactory, TestBulgarianAnalyzer, TestPrefixAwareTokenFilter,
> TestSynonymMapFilter, TestBulgarianStemmer, TestLengthFilter,
> TestFinnishLightStemFilter, TestPatternTokenizer, TestReverseStringFilter,
> TestLatvianStemmer, TokenTypeSinkTokenizerTest, TestPortugueseAnalyzer,
> TestCJKAnalyzer, TestWordlistLoader, TestNorwegianLightStemFilterFactory,
> TestPersianNormalizationFilterFactory, TestKStemmer,
> TestRussianLightStemFilter, TestGreekStemFilterFactory,
> TestGermanLightStemFilterFactory, TestKeepWordFilter,
> TestPrefixAndSuffixAwareTokenFilter, TestElision, TestArabicFilters,
> TestGermanAnalyzer, TestCharArraySet, TestCapitalizationFilterFactory,
> WikipediaTokenizerTest, TestUAX29URLEmailTokenizerFactory,
> TestSwedishLightStemFilter, TestHindiStemmer, TestArmenianAnalyzer,
> GreekAnalyzerTest, TestSwedishLightStemFilterFactory, TestSnowballVocab,
> TestItalianLightStemFilterFactory, TestMappingCharFilter,
> TestTurkishLowerCaseFilterFactory, TestPortugueseLightStemFilter,
> ShingleAnalyzerWrapperTest, TestCharArrayIterator,
> TestGermanNormalizationFilterFactory, TestClassicAnalyzer,
> QueryAutoStopWordAnalyzerTest, TestTrimFilter,
> TokenRangeSinkTokenizerTest, TestIndicNormalizer,
> TestIrishLowerCaseFilterFactory, TestTrimFilterFactory,
> NumericPayloadTokenFilterTest, TestSolrSynonymParser,
> TestLengthFilterFactory, TestGalicianMinimalStemFilter,
> TestPortugueseStemFilter, HTMLStripCharFilterTest, TestRomanianAnalyzer,
> TestHTMLStripCharFilterFactory, TestSpanishAnalyzer,
> TestReverseStringFilterFactory, TestGermanStemFilter, TestCharacterUtils,
> TestKeepFilterFactory, TestHindiNormalizer, TestHungarianAnalyzer,
> TestDictionaryCompoundWordTokenFilterFactory,
> TestPortugueseMinimalStemFilter, TestTurkishAnalyzer, TestCzechAnalyzer,
> TestBrazilianStemFilterFactory, NGramTokenFilterTest,
> TestGermanStemFilterFactory, TestFinnishLightStemFilterFactory,
> TestStandardAnalyzer, TestPersianAnalyzer, TestKeywordMarkerFilterFactory,
> TestTypeTokenFilter, TestBrazilianStemmer, TestTeeSinkTokenFilter,
> TestKeywordMarkerFilter, TestHungarianLightStemFilter, TestDanishAnalyzer,
> TestFrenchAnalyzer, TestPersianNormalizationFilter, NGramTokenizerTest,
> TestCommonGramsFilterFactory, TestEmptyTokenStream,
> TestSpanishLightStemFilterFactory, HunspellStemFilterTest, TestNGramFilters,
> TestDuelingAnalyzers, TestBulgarianStemFilterFactory, TestGalicianStemFilter,
> TestUAX29URLEmailTokenizer, TestPathHierarchyTokenizer,
> TestHungarianLightStemFilterFactory, TestHyphenatedWordsFilter,
> CommonGramsFilterTest, HunspellDictionaryTest,
> TestGermanNormalizationFilter, TestArabicAnalyzer, TestGreekStemmer,
> TestStemmerOverrideFilter, TestPortugueseStemFilterFactory,
> TestAllAnalyzersHaveFactories] Tests run: 1, Failures: 0, Errors: 1, Skipped: 0,
> Time elapsed: 0.186 sec <<< FAILURE!
> 
> [...truncated 70 lines...]
> Running org.apache.lucene.analysis.core.TestRandomChains
> NOTE: test params are: codec=Lucene40: {}, sim=DefaultSimilarity,
> locale=es_PY, timezone=America/Anchorage
> NOTE: FreeBSD 9.0-RELEASE amd64/Sun Microsystems Inc. 1.6.0_32 (64-
> bit)/cpus=16,threads=1,free=35460968,total=136773632
> NOTE: All tests run in this JVM: [TestSnowballPorterFilterFactory,
> TestShingleFilterFactory, PositionFilterTest,
> TestEnglishMinimalStemFilterFactory, TestMappingCharFilterFactory,
> TestWordDelimiterFilter, TestPatternReplaceCharFilterFactory,
> TestNorwegianMinimalStemFilter, TestPorterStemFilter, TestCharArrayMap,
> TestPatternReplaceFilterFactory, TestSynonymFilterFactory,
> TestEnglishAnalyzer, TestGalicianStemFilterFactory, TestThaiAnalyzer,
> TestSpanishLightStemFilter, TestRussianAnalyzer, TestHindiAnalyzer,
> DateRecognizerSinkTokenizerTest, TestIndonesianStemFilterFactory,
> TestItalianLightStemFilter, TestIrishAnalyzer, TestSingleTokenTokenFilter,
> TestCzechStemFilterFactory, TestFrenchLightStemFilterFactory,
> TestRemoveDuplicatesTokenFilterFactory, TestCzechStemmer,
> TestElisionFilterFactory, TestAnalysisSPILoader, TestGalicianAnalyzer,
> TestPortugueseLightStemFilterFactory, TestCharTokenizers,
> TestEnglishMinimalStemFilter, TestASCIIFoldingFilter,
> DelimitedPayloadTokenFilterTest, TestNorwegianAnalyzer,
> TestIrishLowerCaseFilter, TestGermanMinimalStemFilterFactory,
> TestBugInSomething, TestFrenchMinimalStemFilterFactory,
> TestStopFilterFactory, TestBulgarianAnalyzer, TestPrefixAwareTokenFilter,
> TestSynonymMapFilter, TestBulgarianStemmer, TestLengthFilter,
> TestFinnishLightStemFilter, TestPatternTokenizer, TestReverseStringFilter,
> TestLatvianStemmer, TokenTypeSinkTokenizerTest, TestPortugueseAnalyzer,
> TestCJKAnalyzer, TestWordlistLoader, TestNorwegianLightStemFilterFactory,
> TestPersianNormalizationFilterFactory, TestKStemmer,
> TestRussianLightStemFilter, TestGreekStemFilterFactory,
> TestGermanLightStemFilterFactory, TestKeepWordFilter,
> TestPrefixAndSuffixAwareTokenFilter, TestElision, TestArabicFilters,
> TestGermanAnalyzer, TestCharArraySet, TestCapitalizationFilterFactory,
> WikipediaTokenizerTest, TestUAX29URLEmailTokenizerFactory,
> TestSwedishLightStemFilter, TestHindiStemmer, TestArmenianAnalyzer,
> GreekAnalyzerTest, TestSwedishLightStemFilterFactory, TestSnowballVocab,
> TestItalianLightStemFilterFactory, TestMappingCharFilter,
> TestTurkishLowerCaseFilterFactory, TestPortugueseLightStemFilter,
> ShingleAnalyzerWrapperTest, TestCharArrayIterator,
> TestGermanNormalizationFilterFactory, TestClassicAnalyzer,
> QueryAutoStopWordAnalyzerTest, TestTrimFilter,
> TokenRangeSinkTokenizerTest, TestIndicNormalizer,
> TestIrishLowerCaseFilterFactory, TestTrimFilterFactory,
> NumericPayloadTokenFilterTest, TestSolrSynonymParser,
> TestLengthFilterFactory, TestGalicianMinimalStemFilter,
> TestPortugueseStemFilter, HTMLStripCharFilterTest, TestRomanianAnalyzer,
> TestHTMLStripCharFilterFactory, TestSpanishAnalyzer,
> TestReverseStringFilterFactory, TestGermanStemFilter, TestCharacterUtils,
> TestKeepFilterFactory, TestHindiNormalizer, TestHungarianAnalyzer,
> TestDictionaryCompoundWordTokenFilterFactory,
> TestPortugueseMinimalStemFilter, TestTurkishAnalyzer, TestCzechAnalyzer,
> TestBrazilianStemFilterFactory, NGramTokenFilterTest,
> TestGermanStemFilterFactory, TestFinnishLightStemFilterFactory,
> TestStandardAnalyzer, TestPersianAnalyzer, TestKeywordMarkerFilterFactory,
> TestTypeTokenFilter, TestBrazilianStemmer, TestTeeSinkTokenFilter,
> TestKeywordMarkerFilter, TestHungarianLightStemFilter, TestDanishAnalyzer,
> TestFrenchAnalyzer, TestPersianNormalizationFilter, NGramTokenizerTest,
> TestCommonGramsFilterFactory, TestEmptyTokenStream,
> TestSpanishLightStemFilterFactory, HunspellStemFilterTest, TestNGramFilters,
> TestDuelingAnalyzers, TestBulgarianStemFilterFactory, TestGalicianStemFilter,
> TestUAX29URLEmailTokenizer, TestPathHierarchyTokenizer,
> TestHungarianLightStemFilterFactory, TestHyphenatedWordsFilter,
> CommonGramsFilterTest, HunspellDictionaryTest,
> TestGermanNormalizationFilter, TestArabicAnalyzer, TestGreekStemmer,
> TestStemmerOverrideFilter, TestPortugueseStemFilterFactory,
> TestAllAnalyzersHaveFactories, TestCollationKeyAnalyzer,
> TestThaiWordFilterFactory, TestWordnetSynonymParser,
> TestCommonGramsQueryFilterFactory, TestIndonesianStemmer,
> TestRussianLightStemFilterFactory, TestGreekLowerCaseFilterFactory,
> TestReversePathHierarchyTokenizer, TestPatternReplaceFilter, TestAnalyzers,
> TestCJKBigramFilter, TestGalicianMinimalStemFilterFactory,
> TestCJKWidthFilterFactory, EdgeNGramTokenizerTest, TestArabicStemFilter,
> TestHindiFilters, EdgeNGramTokenFilterTest, TestKStemFilterFactory,
> TestCJKWidthFilter, TestRemoveDuplicatesTokenFilter,
> TypeAsPayloadTokenFilterTest, TestStandardFactories, TestCatalanAnalyzer,
> TestTurkishLowerCaseFilter, TestFactories, TestUAX29URLEmailAnalyzer,
> TestGermanMinimalStemFilter, TestSnowball,
> TestNorwegianMinimalStemFilterFactory, TestFinnishAnalyzer,
> TestGermanLightStemFilter, TestFilesystemResourceLoader,
> TestPatternTokenizerFactory, TestStopAnalyzer, TestKeywordAnalyzer,
> TestRandomChains]
> NOTE: reproduce with: ant test  -Dtestcase=TestRandomChains -
> Dtests.seed=FA87A9B277BAD750 -Dtests.locale=es_PY -
> Dtests.timezone=America/Anchorage -Dtests.file.encoding=ISO8859-1 Tests
> run: 1, Failures: 0, Errors: 1, Skipped: 0, Time elapsed: 0.14 sec <<< FAILURE!
> 
> [...truncated 81 lines...]
> 



---------------------------------------------------------------------
To unsubscribe, e-mail: dev-unsubscribe@lucene.apache.org
For additional commands, e-mail: dev-help@lucene.apache.org


Mime
View raw message