lucene-dev mailing list archives

Site index · List index
Message view « Date » · « Thread »
Top « Date » · « Thread »
From "Uwe Schindler" <...@thetaphi.de>
Subject RE: [JENKINS] lucene3312-branch (32bit/jdk1.8.0-ea-b51) - Build # 73 - Failure!
Date Tue, 21 Aug 2012 14:28:59 GMT
Hi Nikola,

 

Forget about this test, I don't think it is caused by your work on
LUCENE-3312! It is also happening on trunk from time to time, but in most
cases with JDK 8. I have seen this approximately 3 times the last month, 2
times with Oracle Java 8 (b49 and b51) on Linux, one time with FreeBSD's
Java 6 (stock). If you look into the history of the mailing list
dev@lucene.apache.org and search for "testWatchChildren", you will see the
failures (in trunk and branch_4x).

 

But thanks for trying it out! What steps did you do to reproduce?

 

Uwe

 

-----

Uwe Schindler

H.-H.-Meier-Allee 63, D-28213 Bremen

 <http://www.thetaphi.de/> http://www.thetaphi.de

eMail: uwe@thetaphi.de

 

From: Nikola Tanković [mailto:nikola.tankovic@gmail.com] 
Sent: Tuesday, August 21, 2012 4:16 PM
To: uwe@thetaphi.de
Subject: Re: [JENKINS] lucene3312-branch (32bit/jdk1.8.0-ea-b51) - Build #
73 - Failure!

 

Hi Uwe,

 

When I reproduce this test on my machine, it goes fine? What could be the
reason?




Nikola





On Tue, Aug 21, 2012 at 3:30 PM, Policeman Jenkins Server
<jenkins@sd-datasolutions.de> wrote:

Build: http://jenkins.sd-datasolutions.de/job/lucene3312-branch/73/
Java: 32bit/jdk1.8.0-ea-b51 -server -XX:+UseSerialGC

1 tests failed.
REGRESSION:  org.apache.solr.cloud.ZkSolrClientTest.testWatchChildren

Error Message:
expected:<2> but was:<1>

Stack Trace:
java.lang.AssertionError: expected:<2> but was:<1>
        at
__randomizedtesting.SeedInfo.seed([B2FA8103836A28DC:FA84E31FC4AE9267]:0)
        at org.junit.Assert.fail(Assert.java:93)
        at org.junit.Assert.failNotEquals(Assert.java:647)
        at org.junit.Assert.assertEquals(Assert.java:128)
        at org.junit.Assert.assertEquals(Assert.java:472)
        at org.junit.Assert.assertEquals(Assert.java:456)
        at
org.apache.solr.cloud.ZkSolrClientTest.testWatchChildren(ZkSolrClientTest.ja
va:218)
        at sun.reflect.NativeMethodAccessorImpl.invoke0(Native Method)
        at
sun.reflect.NativeMethodAccessorImpl.invoke(NativeMethodAccessorImpl.java:57
)
        at
sun.reflect.DelegatingMethodAccessorImpl.invoke(DelegatingMethodAccessorImpl
.java:43)
        at java.lang.reflect.Method.invoke(Method.java:474)
        at
com.carrotsearch.randomizedtesting.RandomizedRunner.invoke(RandomizedRunner.
java:1559)
        at
com.carrotsearch.randomizedtesting.RandomizedRunner.access$600(RandomizedRun
ner.java:79)
        at
com.carrotsearch.randomizedtesting.RandomizedRunner$6.evaluate(RandomizedRun
ner.java:737)
        at
com.carrotsearch.randomizedtesting.RandomizedRunner$7.evaluate(RandomizedRun
ner.java:773)
        at
com.carrotsearch.randomizedtesting.RandomizedRunner$8.evaluate(RandomizedRun
ner.java:787)
        at
com.carrotsearch.randomizedtesting.rules.SystemPropertiesRestoreRule$1.evalu
ate(SystemPropertiesRestoreRule.java:53)
        at
org.apache.lucene.util.TestRuleSetupTeardownChained$1.evaluate(TestRuleSetup
TeardownChained.java:50)
        at
org.apache.lucene.util.TestRuleFieldCacheSanity$1.evaluate(TestRuleFieldCach
eSanity.java:51)
        at
org.apache.lucene.util.AbstractBeforeAfterRule$1.evaluate(AbstractBeforeAfte
rRule.java:45)
        at
com.carrotsearch.randomizedtesting.rules.SystemPropertiesInvariantRule$1.eva
luate(SystemPropertiesInvariantRule.java:55)
        at
org.apache.lucene.util.TestRuleThreadAndTestName$1.evaluate(TestRuleThreadAn
dTestName.java:48)
        at
org.apache.lucene.util.TestRuleIgnoreAfterMaxFailures$1.evaluate(TestRuleIgn
oreAfterMaxFailures.java:70)
        at
org.apache.lucene.util.TestRuleMarkFailure$1.evaluate(TestRuleMarkFailure.ja
va:48)
        at
com.carrotsearch.randomizedtesting.rules.StatementAdapter.evaluate(Statement
Adapter.java:36)
        at
com.carrotsearch.randomizedtesting.ThreadLeakControl$StatementRunner.run(Thr
eadLeakControl.java:345)
        at
com.carrotsearch.randomizedtesting.ThreadLeakControl.forkTimeoutingTask(Thre
adLeakControl.java:769)
        at
com.carrotsearch.randomizedtesting.ThreadLeakControl$3.evaluate(ThreadLeakCo
ntrol.java:429)
        at
com.carrotsearch.randomizedtesting.RandomizedRunner.runSingleTest(Randomized
Runner.java:746)
        at
com.carrotsearch.randomizedtesting.RandomizedRunner$3.evaluate(RandomizedRun
ner.java:648)
        at
com.carrotsearch.randomizedtesting.RandomizedRunner$4.evaluate(RandomizedRun
ner.java:682)
        at
com.carrotsearch.randomizedtesting.RandomizedRunner$5.evaluate(RandomizedRun
ner.java:693)
        at
com.carrotsearch.randomizedtesting.rules.StatementAdapter.evaluate(Statement
Adapter.java:36)
        at
com.carrotsearch.randomizedtesting.rules.SystemPropertiesRestoreRule$1.evalu
ate(SystemPropertiesRestoreRule.java:53)
        at
org.apache.lucene.util.AbstractBeforeAfterRule$1.evaluate(AbstractBeforeAfte
rRule.java:45)
        at
org.apache.lucene.util.TestRuleStoreClassName$1.evaluate(TestRuleStoreClassN
ame.java:42)
        at
com.carrotsearch.randomizedtesting.rules.SystemPropertiesInvariantRule$1.eva
luate(SystemPropertiesInvariantRule.java:55)
        at
com.carrotsearch.randomizedtesting.rules.NoShadowingOrOverridesOnMethodsRule
$1.evaluate(NoShadowingOrOverridesOnMethodsRule.java:39)
        at
com.carrotsearch.randomizedtesting.rules.NoShadowingOrOverridesOnMethodsRule
$1.evaluate(NoShadowingOrOverridesOnMethodsRule.java:39)
        at
org.apache.lucene.util.TestRuleAssertionsRequired$1.evaluate(TestRuleAsserti
onsRequired.java:40)
        at
org.apache.lucene.util.TestRuleMarkFailure$1.evaluate(TestRuleMarkFailure.ja
va:48)
        at
org.apache.lucene.util.TestRuleIgnoreAfterMaxFailures$1.evaluate(TestRuleIgn
oreAfterMaxFailures.java:70)
        at
org.apache.lucene.util.TestRuleIgnoreTestSuites$1.evaluate(TestRuleIgnoreTes
tSuites.java:55)
        at
com.carrotsearch.randomizedtesting.rules.StatementAdapter.evaluate(Statement
Adapter.java:36)
        at
com.carrotsearch.randomizedtesting.ThreadLeakControl$StatementRunner.run(Thr
eadLeakControl.java:345)
        at java.lang.Thread.run(Thread.java:722)




Build Log:
[...truncated 7192 lines...]
[junit4:junit4] Suite: org.apache.solr.cloud.ZkSolrClientTest
[junit4:junit4]   2> 925 T867 oasu.AbstractSolrTestCase.setUp
####SETUP_START testReconnect
[junit4:junit4]   2> 926 T867 oasu.AbstractSolrTestCase.setUp ####SETUP_END
testReconnect
[junit4:junit4]   2> 926 T867 oasc.ZkTestServer.run STARTING ZK TEST SERVER
[junit4:junit4]   2> 927 T868 oazs.ZooKeeperServer.setTickTime tickTime set
to 3000
[junit4:junit4]   2> 927 T868 oazs.NIOServerCnxn$Factory.<init> binding to
port  <http://0.0.0.0/0.0.0.0:0%0d%0a%5bjunit4:junit4> 0.0.0.0/0.0.0.0:0
[junit4:junit4]   2> 939 T868 oazsp.FileTxnSnapLog.save Snapshotting: 0
[junit4:junit4]   2> 1027 T867 oasc.ZkTestServer.run start zk server on
port:38808
[junit4:junit4]   2> 1027 T867 oaz.ZooKeeper.<init> Initiating client
connection, connectString= <http://127.0.0.1:38808> 127.0.0.1:38808
sessionTimeout=10000
<mailto:watcher=org.apache.solr.common.cloud.ConnectionManager@31c236>
watcher=org.apache.solr.common.cloud.ConnectionManager@31c236
[junit4:junit4]   2> 1028 T873 oaz.ClientCnxn$SendThread.startConnect
Opening socket connection to server / <http://127.0.0.1:38808>
127.0.0.1:38808
[junit4:junit4]   2> 1028 T873 oaz.ClientCnxn$SendThread.primeConnection
Socket connection established to localhost.localdomain/
<http://127.0.0.1:38808> 127.0.0.1:38808, initiating session
[junit4:junit4]   2> 1029 T869 oazs.NIOServerCnxn$Factory.run Accepted
socket connection from / <http://127.0.0.1:57358> 127.0.0.1:57358
[junit4:junit4]   2> 1029 T869 oazs.NIOServerCnxn.readConnectRequest Client
attempting to establish new session at / <http://127.0.0.1:57358>
127.0.0.1:57358
[junit4:junit4]   2> 1039 T871 oazsp.FileTxnLog.append Creating new log
file: log.1
[junit4:junit4]   2> 1114 T871 oazs.NIOServerCnxn.finishSessionInit
Established session 0x139495b31ff0000 with negotiated timeout 10000 for
client / <http://127.0.0.1:57358> 127.0.0.1:57358
[junit4:junit4]   2> 1114 T873 oaz.ClientCnxn$SendThread.readConnectResult
Session establishment complete on server localhost.localdomain/
<http://127.0.0.1:38808> 127.0.0.1:38808, sessionid = 0x139495b31ff0000,
negotiated timeout = 10000
[junit4:junit4]   2> 1115 T874 oascc.ConnectionManager.process Watcher
<mailto:org.apache.solr.common.cloud.ConnectionManager@31c236>
org.apache.solr.common.cloud.ConnectionManager@31c236
name:ZooKeeperConnection Watcher: <http://127.0.0.1:38808> 127.0.0.1:38808
got event WatchedEvent state:SyncConnected type:None path:null path:null
type:None
[junit4:junit4]   2> 1115 T867 oascc.SolrZkClient.makePath makePath: /solr
[junit4:junit4]   2> 1117 T872 oazs.PrepRequestProcessor.pRequest Processed
session termination for sessionid: 0x139495b31ff0000
[junit4:junit4]   2> 1117 T869 oazs.NIOServerCnxn.closeSock Closed socket
connection for client / <http://127.0.0.1:57358> 127.0.0.1:57358 which had
sessionid 0x139495b31ff0000
[junit4:junit4]   2> 1117 T867 oaz.ZooKeeper.close Session:
0x139495b31ff0000 closed
[junit4:junit4]   2> 1118 T867 oaz.ZooKeeper.<init> Initiating client
connection, connectString= <http://127.0.0.1:38808/solr>
127.0.0.1:38808/solr sessionTimeout=10000
<mailto:watcher=org.apache.solr.common.cloud.ConnectionManager@110e0f6>
watcher=org.apache.solr.common.cloud.ConnectionManager@110e0f6
[junit4:junit4]   2> 1118 T875 oaz.ClientCnxn$SendThread.startConnect
Opening socket connection to server / <http://127.0.0.1:38808>
127.0.0.1:38808
[junit4:junit4]   2> 1119 T875 oaz.ClientCnxn$SendThread.primeConnection
Socket connection established to localhost.localdomain/
<http://127.0.0.1:38808> 127.0.0.1:38808, initiating session
[junit4:junit4]   2> 1119 T869 oazs.NIOServerCnxn$Factory.run Accepted
socket connection from / <http://127.0.0.1:57359> 127.0.0.1:57359
[junit4:junit4]   2> 1119 T869 oazs.NIOServerCnxn.readConnectRequest Client
attempting to establish new session at / <http://127.0.0.1:57359>
127.0.0.1:57359
[junit4:junit4]   2> 1119 T874 oaz.ClientCnxn$EventThread.run EventThread
shut down
[junit4:junit4]   2> 1119 T875 oaz.ClientCnxn$SendThread.readConnectResult
Session establishment complete on server localhost.localdomain/
<http://127.0.0.1:38808> 127.0.0.1:38808, sessionid = 0x139495b31ff0001,
negotiated timeout = 10000
[junit4:junit4]   2> 1119 T871 oazs.NIOServerCnxn.finishSessionInit
Established session 0x139495b31ff0001 with negotiated timeout 10000 for
client / <http://127.0.0.1:57359> 127.0.0.1:57359
[junit4:junit4]   2> 1139 T876 oascc.ConnectionManager.process Watcher
<mailto:org.apache.solr.common.cloud.ConnectionManager@110e0f6>
org.apache.solr.common.cloud.ConnectionManager@110e0f6
name:ZooKeeperConnection Watcher: <http://127.0.0.1:38808/solr>
127.0.0.1:38808/solr got event WatchedEvent state:SyncConnected type:None
path:null path:null type:None
[junit4:junit4]   2> 1139 T867 oascc.SolrZkClient.makePath makePath:
/collections/collection1/shards
[junit4:junit4]   2> 1141 T867 oascc.SolrZkClient.makePath makePath:
collections/collection1
[junit4:junit4]   2> 1143 T871 oazs.SyncRequestProcessor.run
SyncRequestProcessor exited!
[junit4:junit4]   2> 1144 T867 oazs.FinalRequestProcessor.shutdown shutdown
of request processor complete
[junit4:junit4]   2> 1143 T872 oazs.PrepRequestProcessor.run
PrepRequestProcessor exited loop!
[junit4:junit4]   2> 1146 T867 oazs.NIOServerCnxn.closeSock Closed socket
connection for client / <http://127.0.0.1:57359> 127.0.0.1:57359 which had
sessionid 0x139495b31ff0001
[junit4:junit4]   2> 1146 T875 oaz.ClientCnxn$SendThread.run Unable to read
additional data from server sessionid 0x139495b31ff0001, likely server has
closed socket, closing socket connection and attempting reconnect
[junit4:junit4]   2> 1147 T869 oazs.NIOServerCnxn$Factory.run NIOServerCnxn
factory exited run method
[junit4:junit4]   2> 1147 T867 oazs.FinalRequestProcessor.shutdown shutdown
of request processor complete
[junit4:junit4]   2> 1228 T867 oascc.SolrZkClient.makePath makePath:
collections/collection2
[junit4:junit4]   2> 1247 T876 oascc.ConnectionManager.process Watcher
<mailto:org.apache.solr.common.cloud.ConnectionManager@110e0f6>
org.apache.solr.common.cloud.ConnectionManager@110e0f6
name:ZooKeeperConnection Watcher: <http://127.0.0.1:38808/solr>
127.0.0.1:38808/solr got event WatchedEvent state:Disconnected type:None
path:null path:null type:None
[junit4:junit4]   2> 1247 T867 oasc.ZkTestServer.run STARTING ZK TEST SERVER
[junit4:junit4]   2> 1255 T877 oazs.ZooKeeperServer.setTickTime tickTime set
to 3000
[junit4:junit4]   2> 1255 T877 oazs.NIOServerCnxn$Factory.<init> binding to
port  <http://0.0.0.0/0.0.0.0:38808%0d%0a%5bjunit4:junit4>
0.0.0.0/0.0.0.0:38808
[junit4:junit4]   2> 1256 T877 oazsp.FileSnap.deserialize Reading snapshot
/mnt/ssd/jenkins/workspace/lucene3312-branch/solr/build/solr-core/test/J1/./
org.apache.solr.cloud.ZkSolrClientTest-1345555476978/zookeeper/server1/data/
version-2/snapshot.0
[junit4:junit4]   2> 1256 T877 oazsp.FileTxnSnapLog.save Snapshotting: 8
[junit4:junit4]   2> 1355 T867 oasc.ZkTestServer.run start zk server on
port:38808
[junit4:junit4]   2> 1955 T867 oascc.SolrZkClient.makePath makePath:
collections/collection3
[junit4:junit4]   2> 2948 T870 oazs.SessionTrackerImpl.run
SessionTrackerImpl exited loop!
[junit4:junit4]   2> 3211 T875 oaz.ClientCnxn$SendThread.startConnect
Opening socket connection to server localhost.localdomain/
<http://127.0.0.1:38808> 127.0.0.1:38808
[junit4:junit4]   2> 3212 T878 oazs.NIOServerCnxn$Factory.run Accepted
socket connection from / <http://127.0.0.1:57360> 127.0.0.1:57360
[junit4:junit4]   2> 3212 T875 oaz.ClientCnxn$SendThread.primeConnection
Socket connection established to localhost.localdomain/
<http://127.0.0.1:38808> 127.0.0.1:38808, initiating session
[junit4:junit4]   2> 3212 T878 oazs.NIOServerCnxn.readConnectRequest Client
attempting to renew session 0x139495b31ff0001 at / <http://127.0.0.1:57360>
127.0.0.1:57360
[junit4:junit4]   2> 3213 T878 oazs.NIOServerCnxn.finishSessionInit
Established session 0x139495b31ff0001 with negotiated timeout 10000 for
client / <http://127.0.0.1:57360> 127.0.0.1:57360
[junit4:junit4]   2> 3213 T875 oaz.ClientCnxn$SendThread.readConnectResult
Session establishment complete on server localhost.localdomain/
<http://127.0.0.1:38808> 127.0.0.1:38808, sessionid = 0x139495b31ff0001,
negotiated timeout = 10000
[junit4:junit4]   2> 3213 T876 oascc.ConnectionManager.process Watcher
<mailto:org.apache.solr.common.cloud.ConnectionManager@110e0f6>
org.apache.solr.common.cloud.ConnectionManager@110e0f6
name:ZooKeeperConnection Watcher: <http://127.0.0.1:38808/solr>
127.0.0.1:38808/solr got event WatchedEvent state:SyncConnected type:None
path:null path:null type:None
[junit4:junit4]   2> 3213 T880 oazsp.FileTxnLog.append Creating new log
file: log.9
[junit4:junit4]   2> 3275 T867 oazs.ZooKeeperServer.expire Expiring session
0x139495b31ff0001, timeout of 4000ms exceeded
[junit4:junit4]   2> 3275 T881 oazs.PrepRequestProcessor.pRequest Processed
session termination for sessionid: 0x139495b31ff0001
[junit4:junit4]   2> 3276 T880 oazs.NIOServerCnxn.closeSock Closed socket
connection for client / <http://127.0.0.1:57360> 127.0.0.1:57360 which had
sessionid 0x139495b31ff0001
[junit4:junit4]   2> 3276 T875 oaz.ClientCnxn$SendThread.run Unable to read
additional data from server sessionid 0x139495b31ff0001, likely server has
closed socket, closing socket connection and attempting reconnect
[junit4:junit4]   2> 3376 T876 oascc.ConnectionManager.process Watcher
<mailto:org.apache.solr.common.cloud.ConnectionManager@110e0f6>
org.apache.solr.common.cloud.ConnectionManager@110e0f6
name:ZooKeeperConnection Watcher: <http://127.0.0.1:38808/solr>
127.0.0.1:38808/solr got event WatchedEvent state:Disconnected type:None
path:null path:null type:None
[junit4:junit4]   2> 4275 T867 oascc.SolrZkClient.makePath makePath:
collections/collection4
[junit4:junit4]   2> 4471 T875 oaz.ClientCnxn$SendThread.startConnect
Opening socket connection to server localhost.localdomain/
<http://127.0.0.1:38808> 127.0.0.1:38808
[junit4:junit4]   2> 4471 T875 oaz.ClientCnxn$SendThread.primeConnection
Socket connection established to localhost.localdomain/
<http://127.0.0.1:38808> 127.0.0.1:38808, initiating session
[junit4:junit4]   2> 4471 T878 oazs.NIOServerCnxn$Factory.run Accepted
socket connection from / <http://127.0.0.1:57361> 127.0.0.1:57361
[junit4:junit4]   2> 4471 T878 oazs.NIOServerCnxn.readConnectRequest Client
attempting to renew session 0x139495b31ff0001 at / <http://127.0.0.1:57361>
127.0.0.1:57361
[junit4:junit4]   2> 4472 T878 oazs.NIOServerCnxn.finishSessionInit Invalid
session 0x139495b31ff0001 for client / <http://127.0.0.1:57361>
127.0.0.1:57361, probably expired
[junit4:junit4]   2> 4472 T878 oazs.NIOServerCnxn.closeSock Closed socket
connection for client / <http://127.0.0.1:57361> 127.0.0.1:57361 which had
sessionid 0x139495b31ff0001
[junit4:junit4]   2> 4473 T875 oaz.ClientCnxn$SendThread.run Unable to
reconnect to ZooKeeper service, session 0x139495b31ff0001 has expired,
closing socket connection
[junit4:junit4]   2> 4473 T876 oascc.ConnectionManager.process Watcher
<mailto:org.apache.solr.common.cloud.ConnectionManager@110e0f6>
org.apache.solr.common.cloud.ConnectionManager@110e0f6
name:ZooKeeperConnection Watcher: <http://127.0.0.1:38808/solr>
127.0.0.1:38808/solr got event WatchedEvent state:Expired type:None
path:null path:null type:None
[junit4:junit4]   2> 4473 T876 oascc.ConnectionManager.process Attempting to
reconnect to recover relationship with ZooKeeper...
[junit4:junit4]   2> 4473 T876 oascc.DefaultConnectionStrategy.reconnect
Connection expired - starting a new one...
[junit4:junit4]   2> 4473 T876 oaz.ZooKeeper.<init> Initiating client
connection, connectString= <http://127.0.0.1:38808/solr>
127.0.0.1:38808/solr sessionTimeout=10000
<mailto:watcher=org.apache.solr.common.cloud.ConnectionManager@110e0f6>
watcher=org.apache.solr.common.cloud.ConnectionManager@110e0f6
[junit4:junit4]   2> 4474 T882 oaz.ClientCnxn$SendThread.startConnect
Opening socket connection to server / <http://127.0.0.1:38808>
127.0.0.1:38808
[junit4:junit4]   2> 4474 T882 oaz.ClientCnxn$SendThread.primeConnection
Socket connection established to localhost.localdomain/
<http://127.0.0.1:38808> 127.0.0.1:38808, initiating session
[junit4:junit4]   2> 4474 T878 oazs.NIOServerCnxn$Factory.run Accepted
socket connection from / <http://127.0.0.1:57362> 127.0.0.1:57362
[junit4:junit4]   2> 4474 T878 oazs.NIOServerCnxn.readConnectRequest Client
attempting to establish new session at / <http://127.0.0.1:57362>
127.0.0.1:57362
[junit4:junit4]   2> 4475 T880 oazs.NIOServerCnxn.finishSessionInit
Established session 0x139495b333d0000 with negotiated timeout 10000 for
client / <http://127.0.0.1:57362> 127.0.0.1:57362
[junit4:junit4]   2> 4475 T882 oaz.ClientCnxn$SendThread.readConnectResult
Session establishment complete on server localhost.localdomain/
<http://127.0.0.1:38808> 127.0.0.1:38808, sessionid = 0x139495b333d0000,
negotiated timeout = 10000
[junit4:junit4]   2> 4476 T883 oascc.ConnectionManager.process Watcher
<mailto:org.apache.solr.common.cloud.ConnectionManager@110e0f6>
org.apache.solr.common.cloud.ConnectionManager@110e0f6
name:ZooKeeperConnection Watcher: <http://127.0.0.1:38808/solr>
127.0.0.1:38808/solr got event WatchedEvent state:SyncConnected type:None
path:null path:null type:None
[junit4:junit4]   2> 4476 T876 oascc.DefaultConnectionStrategy.reconnect
Reconnected to ZooKeeper
[junit4:junit4]   2> 4476 T876 oascc.ConnectionManager.process
Connected:true
[junit4:junit4]   2> 4476 T876 oaz.ClientCnxn$EventThread.run EventThread
shut down
[junit4:junit4]   2> 4573 T867 oascc.SolrZkClient.makePath makePath:
collections/collection4
[junit4:junit4]   2> 4574 T881 oazs.PrepRequestProcessor.pRequest Processed
session termination for sessionid: 0x139495b333d0000
[junit4:junit4]   2> 4575 T883 oaz.ClientCnxn$EventThread.run EventThread
shut down
[junit4:junit4]   2> 4575 T878 oazs.NIOServerCnxn.closeSock Closed socket
connection for client / <http://127.0.0.1:57362> 127.0.0.1:57362 which had
sessionid 0x139495b333d0000
[junit4:junit4]   2> 4575 T867 oaz.ZooKeeper.close Session:
0x139495b333d0000 closed
[junit4:junit4]   2> 4575 T881 oazs.PrepRequestProcessor.run
PrepRequestProcessor exited loop!
[junit4:junit4]   2> 4575 T880 oazs.SyncRequestProcessor.run
SyncRequestProcessor exited!
[junit4:junit4]   2> 4575 T867 oazs.FinalRequestProcessor.shutdown shutdown
of request processor complete
[junit4:junit4]   2> 4577 T878 oazs.NIOServerCnxn$Factory.run NIOServerCnxn
factory exited run method
[junit4:junit4]   2> 4578 T867 oazs.FinalRequestProcessor.shutdown shutdown
of request processor complete
[junit4:junit4]   2> 4578 T867 oasu.AbstractSolrTestCase.tearDown
####TEARDOWN_START testReconnect
[junit4:junit4]   2> 4582 T867 oasu.AbstractSolrTestCase.setUp
####SETUP_START testMakeRootNode
[junit4:junit4]   2> 4583 T867 oasu.AbstractSolrTestCase.setUp ####SETUP_END
testMakeRootNode
[junit4:junit4]   2> 4583 T867 oasc.ZkTestServer.run STARTING ZK TEST SERVER
[junit4:junit4]   2> 4584 T884 oazs.ZooKeeperServer.setTickTime tickTime set
to 3000
[junit4:junit4]   2> 4587 T884 oazs.NIOServerCnxn$Factory.<init> binding to
port  <http://0.0.0.0/0.0.0.0:0%0d%0a%5bjunit4:junit4> 0.0.0.0/0.0.0.0:0
[junit4:junit4]   2> 4587 T884 oazsp.FileTxnSnapLog.save Snapshotting: 0
[junit4:junit4]   2> 4683 T867 oasc.ZkTestServer.run start zk server on
port:59068
[junit4:junit4]   2> 4684 T867 oaz.ZooKeeper.<init> Initiating client
connection, connectString= <http://127.0.0.1:59068> 127.0.0.1:59068
sessionTimeout=10000
<mailto:watcher=org.apache.solr.common.cloud.ConnectionManager@26ee26>
watcher=org.apache.solr.common.cloud.ConnectionManager@26ee26
[junit4:junit4]   2> 4684 T889 oaz.ClientCnxn$SendThread.startConnect
Opening socket connection to server / <http://127.0.0.1:59068>
127.0.0.1:59068
[junit4:junit4]   2> 4685 T889 oaz.ClientCnxn$SendThread.primeConnection
Socket connection established to localhost.localdomain/
<http://127.0.0.1:59068> 127.0.0.1:59068, initiating session
[junit4:junit4]   2> 4685 T885 oazs.NIOServerCnxn$Factory.run Accepted
socket connection from / <http://127.0.0.1:34281> 127.0.0.1:34281
[junit4:junit4]   2> 4685 T885 oazs.NIOServerCnxn.readConnectRequest Client
attempting to establish new session at / <http://127.0.0.1:34281>
127.0.0.1:34281
[junit4:junit4]   2> 4685 T887 oazsp.FileTxnLog.append Creating new log
file: log.1
[junit4:junit4]   2> 4764 T887 oazs.NIOServerCnxn.finishSessionInit
Established session 0x139495b40400000 with negotiated timeout 10000 for
client / <http://127.0.0.1:34281> 127.0.0.1:34281
[junit4:junit4]   2> 4764 T889 oaz.ClientCnxn$SendThread.readConnectResult
Session establishment complete on server localhost.localdomain/
<http://127.0.0.1:59068> 127.0.0.1:59068, sessionid = 0x139495b40400000,
negotiated timeout = 10000
[junit4:junit4]   2> 4764 T890 oascc.ConnectionManager.process Watcher
<mailto:org.apache.solr.common.cloud.ConnectionManager@26ee26>
org.apache.solr.common.cloud.ConnectionManager@26ee26
name:ZooKeeperConnection Watcher: <http://127.0.0.1:59068> 127.0.0.1:59068
got event WatchedEvent state:SyncConnected type:None path:null path:null
type:None
[junit4:junit4]   2> 4764 T867 oascc.SolrZkClient.makePath makePath: /solr
[junit4:junit4]   2> 4766 T888 oazs.PrepRequestProcessor.pRequest Processed
session termination for sessionid: 0x139495b40400000
[junit4:junit4]   2> 4767 T885 oazs.NIOServerCnxn.closeSock Closed socket
connection for client / <http://127.0.0.1:34281> 127.0.0.1:34281 which had
sessionid 0x139495b40400000
[junit4:junit4]   2> 4767 T867 oaz.ZooKeeper.close Session:
0x139495b40400000 closed
[junit4:junit4]   2> 4768 T867 oaz.ZooKeeper.<init> Initiating client
connection, connectString= <http://127.0.0.1:59068> 127.0.0.1:59068
sessionTimeout=10000
<mailto:watcher=org.apache.solr.common.cloud.ConnectionManager@3672cd>
watcher=org.apache.solr.common.cloud.ConnectionManager@3672cd
[junit4:junit4]   2> 4768 T890 oaz.ClientCnxn$EventThread.run EventThread
shut down
[junit4:junit4]   2> 4768 T891 oaz.ClientCnxn$SendThread.startConnect
Opening socket connection to server / <http://127.0.0.1:59068>
127.0.0.1:59068
[junit4:junit4]   2> 4768 T891 oaz.ClientCnxn$SendThread.primeConnection
Socket connection established to localhost.localdomain/
<http://127.0.0.1:59068> 127.0.0.1:59068, initiating session
[junit4:junit4]   2> 4768 T885 oazs.NIOServerCnxn$Factory.run Accepted
socket connection from / <http://127.0.0.1:34282> 127.0.0.1:34282
[junit4:junit4]   2> 4769 T885 oazs.NIOServerCnxn.readConnectRequest Client
attempting to establish new session at / <http://127.0.0.1:34282>
127.0.0.1:34282
[junit4:junit4]   2> 4769 T887 oazs.NIOServerCnxn.finishSessionInit
Established session 0x139495b40400001 with negotiated timeout 10000 for
client / <http://127.0.0.1:34282> 127.0.0.1:34282
[junit4:junit4]   2> 4769 T891 oaz.ClientCnxn$SendThread.readConnectResult
Session establishment complete on server localhost.localdomain/
<http://127.0.0.1:59068> 127.0.0.1:59068, sessionid = 0x139495b40400001,
negotiated timeout = 10000
[junit4:junit4]   2> 4769 T892 oascc.ConnectionManager.process Watcher
<mailto:org.apache.solr.common.cloud.ConnectionManager@3672cd>
org.apache.solr.common.cloud.ConnectionManager@3672cd
name:ZooKeeperConnection Watcher: <http://127.0.0.1:59068> 127.0.0.1:59068
got event WatchedEvent state:SyncConnected type:None path:null path:null
type:None
[junit4:junit4]   2> 4770 T888 oazs.PrepRequestProcessor.pRequest Processed
session termination for sessionid: 0x139495b40400001
[junit4:junit4]   2> 4770 T885 oazs.NIOServerCnxn.closeSock Closed socket
connection for client / <http://127.0.0.1:34282> 127.0.0.1:34282 which had
sessionid 0x139495b40400001
[junit4:junit4]   2> 4770 T867 oaz.ZooKeeper.close Session:
0x139495b40400001 closed
[junit4:junit4]   2> 4770 T892 oaz.ClientCnxn$EventThread.run EventThread
shut down
[junit4:junit4]   2> 4770 T887 oazs.SyncRequestProcessor.run
SyncRequestProcessor exited!
[junit4:junit4]   2> 4770 T888 oazs.PrepRequestProcessor.run
PrepRequestProcessor exited loop!
[junit4:junit4]   2> 4779 T867 oazs.FinalRequestProcessor.shutdown shutdown
of request processor complete
[junit4:junit4]   2> 4781 T885 oazs.NIOServerCnxn$Factory.run NIOServerCnxn
factory exited run method
[junit4:junit4]   2> 4781 T867 oazs.FinalRequestProcessor.shutdown shutdown
of request processor complete
[junit4:junit4]   2> 4781 T867 oasu.AbstractSolrTestCase.tearDown
####TEARDOWN_START testMakeRootNode
[junit4:junit4]   2> 4784 T867 oasu.AbstractSolrTestCase.setUp
####SETUP_START testConnect
[junit4:junit4]   2> 4784 T867 oasu.AbstractSolrTestCase.setUp ####SETUP_END
testConnect
[junit4:junit4]   2> 4784 T867 oasc.ZkTestServer.run STARTING ZK TEST SERVER
[junit4:junit4]   2> 4785 T893 oazs.ZooKeeperServer.setTickTime tickTime set
to 3000
[junit4:junit4]   2> 4785 T893 oazs.NIOServerCnxn$Factory.<init> binding to
port  <http://0.0.0.0/0.0.0.0:0%0d%0a%5bjunit4:junit4> 0.0.0.0/0.0.0.0:0
[junit4:junit4]   2> 4786 T893 oazsp.FileTxnSnapLog.save Snapshotting: 0
[junit4:junit4]   2> 4885 T867 oasc.ZkTestServer.run start zk server on
port:58213
[junit4:junit4]   2> 4885 T867 oaz.ZooKeeper.<init> Initiating client
connection, connectString= <http://127.0.0.1:58213/solr>
127.0.0.1:58213/solr sessionTimeout=10000
<mailto:watcher=org.apache.solr.common.cloud.ConnectionManager@6be0d6>
watcher=org.apache.solr.common.cloud.ConnectionManager@6be0d6
[junit4:junit4]   2> 4886 T898 oaz.ClientCnxn$SendThread.startConnect
Opening socket connection to server / <http://127.0.0.1:58213>
127.0.0.1:58213
[junit4:junit4]   2> 4886 T898 oaz.ClientCnxn$SendThread.primeConnection
Socket connection established to localhost.localdomain/
<http://127.0.0.1:58213> 127.0.0.1:58213, initiating session
[junit4:junit4]   2> 4898 T894 oazs.NIOServerCnxn$Factory.run Accepted
socket connection from / <http://127.0.0.1:43895> 127.0.0.1:43895
[junit4:junit4]   2> 4898 T894 oazs.NIOServerCnxn.readConnectRequest Client
attempting to establish new session at / <http://127.0.0.1:43895>
127.0.0.1:43895
[junit4:junit4]   2> 4899 T896 oazsp.FileTxnLog.append Creating new log
file: log.1
[junit4:junit4]   2> 4954 T896 oazs.NIOServerCnxn.finishSessionInit
Established session 0x139495b41070000 with negotiated timeout 10000 for
client / <http://127.0.0.1:43895> 127.0.0.1:43895
[junit4:junit4]   2> 4954 T898 oaz.ClientCnxn$SendThread.readConnectResult
Session establishment complete on server localhost.localdomain/
<http://127.0.0.1:58213> 127.0.0.1:58213, sessionid = 0x139495b41070000,
negotiated timeout = 10000
[junit4:junit4]   2> 4954 T899 oascc.ConnectionManager.process Watcher
<mailto:org.apache.solr.common.cloud.ConnectionManager@6be0d6>
org.apache.solr.common.cloud.ConnectionManager@6be0d6
name:ZooKeeperConnection Watcher: <http://127.0.0.1:58213/solr>
127.0.0.1:58213/solr got event WatchedEvent state:SyncConnected type:None
path:null path:null type:None
[junit4:junit4]   2> 4955 T897 oazs.PrepRequestProcessor.pRequest Processed
session termination for sessionid: 0x139495b41070000
[junit4:junit4]   2> 4956 T894 oazs.NIOServerCnxn.closeSock Closed socket
connection for client / <http://127.0.0.1:43895> 127.0.0.1:43895 which had
sessionid 0x139495b41070000
[junit4:junit4]   2> 4956 T899 oaz.ClientCnxn$EventThread.run EventThread
shut down
[junit4:junit4]   2> 4956 T867 oaz.ZooKeeper.close Session:
0x139495b41070000 closed
[junit4:junit4]   2> 4956 T896 oazs.SyncRequestProcessor.run
SyncRequestProcessor exited!
[junit4:junit4]   2> 4957 T897 oazs.PrepRequestProcessor.run
PrepRequestProcessor exited loop!
[junit4:junit4]   2> 4957 T867 oazs.FinalRequestProcessor.shutdown shutdown
of request processor complete
[junit4:junit4]   2> 4958 T894 oazs.NIOServerCnxn$Factory.run NIOServerCnxn
factory exited run method
[junit4:junit4]   2> 4959 T867 oazs.FinalRequestProcessor.shutdown shutdown
of request processor complete
[junit4:junit4]   2> 4959 T867 oasu.AbstractSolrTestCase.tearDown
####TEARDOWN_START testConnect
[junit4:junit4]   2> 4962 T867 oasu.AbstractSolrTestCase.setUp
####SETUP_START testWatchChildren
[junit4:junit4]   2> 4962 T867 oasu.AbstractSolrTestCase.setUp ####SETUP_END
testWatchChildren
[junit4:junit4]   2> 4962 T867 oasc.ZkTestServer.run STARTING ZK TEST SERVER
[junit4:junit4]   2> 4963 T900 oazs.ZooKeeperServer.setTickTime tickTime set
to 3000
[junit4:junit4]   2> 4963 T900 oazs.NIOServerCnxn$Factory.<init> binding to
port  <http://0.0.0.0/0.0.0.0:0%0d%0a%5bjunit4:junit4> 0.0.0.0/0.0.0.0:0
[junit4:junit4]   2> 4965 T900 oazsp.FileTxnSnapLog.save Snapshotting: 0
[junit4:junit4]   2> 5063 T867 oasc.ZkTestServer.run start zk server on
port:43166
[junit4:junit4]   2> 5466 T867 oaz.ZooKeeper.<init> Initiating client
connection, connectString= <http://127.0.0.1:43166> 127.0.0.1:43166
sessionTimeout=10000
<mailto:watcher=org.apache.solr.common.cloud.ConnectionManager@274249>
watcher=org.apache.solr.common.cloud.ConnectionManager@274249
[junit4:junit4]   2> 5467 T905 oaz.ClientCnxn$SendThread.startConnect
Opening socket connection to server / <http://127.0.0.1:43166>
127.0.0.1:43166
[junit4:junit4]   2> 5467 T901 oazs.NIOServerCnxn$Factory.run Accepted
socket connection from / <http://127.0.0.1:43972> 127.0.0.1:43972
[junit4:junit4]   2> 5467 T905 oaz.ClientCnxn$SendThread.primeConnection
Socket connection established to localhost.localdomain/
<http://127.0.0.1:43166> 127.0.0.1:43166, initiating session
[junit4:junit4]   2> 5467 T901 oazs.NIOServerCnxn.readConnectRequest Client
attempting to establish new session at / <http://127.0.0.1:43972>
127.0.0.1:43972
[junit4:junit4]   2> 5468 T903 oazsp.FileTxnLog.append Creating new log
file: log.1
[junit4:junit4]   2> 5524 T903 oazs.NIOServerCnxn.finishSessionInit
Established session 0x139495b41b90000 with negotiated timeout 10000 for
client / <http://127.0.0.1:43972> 127.0.0.1:43972
[junit4:junit4]   2> 5524 T905 oaz.ClientCnxn$SendThread.readConnectResult
Session establishment complete on server localhost.localdomain/
<http://127.0.0.1:43166> 127.0.0.1:43166, sessionid = 0x139495b41b90000,
negotiated timeout = 10000
[junit4:junit4]   2> 5524 T906 oascc.ConnectionManager.process Watcher
<mailto:org.apache.solr.common.cloud.ConnectionManager@274249>
org.apache.solr.common.cloud.ConnectionManager@274249
name:ZooKeeperConnection Watcher: <http://127.0.0.1:43166> 127.0.0.1:43166
got event WatchedEvent state:SyncConnected type:None path:null path:null
type:None
[junit4:junit4]   2> 5524 T867 oascc.SolrZkClient.makePath makePath: /solr
[junit4:junit4]   2> 5527 T904 oazs.PrepRequestProcessor.pRequest Processed
session termination for sessionid: 0x139495b41b90000
[junit4:junit4]   2> 5527 T906 oaz.ClientCnxn$EventThread.run EventThread
shut down
[junit4:junit4]   2> 5527 T867 oaz.ZooKeeper.close Session:
0x139495b41b90000 closed
[junit4:junit4]   2> 5527 T867 oaz.ZooKeeper.<init> Initiating client
connection, connectString= <http://127.0.0.1:43166/solr>
127.0.0.1:43166/solr sessionTimeout=10000
<mailto:watcher=org.apache.solr.common.cloud.ConnectionManager@1e72834>
watcher=org.apache.solr.common.cloud.ConnectionManager@1e72834
[junit4:junit4]   2> 5528 T901 oazs.NIOServerCnxn.closeSock Closed socket
connection for client / <http://127.0.0.1:43972> 127.0.0.1:43972 which had
sessionid 0x139495b41b90000
[junit4:junit4]   2> 5528 T907 oaz.ClientCnxn$SendThread.startConnect
Opening socket connection to server / <http://127.0.0.1:43166>
127.0.0.1:43166
[junit4:junit4]   2> 5529 T901 oazs.NIOServerCnxn$Factory.run Accepted
socket connection from / <http://127.0.0.1:43973> 127.0.0.1:43973
[junit4:junit4]   2> 5529 T907 oaz.ClientCnxn$SendThread.primeConnection
Socket connection established to localhost.localdomain/
<http://127.0.0.1:43166> 127.0.0.1:43166, initiating session
[junit4:junit4]   2> 5529 T901 oazs.NIOServerCnxn.readConnectRequest Client
attempting to establish new session at / <http://127.0.0.1:43973>
127.0.0.1:43973
[junit4:junit4]   2> 5529 T903 oazs.NIOServerCnxn.finishSessionInit
Established session 0x139495b41b90001 with negotiated timeout 10000 for
client / <http://127.0.0.1:43973> 127.0.0.1:43973
[junit4:junit4]   2> 5529 T907 oaz.ClientCnxn$SendThread.readConnectResult
Session establishment complete on server localhost.localdomain/
<http://127.0.0.1:43166> 127.0.0.1:43166, sessionid = 0x139495b41b90001,
negotiated timeout = 10000
[junit4:junit4]   2> 5530 T908 oascc.ConnectionManager.process Watcher
<mailto:org.apache.solr.common.cloud.ConnectionManager@1e72834>
org.apache.solr.common.cloud.ConnectionManager@1e72834
name:ZooKeeperConnection Watcher: <http://127.0.0.1:43166/solr>
127.0.0.1:43166/solr got event WatchedEvent state:SyncConnected type:None
path:null path:null type:None
[junit4:junit4]   2> 5531 T867 oascc.SolrZkClient.makePath makePath:
/collections
[junit4:junit4]   2> 5532 T867 oascc.SolrZkClient.makePath makePath:
/collections/collection99/shards
[junit4:junit4]   2> 5534 T867 oascc.SolrZkClient.makePath makePath:
collections/collection99/config=collection1
[junit4:junit4]   2> 5535 T867 oascc.SolrZkClient.makePath makePath:
collections/collection99/config=collection3
[junit4:junit4]   2> 5536 T867 oascc.SolrZkClient.makePath makePath:
/collections/collection97/shards
[junit4:junit4]   2> 5948 T879 oazs.SessionTrackerImpl.run
SessionTrackerImpl exited loop!
[junit4:junit4]   2> 5948 T895 oazs.SessionTrackerImpl.run
SessionTrackerImpl exited loop!
[junit4:junit4]   2> 5948 T886 oazs.SessionTrackerImpl.run
SessionTrackerImpl exited loop!
[junit4:junit4]   2> 14238 T904 oazs.PrepRequestProcessor.pRequest Processed
session termination for sessionid: 0x139495b41b90001
[junit4:junit4]   2> 14239 T908 oaz.ClientCnxn$EventThread.run EventThread
shut down
[junit4:junit4]   2> 14239 T901 oazs.NIOServerCnxn.closeSock Closed socket
connection for client /127.0.0.1:43973 which had sessionid 0x139495b41b90001
[junit4:junit4]   2> 14239 T867 oaz.ZooKeeper.close Session:
0x139495b41b90001 closed
[junit4:junit4]   2> 14239 T903 oazs.SyncRequestProcessor.run
SyncRequestProcessor exited!
[junit4:junit4]   2> 14239 T904 oazs.PrepRequestProcessor.run
PrepRequestProcessor exited loop!
[junit4:junit4]   2> 14240 T867 oazs.FinalRequestProcessor.shutdown shutdown
of request processor complete
[junit4:junit4]   2> 14241 T901 oazs.NIOServerCnxn$Factory.run NIOServerCnxn
factory exited run method
[junit4:junit4]   2> 14242 T867 oazs.FinalRequestProcessor.shutdown shutdown
of request processor complete
[junit4:junit4]   2> 14242 T867 oasu.AbstractSolrTestCase.tearDown
####TEARDOWN_START testWatchChildren
[junit4:junit4]   2> NOTE: reproduce with: ant test
-Dtestcase=ZkSolrClientTest -Dtests.method=testWatchChildren
-Dtests.seed=B2FA8103836A28DC -Dtests.multiplier=3 -Dtests.slow=true
-Dtests.locale=ja -Dtests.timezone=Chile/EasterIsland
-Dtests.file.encoding=UTF-8
[junit4:junit4] FAILURE 9.31s J1 | ZkSolrClientTest.testWatchChildren <<<
[junit4:junit4]    > Throwable #1: java.lang.AssertionError: expected:<2>
but was:<1>
[junit4:junit4]    >    at
__randomizedtesting.SeedInfo.seed([B2FA8103836A28DC:FA84E31FC4AE9267]:0)
[junit4:junit4]    >    at org.junit.Assert.fail(Assert.java:93)
[junit4:junit4]    >    at org.junit.Assert.failNotEquals(Assert.java:647)
[junit4:junit4]    >    at org.junit.Assert.assertEquals(Assert.java:128)
[junit4:junit4]    >    at org.junit.Assert.assertEquals(Assert.java:472)
[junit4:junit4]    >    at org.junit.Assert.assertEquals(Assert.java:456)
[junit4:junit4]    >    at
org.apache.solr.cloud.ZkSolrClientTest.testWatchChildren(ZkSolrClientTest.ja
va:218)
[junit4:junit4]    >    at
sun.reflect.NativeMethodAccessorImpl.invoke0(Native Method)
[junit4:junit4]    >    at
sun.reflect.NativeMethodAccessorImpl.invoke(NativeMethodAccessorImpl.java:57
)
[junit4:junit4]    >    at
sun.reflect.DelegatingMethodAccessorImpl.invoke(DelegatingMethodAccessorImpl
.java:43)
[junit4:junit4]    >    at java.lang.reflect.Method.invoke(Method.java:474)
[junit4:junit4]    >    at
com.carrotsearch.randomizedtesting.RandomizedRunner.invoke(RandomizedRunner.
java:1559)
[junit4:junit4]    >    at
com.carrotsearch.randomizedtesting.RandomizedRunner.access$600(RandomizedRun
ner.java:79)
[junit4:junit4]    >    at
com.carrotsearch.randomizedtesting.RandomizedRunner$6.evaluate(RandomizedRun
ner.java:737)
[junit4:junit4]    >    at
com.carrotsearch.randomizedtesting.RandomizedRunner$7.evaluate(RandomizedRun
ner.java:773)
[junit4:junit4]    >    at
com.carrotsearch.randomizedtesting.RandomizedRunner$8.evaluate(RandomizedRun
ner.java:787)
[junit4:junit4]    >    at
com.carrotsearch.randomizedtesting.rules.SystemPropertiesRestoreRule$1.evalu
ate(SystemPropertiesRestoreRule.java:53)
[junit4:junit4]    >    at
org.apache.lucene.util.TestRuleSetupTeardownChained$1.evaluate(TestRuleSetup
TeardownChained.java:50)
[junit4:junit4]    >    at
org.apache.lucene.util.TestRuleFieldCacheSanity$1.evaluate(TestRuleFieldCach
eSanity.java:51)
[junit4:junit4]    >    at
org.apache.lucene.util.AbstractBeforeAfterRule$1.evaluate(AbstractBeforeAfte
rRule.java:45)
[junit4:junit4]    >    at
com.carrotsearch.randomizedtesting.rules.SystemPropertiesInvariantRule$1.eva
luate(SystemPropertiesInvariantRule.java:55)
[junit4:junit4]    >    at
org.apache.lucene.util.TestRuleThreadAndTestName$1.evaluate(TestRuleThreadAn
dTestName.java:48)
[junit4:junit4]    >    at
org.apache.lucene.util.TestRuleIgnoreAfterMaxFailures$1.evaluate(TestRuleIgn
oreAfterMaxFailures.java:70)
[junit4:junit4]    >    at
org.apache.lucene.util.TestRuleMarkFailure$1.evaluate(TestRuleMarkFailure.ja
va:48)
[junit4:junit4]    >    at
com.carrotsearch.randomizedtesting.rules.StatementAdapter.evaluate(Statement
Adapter.java:36)
[junit4:junit4]    >    at
com.carrotsearch.randomizedtesting.ThreadLeakControl$StatementRunner.run(Thr
eadLeakControl.java:345)
[junit4:junit4]    >    at
com.carrotsearch.randomizedtesting.ThreadLeakControl.forkTimeoutingTask(Thre
adLeakControl.java:769)
[junit4:junit4]    >    at
com.carrotsearch.randomizedtesting.ThreadLeakControl$3.evaluate(ThreadLeakCo
ntrol.java:429)
[junit4:junit4]    >    at
com.carrotsearch.randomizedtesting.RandomizedRunner.runSingleTest(Randomized
Runner.java:746)
[junit4:junit4]    >    at
com.carrotsearch.randomizedtesting.RandomizedRunner$3.evaluate(RandomizedRun
ner.java:648)
[junit4:junit4]    >    at
com.carrotsearch.randomizedtesting.RandomizedRunner$4.evaluate(RandomizedRun
ner.java:682)
[junit4:junit4]    >    at
com.carrotsearch.randomizedtesting.RandomizedRunner$5.evaluate(RandomizedRun
ner.java:693)
[junit4:junit4]    >    at
com.carrotsearch.randomizedtesting.rules.StatementAdapter.evaluate(Statement
Adapter.java:36)
[junit4:junit4]    >    at
com.carrotsearch.randomizedtesting.rules.SystemPropertiesRestoreRule$1.evalu
ate(SystemPropertiesRestoreRule.java:53)
[junit4:junit4]    >    at
org.apache.lucene.util.AbstractBeforeAfterRule$1.evaluate(AbstractBeforeAfte
rRule.java:45)
[junit4:junit4]    >    at
org.apache.lucene.util.TestRuleStoreClassName$1.evaluate(TestRuleStoreClassN
ame.java:42)
[junit4:junit4]    >    at
com.carrotsearch.randomizedtesting.rules.SystemPropertiesInvariantRule$1.eva
luate(SystemPropertiesInvariantRule.java:55)
[junit4:junit4]    >    at
com.carrotsearch.randomizedtesting.rules.NoShadowingOrOverridesOnMethodsRule
$1.evaluate(NoShadowingOrOverridesOnMethodsRule.java:39)
[junit4:junit4]    >    at
com.carrotsearch.randomizedtesting.rules.NoShadowingOrOverridesOnMethodsRule
$1.evaluate(NoShadowingOrOverridesOnMethodsRule.java:39)
[junit4:junit4]    >    at
org.apache.lucene.util.TestRuleAssertionsRequired$1.evaluate(TestRuleAsserti
onsRequired.java:40)
[junit4:junit4]    >    at
org.apache.lucene.util.TestRuleMarkFailure$1.evaluate(TestRuleMarkFailure.ja
va:48)
[junit4:junit4]    >    at
org.apache.lucene.util.TestRuleIgnoreAfterMaxFailures$1.evaluate(TestRuleIgn
oreAfterMaxFailures.java:70)
[junit4:junit4]    >    at
org.apache.lucene.util.TestRuleIgnoreTestSuites$1.evaluate(TestRuleIgnoreTes
tSuites.java:55)
[junit4:junit4]    >    at
com.carrotsearch.randomizedtesting.rules.StatementAdapter.evaluate(Statement
Adapter.java:36)
[junit4:junit4]    >    at
com.carrotsearch.randomizedtesting.ThreadLeakControl$StatementRunner.run(Thr
eadLeakControl.java:345)
[junit4:junit4]    >    at java.lang.Thread.run(Thread.java:722)
[junit4:junit4]   2> 14948 T902 oazs.SessionTrackerImpl.run
SessionTrackerImpl exited loop!
[junit4:junit4]   2> NOTE: test params are: codec=Lucene40: {},
sim=DefaultSimilarity, locale=ja, timezone=Chile/EasterIsland
[junit4:junit4]   2> NOTE: Linux 3.2.0-29-generic i386/Oracle Corporation
1.8.0-ea (32-bit)/cpus=8,threads=1,free=21471328,total=88276992
[junit4:junit4]   2> NOTE: All tests run in this JVM:
[DocumentAnalysisRequestHandlerTest, StandardRequestHandlerTest,
SignatureUpdateProcessorFactoryTest, TestUtils, TestValueSourceCache,
TestPluginEnable, TestDistributedSearch, LeaderElectionTest,
TestMultiCoreConfBootstrap, TestSolrXMLSerializer,
IndexSchemaRuntimeFieldTest, TimeZoneUtilsTest, OverseerTest,
TestPropInject, TestArbitraryIndexDir, TestCSVLoader,
XmlUpdateRequestHandlerTest, TestUpdate, PingRequestHandlerTest,
ZkSolrClientTest]
[junit4:junit4] Completed on J1 in 15.38s, 4 tests, 1 failure <<< FAILURES!

[...truncated 566 lines...]
BUILD FAILED
/mnt/ssd/jenkins/workspace/lucene3312-branch/build.xml:29: The following
error occurred while executing this line:
/mnt/ssd/jenkins/workspace/lucene3312-branch/solr/build.xml:144: The
following error occurred while executing this line:
/mnt/ssd/jenkins/workspace/lucene3312-branch/lucene/module-build.xml:62: The
following error occurred while executing this line:
/mnt/ssd/jenkins/workspace/lucene3312-branch/lucene/common-build.xml:1105:
The following error occurred while executing this line:
/mnt/ssd/jenkins/workspace/lucene3312-branch/lucene/common-build.xml:797:
There were test failures: 227 suites, 915 tests, 1 failure, 6 ignored (1
assumption)

Total time: 19 minutes 46 seconds
Build step 'Invoke Ant' marked build as failure
Recording test results
Description set: Java: 32bit/jdk1.8.0-ea-b51 -server -XX:+UseSerialGC
Email was triggered for: Failure
Sending email for trigger: Failure

 


Mime
View raw message