lucene-dev mailing list archives

Site index · List index
Message view « Date » · « Thread »
Top « Date » · « Thread »
From Robert Muir <rcm...@gmail.com>
Subject Re: [JENKINS] Lucene-Solr-4.x-Linux-Java7-64 - Build # 417 - Failure!
Date Sun, 15 Jul 2012 02:32:46 GMT
https://issues.apache.org/jira/browse/LUCENE-4221

On Sat, Jul 14, 2012 at 9:43 PM, Policeman Jenkins Server
<jenkins@sd-datasolutions.de> wrote:
> Build: http://jenkins.sd-datasolutions.de/job/Lucene-Solr-4.x-Linux-Java7-64/417/
>
> 1 tests failed.
> REGRESSION:  org.apache.lucene.analysis.core.TestRandomChains.testRandomChains
>
> Error Message:
> CheckIndex failed
>
> Stack Trace:
> java.lang.RuntimeException: CheckIndex failed
>         at __randomizedtesting.SeedInfo.seed([29948CE66F6BB97A:1475A5872879A4BA]:0)
>         at org.apache.lucene.util._TestUtil.checkIndex(_TestUtil.java:196)
>         at org.apache.lucene.store.MockDirectoryWrapper.close(MockDirectoryWrapper.java:587)
>         at org.apache.lucene.util.IOUtils.close(IOUtils.java:144)
>         at org.apache.lucene.analysis.BaseTokenStreamTestCase.checkRandomData(BaseTokenStreamTestCase.java:469)
>         at org.apache.lucene.analysis.core.TestRandomChains.testRandomChains(TestRandomChains.java:860)
>         at sun.reflect.NativeMethodAccessorImpl.invoke0(Native Method)
>         at sun.reflect.NativeMethodAccessorImpl.invoke(NativeMethodAccessorImpl.java:57)
>         at sun.reflect.DelegatingMethodAccessorImpl.invoke(DelegatingMethodAccessorImpl.java:43)
>         at java.lang.reflect.Method.invoke(Method.java:601)
>         at com.carrotsearch.randomizedtesting.RandomizedRunner.invoke(RandomizedRunner.java:1995)
>         at com.carrotsearch.randomizedtesting.RandomizedRunner.access$1100(RandomizedRunner.java:132)
>         at com.carrotsearch.randomizedtesting.RandomizedRunner$6.evaluate(RandomizedRunner.java:818)
>         at com.carrotsearch.randomizedtesting.RandomizedRunner$7.evaluate(RandomizedRunner.java:877)
>         at com.carrotsearch.randomizedtesting.RandomizedRunner$8.evaluate(RandomizedRunner.java:891)
>         at org.apache.lucene.util.TestRuleSetupTeardownChained$1.evaluate(TestRuleSetupTeardownChained.java:50)
>         at org.apache.lucene.util.TestRuleFieldCacheSanity$1.evaluate(TestRuleFieldCacheSanity.java:32)
>         at org.apache.lucene.util.AbstractBeforeAfterRule$1.evaluate(AbstractBeforeAfterRule.java:45)
>         at com.carrotsearch.randomizedtesting.rules.SystemPropertiesInvariantRule$1.evaluate(SystemPropertiesInvariantRule.java:55)
>         at org.apache.lucene.util.TestRuleReportUncaughtExceptions$1.evaluate(TestRuleReportUncaughtExceptions.java:68)
>         at org.apache.lucene.util.TestRuleThreadAndTestName$1.evaluate(TestRuleThreadAndTestName.java:48)
>         at org.apache.lucene.util.TestRuleIgnoreAfterMaxFailures$1.evaluate(TestRuleIgnoreAfterMaxFailures.java:70)
>         at org.apache.lucene.util.TestRuleMarkFailure$1.evaluate(TestRuleMarkFailure.java:48)
>         at com.carrotsearch.randomizedtesting.RandomizedRunner.runSingleTest(RandomizedRunner.java:825)
>         at com.carrotsearch.randomizedtesting.RandomizedRunner.access$700(RandomizedRunner.java:132)
>         at com.carrotsearch.randomizedtesting.RandomizedRunner$3$1.run(RandomizedRunner.java:671)
>         at com.carrotsearch.randomizedtesting.RandomizedRunner$3.evaluate(RandomizedRunner.java:697)
>         at com.carrotsearch.randomizedtesting.RandomizedRunner$4.evaluate(RandomizedRunner.java:736)
>         at com.carrotsearch.randomizedtesting.RandomizedRunner$5.evaluate(RandomizedRunner.java:747)
>         at org.apache.lucene.util.AbstractBeforeAfterRule$1.evaluate(AbstractBeforeAfterRule.java:45)
>         at org.apache.lucene.util.TestRuleReportUncaughtExceptions$1.evaluate(TestRuleReportUncaughtExceptions.java:68)
>         at org.apache.lucene.util.TestRuleStoreClassName$1.evaluate(TestRuleStoreClassName.java:38)
>         at org.apache.lucene.util.TestRuleIcuHack$1.evaluate(TestRuleIcuHack.java:51)
>         at com.carrotsearch.randomizedtesting.rules.SystemPropertiesInvariantRule$1.evaluate(SystemPropertiesInvariantRule.java:55)
>         at org.apache.lucene.util.TestRuleNoInstanceHooksOverrides$1.evaluate(TestRuleNoInstanceHooksOverrides.java:53)
>         at org.apache.lucene.util.TestRuleNoStaticHooksShadowing$1.evaluate(TestRuleNoStaticHooksShadowing.java:52)
>         at org.apache.lucene.util.TestRuleAssertionsRequired$1.evaluate(TestRuleAssertionsRequired.java:36)
>         at org.apache.lucene.util.TestRuleMarkFailure$1.evaluate(TestRuleMarkFailure.java:48)
>         at org.apache.lucene.util.TestRuleIgnoreAfterMaxFailures$1.evaluate(TestRuleIgnoreAfterMaxFailures.java:70)
>         at org.apache.lucene.util.TestRuleIgnoreTestSuites$1.evaluate(TestRuleIgnoreTestSuites.java:55)
>         at com.carrotsearch.randomizedtesting.RandomizedRunner.runSuite(RandomizedRunner.java:605)
>         at com.carrotsearch.randomizedtesting.RandomizedRunner.access$400(RandomizedRunner.java:132)
>         at com.carrotsearch.randomizedtesting.RandomizedRunner$2.run(RandomizedRunner.java:551)
>
>
>
>
> Build Log:
> [...truncated 13106 lines...]
> [junit4:junit4] Suite: org.apache.lucene.analysis.core.TestRandomChains
> [junit4:junit4] ERROR   6.59s J0 | TestRandomChains.testRandomChains
> [junit4:junit4]    > Throwable #1: java.lang.RuntimeException: CheckIndex failed
> [junit4:junit4]    >    at __randomizedtesting.SeedInfo.seed([29948CE66F6BB97A:1475A5872879A4BA]:0)
> [junit4:junit4]    >    at org.apache.lucene.util._TestUtil.checkIndex(_TestUtil.java:196)
> [junit4:junit4]    >    at org.apache.lucene.store.MockDirectoryWrapper.close(MockDirectoryWrapper.java:587)
> [junit4:junit4]    >    at org.apache.lucene.util.IOUtils.close(IOUtils.java:144)
> [junit4:junit4]    >    at org.apache.lucene.analysis.BaseTokenStreamTestCase.checkRandomData(BaseTokenStreamTestCase.java:469)
> [junit4:junit4]    >    at org.apache.lucene.analysis.core.TestRandomChains.testRandomChains(TestRandomChains.java:860)
> [junit4:junit4]    >    at sun.reflect.NativeMethodAccessorImpl.invoke0(Native Method)
> [junit4:junit4]    >    at sun.reflect.NativeMethodAccessorImpl.invoke(NativeMethodAccessorImpl.java:57)
> [junit4:junit4]    >    at sun.reflect.DelegatingMethodAccessorImpl.invoke(DelegatingMethodAccessorImpl.java:43)
> [junit4:junit4]    >    at java.lang.reflect.Method.invoke(Method.java:601)
> [junit4:junit4]    >    at com.carrotsearch.randomizedtesting.RandomizedRunner.invoke(RandomizedRunner.java:1995)
> [junit4:junit4]    >    at com.carrotsearch.randomizedtesting.RandomizedRunner.access$1100(RandomizedRunner.java:132)
> [junit4:junit4]    >    at com.carrotsearch.randomizedtesting.RandomizedRunner$6.evaluate(RandomizedRunner.java:818)
> [junit4:junit4]    >    at com.carrotsearch.randomizedtesting.RandomizedRunner$7.evaluate(RandomizedRunner.java:877)
> [junit4:junit4]    >    at com.carrotsearch.randomizedtesting.RandomizedRunner$8.evaluate(RandomizedRunner.java:891)
> [junit4:junit4]    >    at org.apache.lucene.util.TestRuleSetupTeardownChained$1.evaluate(TestRuleSetupTeardownChained.java:50)
> [junit4:junit4]    >    at org.apache.lucene.util.TestRuleFieldCacheSanity$1.evaluate(TestRuleFieldCacheSanity.java:32)
> [junit4:junit4]    >    at org.apache.lucene.util.AbstractBeforeAfterRule$1.evaluate(AbstractBeforeAfterRule.java:45)
> [junit4:junit4]    >    at com.carrotsearch.randomizedtesting.rules.SystemPropertiesInvariantRule$1.evaluate(SystemPropertiesInvariantRule.java:55)
> [junit4:junit4]    >    at org.apache.lucene.util.TestRuleReportUncaughtExceptions$1.evaluate(TestRuleReportUncaughtExceptions.java:68)
> [junit4:junit4]    >    at org.apache.lucene.util.TestRuleThreadAndTestName$1.evaluate(TestRuleThreadAndTestName.java:48)
> [junit4:junit4]    >    at org.apache.lucene.util.TestRuleIgnoreAfterMaxFailures$1.evaluate(TestRuleIgnoreAfterMaxFailures.java:70)
> [junit4:junit4]    >    at org.apache.lucene.util.TestRuleMarkFailure$1.evaluate(TestRuleMarkFailure.java:48)
> [junit4:junit4]    >    at com.carrotsearch.randomizedtesting.RandomizedRunner.runSingleTest(RandomizedRunner.java:825)
> [junit4:junit4]    >    at com.carrotsearch.randomizedtesting.RandomizedRunner.access$700(RandomizedRunner.java:132)
> [junit4:junit4]    >    at com.carrotsearch.randomizedtesting.RandomizedRunner$3$1.run(RandomizedRunner.java:671)
> [junit4:junit4]    >    at com.carrotsearch.randomizedtesting.RandomizedRunner$3.evaluate(RandomizedRunner.java:697)
> [junit4:junit4]    >    at com.carrotsearch.randomizedtesting.RandomizedRunner$4.evaluate(RandomizedRunner.java:736)
> [junit4:junit4]    >    at com.carrotsearch.randomizedtesting.RandomizedRunner$5.evaluate(RandomizedRunner.java:747)
> [junit4:junit4]    >    at org.apache.lucene.util.AbstractBeforeAfterRule$1.evaluate(AbstractBeforeAfterRule.java:45)
> [junit4:junit4]    >    at org.apache.lucene.util.TestRuleReportUncaughtExceptions$1.evaluate(TestRuleReportUncaughtExceptions.java:68)
> [junit4:junit4]    >    at org.apache.lucene.util.TestRuleStoreClassName$1.evaluate(TestRuleStoreClassName.java:38)
> [junit4:junit4]    >    at org.apache.lucene.util.TestRuleIcuHack$1.evaluate(TestRuleIcuHack.java:51)
> [junit4:junit4]    >    at com.carrotsearch.randomizedtesting.rules.SystemPropertiesInvariantRule$1.evaluate(SystemPropertiesInvariantRule.java:55)
> [junit4:junit4]    >    at org.apache.lucene.util.TestRuleNoInstanceHooksOverrides$1.evaluate(TestRuleNoInstanceHooksOverrides.java:53)
> [junit4:junit4]    >    at org.apache.lucene.util.TestRuleNoStaticHooksShadowing$1.evaluate(TestRuleNoStaticHooksShadowing.java:52)
> [junit4:junit4]    >    at org.apache.lucene.util.TestRuleAssertionsRequired$1.evaluate(TestRuleAssertionsRequired.java:36)
> [junit4:junit4]    >    at org.apache.lucene.util.TestRuleMarkFailure$1.evaluate(TestRuleMarkFailure.java:48)
> [junit4:junit4]    >    at org.apache.lucene.util.TestRuleIgnoreAfterMaxFailures$1.evaluate(TestRuleIgnoreAfterMaxFailures.java:70)
> [junit4:junit4]    >    at org.apache.lucene.util.TestRuleIgnoreTestSuites$1.evaluate(TestRuleIgnoreTestSuites.java:55)
> [junit4:junit4]    >    at com.carrotsearch.randomizedtesting.RandomizedRunner.runSuite(RandomizedRunner.java:605)
> [junit4:junit4]    >    at com.carrotsearch.randomizedtesting.RandomizedRunner.access$400(RandomizedRunner.java:132)
> [junit4:junit4]    >    at com.carrotsearch.randomizedtesting.RandomizedRunner$2.run(RandomizedRunner.java:551)
> [junit4:junit4]    >
> [junit4:junit4]   1> CheckIndex failed
> [junit4:junit4]   1> Segments file=segments_1 numSegments=14 version=4.0 format=
> [junit4:junit4]   1>   1 of 14: name=_0 docCount=72
> [junit4:junit4]   1>     codec=Lucene40
> [junit4:junit4]   1>     compound=false
> [junit4:junit4]   1>     numFiles=13
> [junit4:junit4]   1>     size (MB)=0.018
> [junit4:junit4]   1>     diagnostics = {os=Linux, os.version=3.2.0-26-generic, source=flush, lucene.version=4.0-SNAPSHOT, os.arch=amd64, java.version=1.7.0_04, java.vendor=Oracle Corporation}
> [junit4:junit4]   1>     has deletions [delGen=-1]
> [junit4:junit4]   1>     test: open reader.........OK
> [junit4:junit4]   1>     test: fields..............OK [1 fields]
> [junit4:junit4]   1>     test: field norms.........OK [1 fields]
> [junit4:junit4]   1>     test: terms, freq, prox...OK [211 terms; 240 terms/docs pairs; 266 tokens]
> [junit4:junit4]   1>     test: stored fields.......OK [0 total field count; avg 0 fields per doc]
> [junit4:junit4]   1>     test: term vectors........OK [67 total vector count; avg 1 term/freq vector fields per doc]
> [junit4:junit4]   1>     test: DocValues........OK [0 total doc Count; Num DocValues Fields 0
> [junit4:junit4]   1>
> [junit4:junit4]   1>   2 of 14: name=_1 docCount=72
> [junit4:junit4]   1>     codec=Lucene40
> [junit4:junit4]   1>     compound=false
> [junit4:junit4]   1>     numFiles=13
> [junit4:junit4]   1>     size (MB)=0.018
> [junit4:junit4]   1>     diagnostics = {os=Linux, os.version=3.2.0-26-generic, source=flush, lucene.version=4.0-SNAPSHOT, os.arch=amd64, java.version=1.7.0_04, java.vendor=Oracle Corporation}
> [junit4:junit4]   1>     has deletions [delGen=-1]
> [junit4:junit4]   1>     test: open reader.........OK
> [junit4:junit4]   1>     test: fields..............OK [1 fields]
> [junit4:junit4]   1>     test: field norms.........OK [1 fields]
> [junit4:junit4]   1>     test: terms, freq, prox...OK [232 terms; 285 terms/docs pairs; 312 tokens]
> [junit4:junit4]   1>     test: stored fields.......OK [0 total field count; avg 0 fields per doc]
> [junit4:junit4]   1>     test: term vectors........ERROR [term [20 69]: doc 0: pos -1: startOffset 3 < lastStartOffset 5]
> [junit4:junit4]   1> java.lang.RuntimeException: term [20 69]: doc 0: pos -1: startOffset 3 < lastStartOffset 5
> [junit4:junit4]   1>    at org.apache.lucene.index.CheckIndex.checkFields(CheckIndex.java:872)
> [junit4:junit4]   1>    at org.apache.lucene.index.CheckIndex.testTermVectors(CheckIndex.java:1420)
> [junit4:junit4]   1>    at org.apache.lucene.index.CheckIndex.checkIndex(CheckIndex.java:574)
> [junit4:junit4]   1>    at org.apache.lucene.util._TestUtil.checkIndex(_TestUtil.java:192)
> [junit4:junit4]   1>    at org.apache.lucene.store.MockDirectoryWrapper.close(MockDirectoryWrapper.java:587)
> [junit4:junit4]   1>    at org.apache.lucene.util.IOUtils.close(IOUtils.java:144)
> [junit4:junit4]   1>    at org.apache.lucene.analysis.BaseTokenStreamTestCase.checkRandomData(BaseTokenStreamTestCase.java:469)
> [junit4:junit4]   1>    at org.apache.lucene.analysis.core.TestRandomChains.testRandomChains(TestRandomChains.java:860)
> [junit4:junit4]   1>    at sun.reflect.NativeMethodAccessorImpl.invoke0(Native Method)
> [junit4:junit4]   1>    at sun.reflect.NativeMethodAccessorImpl.invoke(NativeMethodAccessorImpl.java:57)
> [junit4:junit4]   1>    at sun.reflect.DelegatingMethodAccessorImpl.invoke(DelegatingMethodAccessorImpl.java:43)
> [junit4:junit4]   1>    at java.lang.reflect.Method.invoke(Method.java:601)
> [junit4:junit4]   1>    at com.carrotsearch.randomizedtesting.RandomizedRunner.invoke(RandomizedRunner.java:1995)
> [junit4:junit4]   1>    at com.carrotsearch.randomizedtesting.RandomizedRunner.access$1100(RandomizedRunner.java:132)
> [junit4:junit4]   1>    at com.carrotsearch.randomizedtesting.RandomizedRunner$6.evaluate(RandomizedRunner.java:818)
> [junit4:junit4]   1>    at com.carrotsearch.randomizedtesting.RandomizedRunner$7.evaluate(RandomizedRunner.java:877)
> [junit4:junit4]   1>    at com.carrotsearch.randomizedtesting.RandomizedRunner$8.evaluate(RandomizedRunner.java:891)
> [junit4:junit4]   1>    at org.apache.lucene.util.TestRuleSetupTeardownChained$1.evaluate(TestRuleSetupTeardownChained.java:50)
> [junit4:junit4]   1>    at org.apache.lucene.util.TestRuleFieldCacheSanity$1.evaluate(TestRuleFieldCacheSanity.java:32)
> [junit4:junit4]   1>    at org.apache.lucene.util.AbstractBeforeAfterRule$1.evaluate(AbstractBeforeAfterRule.java:45)
> [junit4:junit4]   1>    at com.carrotsearch.randomizedtesting.rules.SystemPropertiesInvariantRule$1.evaluate(SystemPropertiesInvariantRule.java:55)
> [junit4:junit4]   1>    at org.apache.lucene.util.TestRuleReportUncaughtExceptions$1.evaluate(TestRuleReportUncaughtExceptions.java:68)
> [junit4:junit4]   1>    at org.apache.lucene.util.TestRuleThreadAndTestName$1.evaluate(TestRuleThreadAndTestName.java:48)
> [junit4:junit4]   1>    at org.apache.lucene.util.TestRuleIgnoreAfterMaxFailures$1.evaluate(TestRuleIgnoreAfterMaxFailures.java:70)
> [junit4:junit4]   1>    at org.apache.lucene.util.TestRuleMarkFailure$1.evaluate(TestRuleMarkFailure.java:48)
> [junit4:junit4]   1>    at com.carrotsearch.randomizedtesting.RandomizedRunner.runSingleTest(RandomizedRunner.java:825)
> [junit4:junit4]   1>    at com.carrotsearch.randomizedtesting.RandomizedRunner.access$700(RandomizedRunner.java:132)
> [junit4:junit4]   1>    at com.carrotsearch.randomizedtesting.RandomizedRunner$3$1.run(RandomizedRunner.java:671)
> [junit4:junit4]   1>    at com.carrotsearch.randomizedtesting.RandomizedRunner$3.evaluate(RandomizedRunner.java:697)
> [junit4:junit4]   1>    at com.carrotsearch.randomizedtesting.RandomizedRunner$4.evaluate(RandomizedRunner.java:736)
> [junit4:junit4]   1>    at com.carrotsearch.randomizedtesting.RandomizedRunner$5.evaluate(RandomizedRunner.java:747)
> [junit4:junit4]   1>    at org.apache.lucene.util.AbstractBeforeAfterRule$1.evaluate(AbstractBeforeAfterRule.java:45)
> [junit4:junit4]   1>    at org.apache.lucene.util.TestRuleReportUncaughtExceptions$1.evaluate(TestRuleReportUncaughtExceptions.java:68)
> [junit4:junit4]   1>    at org.apache.lucene.util.TestRuleStoreClassName$1.evaluate(TestRuleStoreClassName.java:38)
> [junit4:junit4]   1>    at org.apache.lucene.util.TestRuleIcuHack$1.evaluate(TestRuleIcuHack.java:51)
> [junit4:junit4]   1>    at com.carrotsearch.randomizedtesting.rules.SystemPropertiesInvariantRule$1.evaluate(SystemPropertiesInvariantRule.java:55)
> [junit4:junit4]   1>    at org.apache.lucene.util.TestRuleNoInstanceHooksOverrides$1.evaluate(TestRuleNoInstanceHooksOverrides.java:53)
> [junit4:junit4]   1>    at org.apache.lucene.util.TestRuleNoStaticHooksShadowing$1.evaluate(TestRuleNoStaticHooksShadowing.java:52)
> [junit4:junit4]   1>    at org.apache.lucene.util.TestRuleAssertionsRequired$1.evaluate(TestRuleAssertionsRequired.java:36)
> [junit4:junit4]   1>    at org.apache.lucene.util.TestRuleMarkFailure$1.evaluate(TestRuleMarkFailure.java:48)
> [junit4:junit4]   1>    at org.apache.lucene.util.TestRuleIgnoreAfterMaxFailures$1.evaluate(TestRuleIgnoreAfterMaxFailures.java:70)
> [junit4:junit4]   1>    at org.apache.lucene.util.TestRuleIgnoreTestSuites$1.evaluate(TestRuleIgnoreTestSuites.java:55)
> [junit4:junit4]   1>    at com.carrotsearch.randomizedtesting.RandomizedRunner.runSuite(RandomizedRunner.java:605)
> [junit4:junit4]   1>    at com.carrotsearch.randomizedtesting.RandomizedRunner.access$400(RandomizedRunner.java:132)
> [junit4:junit4]   1>    at com.carrotsearch.randomizedtesting.RandomizedRunner$2.run(RandomizedRunner.java:551)
> [junit4:junit4]   1>     test: DocValues........OK [0 total doc Count; Num DocValues Fields 0
> [junit4:junit4]   1> FAILED
> [junit4:junit4]   1>     WARNING: fixIndex() would remove reference to this segment; full exception:
> [junit4:junit4]   1> java.lang.RuntimeException: Term Vector test failed
> [junit4:junit4]   1>    at org.apache.lucene.index.CheckIndex.checkIndex(CheckIndex.java:587)
> [junit4:junit4]   1>    at org.apache.lucene.util._TestUtil.checkIndex(_TestUtil.java:192)
> [junit4:junit4]   1>    at org.apache.lucene.store.MockDirectoryWrapper.close(MockDirectoryWrapper.java:587)
> [junit4:junit4]   1>    at org.apache.lucene.util.IOUtils.close(IOUtils.java:144)
> [junit4:junit4]   1>    at org.apache.lucene.analysis.BaseTokenStreamTestCase.checkRandomData(BaseTokenStreamTestCase.java:469)
> [junit4:junit4]   1>    at org.apache.lucene.analysis.core.TestRandomChains.testRandomChains(TestRandomChains.java:860)
> [junit4:junit4]   1>    at sun.reflect.NativeMethodAccessorImpl.invoke0(Native Method)
> [junit4:junit4]   1>    at sun.reflect.NativeMethodAccessorImpl.invoke(NativeMethodAccessorImpl.java:57)
> [junit4:junit4]   1>    at sun.reflect.DelegatingMethodAccessorImpl.invoke(DelegatingMethodAccessorImpl.java:43)
> [junit4:junit4]   1>    at java.lang.reflect.Method.invoke(Method.java:601)
> [junit4:junit4]   1>    at com.carrotsearch.randomizedtesting.RandomizedRunner.invoke(RandomizedRunner.java:1995)
> [junit4:junit4]   1>    at com.carrotsearch.randomizedtesting.RandomizedRunner.access$1100(RandomizedRunner.java:132)
> [junit4:junit4]   1>    at com.carrotsearch.randomizedtesting.RandomizedRunner$6.evaluate(RandomizedRunner.java:818)
> [junit4:junit4]   1>    at com.carrotsearch.randomizedtesting.RandomizedRunner$7.evaluate(RandomizedRunner.java:877)
> [junit4:junit4]   1>    at com.carrotsearch.randomizedtesting.RandomizedRunner$8.evaluate(RandomizedRunner.java:891)
> [junit4:junit4]   1>    at org.apache.lucene.util.TestRuleSetupTeardownChained$1.evaluate(TestRuleSetupTeardownChained.java:50)
> [junit4:junit4]   1>    at org.apache.lucene.util.TestRuleFieldCacheSanity$1.evaluate(TestRuleFieldCacheSanity.java:32)
> [junit4:junit4]   1>    at org.apache.lucene.util.AbstractBeforeAfterRule$1.evaluate(AbstractBeforeAfterRule.java:45)
> [junit4:junit4]   1>    at com.carrotsearch.randomizedtesting.rules.SystemPropertiesInvariantRule$1.evaluate(SystemPropertiesInvariantRule.java:55)
> [junit4:junit4]   1>    at org.apache.lucene.util.TestRuleReportUncaughtExceptions$1.evaluate(TestRuleReportUncaughtExceptions.java:68)
> [junit4:junit4]   1>    at org.apache.lucene.util.TestRuleThreadAndTestName$1.evaluate(TestRuleThreadAndTestName.java:48)
> [junit4:junit4]   1>    at org.apache.lucene.util.TestRuleIgnoreAfterMaxFailures$1.evaluate(TestRuleIgnoreAfterMaxFailures.java:70)
> [junit4:junit4]   1>    at org.apache.lucene.util.TestRuleMarkFailure$1.evaluate(TestRuleMarkFailure.java:48)
> [junit4:junit4]   1>    at com.carrotsearch.randomizedtesting.RandomizedRunner.runSingleTest(RandomizedRunner.java:825)
> [junit4:junit4]   1>    at com.carrotsearch.randomizedtesting.RandomizedRunner.access$700(RandomizedRunner.java:132)
> [junit4:junit4]   1>    at com.carrotsearch.randomizedtesting.RandomizedRunner$3$1.run(RandomizedRunner.java:671)
> [junit4:junit4]   1>    at com.carrotsearch.randomizedtesting.RandomizedRunner$3.evaluate(RandomizedRunner.java:697)
> [junit4:junit4]   1>    at com.carrotsearch.randomizedtesting.RandomizedRunner$4.evaluate(RandomizedRunner.java:736)
> [junit4:junit4]   1>    at com.carrotsearch.randomizedtesting.RandomizedRunner$5.evaluate(RandomizedRunner.java:747)
> [junit4:junit4]   1>    at org.apache.lucene.util.AbstractBeforeAfterRule$1.evaluate(AbstractBeforeAfterRule.java:45)
> [junit4:junit4]   1>    at org.apache.lucene.util.TestRuleReportUncaughtExceptions$1.evaluate(TestRuleReportUncaughtExceptions.java:68)
> [junit4:junit4]   1>    at org.apache.lucene.util.TestRuleStoreClassName$1.evaluate(TestRuleStoreClassName.java:38)
> [junit4:junit4]   1>    at org.apache.lucene.util.TestRuleIcuHack$1.evaluate(TestRuleIcuHack.java:51)
> [junit4:junit4]   1>    at com.carrotsearch.randomizedtesting.rules.SystemPropertiesInvariantRule$1.evaluate(SystemPropertiesInvariantRule.java:55)
> [junit4:junit4]   1>    at org.apache.lucene.util.TestRuleNoInstanceHooksOverrides$1.evaluate(TestRuleNoInstanceHooksOverrides.java:53)
> [junit4:junit4]   1>    at org.apache.lucene.util.TestRuleNoStaticHooksShadowing$1.evaluate(TestRuleNoStaticHooksShadowing.java:52)
> [junit4:junit4]   1>    at org.apache.lucene.util.TestRuleAssertionsRequired$1.evaluate(TestRuleAssertionsRequired.java:36)
> [junit4:junit4]   1>    at org.apache.lucene.util.TestRuleMarkFailure$1.evaluate(TestRuleMarkFailure.java:48)
> [junit4:junit4]   1>    at org.apache.lucene.util.TestRuleIgnoreAfterMaxFailures$1.evaluate(TestRuleIgnoreAfterMaxFailures.java:70)
> [junit4:junit4]   1>    at org.apache.lucene.util.TestRuleIgnoreTestSuites$1.evaluate(TestRuleIgnoreTestSuites.java:55)
> [junit4:junit4]   1>    at com.carrotsearch.randomizedtesting.RandomizedRunner.runSuite(RandomizedRunner.java:605)
> [junit4:junit4]   1>    at com.carrotsearch.randomizedtesting.RandomizedRunner.access$400(RandomizedRunner.java:132)
> [junit4:junit4]   1>    at com.carrotsearch.randomizedtesting.RandomizedRunner$2.run(RandomizedRunner.java:551)
> [junit4:junit4]   1>
> [junit4:junit4]   1>   3 of 14: name=_2 docCount=72
> [junit4:junit4]   1>     codec=Lucene40
> [junit4:junit4]   1>     compound=false
> [junit4:junit4]   1>     numFiles=13
> [junit4:junit4]   1>     size (MB)=0.019
> [junit4:junit4]   1>     diagnostics = {os=Linux, os.version=3.2.0-26-generic, source=flush, lucene.version=4.0-SNAPSHOT, os.arch=amd64, java.version=1.7.0_04, java.vendor=Oracle Corporation}
> [junit4:junit4]   1>     has deletions [delGen=-1]
> [junit4:junit4]   1>     test: open reader.........OK
> [junit4:junit4]   1>     test: fields..............OK [1 fields]
> [junit4:junit4]   1>     test: field norms.........OK [1 fields]
> [junit4:junit4]   1>     test: terms, freq, prox...OK [203 terms; 307 terms/docs pairs; 374 tokens]
> [junit4:junit4]   1>     test: stored fields.......OK [0 total field count; avg 0 fields per doc]
> [junit4:junit4]   1>     test: term vectors........ERROR [term [73 73]: doc 0: pos -1: startOffset 2 < lastStartOffset 3]
> [junit4:junit4]   1> java.lang.RuntimeException: term [73 73]: doc 0: pos -1: startOffset 2 < lastStartOffset 3
> [junit4:junit4]   1>    at org.apache.lucene.index.CheckIndex.checkFields(CheckIndex.java:872)
> [junit4:junit4]   1>    at org.apache.lucene.index.CheckIndex.testTermVectors(CheckIndex.java:1420)
> [junit4:junit4]   1>    at org.apache.lucene.index.CheckIndex.checkIndex(CheckIndex.java:574)
> [junit4:junit4]   1>    at org.apache.lucene.util._TestUtil.checkIndex(_TestUtil.java:192)
> [junit4:junit4]   1>    at org.apache.lucene.store.MockDirectoryWrapper.close(MockDirectoryWrapper.java:587)
> [junit4:junit4]   1>    at org.apache.lucene.util.IOUtils.close(IOUtils.java:144)
> [junit4:junit4]   1>    at org.apache.lucene.analysis.BaseTokenStreamTestCase.checkRandomData(BaseTokenStreamTestCase.java:469)
> [junit4:junit4]   1>    at org.apache.lucene.analysis.core.TestRandomChains.testRandomChains(TestRandomChains.java:860)
> [junit4:junit4]   1>    at sun.reflect.NativeMethodAccessorImpl.invoke0(Native Method)
> [junit4:junit4]   1>    at sun.reflect.NativeMethodAccessorImpl.invoke(NativeMethodAccessorImpl.java:57)
> [junit4:junit4]   1>    at sun.reflect.DelegatingMethodAccessorImpl.invoke(DelegatingMethodAccessorImpl.java:43)
> [junit4:junit4]   1>    at java.lang.reflect.Method.invoke(Method.java:601)
> [junit4:junit4]   1>    at com.carrotsearch.randomizedtesting.RandomizedRunner.invoke(RandomizedRunner.java:1995)
> [junit4:junit4]   1>    at com.carrotsearch.randomizedtesting.RandomizedRunner.access$1100(RandomizedRunner.java:132)
> [junit4:junit4]   1>    at com.carrotsearch.randomizedtesting.RandomizedRunner$6.evaluate(RandomizedRunner.java:818)
> [junit4:junit4]   1>    at com.carrotsearch.randomizedtesting.RandomizedRunner$7.evaluate(RandomizedRunner.java:877)
> [junit4:junit4]   1>    at com.carrotsearch.randomizedtesting.RandomizedRunner$8.evaluate(RandomizedRunner.java:891)
> [junit4:junit4]   1>    at org.apache.lucene.util.TestRuleSetupTeardownChained$1.evaluate(TestRuleSetupTeardownChained.java:50)
> [junit4:junit4]   1>    at org.apache.lucene.util.TestRuleFieldCacheSanity$1.evaluate(TestRuleFieldCacheSanity.java:32)
> [junit4:junit4]   1>    at org.apache.lucene.util.AbstractBeforeAfterRule$1.evaluate(AbstractBeforeAfterRule.java:45)
> [junit4:junit4]   1>    at com.carrotsearch.randomizedtesting.rules.SystemPropertiesInvariantRule$1.evaluate(SystemPropertiesInvariantRule.java:55)
> [junit4:junit4]   1>    at org.apache.lucene.util.TestRuleReportUncaughtExceptions$1.evaluate(TestRuleReportUncaughtExceptions.java:68)
> [junit4:junit4]   1>    at org.apache.lucene.util.TestRuleThreadAndTestName$1.evaluate(TestRuleThreadAndTestName.java:48)
> [junit4:junit4]   1>    at org.apache.lucene.util.TestRuleIgnoreAfterMaxFailures$1.evaluate(TestRuleIgnoreAfterMaxFailures.java:70)
> [junit4:junit4]   1>    at org.apache.lucene.util.TestRuleMarkFailure$1.evaluate(TestRuleMarkFailure.java:48)
> [junit4:junit4]   1>    at com.carrotsearch.randomizedtesting.RandomizedRunner.runSingleTest(RandomizedRunner.java:825)
> [junit4:junit4]   1>    at com.carrotsearch.randomizedtesting.RandomizedRunner.access$700(RandomizedRunner.java:132)
> [junit4:junit4]   1>    at com.carrotsearch.randomizedtesting.RandomizedRunner$3$1.run(RandomizedRunner.java:671)
> [junit4:junit4]   1>    at com.carrotsearch.randomizedtesting.RandomizedRunner$3.evaluate(RandomizedRunner.java:697)
> [junit4:junit4]   1>    at com.carrotsearch.randomizedtesting.RandomizedRunner$4.evaluate(RandomizedRunner.java:736)
> [junit4:junit4]   1>    at com.carrotsearch.randomizedtesting.RandomizedRunner$5.evaluate(RandomizedRunner.java:747)
> [junit4:junit4]   1>    at org.apache.lucene.util.AbstractBeforeAfterRule$1.evaluate(AbstractBeforeAfterRule.java:45)
> [junit4:junit4]   1>    at org.apache.lucene.util.TestRuleReportUncaughtExceptions$1.evaluate(TestRuleReportUncaughtExceptions.java:68)
> [junit4:junit4]   1>    at org.apache.lucene.util.TestRuleStoreClassName$1.evaluate(TestRuleStoreClassName.java:38)
> [junit4:junit4]   1>    at org.apache.lucene.util.TestRuleIcuHack$1.evaluate(TestRuleIcuHack.java:51)
> [junit4:junit4]   1>    at com.carrotsearch.randomizedtesting.rules.SystemPropertiesInvariantRule$1.evaluate(SystemPropertiesInvariantRule.java:55)
> [junit4:junit4]   1>    at org.apache.lucene.util.TestRuleNoInstanceHooksOverrides$1.evaluate(TestRuleNoInstanceHooksOverrides.java:53)
> [junit4:junit4]   1>    at org.apache.lucene.util.TestRuleNoStaticHooksShadowing$1.evaluate(TestRuleNoStaticHooksShadowing.java:52)
> [junit4:junit4]   1>    at org.apache.lucene.util.TestRuleAssertionsRequired$1.evaluate(TestRuleAssertionsRequired.java:36)
> [junit4:junit4]   1>    at org.apache.lucene.util.TestRuleMarkFailure$1.evaluate(TestRuleMarkFailure.java:48)
> [junit4:junit4]   1>    at org.apache.lucene.util.TestRuleIgnoreAfterMaxFailures$1.evaluate(TestRuleIgnoreAfterMaxFailures.java:70)
> [junit4:junit4]   1>    at org.apache.lucene.util.TestRuleIgnoreTestSuites$1.evaluate(TestRuleIgnoreTestSuites.java:55)
> [junit4:junit4]   1>    at com.carrotsearch.randomizedtesting.RandomizedRunner.runSuite(RandomizedRunner.java:605)
> [junit4:junit4]   1>    at com.carrotsearch.randomizedtesting.RandomizedRunner.access$400(RandomizedRunner.java:132)
> [junit4:junit4]   1>    at com.carrotsearch.randomizedtesting.RandomizedRunner$2.run(RandomizedRunner.java:551)
> [junit4:junit4]   1>     test: DocValues........OK [0 total doc Count; Num DocValues Fields 0
> [junit4:junit4]   1> FAILED
> [junit4:junit4]   1>     WARNING: fixIndex() would remove reference to this segment; full exception:
> [junit4:junit4]   1> java.lang.RuntimeException: Term Vector test failed
> [junit4:junit4]   1>    at org.apache.lucene.index.CheckIndex.checkIndex(CheckIndex.java:587)
> [junit4:junit4]   1>    at org.apache.lucene.util._TestUtil.checkIndex(_TestUtil.java:192)
> [junit4:junit4]   1>    at org.apache.lucene.store.MockDirectoryWrapper.close(MockDirectoryWrapper.java:587)
> [junit4:junit4]   1>    at org.apache.lucene.util.IOUtils.close(IOUtils.java:144)
> [junit4:junit4]   1>    at org.apache.lucene.analysis.BaseTokenStreamTestCase.checkRandomData(BaseTokenStreamTestCase.java:469)
> [junit4:junit4]   1>    at org.apache.lucene.analysis.core.TestRandomChains.testRandomChains(TestRandomChains.java:860)
> [junit4:junit4]   1>    at sun.reflect.NativeMethodAccessorImpl.invoke0(Native Method)
> [junit4:junit4]   1>    at sun.reflect.NativeMethodAccessorImpl.invoke(NativeMethodAccessorImpl.java:57)
> [junit4:junit4]   1>    at sun.reflect.DelegatingMethodAccessorImpl.invoke(DelegatingMethodAccessorImpl.java:43)
> [junit4:junit4]   1>    at java.lang.reflect.Method.invoke(Method.java:601)
> [junit4:junit4]   1>    at com.carrotsearch.randomizedtesting.RandomizedRunner.invoke(RandomizedRunner.java:1995)
> [junit4:junit4]   1>    at com.carrotsearch.randomizedtesting.RandomizedRunner.access$1100(RandomizedRunner.java:132)
> [junit4:junit4]   1>    at com.carrotsearch.randomizedtesting.RandomizedRunner$6.evaluate(RandomizedRunner.java:818)
> [junit4:junit4]   1>    at com.carrotsearch.randomizedtesting.RandomizedRunner$7.evaluate(RandomizedRunner.java:877)
> [junit4:junit4]   1>    at com.carrotsearch.randomizedtesting.RandomizedRunner$8.evaluate(RandomizedRunner.java:891)
> [junit4:junit4]   1>    at org.apache.lucene.util.TestRuleSetupTeardownChained$1.evaluate(TestRuleSetupTeardownChained.java:50)
> [junit4:junit4]   1>    at org.apache.lucene.util.TestRuleFieldCacheSanity$1.evaluate(TestRuleFieldCacheSanity.java:32)
> [junit4:junit4]   1>    at org.apache.lucene.util.AbstractBeforeAfterRule$1.evaluate(AbstractBeforeAfterRule.java:45)
> [junit4:junit4]   1>    at com.carrotsearch.randomizedtesting.rules.SystemPropertiesInvariantRule$1.evaluate(SystemPropertiesInvariantRule.java:55)
> [junit4:junit4]   1>    at org.apache.lucene.util.TestRuleReportUncaughtExceptions$1.evaluate(TestRuleReportUncaughtExceptions.java:68)
> [junit4:junit4]   1>    at org.apache.lucene.util.TestRuleThreadAndTestName$1.evaluate(TestRuleThreadAndTestName.java:48)
> [junit4:junit4]   1>    at org.apache.lucene.util.TestRuleIgnoreAfterMaxFailures$1.evaluate(TestRuleIgnoreAfterMaxFailures.java:70)
> [junit4:junit4]   1>    at org.apache.lucene.util.TestRuleMarkFailure$1.evaluate(TestRuleMarkFailure.java:48)
> [junit4:junit4]   1>    at com.carrotsearch.randomizedtesting.RandomizedRunner.runSingleTest(RandomizedRunner.java:825)
> [junit4:junit4]   1>    at com.carrotsearch.randomizedtesting.RandomizedRunner.access$700(RandomizedRunner.java:132)
> [junit4:junit4]   1>    at com.carrotsearch.randomizedtesting.RandomizedRunner$3$1.run(RandomizedRunner.java:671)
> [junit4:junit4]   1>    at com.carrotsearch.randomizedtesting.RandomizedRunner$3.evaluate(RandomizedRunner.java:697)
> [junit4:junit4]   1>    at com.carrotsearch.randomizedtesting.RandomizedRunner$4.evaluate(RandomizedRunner.java:736)
> [junit4:junit4]   1>    at com.carrotsearch.randomizedtesting.RandomizedRunner$5.evaluate(RandomizedRunner.java:747)
> [junit4:junit4]   1>    at org.apache.lucene.util.AbstractBeforeAfterRule$1.evaluate(AbstractBeforeAfterRule.java:45)
> [junit4:junit4]   1>    at org.apache.lucene.util.TestRuleReportUncaughtExceptions$1.evaluate(TestRuleReportUncaughtExceptions.java:68)
> [junit4:junit4]   1>    at org.apache.lucene.util.TestRuleStoreClassName$1.evaluate(TestRuleStoreClassName.java:38)
> [junit4:junit4]   1>    at org.apache.lucene.util.TestRuleIcuHack$1.evaluate(TestRuleIcuHack.java:51)
> [junit4:junit4]   1>    at com.carrotsearch.randomizedtesting.rules.SystemPropertiesInvariantRule$1.evaluate(SystemPropertiesInvariantRule.java:55)
> [junit4:junit4]   1>    at org.apache.lucene.util.TestRuleNoInstanceHooksOverrides$1.evaluate(TestRuleNoInstanceHooksOverrides.java:53)
> [junit4:junit4]   1>    at org.apache.lucene.util.TestRuleNoStaticHooksShadowing$1.evaluate(TestRuleNoStaticHooksShadowing.java:52)
> [junit4:junit4]   1>    at org.apache.lucene.util.TestRuleAssertionsRequired$1.evaluate(TestRuleAssertionsRequired.java:36)
> [junit4:junit4]   1>    at org.apache.lucene.util.TestRuleMarkFailure$1.evaluate(TestRuleMarkFailure.java:48)
> [junit4:junit4]   1>    at org.apache.lucene.util.TestRuleIgnoreAfterMaxFailures$1.evaluate(TestRuleIgnoreAfterMaxFailures.java:70)
> [junit4:junit4]   1>    at org.apache.lucene.util.TestRuleIgnoreTestSuites$1.evaluate(TestRuleIgnoreTestSuites.java:55)
> [junit4:junit4]   1>    at com.carrotsearch.randomizedtesting.RandomizedRunner.runSuite(RandomizedRunner.java:605)
> [junit4:junit4]   1>    at com.carrotsearch.randomizedtesting.RandomizedRunner.access$400(RandomizedRunner.java:132)
> [junit4:junit4]   1>    at com.carrotsearch.randomizedtesting.RandomizedRunner$2.run(RandomizedRunner.java:551)
> [junit4:junit4]   1>
> [junit4:junit4]   1>   4 of 14: name=_3 docCount=72
> [junit4:junit4]   1>     codec=Lucene40
> [junit4:junit4]   1>     compound=false
> [junit4:junit4]   1>     numFiles=13
> [junit4:junit4]   1>     size (MB)=0.016
> [junit4:junit4]   1>     diagnostics = {os=Linux, os.version=3.2.0-26-generic, source=flush, lucene.version=4.0-SNAPSHOT, os.arch=amd64, java.version=1.7.0_04, java.vendor=Oracle Corporation}
> [junit4:junit4]   1>     has deletions [delGen=-1]
> [junit4:junit4]   1>     test: open reader.........OK
> [junit4:junit4]   1>     test: fields..............OK [1 fields]
> [junit4:junit4]   1>     test: field norms.........OK [1 fields]
> [junit4:junit4]   1>     test: terms, freq, prox...OK [144 terms; 266 terms/docs pairs; 302 tokens]
> [junit4:junit4]   1>     test: stored fields.......OK [0 total field count; avg 0 fields per doc]
> [junit4:junit4]   1>     test: term vectors........OK [67 total vector count; avg 1 term/freq vector fields per doc]
> [junit4:junit4]   1>     test: DocValues........OK [0 total doc Count; Num DocValues Fields 0
> [junit4:junit4]   1>
> [junit4:junit4]   1>   5 of 14: name=_4 docCount=72
> [junit4:junit4]   1>     codec=Lucene40
> [junit4:junit4]   1>     compound=false
> [junit4:junit4]   1>     numFiles=13
> [junit4:junit4]   1>     size (MB)=0.018
> [junit4:junit4]   1>     diagnostics = {os=Linux, os.version=3.2.0-26-generic, source=flush, lucene.version=4.0-SNAPSHOT, os.arch=amd64, java.version=1.7.0_04, java.vendor=Oracle Corporation}
> [junit4:junit4]   1>     has deletions [delGen=-1]
> [junit4:junit4]   1>     test: open reader.........OK
> [junit4:junit4]   1>     test: fields..............OK [1 fields]
> [junit4:junit4]   1>     test: field norms.........OK [1 fields]
> [junit4:junit4]   1>     test: terms, freq, prox...OK [233 terms; 303 terms/docs pairs; 333 tokens]
> [junit4:junit4]   1>     test: stored fields.......OK [0 total field count; avg 0 fields per doc]
> [junit4:junit4]   1>     test: term vectors........ERROR [term [20 69]: doc 0: pos -1: startOffset 3 < lastStartOffset 5]
> [junit4:junit4]   1> java.lang.RuntimeException: term [20 69]: doc 0: pos -1: startOffset 3 < lastStartOffset 5
> [junit4:junit4]   1>    at org.apache.lucene.index.CheckIndex.checkFields(CheckIndex.java:872)
> [junit4:junit4]   1>    at org.apache.lucene.index.CheckIndex.testTermVectors(CheckIndex.java:1420)
> [junit4:junit4]   1>    at org.apache.lucene.index.CheckIndex.checkIndex(CheckIndex.java:574)
> [junit4:junit4]   1>    at org.apache.lucene.util._TestUtil.checkIndex(_TestUtil.java:192)
> [junit4:junit4]   1>    at org.apache.lucene.store.MockDirectoryWrapper.close(MockDirectoryWrapper.java:587)
> [junit4:junit4]   1>    at org.apache.lucene.util.IOUtils.close(IOUtils.java:144)
> [junit4:junit4]   1>    at org.apache.lucene.analysis.BaseTokenStreamTestCase.checkRandomData(BaseTokenStreamTestCase.java:469)
> [junit4:junit4]   1>    at org.apache.lucene.analysis.core.TestRandomChains.testRandomChains(TestRandomChains.java:860)
> [junit4:junit4]   1>    at sun.reflect.NativeMethodAccessorImpl.invoke0(Native Method)
> [junit4:junit4]   1>    at sun.reflect.NativeMethodAccessorImpl.invoke(NativeMethodAccessorImpl.java:57)
> [junit4:junit4]   1>    at sun.reflect.DelegatingMethodAccessorImpl.invoke(DelegatingMethodAccessorImpl.java:43)
> [junit4:junit4]   1>    at java.lang.reflect.Method.invoke(Method.java:601)
> [junit4:junit4]   1>    at com.carrotsearch.randomizedtesting.RandomizedRunner.invoke(RandomizedRunner.java:1995)
> [junit4:junit4]   1>    at com.carrotsearch.randomizedtesting.RandomizedRunner.access$1100(RandomizedRunner.java:132)
> [junit4:junit4]   1>    at com.carrotsearch.randomizedtesting.RandomizedRunner$6.evaluate(RandomizedRunner.java:818)
> [junit4:junit4]   1>    at com.carrotsearch.randomizedtesting.RandomizedRunner$7.evaluate(RandomizedRunner.java:877)
> [junit4:junit4]   1>    at com.carrotsearch.randomizedtesting.RandomizedRunner$8.evaluate(RandomizedRunner.java:891)
> [junit4:junit4]   1>    at org.apache.lucene.util.TestRuleSetupTeardownChained$1.evaluate(TestRuleSetupTeardownChained.java:50)
> [junit4:junit4]   1>    at org.apache.lucene.util.TestRuleFieldCacheSanity$1.evaluate(TestRuleFieldCacheSanity.java:32)
> [junit4:junit4]   1>    at org.apache.lucene.util.AbstractBeforeAfterRule$1.evaluate(AbstractBeforeAfterRule.java:45)
> [junit4:junit4]   1>    at com.carrotsearch.randomizedtesting.rules.SystemPropertiesInvariantRule$1.evaluate(SystemPropertiesInvariantRule.java:55)
> [junit4:junit4]   1>    at org.apache.lucene.util.TestRuleReportUncaughtExceptions$1.evaluate(TestRuleReportUncaughtExceptions.java:68)
> [junit4:junit4]   1>    at org.apache.lucene.util.TestRuleThreadAndTestName$1.evaluate(TestRuleThreadAndTestName.java:48)
> [junit4:junit4]   1>    at org.apache.lucene.util.TestRuleIgnoreAfterMaxFailures$1.evaluate(TestRuleIgnoreAfterMaxFailures.java:70)
> [junit4:junit4]   1>    at org.apache.lucene.util.TestRuleMarkFailure$1.evaluate(TestRuleMarkFailure.java:48)
> [junit4:junit4]   1>    at com.carrotsearch.randomizedtesting.RandomizedRunner.runSingleTest(RandomizedRunner.java:825)
> [junit4:junit4]   1>    at com.carrotsearch.randomizedtesting.RandomizedRunner.access$700(RandomizedRunner.java:132)
> [junit4:junit4]   1>    at com.carrotsearch.randomizedtesting.RandomizedRunner$3$1.run(RandomizedRunner.java:671)
> [junit4:junit4]   1>    at com.carrotsearch.randomizedtesting.RandomizedRunner$3.evaluate(RandomizedRunner.java:697)
> [junit4:junit4]   1>    at com.carrotsearch.randomizedtesting.RandomizedRunner$4.evaluate(RandomizedRunner.java:736)
> [junit4:junit4]   1>    at com.carrotsearch.randomizedtesting.RandomizedRunner$5.evaluate(RandomizedRunner.java:747)
> [junit4:junit4]   1>    at org.apache.lucene.util.AbstractBeforeAfterRule$1.evaluate(AbstractBeforeAfterRule.java:45)
> [junit4:junit4]   1>    at org.apache.lucene.util.TestRuleReportUncaughtExceptions$1.evaluate(TestRuleReportUncaughtExceptions.java:68)
> [junit4:junit4]   1>    at org.apache.lucene.util.TestRuleStoreClassName$1.evaluate(TestRuleStoreClassName.java:38)
> [junit4:junit4]   1>    at org.apache.lucene.util.TestRuleIcuHack$1.evaluate(TestRuleIcuHack.java:51)
> [junit4:junit4]   1>    at com.carrotsearch.randomizedtesting.rules.SystemPropertiesInvariantRule$1.evaluate(SystemPropertiesInvariantRule.java:55)
> [junit4:junit4]   1>    at org.apache.lucene.util.TestRuleNoInstanceHooksOverrides$1.evaluate(TestRuleNoInstanceHooksOverrides.java:53)
> [junit4:junit4]   1>    at org.apache.lucene.util.TestRuleNoStaticHooksShadowing$1.evaluate(TestRuleNoStaticHooksShadowing.java:52)
> [junit4:junit4]   1>    at org.apache.lucene.util.TestRuleAssertionsRequired$1.evaluate(TestRuleAssertionsRequired.java:36)
> [junit4:junit4]   1>    at org.apache.lucene.util.TestRuleMarkFailure$1.evaluate(TestRuleMarkFailure.java:48)
> [junit4:junit4]   1>    at org.apache.lucene.util.TestRuleIgnoreAfterMaxFailures$1.evaluate(TestRuleIgnoreAfterMaxFailures.java:70)
> [junit4:junit4]   1>    at org.apache.lucene.util.TestRuleIgnoreTestSuites$1.evaluate(TestRuleIgnoreTestSuites.java:55)
> [junit4:junit4]   1>    at com.carrotsearch.randomizedtesting.RandomizedRunner.runSuite(RandomizedRunner.java:605)
> [junit4:junit4]   1>    at com.carrotsearch.randomizedtesting.RandomizedRunner.access$400(RandomizedRunner.java:132)
> [junit4:junit4]   1>    at com.carrotsearch.randomizedtesting.RandomizedRunner$2.run(RandomizedRunner.java:551)
> [junit4:junit4]   1>     test: DocValues........OK [0 total doc Count; Num DocValues Fields 0
> [junit4:junit4]   1> FAILED
> [junit4:junit4]   1>     WARNING: fixIndex() would remove reference to this segment; full exception:
> [junit4:junit4]   1> java.lang.RuntimeException: Term Vector test failed
> [junit4:junit4]   1>    at org.apache.lucene.index.CheckIndex.checkIndex(CheckIndex.java:587)
> [junit4:junit4]   1>    at org.apache.lucene.util._TestUtil.checkIndex(_TestUtil.java:192)
> [junit4:junit4]   1>    at org.apache.lucene.store.MockDirectoryWrapper.close(MockDirectoryWrapper.java:587)
> [junit4:junit4]   1>    at org.apache.lucene.util.IOUtils.close(IOUtils.java:144)
> [junit4:junit4]   1>    at org.apache.lucene.analysis.BaseTokenStreamTestCase.checkRandomData(BaseTokenStreamTestCase.java:469)
> [junit4:junit4]   1>    at org.apache.lucene.analysis.core.TestRandomChains.testRandomChains(TestRandomChains.java:860)
> [junit4:junit4]   1>    at sun.reflect.NativeMethodAccessorImpl.invoke0(Native Method)
> [junit4:junit4]   1>    at sun.reflect.NativeMethodAccessorImpl.invoke(NativeMethodAccessorImpl.java:57)
> [junit4:junit4]   1>    at sun.reflect.DelegatingMethodAccessorImpl.invoke(DelegatingMethodAccessorImpl.java:43)
> [junit4:junit4]   1>    at java.lang.reflect.Method.invoke(Method.java:601)
> [junit4:junit4]   1>    at com.carrotsearch.randomizedtesting.RandomizedRunner.invoke(RandomizedRunner.java:1995)
> [junit4:junit4]   1>    at com.carrotsearch.randomizedtesting.RandomizedRunner.access$1100(RandomizedRunner.java:132)
> [junit4:junit4]   1>    at com.carrotsearch.randomizedtesting.RandomizedRunner$6.evaluate(RandomizedRunner.java:818)
> [junit4:junit4]   1>    at com.carrotsearch.randomizedtesting.RandomizedRunner$7.evaluate(RandomizedRunner.java:877)
> [junit4:junit4]   1>    at com.carrotsearch.randomizedtesting.RandomizedRunner$8.evaluate(RandomizedRunner.java:891)
> [junit4:junit4]   1>    at org.apache.lucene.util.TestRuleSetupTeardownChained$1.evaluate(TestRuleSetupTeardownChained.java:50)
> [junit4:junit4]   1>    at org.apache.lucene.util.TestRuleFieldCacheSanity$1.evaluate(TestRuleFieldCacheSanity.java:32)
> [junit4:junit4]   1>    at org.apache.lucene.util.AbstractBeforeAfterRule$1.evaluate(AbstractBeforeAfterRule.java:45)
> [junit4:junit4]   1>    at com.carrotsearch.randomizedtesting.rules.SystemPropertiesInvariantRule$1.evaluate(SystemPropertiesInvariantRule.java:55)
> [junit4:junit4]   1>    at org.apache.lucene.util.TestRuleReportUncaughtExceptions$1.evaluate(TestRuleReportUncaughtExceptions.java:68)
> [junit4:junit4]   1>    at org.apache.lucene.util.TestRuleThreadAndTestName$1.evaluate(TestRuleThreadAndTestName.java:48)
> [junit4:junit4]   1>    at org.apache.lucene.util.TestRuleIgnoreAfterMaxFailures$1.evaluate(TestRuleIgnoreAfterMaxFailures.java:70)
> [junit4:junit4]   1>    at org.apache.lucene.util.TestRuleMarkFailure$1.evaluate(TestRuleMarkFailure.java:48)
> [junit4:junit4]   1>    at com.carrotsearch.randomizedtesting.RandomizedRunner.runSingleTest(RandomizedRunner.java:825)
> [junit4:junit4]   1>    at com.carrotsearch.randomizedtesting.RandomizedRunner.access$700(RandomizedRunner.java:132)
> [junit4:junit4]   1>    at com.carrotsearch.randomizedtesting.RandomizedRunner$3$1.run(RandomizedRunner.java:671)
> [junit4:junit4]   1>    at com.carrotsearch.randomizedtesting.RandomizedRunner$3.evaluate(RandomizedRunner.java:697)
> [junit4:junit4]   1>    at com.carrotsearch.randomizedtesting.RandomizedRunner$4.evaluate(RandomizedRunner.java:736)
> [junit4:junit4]   1>    at com.carrotsearch.randomizedtesting.RandomizedRunner$5.evaluate(RandomizedRunner.java:747)
> [junit4:junit4]   1>    at org.apache.lucene.util.AbstractBeforeAfterRule$1.evaluate(AbstractBeforeAfterRule.java:45)
> [junit4:junit4]   1>    at org.apache.lucene.util.TestRuleReportUncaughtExceptions$1.evaluate(TestRuleReportUncaughtExceptions.java:68)
> [junit4:junit4]   1>    at org.apache.lucene.util.TestRuleStoreClassName$1.evaluate(TestRuleStoreClassName.java:38)
> [junit4:junit4]   1>    at org.apache.lucene.util.TestRuleIcuHack$1.evaluate(TestRuleIcuHack.java:51)
> [junit4:junit4]   1>    at com.carrotsearch.randomizedtesting.rules.SystemPropertiesInvariantRule$1.evaluate(SystemPropertiesInvariantRule.java:55)
> [junit4:junit4]   1>    at org.apache.lucene.util.TestRuleNoInstanceHooksOverrides$1.evaluate(TestRuleNoInstanceHooksOverrides.java:53)
> [junit4:junit4]   1>    at org.apache.lucene.util.TestRuleNoStaticHooksShadowing$1.evaluate(TestRuleNoStaticHooksShadowing.java:52)
> [junit4:junit4]   1>    at org.apache.lucene.util.TestRuleAssertionsRequired$1.evaluate(TestRuleAssertionsRequired.java:36)
> [junit4:junit4]   1>    at org.apache.lucene.util.TestRuleMarkFailure$1.evaluate(TestRuleMarkFailure.java:48)
> [junit4:junit4]   1>    at org.apache.lucene.util.TestRuleIgnoreAfterMaxFailures$1.evaluate(TestRuleIgnoreAfterMaxFailures.java:70)
> [junit4:junit4]   1>    at org.apache.lucene.util.TestRuleIgnoreTestSuites$1.evaluate(TestRuleIgnoreTestSuites.java:55)
> [junit4:junit4]   1>    at com.carrotsearch.randomizedtesting.RandomizedRunner.runSuite(RandomizedRunner.java:605)
> [junit4:junit4]   1>    at com.carrotsearch.randomizedtesting.RandomizedRunner.access$400(RandomizedRunner.java:132)
> [junit4:junit4]   1>    at com.carrotsearch.randomizedtesting.RandomizedRunner$2.run(RandomizedRunner.java:551)
> [junit4:junit4]   1>
> [junit4:junit4]   1>   6 of 14: name=_5 docCount=72
> [junit4:junit4]   1>     codec=Lucene40
> [junit4:junit4]   1>     compound=false
> [junit4:junit4]   1>     numFiles=13
> [junit4:junit4]   1>     size (MB)=0.017
> [junit4:junit4]   1>     diagnostics = {os=Linux, os.version=3.2.0-26-generic, source=flush, lucene.version=4.0-SNAPSHOT, os.arch=amd64, java.version=1.7.0_04, java.vendor=Oracle Corporation}
> [junit4:junit4]   1>     has deletions [delGen=-1]
> [junit4:junit4]   1>     test: open reader.........OK
> [junit4:junit4]   1>     test: fields..............OK [1 fields]
> [junit4:junit4]   1>     test: field norms.........OK [1 fields]
> [junit4:junit4]   1>     test: terms, freq, prox...OK [179 terms; 236 terms/docs pairs; 263 tokens]
> [junit4:junit4]   1>     test: stored fields.......OK [0 total field count; avg 0 fields per doc]
> [junit4:junit4]   1>     test: term vectors........OK [65 total vector count; avg 1 term/freq vector fields per doc]
> [junit4:junit4]   1>     test: DocValues........OK [0 total doc Count; Num DocValues Fields 0
> [junit4:junit4]   1>
> [junit4:junit4]   1>   7 of 14: name=_6 docCount=72
> [junit4:junit4]   1>     codec=Lucene40
> [junit4:junit4]   1>     compound=false
> [junit4:junit4]   1>     numFiles=13
> [junit4:junit4]   1>     size (MB)=0.019
> [junit4:junit4]   1>     diagnostics = {os=Linux, os.version=3.2.0-26-generic, source=flush, lucene.version=4.0-SNAPSHOT, os.arch=amd64, java.version=1.7.0_04, java.vendor=Oracle Corporation}
> [junit4:junit4]   1>     has deletions [delGen=-1]
> [junit4:junit4]   1>     test: open reader.........OK
> [junit4:junit4]   1>     test: fields..............OK [1 fields]
> [junit4:junit4]   1>     test: field norms.........OK [1 fields]
> [junit4:junit4]   1>     test: terms, freq, prox...OK [254 terms; 326 terms/docs pairs; 358 tokens]
> [junit4:junit4]   1>     test: stored fields.......OK [0 total field count; avg 0 fields per doc]
> [junit4:junit4]   1>     test: term vectors........ERROR [term [20 69]: doc 0: pos -1: startOffset 3 < lastStartOffset 5]
> [junit4:junit4]   1> java.lang.RuntimeException: term [20 69]: doc 0: pos -1: startOffset 3 < lastStartOffset 5
> [junit4:junit4]   1>    at org.apache.lucene.index.CheckIndex.checkFields(CheckIndex.java:872)
> [junit4:junit4]   1>    at org.apache.lucene.index.CheckIndex.testTermVectors(CheckIndex.java:1420)
> [junit4:junit4]   1>    at org.apache.lucene.index.CheckIndex.checkIndex(CheckIndex.java:574)
> [junit4:junit4]   1>    at org.apache.lucene.util._TestUtil.checkIndex(_TestUtil.java:192)
> [junit4:junit4]   1>    at org.apache.lucene.store.MockDirectoryWrapper.close(MockDirectoryWrapper.java:587)
> [junit4:junit4]   1>    at org.apache.lucene.util.IOUtils.close(IOUtils.java:144)
> [junit4:junit4]   1>    at org.apache.lucene.analysis.BaseTokenStreamTestCase.checkRandomData(BaseTokenStreamTestCase.java:469)
> [junit4:junit4]   1>    at org.apache.lucene.analysis.core.TestRandomChains.testRandomChains(TestRandomChains.java:860)
> [junit4:junit4]   1>    at sun.reflect.NativeMethodAccessorImpl.invoke0(Native Method)
> [junit4:junit4]   1>    at sun.reflect.NativeMethodAccessorImpl.invoke(NativeMethodAccessorImpl.java:57)
> [junit4:junit4]   1>    at sun.reflect.DelegatingMethodAccessorImpl.invoke(DelegatingMethodAccessorImpl.java:43)
> [junit4:junit4]   1>    at java.lang.reflect.Method.invoke(Method.java:601)
> [junit4:junit4]   1>    at com.carrotsearch.randomizedtesting.RandomizedRunner.invoke(RandomizedRunner.java:1995)
> [junit4:junit4]   1>    at com.carrotsearch.randomizedtesting.RandomizedRunner.access$1100(RandomizedRunner.java:132)
> [junit4:junit4]   1>    at com.carrotsearch.randomizedtesting.RandomizedRunner$6.evaluate(RandomizedRunner.java:818)
> [junit4:junit4]   1>    at com.carrotsearch.randomizedtesting.RandomizedRunner$7.evaluate(RandomizedRunner.java:877)
> [junit4:junit4]   1>    at com.carrotsearch.randomizedtesting.RandomizedRunner$8.evaluate(RandomizedRunner.java:891)
> [junit4:junit4]   1>    at org.apache.lucene.util.TestRuleSetupTeardownChained$1.evaluate(TestRuleSetupTeardownChained.java:50)
> [junit4:junit4]   1>    at org.apache.lucene.util.TestRuleFieldCacheSanity$1.evaluate(TestRuleFieldCacheSanity.java:32)
> [junit4:junit4]   1>    at org.apache.lucene.util.AbstractBeforeAfterRule$1.evaluate(AbstractBeforeAfterRule.java:45)
> [junit4:junit4]   1>    at com.carrotsearch.randomizedtesting.rules.SystemPropertiesInvariantRule$1.evaluate(SystemPropertiesInvariantRule.java:55)
> [junit4:junit4]   1>    at org.apache.lucene.util.TestRuleReportUncaughtExceptions$1.evaluate(TestRuleReportUncaughtExceptions.java:68)
> [junit4:junit4]   1>    at org.apache.lucene.util.TestRuleThreadAndTestName$1.evaluate(TestRuleThreadAndTestName.java:48)
> [junit4:junit4]   1>    at org.apache.lucene.util.TestRuleIgnoreAfterMaxFailures$1.evaluate(TestRuleIgnoreAfterMaxFailures.java:70)
> [junit4:junit4]   1>    at org.apache.lucene.util.TestRuleMarkFailure$1.evaluate(TestRuleMarkFailure.java:48)
> [junit4:junit4]   1>    at com.carrotsearch.randomizedtesting.RandomizedRunner.runSingleTest(RandomizedRunner.java:825)
> [junit4:junit4]   1>    at com.carrotsearch.randomizedtesting.RandomizedRunner.access$700(RandomizedRunner.java:132)
> [junit4:junit4]   1>    at com.carrotsearch.randomizedtesting.RandomizedRunner$3$1.run(RandomizedRunner.java:671)
> [junit4:junit4]   1>    at com.carrotsearch.randomizedtesting.RandomizedRunner$3.evaluate(RandomizedRunner.java:697)
> [junit4:junit4]   1>    at com.carrotsearch.randomizedtesting.RandomizedRunner$4.evaluate(RandomizedRunner.java:736)
> [junit4:junit4]   1>    at com.carrotsearch.randomizedtesting.RandomizedRunner$5.evaluate(RandomizedRunner.java:747)
> [junit4:junit4]   1>    at org.apache.lucene.util.AbstractBeforeAfterRule$1.evaluate(AbstractBeforeAfterRule.java:45)
> [junit4:junit4]   1>    at org.apache.lucene.util.TestRuleReportUncaughtExceptions$1.evaluate(TestRuleReportUncaughtExceptions.java:68)
> [junit4:junit4]   1>    at org.apache.lucene.util.TestRuleStoreClassName$1.evaluate(TestRuleStoreClassName.java:38)
> [junit4:junit4]   1>    at org.apache.lucene.util.TestRuleIcuHack$1.evaluate(TestRuleIcuHack.java:51)
> [junit4:junit4]   1>    at com.carrotsearch.randomizedtesting.rules.SystemPropertiesInvariantRule$1.evaluate(SystemPropertiesInvariantRule.java:55)
> [junit4:junit4]   1>    at org.apache.lucene.util.TestRuleNoInstanceHooksOverrides$1.evaluate(TestRuleNoInstanceHooksOverrides.java:53)
> [junit4:junit4]   1>    at org.apache.lucene.util.TestRuleNoStaticHooksShadowing$1.evaluate(TestRuleNoStaticHooksShadowing.java:52)
> [junit4:junit4]   1>    at org.apache.lucene.util.TestRuleAssertionsRequired$1.evaluate(TestRuleAssertionsRequired.java:36)
> [junit4:junit4]   1>    at org.apache.lucene.util.TestRuleMarkFailure$1.evaluate(TestRuleMarkFailure.java:48)
> [junit4:junit4]   1>    at org.apache.lucene.util.TestRuleIgnoreAfterMaxFailures$1.evaluate(TestRuleIgnoreAfterMaxFailures.java:70)
> [junit4:junit4]   1>    at org.apache.lucene.util.TestRuleIgnoreTestSuites$1.evaluate(TestRuleIgnoreTestSuites.java:55)
> [junit4:junit4]   1>    at com.carrotsearch.randomizedtesting.RandomizedRunner.runSuite(RandomizedRunner.java:605)
> [junit4:junit4]   1>    at com.carrotsearch.randomizedtesting.RandomizedRunner.access$400(RandomizedRunner.java:132)
> [junit4:junit4]   1>    at com.carrotsearch.randomizedtesting.RandomizedRunner$2.run(RandomizedRunner.java:551)
> [junit4:junit4]   1>     test: DocValues........OK [0 total doc Count; Num DocValues Fields 0
> [junit4:junit4]   1> FAILED
> [junit4:junit4]   1>     WARNING: fixIndex() would remove reference to this segment; full exception:
> [junit4:junit4]   1> java.lang.RuntimeException: Term Vector test failed
> [junit4:junit4]   1>    at org.apache.lucene.index.CheckIndex.checkIndex(CheckIndex.java:587)
> [junit4:junit4]   1>    at org.apache.lucene.util._TestUtil.checkIndex(_TestUtil.java:192)
> [junit4:junit4]   1>    at org.apache.lucene.store.MockDirectoryWrapper.close(MockDirectoryWrapper.java:587)
> [junit4:junit4]   1>    at org.apache.lucene.util.IOUtils.close(IOUtils.java:144)
> [junit4:junit4]   1>    at org.apache.lucene.analysis.BaseTokenStreamTestCase.checkRandomData(BaseTokenStreamTestCase.java:469)
> [junit4:junit4]   1>    at org.apache.lucene.analysis.core.TestRandomChains.testRandomChains(TestRandomChains.java:860)
> [junit4:junit4]   1>    at sun.reflect.NativeMethodAccessorImpl.invoke0(Native Method)
> [junit4:junit4]   1>    at sun.reflect.NativeMethodAccessorImpl.invoke(NativeMethodAccessorImpl.java:57)
> [junit4:junit4]   1>    at sun.reflect.DelegatingMethodAccessorImpl.invoke(DelegatingMethodAccessorImpl.java:43)
> [junit4:junit4]   1>    at java.lang.reflect.Method.invoke(Method.java:601)
> [junit4:junit4]   1>    at com.carrotsearch.randomizedtesting.RandomizedRunner.invoke(RandomizedRunner.java:1995)
> [junit4:junit4]   1>    at com.carrotsearch.randomizedtesting.RandomizedRunner.access$1100(RandomizedRunner.java:132)
> [junit4:junit4]   1>    at com.carrotsearch.randomizedtesting.RandomizedRunner$6.evaluate(RandomizedRunner.java:818)
> [junit4:junit4]   1>    at com.carrotsearch.randomizedtesting.RandomizedRunner$7.evaluate(RandomizedRunner.java:877)
> [junit4:junit4]   1>    at com.carrotsearch.randomizedtesting.RandomizedRunner$8.evaluate(RandomizedRunner.java:891)
> [junit4:junit4]   1>    at org.apache.lucene.util.TestRuleSetupTeardownChained$1.evaluate(TestRuleSetupTeardownChained.java:50)
> [junit4:junit4]   1>    at org.apache.lucene.util.TestRuleFieldCacheSanity$1.evaluate(TestRuleFieldCacheSanity.java:32)
> [junit4:junit4]   1>    at org.apache.lucene.util.AbstractBeforeAfterRule$1.evaluate(AbstractBeforeAfterRule.java:45)
> [junit4:junit4]   1>    at com.carrotsearch.randomizedtesting.rules.SystemPropertiesInvariantRule$1.evaluate(SystemPropertiesInvariantRule.java:55)
> [junit4:junit4]   1>    at org.apache.lucene.util.TestRuleReportUncaughtExceptions$1.evaluate(TestRuleReportUncaughtExceptions.java:68)
> [junit4:junit4]   1>    at org.apache.lucene.util.TestRuleThreadAndTestName$1.evaluate(TestRuleThreadAndTestName.java:48)
> [junit4:junit4]   1>    at org.apache.lucene.util.TestRuleIgnoreAfterMaxFailures$1.evaluate(TestRuleIgnoreAfterMaxFailures.java:70)
> [junit4:junit4]   1>    at org.apache.lucene.util.TestRuleMarkFailure$1.evaluate(TestRuleMarkFailure.java:48)
> [junit4:junit4]   1>    at com.carrotsearch.randomizedtesting.RandomizedRunner.runSingleTest(RandomizedRunner.java:825)
> [junit4:junit4]   1>    at com.carrotsearch.randomizedtesting.RandomizedRunner.access$700(RandomizedRunner.java:132)
> [junit4:junit4]   1>    at com.carrotsearch.randomizedtesting.RandomizedRunner$3$1.run(RandomizedRunner.java:671)
> [junit4:junit4]   1>    at com.carrotsearch.randomizedtesting.RandomizedRunner$3.evaluate(RandomizedRunner.java:697)
> [junit4:junit4]   1>    at com.carrotsearch.randomizedtesting.RandomizedRunner$4.evaluate(RandomizedRunner.java:736)
> [junit4:junit4]   1>    at com.carrotsearch.randomizedtesting.RandomizedRunner$5.evaluate(RandomizedRunner.java:747)
> [junit4:junit4]   1>    at org.apache.lucene.util.AbstractBeforeAfterRule$1.evaluate(AbstractBeforeAfterRule.java:45)
> [junit4:junit4]   1>    at org.apache.lucene.util.TestRuleReportUncaughtExceptions$1.evaluate(TestRuleReportUncaughtExceptions.java:68)
> [junit4:junit4]   1>    at org.apache.lucene.util.TestRuleStoreClassName$1.evaluate(TestRuleStoreClassName.java:38)
> [junit4:junit4]   1>    at org.apache.lucene.util.TestRuleIcuHack$1.evaluate(TestRuleIcuHack.java:51)
> [junit4:junit4]   1>    at com.carrotsearch.randomizedtesting.rules.SystemPropertiesInvariantRule$1.evaluate(SystemPropertiesInvariantRule.java:55)
> [junit4:junit4]   1>    at org.apache.lucene.util.TestRuleNoInstanceHooksOverrides$1.evaluate(TestRuleNoInstanceHooksOverrides.java:53)
> [junit4:junit4]   1>    at org.apache.lucene.util.TestRuleNoStaticHooksShadowing$1.evaluate(TestRuleNoStaticHooksShadowing.java:52)
> [junit4:junit4]   1>    at org.apache.lucene.util.TestRuleAssertionsRequired$1.evaluate(TestRuleAssertionsRequired.java:36)
> [junit4:junit4]   1>    at org.apache.lucene.util.TestRuleMarkFailure$1.evaluate(TestRuleMarkFailure.java:48)
> [junit4:junit4]   1>    at org.apache.lucene.util.TestRuleIgnoreAfterMaxFailures$1.evaluate(TestRuleIgnoreAfterMaxFailures.java:70)
> [junit4:junit4]   1>    at org.apache.lucene.util.TestRuleIgnoreTestSuites$1.evaluate(TestRuleIgnoreTestSuites.java:55)
> [junit4:junit4]   1>    at com.carrotsearch.randomizedtesting.RandomizedRunner.runSuite(RandomizedRunner.java:605)
> [junit4:junit4]   1>    at com.carrotsearch.randomizedtesting.RandomizedRunner.access$400(RandomizedRunner.java:132)
> [junit4:junit4]   1>    at com.carrotsearch.randomizedtesting.RandomizedRunner$2.run(RandomizedRunner.java:551)
> [junit4:junit4]   1>
> [junit4:junit4]   1>   8 of 14: name=_7 docCount=72
> [junit4:junit4]   1>     codec=Lucene40
> [junit4:junit4]   1>     compound=false
> [junit4:junit4]   1>     numFiles=13
> [junit4:junit4]   1>     size (MB)=0.019
> [junit4:junit4]   1>     diagnostics = {os=Linux, os.version=3.2.0-26-generic, source=flush, lucene.version=4.0-SNAPSHOT, os.arch=amd64, java.version=1.7.0_04, java.vendor=Oracle Corporation}
> [junit4:junit4]   1>     has deletions [delGen=-1]
> [junit4:junit4]   1>     test: open reader.........OK
> [junit4:junit4]   1>     test: fields..............OK [1 fields]
> [junit4:junit4]   1>     test: field norms.........OK [1 fields]
> [junit4:junit4]   1>     test: terms, freq, prox...OK [230 terms; 304 terms/docs pairs; 346 tokens]
> [junit4:junit4]   1>     test: stored fields.......OK [0 total field count; avg 0 fields per doc]
> [junit4:junit4]   1>     test: term vectors........OK [66 total vector count; avg 1 term/freq vector fields per doc]
> [junit4:junit4]   1>     test: DocValues........OK [0 total doc Count; Num DocValues Fields 0
> [junit4:junit4]   1>
> [junit4:junit4]   1>   9 of 14: name=_8 docCount=72
> [junit4:junit4]   1>     codec=Lucene40
> [junit4:junit4]   1>     compound=false
> [junit4:junit4]   1>     numFiles=13
> [junit4:junit4]   1>     size (MB)=0.017
> [junit4:junit4]   1>     diagnostics = {os=Linux, os.version=3.2.0-26-generic, source=flush, lucene.version=4.0-SNAPSHOT, os.arch=amd64, java.version=1.7.0_04, java.vendor=Oracle Corporation}
> [junit4:junit4]   1>     has deletions [delGen=-1]
> [junit4:junit4]   1>     test: open reader.........OK
> [junit4:junit4]   1>     test: fields..............OK [1 fields]
> [junit4:junit4]   1>     test: field norms.........OK [1 fields]
> [junit4:junit4]   1>     test: terms, freq, prox...OK [176 terms; 274 terms/docs pairs; 286 tokens]
> [junit4:junit4]   1>     test: stored fields.......OK [0 total field count; avg 0 fields per doc]
> [junit4:junit4]   1>     test: term vectors........OK [70 total vector count; avg 1 term/freq vector fields per doc]
> [junit4:junit4]   1>     test: DocValues........OK [0 total doc Count; Num DocValues Fields 0
> [junit4:junit4]   1>
> [junit4:junit4]   1>   10 of 14: name=_b docCount=72
> [junit4:junit4]   1>     codec=Lucene40
> [junit4:junit4]   1>     compound=false
> [junit4:junit4]   1>     numFiles=13
> [junit4:junit4]   1>     size (MB)=0.018
> [junit4:junit4]   1>     diagnostics = {os=Linux, os.version=3.2.0-26-generic, source=flush, lucene.version=4.0-SNAPSHOT, os.arch=amd64, java.version=1.7.0_04, java.vendor=Oracle Corporation}
> [junit4:junit4]   1>     has deletions [delGen=-1]
> [junit4:junit4]   1>     test: open reader.........OK
> [junit4:junit4]   1>     test: fields..............OK [1 fields]
> [junit4:junit4]   1>     test: field norms.........OK [1 fields]
> [junit4:junit4]   1>     test: terms, freq, prox...OK [197 terms; 323 terms/docs pairs; 360 tokens]
> [junit4:junit4]   1>     test: stored fields.......OK [0 total field count; avg 0 fields per doc]
> [junit4:junit4]   1>     test: term vectors........ERROR [term [20 69]: doc 0: pos -1: startOffset 3 < lastStartOffset 5]
> [junit4:junit4]   1> java.lang.RuntimeException: term [20 69]: doc 0: pos -1: startOffset 3 < lastStartOffset 5
> [junit4:junit4]   1>    at org.apache.lucene.index.CheckIndex.checkFields(CheckIndex.java:872)
> [junit4:junit4]   1>    at org.apache.lucene.index.CheckIndex.testTermVectors(CheckIndex.java:1420)
> [junit4:junit4]   1>    at org.apache.lucene.index.CheckIndex.checkIndex(CheckIndex.java:574)
> [junit4:junit4]   1>    at org.apache.lucene.util._TestUtil.checkIndex(_TestUtil.java:192)
> [junit4:junit4]   1>    at org.apache.lucene.store.MockDirectoryWrapper.close(MockDirectoryWrapper.java:587)
> [junit4:junit4]   1>    at org.apache.lucene.util.IOUtils.close(IOUtils.java:144)
> [junit4:junit4]   1>    at org.apache.lucene.analysis.BaseTokenStreamTestCase.checkRandomData(BaseTokenStreamTestCase.java:469)
> [junit4:junit4]   1>    at org.apache.lucene.analysis.core.TestRandomChains.testRandomChains(TestRandomChains.java:860)
> [junit4:junit4]   1>    at sun.reflect.NativeMethodAccessorImpl.invoke0(Native Method)
> [junit4:junit4]   1>    at sun.reflect.NativeMethodAccessorImpl.invoke(NativeMethodAccessorImpl.java:57)
> [junit4:junit4]   1>    at sun.reflect.DelegatingMethodAccessorImpl.invoke(DelegatingMethodAccessorImpl.java:43)
> [junit4:junit4]   1>    at java.lang.reflect.Method.invoke(Method.java:601)
> [junit4:junit4]   1>    at com.carrotsearch.randomizedtesting.RandomizedRunner.invoke(RandomizedRunner.java:1995)
> [junit4:junit4]   1>    at com.carrotsearch.randomizedtesting.RandomizedRunner.access$1100(RandomizedRunner.java:132)
> [junit4:junit4]   1>    at com.carrotsearch.randomizedtesting.RandomizedRunner$6.evaluate(RandomizedRunner.java:818)
> [junit4:junit4]   1>    at com.carrotsearch.randomizedtesting.RandomizedRunner$7.evaluate(RandomizedRunner.java:877)
> [junit4:junit4]   1>    at com.carrotsearch.randomizedtesting.RandomizedRunner$8.evaluate(RandomizedRunner.java:891)
> [junit4:junit4]   1>    at org.apache.lucene.util.TestRuleSetupTeardownChained$1.evaluate(TestRuleSetupTeardownChained.java:50)
> [junit4:junit4]   1>    at org.apache.lucene.util.TestRuleFieldCacheSanity$1.evaluate(TestRuleFieldCacheSanity.java:32)
> [junit4:junit4]   1>    at org.apache.lucene.util.AbstractBeforeAfterRule$1.evaluate(AbstractBeforeAfterRule.java:45)
> [junit4:junit4]   1>    at com.carrotsearch.randomizedtesting.rules.SystemPropertiesInvariantRule$1.evaluate(SystemPropertiesInvariantRule.java:55)
> [junit4:junit4]   1>    at org.apache.lucene.util.TestRuleReportUncaughtExceptions$1.evaluate(TestRuleReportUncaughtExceptions.java:68)
> [junit4:junit4]   1>    at org.apache.lucene.util.TestRuleThreadAndTestName$1.evaluate(TestRuleThreadAndTestName.java:48)
> [junit4:junit4]   1>    at org.apache.lucene.util.TestRuleIgnoreAfterMaxFailures$1.evaluate(TestRuleIgnoreAfterMaxFailures.java:70)
> [junit4:junit4]   1>    at org.apache.lucene.util.TestRuleMarkFailure$1.evaluate(TestRuleMarkFailure.java:48)
> [junit4:junit4]   1>    at com.carrotsearch.randomizedtesting.RandomizedRunner.runSingleTest(RandomizedRunner.java:825)
> [junit4:junit4]   1>    at com.carrotsearch.randomizedtesting.RandomizedRunner.access$700(RandomizedRunner.java:132)
> [junit4:junit4]   1>    at com.carrotsearch.randomizedtesting.RandomizedRunner$3$1.run(RandomizedRunner.java:671)
> [junit4:junit4]   1>    at com.carrotsearch.randomizedtesting.RandomizedRunner$3.evaluate(RandomizedRunner.java:697)
> [junit4:junit4]   1>    at com.carrotsearch.randomizedtesting.RandomizedRunner$4.evaluate(RandomizedRunner.java:736)
> [junit4:junit4]   1>    at com.carrotsearch.randomizedtesting.RandomizedRunner$5.evaluate(RandomizedRunner.java:747)
> [junit4:junit4]   1>    at org.apache.lucene.util.AbstractBeforeAfterRule$1.evaluate(AbstractBeforeAfterRule.java:45)
> [junit4:junit4]   1>    at org.apache.lucene.util.TestRuleReportUncaughtExceptions$1.evaluate(TestRuleReportUncaughtExceptions.java:68)
> [junit4:junit4]   1>    at org.apache.lucene.util.TestRuleStoreClassName$1.evaluate(TestRuleStoreClassName.java:38)
> [junit4:junit4]   1>    at org.apache.lucene.util.TestRuleIcuHack$1.evaluate(TestRuleIcuHack.java:51)
> [junit4:junit4]   1>    at com.carrotsearch.randomizedtesting.rules.SystemPropertiesInvariantRule$1.evaluate(SystemPropertiesInvariantRule.java:55)
> [junit4:junit4]   1>    at org.apache.lucene.util.TestRuleNoInstanceHooksOverrides$1.evaluate(TestRuleNoInstanceHooksOverrides.java:53)
> [junit4:junit4]   1>    at org.apache.lucene.util.TestRuleNoStaticHooksShadowing$1.evaluate(TestRuleNoStaticHooksShadowing.java:52)
> [junit4:junit4]   1>    at org.apache.lucene.util.TestRuleAssertionsRequired$1.evaluate(TestRuleAssertionsRequired.java:36)
> [junit4:junit4]   1>    at org.apache.lucene.util.TestRuleMarkFailure$1.evaluate(TestRuleMarkFailure.java:48)
> [junit4:junit4]   1>    at org.apache.lucene.util.TestRuleIgnoreAfterMaxFailures$1.evaluate(TestRuleIgnoreAfterMaxFailures.java:70)
> [junit4:junit4]   1>    at org.apache.lucene.util.TestRuleIgnoreTestSuites$1.evaluate(TestRuleIgnoreTestSuites.java:55)
> [junit4:junit4]   1>    at com.carrotsearch.randomizedtesting.RandomizedRunner.runSuite(RandomizedRunner.java:605)
> [junit4:junit4]   1>    at com.carrotsearch.randomizedtesting.RandomizedRunner.access$400(RandomizedRunner.java:132)
> [junit4:junit4]   1>    at com.carrotsearch.randomizedtesting.RandomizedRunner$2.run(RandomizedRunner.java:551)
> [junit4:junit4]   1>     test: DocValues........OK [0 total doc Count; Num DocValues Fields 0
> [junit4:junit4]   1> FAILED
> [junit4:junit4]   1>     WARNING: fixIndex() would remove reference to this segment; full exception:
> [junit4:junit4]   1> java.lang.RuntimeException: Term Vector test failed
> [junit4:junit4]   1>    at org.apache.lucene.index.CheckIndex.checkIndex(CheckIndex.java:587)
> [junit4:junit4]   1>    at org.apache.lucene.util._TestUtil.checkIndex(_TestUtil.java:192)
> [junit4:junit4]   1>    at org.apache.lucene.store.MockDirectoryWrapper.close(MockDirectoryWrapper.java:587)
> [junit4:junit4]   1>    at org.apache.lucene.util.IOUtils.close(IOUtils.java:144)
> [junit4:junit4]   1>    at org.apache.lucene.analysis.BaseTokenStreamTestCase.checkRandomData(BaseTokenStreamTestCase.java:469)
> [junit4:junit4]   1>    at org.apache.lucene.analysis.core.TestRandomChains.testRandomChains(TestRandomChains.java:860)
> [junit4:junit4]   1>    at sun.reflect.NativeMethodAccessorImpl.invoke0(Native Method)
> [junit4:junit4]   1>    at sun.reflect.NativeMethodAccessorImpl.invoke(NativeMethodAccessorImpl.java:57)
> [junit4:junit4]   1>    at sun.reflect.DelegatingMethodAccessorImpl.invoke(DelegatingMethodAccessorImpl.java:43)
> [junit4:junit4]   1>    at java.lang.reflect.Method.invoke(Method.java:601)
> [junit4:junit4]   1>    at com.carrotsearch.randomizedtesting.RandomizedRunner.invoke(RandomizedRunner.java:1995)
> [junit4:junit4]   1>    at com.carrotsearch.randomizedtesting.RandomizedRunner.access$1100(RandomizedRunner.java:132)
> [junit4:junit4]   1>    at com.carrotsearch.randomizedtesting.RandomizedRunner$6.evaluate(RandomizedRunner.java:818)
> [junit4:junit4]   1>    at com.carrotsearch.randomizedtesting.RandomizedRunner$7.evaluate(RandomizedRunner.java:877)
> [junit4:junit4]   1>    at com.carrotsearch.randomizedtesting.RandomizedRunner$8.evaluate(RandomizedRunner.java:891)
> [junit4:junit4]   1>    at org.apache.lucene.util.TestRuleSetupTeardownChained$1.evaluate(TestRuleSetupTeardownChained.java:50)
> [junit4:junit4]   1>    at org.apache.lucene.util.TestRuleFieldCacheSanity$1.evaluate(TestRuleFieldCacheSanity.java:32)
> [junit4:junit4]   1>    at org.apache.lucene.util.AbstractBeforeAfterRule$1.evaluate(AbstractBeforeAfterRule.java:45)
> [junit4:junit4]   1>    at com.carrotsearch.randomizedtesting.rules.SystemPropertiesInvariantRule$1.evaluate(SystemPropertiesInvariantRule.java:55)
> [junit4:junit4]   1>    at org.apache.lucene.util.TestRuleReportUncaughtExceptions$1.evaluate(TestRuleReportUncaughtExceptions.java:68)
> [junit4:junit4]   1>    at org.apache.lucene.util.TestRuleThreadAndTestName$1.evaluate(TestRuleThreadAndTestName.java:48)
> [junit4:junit4]   1>    at org.apache.lucene.util.TestRuleIgnoreAfterMaxFailures$1.evaluate(TestRuleIgnoreAfterMaxFailures.java:70)
> [junit4:junit4]   1>    at org.apache.lucene.util.TestRuleMarkFailure$1.evaluate(TestRuleMarkFailure.java:48)
> [junit4:junit4]   1>    at com.carrotsearch.randomizedtesting.RandomizedRunner.runSingleTest(RandomizedRunner.java:825)
> [junit4:junit4]   1>    at com.carrotsearch.randomizedtesting.RandomizedRunner.access$700(RandomizedRunner.java:132)
> [junit4:junit4]   1>    at com.carrotsearch.randomizedtesting.RandomizedRunner$3$1.run(RandomizedRunner.java:671)
> [junit4:junit4]   1>    at com.carrotsearch.randomizedtesting.RandomizedRunner$3.evaluate(RandomizedRunner.java:697)
> [junit4:junit4]   1>    at com.carrotsearch.randomizedtesting.RandomizedRunner$4.evaluate(RandomizedRunner.java:736)
> [junit4:junit4]   1>    at com.carrotsearch.randomizedtesting.RandomizedRunner$5.evaluate(RandomizedRunner.java:747)
> [junit4:junit4]   1>    at org.apache.lucene.util.AbstractBeforeAfterRule$1.evaluate(AbstractBeforeAfterRule.java:45)
> [junit4:junit4]   1>    at org.apache.lucene.util.TestRuleReportUncaughtExceptions$1.evaluate(TestRuleReportUncaughtExceptions.java:68)
> [junit4:junit4]   1>    at org.apache.lucene.util.TestRuleStoreClassName$1.evaluate(TestRuleStoreClassName.java:38)
> [junit4:junit4]   1>    at org.apache.lucene.util.TestRuleIcuHack$1.evaluate(TestRuleIcuHack.java:51)
> [junit4:junit4]   1>    at com.carrotsearch.randomizedtesting.rules.SystemPropertiesInvariantRule$1.evaluate(SystemPropertiesInvariantRule.java:55)
> [junit4:junit4]   1>    at org.apache.lucene.util.TestRuleNoInstanceHooksOverrides$1.evaluate(TestRuleNoInstanceHooksOverrides.java:53)
> [junit4:junit4]   1>    at org.apache.lucene.util.TestRuleNoStaticHooksShadowing$1.evaluate(TestRuleNoStaticHooksShadowing.java:52)
> [junit4:junit4]   1>    at org.apache.lucene.util.TestRuleAssertionsRequired$1.evaluate(TestRuleAssertionsRequired.java:36)
> [junit4:junit4]   1>    at org.apache.lucene.util.TestRuleMarkFailure$1.evaluate(TestRuleMarkFailure.java:48)
> [junit4:junit4]   1>    at org.apache.lucene.util.TestRuleIgnoreAfterMaxFailures$1.evaluate(TestRuleIgnoreAfterMaxFailures.java:70)
> [junit4:junit4]   1>    at org.apache.lucene.util.TestRuleIgnoreTestSuites$1.evaluate(TestRuleIgnoreTestSuites.java:55)
> [junit4:junit4]   1>    at com.carrotsearch.randomizedtesting.RandomizedRunner.runSuite(RandomizedRunner.java:605)
> [junit4:junit4]   1>    at com.carrotsearch.randomizedtesting.RandomizedRunner.access$400(RandomizedRunner.java:132)
> [junit4:junit4]   1>    at com.carrotsearch.randomizedtesting.RandomizedRunner$2.run(RandomizedRunner.java:551)
> [junit4:junit4]   1>
> [junit4:junit4]   1>   11 of 14: name=_c docCount=72
> [junit4:junit4]   1>     codec=Lucene40
> [junit4:junit4]   1>     compound=false
> [junit4:junit4]   1>     numFiles=13
> [junit4:junit4]   1>     size (MB)=0.02
> [junit4:junit4]   1>     diagnostics = {os=Linux, os.version=3.2.0-26-generic, source=flush, lucene.version=4.0-SNAPSHOT, os.arch=amd64, java.version=1.7.0_04, java.vendor=Oracle Corporation}
> [junit4:junit4]   1>     has deletions [delGen=-1]
> [junit4:junit4]   1>     test: open reader.........OK
> [junit4:junit4]   1>     test: fields..............OK [1 fields]
> [junit4:junit4]   1>     test: field norms.........OK [1 fields]
> [junit4:junit4]   1>     test: terms, freq, prox...OK [239 terms; 344 terms/docs pairs; 405 tokens]
> [junit4:junit4]   1>     test: stored fields.......OK [0 total field count; avg 0 fields per doc]
> [junit4:junit4]   1>     test: term vectors........ERROR [term [73 73]: doc 0: pos -1: startOffset 2 < lastStartOffset 3]
> [junit4:junit4]   1> java.lang.RuntimeException: term [73 73]: doc 0: pos -1: startOffset 2 < lastStartOffset 3
> [junit4:junit4]   1>    at org.apache.lucene.index.CheckIndex.checkFields(CheckIndex.java:872)
> [junit4:junit4]   1>    at org.apache.lucene.index.CheckIndex.testTermVectors(CheckIndex.java:1420)
> [junit4:junit4]   1>    at org.apache.lucene.index.CheckIndex.checkIndex(CheckIndex.java:574)
> [junit4:junit4]   1>    at org.apache.lucene.util._TestUtil.checkIndex(_TestUtil.java:192)
> [junit4:junit4]   1>    at org.apache.lucene.store.MockDirectoryWrapper.close(MockDirectoryWrapper.java:587)
> [junit4:junit4]   1>    at org.apache.lucene.util.IOUtils.close(IOUtils.java:144)
> [junit4:junit4]   1>    at org.apache.lucene.analysis.BaseTokenStreamTestCase.checkRandomData(BaseTokenStreamTestCase.java:469)
> [junit4:junit4]   1>    at org.apache.lucene.analysis.core.TestRandomChains.testRandomChains(TestRandomChains.java:860)
> [junit4:junit4]   1>    at sun.reflect.NativeMethodAccessorImpl.invoke0(Native Method)
> [junit4:junit4]   1>    at sun.reflect.NativeMethodAccessorImpl.invoke(NativeMethodAccessorImpl.java:57)
> [junit4:junit4]   1>    at sun.reflect.DelegatingMethodAccessorImpl.invoke(DelegatingMethodAccessorImpl.java:43)
> [junit4:junit4]   1>    at java.lang.reflect.Method.invoke(Method.java:601)
> [junit4:junit4]   1>    at com.carrotsearch.randomizedtesting.RandomizedRunner.invoke(RandomizedRunner.java:1995)
> [junit4:junit4]   1>    at com.carrotsearch.randomizedtesting.RandomizedRunner.access$1100(RandomizedRunner.java:132)
> [junit4:junit4]   1>    at com.carrotsearch.randomizedtesting.RandomizedRunner$6.evaluate(RandomizedRunner.java:818)
> [junit4:junit4]   1>    at com.carrotsearch.randomizedtesting.RandomizedRunner$7.evaluate(RandomizedRunner.java:877)
> [junit4:junit4]   1>    at com.carrotsearch.randomizedtesting.RandomizedRunner$8.evaluate(RandomizedRunner.java:891)
> [junit4:junit4]   1>    at org.apache.lucene.util.TestRuleSetupTeardownChained$1.evaluate(TestRuleSetupTeardownChained.java:50)
> [junit4:junit4]   1>    at org.apache.lucene.util.TestRuleFieldCacheSanity$1.evaluate(TestRuleFieldCacheSanity.java:32)
> [junit4:junit4]   1>    at org.apache.lucene.util.AbstractBeforeAfterRule$1.evaluate(AbstractBeforeAfterRule.java:45)
> [junit4:junit4]   1>    at com.carrotsearch.randomizedtesting.rules.SystemPropertiesInvariantRule$1.evaluate(SystemPropertiesInvariantRule.java:55)
> [junit4:junit4]   1>    at org.apache.lucene.util.TestRuleReportUncaughtExceptions$1.evaluate(TestRuleReportUncaughtExceptions.java:68)
> [junit4:junit4]   1>    at org.apache.lucene.util.TestRuleThreadAndTestName$1.evaluate(TestRuleThreadAndTestName.java:48)
> [junit4:junit4]   1>    at org.apache.lucene.util.TestRuleIgnoreAfterMaxFailures$1.evaluate(TestRuleIgnoreAfterMaxFailures.java:70)
> [junit4:junit4]   1>    at org.apache.lucene.util.TestRuleMarkFailure$1.evaluate(TestRuleMarkFailure.java:48)
> [junit4:junit4]   1>    at com.carrotsearch.randomizedtesting.RandomizedRunner.runSingleTest(RandomizedRunner.java:825)
> [junit4:junit4]   1>    at com.carrotsearch.randomizedtesting.RandomizedRunner.access$700(RandomizedRunner.java:132)
> [junit4:junit4]   1>    at com.carrotsearch.randomizedtesting.RandomizedRunner$3$1.run(RandomizedRunner.java:671)
> [junit4:junit4]   1>    at com.carrotsearch.randomizedtesting.RandomizedRunner$3.evaluate(RandomizedRunner.java:697)
> [junit4:junit4]   1>    at com.carrotsearch.randomizedtesting.RandomizedRunner$4.evaluate(RandomizedRunner.java:736)
> [junit4:junit4]   1>    at com.carrotsearch.randomizedtesting.RandomizedRunner$5.evaluate(RandomizedRunner.java:747)
> [junit4:junit4]   1>    at org.apache.lucene.util.AbstractBeforeAfterRule$1.evaluate(AbstractBeforeAfterRule.java:45)
> [junit4:junit4]   1>    at org.apache.lucene.util.TestRuleReportUncaughtExceptions$1.evaluate(TestRuleReportUncaughtExceptions.java:68)
> [junit4:junit4]   1>    at org.apache.lucene.util.TestRuleStoreClassName$1.evaluate(TestRuleStoreClassName.java:38)
> [junit4:junit4]   1>    at org.apache.lucene.util.TestRuleIcuHack$1.evaluate(TestRuleIcuHack.java:51)
> [junit4:junit4]   1>    at com.carrotsearch.randomizedtesting.rules.SystemPropertiesInvariantRule$1.evaluate(SystemPropertiesInvariantRule.java:55)
> [junit4:junit4]   1>    at org.apache.lucene.util.TestRuleNoInstanceHooksOverrides$1.evaluate(TestRuleNoInstanceHooksOverrides.java:53)
> [junit4:junit4]   1>    at org.apache.lucene.util.TestRuleNoStaticHooksShadowing$1.evaluate(TestRuleNoStaticHooksShadowing.java:52)
> [junit4:junit4]   1>    at org.apache.lucene.util.TestRuleAssertionsRequired$1.evaluate(TestRuleAssertionsRequired.java:36)
> [junit4:junit4]   1>    at org.apache.lucene.util.TestRuleMarkFailure$1.evaluate(TestRuleMarkFailure.java:48)
> [junit4:junit4]   1>    at org.apache.lucene.util.TestRuleIgnoreAfterMaxFailures$1.evaluate(TestRuleIgnoreAfterMaxFailures.java:70)
> [junit4:junit4]   1>    at org.apache.lucene.util.TestRuleIgnoreTestSuites$1.evaluate(TestRuleIgnoreTestSuites.java:55)
> [junit4:junit4]   1>    at com.carrotsearch.randomizedtesting.RandomizedRunner.runSuite(RandomizedRunner.java:605)
> [junit4:junit4]   1>    at com.carrotsearch.randomizedtesting.RandomizedRunner.access$400(RandomizedRunner.java:132)
> [junit4:junit4]   1>    at com.carrotsearch.randomizedtesting.RandomizedRunner$2.run(RandomizedRunner.java:551)
> [junit4:junit4]   1>     test: DocValues........OK [0 total doc Count; Num DocValues Fields 0
> [junit4:junit4]   1> FAILED
> [junit4:junit4]   1>     WARNING: fixIndex() would remove reference to this segment; full exception:
> [junit4:junit4]   1> java.lang.RuntimeException: Term Vector test failed
> [junit4:junit4]   1>    at org.apache.lucene.index.CheckIndex.checkIndex(CheckIndex.java:587)
> [junit4:junit4]   1>    at org.apache.lucene.util._TestUtil.checkIndex(_TestUtil.java:192)
> [junit4:junit4]   1>    at org.apache.lucene.store.MockDirectoryWrapper.close(MockDirectoryWrapper.java:587)
> [junit4:junit4]   1>    at org.apache.lucene.util.IOUtils.close(IOUtils.java:144)
> [junit4:junit4]   1>    at org.apache.lucene.analysis.BaseTokenStreamTestCase.checkRandomData(BaseTokenStreamTestCase.java:469)
> [junit4:junit4]   1>    at org.apache.lucene.analysis.core.TestRandomChains.testRandomChains(TestRandomChains.java:860)
> [junit4:junit4]   1>    at sun.reflect.NativeMethodAccessorImpl.invoke0(Native Method)
> [junit4:junit4]   1>    at sun.reflect.NativeMethodAccessorImpl.invoke(NativeMethodAccessorImpl.java:57)
> [junit4:junit4]   1>    at sun.reflect.DelegatingMethodAccessorImpl.invoke(DelegatingMethodAccessorImpl.java:43)
> [junit4:junit4]   1>    at java.lang.reflect.Method.invoke(Method.java:601)
> [junit4:junit4]   1>    at com.carrotsearch.randomizedtesting.RandomizedRunner.invoke(RandomizedRunner.java:1995)
> [junit4:junit4]   1>    at com.carrotsearch.randomizedtesting.RandomizedRunner.access$1100(RandomizedRunner.java:132)
> [junit4:junit4]   1>    at com.carrotsearch.randomizedtesting.RandomizedRunner$6.evaluate(RandomizedRunner.java:818)
> [junit4:junit4]   1>    at com.carrotsearch.randomizedtesting.RandomizedRunner$7.evaluate(RandomizedRunner.java:877)
> [junit4:junit4]   1>    at com.carrotsearch.randomizedtesting.RandomizedRunner$8.evaluate(RandomizedRunner.java:891)
> [junit4:junit4]   1>    at org.apache.lucene.util.TestRuleSetupTeardownChained$1.evaluate(TestRuleSetupTeardownChained.java:50)
> [junit4:junit4]   1>    at org.apache.lucene.util.TestRuleFieldCacheSanity$1.evaluate(TestRuleFieldCacheSanity.java:32)
> [junit4:junit4]   1>    at org.apache.lucene.util.AbstractBeforeAfterRule$1.evaluate(AbstractBeforeAfterRule.java:45)
> [junit4:junit4]   1>    at com.carrotsearch.randomizedtesting.rules.SystemPropertiesInvariantRule$1.evaluate(SystemPropertiesInvariantRule.java:55)
> [junit4:junit4]   1>    at org.apache.lucene.util.TestRuleReportUncaughtExceptions$1.evaluate(TestRuleReportUncaughtExceptions.java:68)
> [junit4:junit4]   1>    at org.apache.lucene.util.TestRuleThreadAndTestName$1.evaluate(TestRuleThreadAndTestName.java:48)
> [junit4:junit4]   1>    at org.apache.lucene.util.TestRuleIgnoreAfterMaxFailures$1.evaluate(TestRuleIgnoreAfterMaxFailures.java:70)
> [junit4:junit4]   1>    at org.apache.lucene.util.TestRuleMarkFailure$1.evaluate(TestRuleMarkFailure.java:48)
> [junit4:junit4]   1>    at com.carrotsearch.randomizedtesting.RandomizedRunner.runSingleTest(RandomizedRunner.java:825)
> [junit4:junit4]   1>    at com.carrotsearch.randomizedtesting.RandomizedRunner.access$700(RandomizedRunner.java:132)
> [junit4:junit4]   1>    at com.carrotsearch.randomizedtesting.RandomizedRunner$3$1.run(RandomizedRunner.java:671)
> [junit4:junit4]   1>    at com.carrotsearch.randomizedtesting.RandomizedRunner$3.evaluate(RandomizedRunner.java:697)
> [junit4:junit4]   1>    at com.carrotsearch.randomizedtesting.RandomizedRunner$4.evaluate(RandomizedRunner.java:736)
> [junit4:junit4]   1>    at com.carrotsearch.randomizedtesting.RandomizedRunner$5.evaluate(RandomizedRunner.java:747)
> [junit4:junit4]   1>    at org.apache.lucene.util.AbstractBeforeAfterRule$1.evaluate(AbstractBeforeAfterRule.java:45)
> [junit4:junit4]   1>    at org.apache.lucene.util.TestRuleReportUncaughtExceptions$1.evaluate(TestRuleReportUncaughtExceptions.java:68)
> [junit4:junit4]   1>    at org.apache.lucene.util.TestRuleStoreClassName$1.evaluate(TestRuleStoreClassName.java:38)
> [junit4:junit4]   1>    at org.apache.lucene.util.TestRuleIcuHack$1.evaluate(TestRuleIcuHack.java:51)
> [junit4:junit4]   1>    at com.carrotsearch.randomizedtesting.rules.SystemPropertiesInvariantRule$1.evaluate(SystemPropertiesInvariantRule.java:55)
> [junit4:junit4]   1>    at org.apache.lucene.util.TestRuleNoInstanceHooksOverrides$1.evaluate(TestRuleNoInstanceHooksOverrides.java:53)
> [junit4:junit4]   1>    at org.apache.lucene.util.TestRuleNoStaticHooksShadowing$1.evaluate(TestRuleNoStaticHooksShadowing.java:52)
> [junit4:junit4]   1>    at org.apache.lucene.util.TestRuleAssertionsRequired$1.evaluate(TestRuleAssertionsRequired.java:36)
> [junit4:junit4]   1>    at org.apache.lucene.util.TestRuleMarkFailure$1.evaluate(TestRuleMarkFailure.java:48)
> [junit4:junit4]   1>    at org.apache.lucene.util.TestRuleIgnoreAfterMaxFailures$1.evaluate(TestRuleIgnoreAfterMaxFailures.java:70)
> [junit4:junit4]   1>    at org.apache.lucene.util.TestRuleIgnoreTestSuites$1.evaluate(TestRuleIgnoreTestSuites.java:55)
> [junit4:junit4]   1>    at com.carrotsearch.randomizedtesting.RandomizedRunner.runSuite(RandomizedRunner.java:605)
> [junit4:junit4]   1>    at com.carrotsearch.randomizedtesting.RandomizedRunner.access$400(RandomizedRunner.java:132)
> [junit4:junit4]   1>    at com.carrotsearch.randomizedtesting.RandomizedRunner$2.run(RandomizedRunner.java:551)
> [junit4:junit4]   1>
> [junit4:junit4]   1>   12 of 14: name=_d docCount=32
> [junit4:junit4]   1>     codec=Lucene40
> [junit4:junit4]   1>     compound=true
> [junit4:junit4]   1>     numFiles=3
> [junit4:junit4]   1>     size (MB)=0.013
> [junit4:junit4]   1>     diagnostics = {os=Linux, os.version=3.2.0-26-generic, source=flush, lucene.version=4.0-SNAPSHOT, os.arch=amd64, java.version=1.7.0_04, java.vendor=Oracle Corporation}
> [junit4:junit4]   1>     has deletions [delGen=-1]
> [junit4:junit4]   1>     test: open reader.........OK
> [junit4:junit4]   1>     test: fields..............OK [1 fields]
> [junit4:junit4]   1>     test: field norms.........OK [1 fields]
> [junit4:junit4]   1>     test: terms, freq, prox...OK [161 terms; 219 terms/docs pairs; 268 tokens]
> [junit4:junit4]   1>     test: stored fields.......OK [0 total field count; avg 0 fields per doc]
> [junit4:junit4]   1>     test: term vectors........ERROR [term [73 73]: doc 0: pos -1: startOffset 2 < lastStartOffset 3]
> [junit4:junit4]   1> java.lang.RuntimeException: term [73 73]: doc 0: pos -1: startOffset 2 < lastStartOffset 3
> [junit4:junit4]   1>    at org.apache.lucene.index.CheckIndex.checkFields(CheckIndex.java:872)
> [junit4:junit4]   1>    at org.apache.lucene.index.CheckIndex.testTermVectors(CheckIndex.java:1420)
> [junit4:junit4]   1>    at org.apache.lucene.index.CheckIndex.checkIndex(CheckIndex.java:574)
> [junit4:junit4]   1>    at org.apache.lucene.util._TestUtil.checkIndex(_TestUtil.java:192)
> [junit4:junit4]   1>    at org.apache.lucene.store.MockDirectoryWrapper.close(MockDirectoryWrapper.java:587)
> [junit4:junit4]   1>    at org.apache.lucene.util.IOUtils.close(IOUtils.java:144)
> [junit4:junit4]   1>    at org.apache.lucene.analysis.BaseTokenStreamTestCase.checkRandomData(BaseTokenStreamTestCase.java:469)
> [junit4:junit4]   1>    at org.apache.lucene.analysis.core.TestRandomChains.testRandomChains(TestRandomChains.java:860)
> [junit4:junit4]   1>    at sun.reflect.NativeMethodAccessorImpl.invoke0(Native Method)
> [junit4:junit4]   1>    at sun.reflect.NativeMethodAccessorImpl.invoke(NativeMethodAccessorImpl.java:57)
> [junit4:junit4]   1>    at sun.reflect.DelegatingMethodAccessorImpl.invoke(DelegatingMethodAccessorImpl.java:43)
> [junit4:junit4]   1>    at java.lang.reflect.Method.invoke(Method.java:601)
> [junit4:junit4]   1>    at com.carrotsearch.randomizedtesting.RandomizedRunner.invoke(RandomizedRunner.java:1995)
> [junit4:junit4]   1>    at com.carrotsearch.randomizedtesting.RandomizedRunner.access$1100(RandomizedRunner.java:132)
> [junit4:junit4]   1>    at com.carrotsearch.randomizedtesting.RandomizedRunner$6.evaluate(RandomizedRunner.java:818)
> [junit4:junit4]   1>    at com.carrotsearch.randomizedtesting.RandomizedRunner$7.evaluate(RandomizedRunner.java:877)
> [junit4:junit4]   1>    at com.carrotsearch.randomizedtesting.RandomizedRunner$8.evaluate(RandomizedRunner.java:891)
> [junit4:junit4]   1>    at org.apache.lucene.util.TestRuleSetupTeardownChained$1.evaluate(TestRuleSetupTeardownChained.java:50)
> [junit4:junit4]   1>    at org.apache.lucene.util.TestRuleFieldCacheSanity$1.evaluate(TestRuleFieldCacheSanity.java:32)
> [junit4:junit4]   1>    at org.apache.lucene.util.AbstractBeforeAfterRule$1.evaluate(AbstractBeforeAfterRule.java:45)
> [junit4:junit4]   1>    at com.carrotsearch.randomizedtesting.rules.SystemPropertiesInvariantRule$1.evaluate(SystemPropertiesInvariantRule.java:55)
> [junit4:junit4]   1>    at org.apache.lucene.util.TestRuleReportUncaughtExceptions$1.evaluate(TestRuleReportUncaughtExceptions.java:68)
> [junit4:junit4]   1>    at org.apache.lucene.util.TestRuleThreadAndTestName$1.evaluate(TestRuleThreadAndTestName.java:48)
> [junit4:junit4]   1>    at org.apache.lucene.util.TestRuleIgnoreAfterMaxFailures$1.evaluate(TestRuleIgnoreAfterMaxFailures.java:70)
> [junit4:junit4]   1>    at org.apache.lucene.util.TestRuleMarkFailure$1.evaluate(TestRuleMarkFailure.java:48)
> [junit4:junit4]   1>    at com.carrotsearch.randomizedtesting.RandomizedRunner.runSingleTest(RandomizedRunner.java:825)
> [junit4:junit4]   1>    at com.carrotsearch.randomizedtesting.RandomizedRunner.access$700(RandomizedRunner.java:132)
> [junit4:junit4]   1>    at com.carrotsearch.randomizedtesting.RandomizedRunner$3$1.run(RandomizedRunner.java:671)
> [junit4:junit4]   1>    at com.carrotsearch.randomizedtesting.RandomizedRunner$3.evaluate(RandomizedRunner.java:697)
> [junit4:junit4]   1>    at com.carrotsearch.randomizedtesting.RandomizedRunner$4.evaluate(RandomizedRunner.java:736)
> [junit4:junit4]   1>    at com.carrotsearch.randomizedtesting.RandomizedRunner$5.evaluate(RandomizedRunner.java:747)
> [junit4:junit4]   1>    at org.apache.lucene.util.AbstractBeforeAfterRule$1.evaluate(AbstractBeforeAfterRule.java:45)
> [junit4:junit4]   1>    at org.apache.lucene.util.TestRuleReportUncaughtExceptions$1.evaluate(TestRuleReportUncaughtExceptions.java:68)
> [junit4:junit4]   1>    at org.apache.lucene.util.TestRuleStoreClassName$1.evaluate(TestRuleStoreClassName.java:38)
> [junit4:junit4]   1>    at org.apache.lucene.util.TestRuleIcuHack$1.evaluate(TestRuleIcuHack.java:51)
> [junit4:junit4]   1>    at com.carrotsearch.randomizedtesting.rules.SystemPropertiesInvariantRule$1.evaluate(SystemPropertiesInvariantRule.java:55)
> [junit4:junit4]   1>    at org.apache.lucene.util.TestRuleNoInstanceHooksOverrides$1.evaluate(TestRuleNoInstanceHooksOverrides.java:53)
> [junit4:junit4]   1>    at org.apache.lucene.util.TestRuleNoStaticHooksShadowing$1.evaluate(TestRuleNoStaticHooksShadowing.java:52)
> [junit4:junit4]   1>    at org.apache.lucene.util.TestRuleAssertionsRequired$1.evaluate(TestRuleAssertionsRequired.java:36)
> [junit4:junit4]   1>    at org.apache.lucene.util.TestRuleMarkFailure$1.evaluate(TestRuleMarkFailure.java:48)
> [junit4:junit4]   1>    at org.apache.lucene.util.TestRuleIgnoreAfterMaxFailures$1.evaluate(TestRuleIgnoreAfterMaxFailures.java:70)
> [junit4:junit4]   1>    at org.apache.lucene.util.TestRuleIgnoreTestSuites$1.evaluate(TestRuleIgnoreTestSuites.java:55)
> [junit4:junit4]   1>    at com.carrotsearch.randomizedtesting.RandomizedRunner.runSuite(RandomizedRunner.java:605)
> [junit4:junit4]   1>    at com.carrotsearch.randomizedtesting.RandomizedRunner.access$400(RandomizedRunner.java:132)
> [junit4:junit4]   1>    at com.carrotsearch.randomizedtesting.RandomizedRunner$2.run(RandomizedRunner.java:551)
> [junit4:junit4]   1>     test: DocValues........OK [0 total doc Count; Num DocValues Fields 0
> [junit4:junit4]   1> FAILED
> [junit4:junit4]   1>     WARNING: fixIndex() would remove reference to this segment; full exception:
> [junit4:junit4]   1> java.lang.RuntimeException: Term Vector test failed
> [junit4:junit4]   1>    at org.apache.lucene.index.CheckIndex.checkIndex(CheckIndex.java:587)
> [junit4:junit4]   1>    at org.apache.lucene.util._TestUtil.checkIndex(_TestUtil.java:192)
> [junit4:junit4]   1>    at org.apache.lucene.store.MockDirectoryWrapper.close(MockDirectoryWrapper.java:587)
> [junit4:junit4]   1>    at org.apache.lucene.util.IOUtils.close(IOUtils.java:144)
> [junit4:junit4]   1>    at org.apache.lucene.analysis.BaseTokenStreamTestCase.checkRandomData(BaseTokenStreamTestCase.java:469)
> [junit4:junit4]   1>    at org.apache.lucene.analysis.core.TestRandomChains.testRandomChains(TestRandomChains.java:860)
> [junit4:junit4]   1>    at sun.reflect.NativeMethodAccessorImpl.invoke0(Native Method)
> [junit4:junit4]   1>    at sun.reflect.NativeMethodAccessorImpl.invoke(NativeMethodAccessorImpl.java:57)
> [junit4:junit4]   1>    at sun.reflect.DelegatingMethodAccessorImpl.invoke(DelegatingMethodAccessorImpl.java:43)
> [junit4:junit4]   1>    at java.lang.reflect.Method.invoke(Method.java:601)
> [junit4:junit4]   1>    at com.carrotsearch.randomizedtesting.RandomizedRunner.invoke(RandomizedRunner.java:1995)
> [junit4:junit4]   1>    at com.carrotsearch.randomizedtesting.RandomizedRunner.access$1100(RandomizedRunner.java:132)
> [junit4:junit4]   1>    at com.carrotsearch.randomizedtesting.RandomizedRunner$6.evaluate(RandomizedRunner.java:818)
> [junit4:junit4]   1>    at com.carrotsearch.randomizedtesting.RandomizedRunner$7.evaluate(RandomizedRunner.java:877)
> [junit4:junit4]   1>    at com.carrotsearch.randomizedtesting.RandomizedRunner$8.evaluate(RandomizedRunner.java:891)
> [junit4:junit4]   1>    at org.apache.lucene.util.TestRuleSetupTeardownChained$1.evaluate(TestRuleSetupTeardownChained.java:50)
> [junit4:junit4]   1>    at org.apache.lucene.util.TestRuleFieldCacheSanity$1.evaluate(TestRuleFieldCacheSanity.java:32)
> [junit4:junit4]   1>    at org.apache.lucene.util.AbstractBeforeAfterRule$1.evaluate(AbstractBeforeAfterRule.java:45)
> [junit4:junit4]   1>    at com.carrotsearch.randomizedtesting.rules.SystemPropertiesInvariantRule$1.evaluate(SystemPropertiesInvariantRule.java:55)
> [junit4:junit4]   1>    at org.apache.lucene.util.TestRuleReportUncaughtExceptions$1.evaluate(TestRuleReportUncaughtExceptions.java:68)
> [junit4:junit4]   1>    at org.apache.lucene.util.TestRuleThreadAndTestName$1.evaluate(TestRuleThreadAndTestName.java:48)
> [junit4:junit4]   1>    at org.apache.lucene.util.TestRuleIgnoreAfterMaxFailures$1.evaluate(TestRuleIgnoreAfterMaxFailures.java:70)
> [junit4:junit4]   1>    at org.apache.lucene.util.TestRuleMarkFailure$1.evaluate(TestRuleMarkFailure.java:48)
> [junit4:junit4]   1>    at com.carrotsearch.randomizedtesting.RandomizedRunner.runSingleTest(RandomizedRunner.java:825)
> [junit4:junit4]   1>    at com.carrotsearch.randomizedtesting.RandomizedRunner.access$700(RandomizedRunner.java:132)
> [junit4:junit4]   1>    at com.carrotsearch.randomizedtesting.RandomizedRunner$3$1.run(RandomizedRunner.java:671)
> [junit4:junit4]   1>    at com.carrotsearch.randomizedtesting.RandomizedRunner$3.evaluate(RandomizedRunner.java:697)
> [junit4:junit4]   1>    at com.carrotsearch.randomizedtesting.RandomizedRunner$4.evaluate(RandomizedRunner.java:736)
> [junit4:junit4]   1>    at com.carrotsearch.randomizedtesting.RandomizedRunner$5.evaluate(RandomizedRunner.java:747)
> [junit4:junit4]   1>    at org.apache.lucene.util.AbstractBeforeAfterRule$1.evaluate(AbstractBeforeAfterRule.java:45)
> [junit4:junit4]   1>    at org.apache.lucene.util.TestRuleReportUncaughtExceptions$1.evaluate(TestRuleReportUncaughtExceptions.java:68)
> [junit4:junit4]   1>    at org.apache.lucene.util.TestRuleStoreClassName$1.evaluate(TestRuleStoreClassName.java:38)
> [junit4:junit4]   1>    at org.apache.lucene.util.TestRuleIcuHack$1.evaluate(TestRuleIcuHack.java:51)
> [junit4:junit4]   1>    at com.carrotsearch.randomizedtesting.rules.SystemPropertiesInvariantRule$1.evaluate(SystemPropertiesInvariantRule.java:55)
> [junit4:junit4]   1>    at org.apache.lucene.util.TestRuleNoInstanceHooksOverrides$1.evaluate(TestRuleNoInstanceHooksOverrides.java:53)
> [junit4:junit4]   1>    at org.apache.lucene.util.TestRuleNoStaticHooksShadowing$1.evaluate(TestRuleNoStaticHooksShadowing.java:52)
> [junit4:junit4]   1>    at org.apache.lucene.util.TestRuleAssertionsRequired$1.evaluate(TestRuleAssertionsRequired.java:36)
> [junit4:junit4]   1>    at org.apache.lucene.util.TestRuleMarkFailure$1.evaluate(TestRuleMarkFailure.java:48)
> [junit4:junit4]   1>    at org.apache.lucene.util.TestRuleIgnoreAfterMaxFailures$1.evaluate(TestRuleIgnoreAfterMaxFailures.java:70)
> [junit4:junit4]   1>    at org.apache.lucene.util.TestRuleIgnoreTestSuites$1.evaluate(TestRuleIgnoreTestSuites.java:55)
> [junit4:junit4]   1>    at com.carrotsearch.randomizedtesting.RandomizedRunner.runSuite(RandomizedRunner.java:605)
> [junit4:junit4]   1>    at com.carrotsearch.randomizedtesting.RandomizedRunner.access$400(RandomizedRunner.java:132)
> [junit4:junit4]   1>    at com.carrotsearch.randomizedtesting.RandomizedRunner$2.run(RandomizedRunner.java:551)
> [junit4:junit4]   1>
> [junit4:junit4]   1>   13 of 14: name=_9 docCount=32
> [junit4:junit4]   1>     codec=Lucene40
> [junit4:junit4]   1>     compound=true
> [junit4:junit4]   1>     numFiles=3
> [junit4:junit4]   1>     size (MB)=0.01
> [junit4:junit4]   1>     diagnostics = {os=Linux, os.version=3.2.0-26-generic, source=flush, lucene.version=4.0-SNAPSHOT, os.arch=amd64, java.version=1.7.0_04, java.vendor=Oracle Corporation}
> [junit4:junit4]   1>     has deletions [delGen=-1]
> [junit4:junit4]   1>     test: open reader.........OK
> [junit4:junit4]   1>     test: fields..............OK [1 fields]
> [junit4:junit4]   1>     test: field norms.........OK [1 fields]
> [junit4:junit4]   1>     test: terms, freq, prox...OK [113 terms; 124 terms/docs pairs; 144 tokens]
> [junit4:junit4]   1>     test: stored fields.......OK [0 total field count; avg 0 fields per doc]
> [junit4:junit4]   1>     test: term vectors........ERROR [term [73 73]: doc 0: pos -1: startOffset 2 < lastStartOffset 3]
> [junit4:junit4]   1> java.lang.RuntimeException: term [73 73]: doc 0: pos -1: startOffset 2 < lastStartOffset 3
> [junit4:junit4]   1>    at org.apache.lucene.index.CheckIndex.checkFields(CheckIndex.java:872)
> [junit4:junit4]   1>    at org.apache.lucene.index.CheckIndex.testTermVectors(CheckIndex.java:1420)
> [junit4:junit4]   1>    at org.apache.lucene.index.CheckIndex.checkIndex(CheckIndex.java:574)
> [junit4:junit4]   1>    at org.apache.lucene.util._TestUtil.checkIndex(_TestUtil.java:192)
> [junit4:junit4]   1>    at org.apache.lucene.store.MockDirectoryWrapper.close(MockDirectoryWrapper.java:587)
> [junit4:junit4]   1>    at org.apache.lucene.util.IOUtils.close(IOUtils.java:144)
> [junit4:junit4]   1>    at org.apache.lucene.analysis.BaseTokenStreamTestCase.checkRandomData(BaseTokenStreamTestCase.java:469)
> [junit4:junit4]   1>    at org.apache.lucene.analysis.core.TestRandomChains.testRandomChains(TestRandomChains.java:860)
> [junit4:junit4]   1>    at sun.reflect.NativeMethodAccessorImpl.invoke0(Native Method)
> [junit4:junit4]   1>    at sun.reflect.NativeMethodAccessorImpl.invoke(NativeMethodAccessorImpl.java:57)
> [junit4:junit4]   1>    at sun.reflect.DelegatingMethodAccessorImpl.invoke(DelegatingMethodAccessorImpl.java:43)
> [junit4:junit4]   1>    at java.lang.reflect.Method.invoke(Method.java:601)
> [junit4:junit4]   1>    at com.carrotsearch.randomizedtesting.RandomizedRunner.invoke(RandomizedRunner.java:1995)
> [junit4:junit4]   1>    at com.carrotsearch.randomizedtesting.RandomizedRunner.access$1100(RandomizedRunner.java:132)
> [junit4:junit4]   1>    at com.carrotsearch.randomizedtesting.RandomizedRunner$6.evaluate(RandomizedRunner.java:818)
> [junit4:junit4]   1>    at com.carrotsearch.randomizedtesting.RandomizedRunner$7.evaluate(RandomizedRunner.java:877)
> [junit4:junit4]   1>    at com.carrotsearch.randomizedtesting.RandomizedRunner$8.evaluate(RandomizedRunner.java:891)
> [junit4:junit4]   1>    at org.apache.lucene.util.TestRuleSetupTeardownChained$1.evaluate(TestRuleSetupTeardownChained.java:50)
> [junit4:junit4]   1>    at org.apache.lucene.util.TestRuleFieldCacheSanity$1.evaluate(TestRuleFieldCacheSanity.java:32)
> [junit4:junit4]   1>    at org.apache.lucene.util.AbstractBeforeAfterRule$1.evaluate(AbstractBeforeAfterRule.java:45)
> [junit4:junit4]   1>    at com.carrotsearch.randomizedtesting.rules.SystemPropertiesInvariantRule$1.evaluate(SystemPropertiesInvariantRule.java:55)
> [junit4:junit4]   1>    at org.apache.lucene.util.TestRuleReportUncaughtExceptions$1.evaluate(TestRuleReportUncaughtExceptions.java:68)
> [junit4:junit4]   1>    at org.apache.lucene.util.TestRuleThreadAndTestName$1.evaluate(TestRuleThreadAndTestName.java:48)
> [junit4:junit4]   1>    at org.apache.lucene.util.TestRuleIgnoreAfterMaxFailures$1.evaluate(TestRuleIgnoreAfterMaxFailures.java:70)
> [junit4:junit4]   1>    at org.apache.lucene.util.TestRuleMarkFailure$1.evaluate(TestRuleMarkFailure.java:48)
> [junit4:junit4]   1>    at com.carrotsearch.randomizedtesting.RandomizedRunner.runSingleTest(RandomizedRunner.java:825)
> [junit4:junit4]   1>    at com.carrotsearch.randomizedtesting.RandomizedRunner.access$700(RandomizedRunner.java:132)
> [junit4:junit4]   1>    at com.carrotsearch.randomizedtesting.RandomizedRunner$3$1.run(RandomizedRunner.java:671)
> [junit4:junit4]   1>    at com.carrotsearch.randomizedtesting.RandomizedRunner$3.evaluate(RandomizedRunner.java:697)
> [junit4:junit4]   1>    at com.carrotsearch.randomizedtesting.RandomizedRunner$4.evaluate(RandomizedRunner.java:736)
> [junit4:junit4]   1>    at com.carrotsearch.randomizedtesting.RandomizedRunner$5.evaluate(RandomizedRunner.java:747)
> [junit4:junit4]   1>    at org.apache.lucene.util.AbstractBeforeAfterRule$1.evaluate(AbstractBeforeAfterRule.java:45)
> [junit4:junit4]   1>    at org.apache.lucene.util.TestRuleReportUncaughtExceptions$1.evaluate(TestRuleReportUncaughtExceptions.java:68)
> [junit4:junit4]   1>    at org.apache.lucene.util.TestRuleStoreClassName$1.evaluate(TestRuleStoreClassName.java:38)
> [junit4:junit4]   1>    at org.apache.lucene.util.TestRuleIcuHack$1.evaluate(TestRuleIcuHack.java:51)
> [junit4:junit4]   1>    at com.carrotsearch.randomizedtesting.rules.SystemPropertiesInvariantRule$1.evaluate(SystemPropertiesInvariantRule.java:55)
> [junit4:junit4]   1>    at org.apache.lucene.util.TestRuleNoInstanceHooksOverrides$1.evaluate(TestRuleNoInstanceHooksOverrides.java:53)
> [junit4:junit4]   1>    at org.apache.lucene.util.TestRuleNoStaticHooksShadowing$1.evaluate(TestRuleNoStaticHooksShadowing.java:52)
> [junit4:junit4]   1>    at org.apache.lucene.util.TestRuleAssertionsRequired$1.evaluate(TestRuleAssertionsRequired.java:36)
> [junit4:junit4]   1>    at org.apache.lucene.util.TestRuleMarkFailure$1.evaluate(TestRuleMarkFailure.java:48)
> [junit4:junit4]   1>    at org.apache.lucene.util.TestRuleIgnoreAfterMaxFailures$1.evaluate(TestRuleIgnoreAfterMaxFailures.java:70)
> [junit4:junit4]   1>    at org.apache.lucene.util.TestRuleIgnoreTestSuites$1.evaluate(TestRuleIgnoreTestSuites.java:55)
> [junit4:junit4]   1>    at com.carrotsearch.randomizedtesting.RandomizedRunner.runSuite(RandomizedRunner.java:605)
> [junit4:junit4]   1>    at com.carrotsearch.randomizedtesting.RandomizedRunner.access$400(RandomizedRunner.java:132)
> [junit4:junit4]   1>    at com.carrotsearch.randomizedtesting.RandomizedRunner$2.run(RandomizedRunner.java:551)
> [junit4:junit4]   1>     test: DocValues........OK [0 total doc Count; Num DocValues Fields 0
> [junit4:junit4]   1> FAILED
> [junit4:junit4]   1>     WARNING: fixIndex() would remove reference to this segment; full exception:
> [junit4:junit4]   1> java.lang.RuntimeException: Term Vector test failed
> [junit4:junit4]   1>    at org.apache.lucene.index.CheckIndex.checkIndex(CheckIndex.java:587)
> [junit4:junit4]   1>    at org.apache.lucene.util._TestUtil.checkIndex(_TestUtil.java:192)
> [junit4:junit4]   1>    at org.apache.lucene.store.MockDirectoryWrapper.close(MockDirectoryWrapper.java:587)
> [junit4:junit4]   1>    at org.apache.lucene.util.IOUtils.close(IOUtils.java:144)
> [junit4:junit4]   1>    at org.apache.lucene.analysis.BaseTokenStreamTestCase.checkRandomData(BaseTokenStreamTestCase.java:469)
> [junit4:junit4]   1>    at org.apache.lucene.analysis.core.TestRandomChains.testRandomChains(TestRandomChains.java:860)
> [junit4:junit4]   1>    at sun.reflect.NativeMethodAccessorImpl.invoke0(Native Method)
> [junit4:junit4]   1>    at sun.reflect.NativeMethodAccessorImpl.invoke(NativeMethodAccessorImpl.java:57)
> [junit4:junit4]   1>    at sun.reflect.DelegatingMethodAccessorImpl.invoke(DelegatingMethodAccessorImpl.java:43)
> [junit4:junit4]   1>    at java.lang.reflect.Method.invoke(Method.java:601)
> [junit4:junit4]   1>    at com.carrotsearch.randomizedtesting.RandomizedRunner.invoke(RandomizedRunner.java:1995)
> [junit4:junit4]   1>    at com.carrotsearch.randomizedtesting.RandomizedRunner.access$1100(RandomizedRunner.java:132)
> [junit4:junit4]   1>    at com.carrotsearch.randomizedtesting.RandomizedRunner$6.evaluate(RandomizedRunner.java:818)
> [junit4:junit4]   1>    at com.carrotsearch.randomizedtesting.RandomizedRunner$7.evaluate(RandomizedRunner.java:877)
> [junit4:junit4]   1>    at com.carrotsearch.randomizedtesting.RandomizedRunner$8.evaluate(RandomizedRunner.java:891)
> [junit4:junit4]   1>    at org.apache.lucene.util.TestRuleSetupTeardownChained$1.evaluate(TestRuleSetupTeardownChained.java:50)
> [junit4:junit4]   1>    at org.apache.lucene.util.TestRuleFieldCacheSanity$1.evaluate(TestRuleFieldCacheSanity.java:32)
> [junit4:junit4]   1>    at org.apache.lucene.util.AbstractBeforeAfterRule$1.evaluate(AbstractBeforeAfterRule.java:45)
> [junit4:junit4]   1>    at com.carrotsearch.randomizedtesting.rules.SystemPropertiesInvariantRule$1.evaluate(SystemPropertiesInvariantRule.java:55)
> [junit4:junit4]   1>    at org.apache.lucene.util.TestRuleReportUncaughtExceptions$1.evaluate(TestRuleReportUncaughtExceptions.java:68)
> [junit4:junit4]   1>    at org.apache.lucene.util.TestRuleThreadAndTestName$1.evaluate(TestRuleThreadAndTestName.java:48)
> [junit4:junit4]   1>    at org.apache.lucene.util.TestRuleIgnoreAfterMaxFailures$1.evaluate(TestRuleIgnoreAfterMaxFailures.java:70)
> [junit4:junit4]   1>    at org.apache.lucene.util.TestRuleMarkFailure$1.evaluate(TestRuleMarkFailure.java:48)
> [junit4:junit4]   1>    at com.carrotsearch.randomizedtesting.RandomizedRunner.runSingleTest(RandomizedRunner.java:825)
> [junit4:junit4]   1>    at com.carrotsearch.randomizedtesting.RandomizedRunner.access$700(RandomizedRunner.java:132)
> [junit4:junit4]   1>    at com.carrotsearch.randomizedtesting.RandomizedRunner$3$1.run(RandomizedRunner.java:671)
> [junit4:junit4]   1>    at com.carrotsearch.randomizedtesting.RandomizedRunner$3.evaluate(RandomizedRunner.java:697)
> [junit4:junit4]   1>    at com.carrotsearch.randomizedtesting.RandomizedRunner$4.evaluate(RandomizedRunner.java:736)
> [junit4:junit4]   1>    at com.carrotsearch.randomizedtesting.RandomizedRunner$5.evaluate(RandomizedRunner.java:747)
> [junit4:junit4]   1>    at org.apache.lucene.util.AbstractBeforeAfterRule$1.evaluate(AbstractBeforeAfterRule.java:45)
> [junit4:junit4]   1>    at org.apache.lucene.util.TestRuleReportUncaughtExceptions$1.evaluate(TestRuleReportUncaughtExceptions.java:68)
> [junit4:junit4]   1>    at org.apache.lucene.util.TestRuleStoreClassName$1.evaluate(TestRuleStoreClassName.java:38)
> [junit4:junit4]   1>    at org.apache.lucene.util.TestRuleIcuHack$1.evaluate(TestRuleIcuHack.java:51)
> [junit4:junit4]   1>    at com.carrotsearch.randomizedtesting.rules.SystemPropertiesInvariantRule$1.evaluate(SystemPropertiesInvariantRule.java:55)
> [junit4:junit4]   1>    at org.apache.lucene.util.TestRuleNoInstanceHooksOverrides$1.evaluate(TestRuleNoInstanceHooksOverrides.java:53)
> [junit4:junit4]   1>    at org.apache.lucene.util.TestRuleNoStaticHooksShadowing$1.evaluate(TestRuleNoStaticHooksShadowing.java:52)
> [junit4:junit4]   1>    at org.apache.lucene.util.TestRuleAssertionsRequired$1.evaluate(TestRuleAssertionsRequired.java:36)
> [junit4:junit4]   1>    at org.apache.lucene.util.TestRuleMarkFailure$1.evaluate(TestRuleMarkFailure.java:48)
> [junit4:junit4]   1>    at org.apache.lucene.util.TestRuleIgnoreAfterMaxFailures$1.evaluate(TestRuleIgnoreAfterMaxFailures.java:70)
> [junit4:junit4]   1>    at org.apache.lucene.util.TestRuleIgnoreTestSuites$1.evaluate(TestRuleIgnoreTestSuites.java:55)
> [junit4:junit4]   1>    at com.carrotsearch.randomizedtesting.RandomizedRunner.runSuite(RandomizedRunner.java:605)
> [junit4:junit4]   1>    at com.carrotsearch.randomizedtesting.RandomizedRunner.access$400(RandomizedRunner.java:132)
> [junit4:junit4]   1>    at com.carrotsearch.randomizedtesting.RandomizedRunner$2.run(RandomizedRunner.java:551)
> [junit4:junit4]   1>
> [junit4:junit4]   1>   14 of 14: name=_a docCount=29
> [junit4:junit4]   1>     codec=Lucene40
> [junit4:junit4]   1>     compound=true
> [junit4:junit4]   1>     numFiles=3
> [junit4:junit4]   1>     size (MB)=0.011
> [junit4:junit4]   1>     diagnostics = {os=Linux, os.version=3.2.0-26-generic, source=flush, lucene.version=4.0-SNAPSHOT, os.arch=amd64, java.version=1.7.0_04, java.vendor=Oracle Corporation}
> [junit4:junit4]   1>     has deletions [delGen=-1]
> [junit4:junit4]   1>     test: open reader.........OK
> [junit4:junit4]   1>     test: fields..............OK [1 fields]
> [junit4:junit4]   1>     test: field norms.........OK [1 fields]
> [junit4:junit4]   1>     test: terms, freq, prox...OK [135 terms; 174 terms/docs pairs; 218 tokens]
> [junit4:junit4]   1>     test: stored fields.......OK [0 total field count; avg 0 fields per doc]
> [junit4:junit4]   1>     test: term vectors........ERROR [term [73 73]: doc 0: pos -1: startOffset 2 < lastStartOffset 3]
> [junit4:junit4]   1> java.lang.RuntimeException: term [73 73]: doc 0: pos -1: startOffset 2 < lastStartOffset 3
> [junit4:junit4]   1>    at org.apache.lucene.index.CheckIndex.checkFields(CheckIndex.java:872)
> [junit4:junit4]   1>    at org.apache.lucene.index.CheckIndex.testTermVectors(CheckIndex.java:1420)
> [junit4:junit4]   1>    at org.apache.lucene.index.CheckIndex.checkIndex(CheckIndex.java:574)
> [junit4:junit4]   1>    at org.apache.lucene.util._TestUtil.checkIndex(_TestUtil.java:192)
> [junit4:junit4]   1>    at org.apache.lucene.store.MockDirectoryWrapper.close(MockDirectoryWrapper.java:587)
> [junit4:junit4]   1>    at org.apache.lucene.util.IOUtils.close(IOUtils.java:144)
> [junit4:junit4]   1>    at org.apache.lucene.analysis.BaseTokenStreamTestCase.checkRandomData(BaseTokenStreamTestCase.java:469)
> [junit4:junit4]   1>    at org.apache.lucene.analysis.core.TestRandomChains.testRandomChains(TestRandomChains.java:860)
> [junit4:junit4]   1>    at sun.reflect.NativeMethodAccessorImpl.invoke0(Native Method)
> [junit4:junit4]   1>    at sun.reflect.NativeMethodAccessorImpl.invoke(NativeMethodAccessorImpl.java:57)
> [junit4:junit4]   1>    at sun.reflect.DelegatingMethodAccessorImpl.invoke(DelegatingMethodAccessorImpl.java:43)
> [junit4:junit4]   1>    at java.lang.reflect.Method.invoke(Method.java:601)
> [junit4:junit4]   1>    at com.carrotsearch.randomizedtesting.RandomizedRunner.invoke(RandomizedRunner.java:1995)
> [junit4:junit4]   1>    at com.carrotsearch.randomizedtesting.RandomizedRunner.access$1100(RandomizedRunner.java:132)
> [junit4:junit4]   1>    at com.carrotsearch.randomizedtesting.RandomizedRunner$6.evaluate(RandomizedRunner.java:818)
> [junit4:junit4]   1>    at com.carrotsearch.randomizedtesting.RandomizedRunner$7.evaluate(RandomizedRunner.java:877)
> [junit4:junit4]   1>    at com.carrotsearch.randomizedtesting.RandomizedRunner$8.evaluate(RandomizedRunner.java:891)
> [junit4:junit4]   1>    at org.apache.lucene.util.TestRuleSetupTeardownChained$1.evaluate(TestRuleSetupTeardownChained.java:50)
> [junit4:junit4]   1>    at org.apache.lucene.util.TestRuleFieldCacheSanity$1.evaluate(TestRuleFieldCacheSanity.java:32)
> [junit4:junit4]   1>    at org.apache.lucene.util.AbstractBeforeAfterRule$1.evaluate(AbstractBeforeAfterRule.java:45)
> [junit4:junit4]   1>    at com.carrotsearch.randomizedtesting.rules.SystemPropertiesInvariantRule$1.evaluate(SystemPropertiesInvariantRule.java:55)
> [junit4:junit4]   1>    at org.apache.lucene.util.TestRuleReportUncaughtExceptions$1.evaluate(TestRuleReportUncaughtExceptions.java:68)
> [junit4:junit4]   1>    at org.apache.lucene.util.TestRuleThreadAndTestName$1.evaluate(TestRuleThreadAndTestName.java:48)
> [junit4:junit4]   1>    at org.apache.lucene.util.TestRuleIgnoreAfterMaxFailures$1.evaluate(TestRuleIgnoreAfterMaxFailures.java:70)
> [junit4:junit4]   1>    at org.apache.lucene.util.TestRuleMarkFailure$1.evaluate(TestRuleMarkFailure.java:48)
> [junit4:junit4]   1>    at com.carrotsearch.randomizedtesting.RandomizedRunner.runSingleTest(RandomizedRunner.java:825)
> [junit4:junit4]   1>    at com.carrotsearch.randomizedtesting.RandomizedRunner.access$700(RandomizedRunner.java:132)
> [junit4:junit4]   1>    at com.carrotsearch.randomizedtesting.RandomizedRunner$3$1.run(RandomizedRunner.java:671)
> [junit4:junit4]   1>    at com.carrotsearch.randomizedtesting.RandomizedRunner$3.evaluate(RandomizedRunner.java:697)
> [junit4:junit4]   1>    at com.carrotsearch.randomizedtesting.RandomizedRunner$4.evaluate(RandomizedRunner.java:736)
> [junit4:junit4]   1>    at com.carrotsearch.randomizedtesting.RandomizedRunner$5.evaluate(RandomizedRunner.java:747)
> [junit4:junit4]   1>    at org.apache.lucene.util.AbstractBeforeAfterRule$1.evaluate(AbstractBeforeAfterRule.java:45)
> [junit4:junit4]   1>    at org.apache.lucene.util.TestRuleReportUncaughtExceptions$1.evaluate(TestRuleReportUncaughtExceptions.java:68)
> [junit4:junit4]   1>    at org.apache.lucene.util.TestRuleStoreClassName$1.evaluate(TestRuleStoreClassName.java:38)
> [junit4:junit4]   1>    at org.apache.lucene.util.TestRuleIcuHack$1.evaluate(TestRuleIcuHack.java:51)
> [junit4:junit4]   1>    at com.carrotsearch.randomizedtesting.rules.SystemPropertiesInvariantRule$1.evaluate(SystemPropertiesInvariantRule.java:55)
> [junit4:junit4]   1>    at org.apache.lucene.util.TestRuleNoInstanceHooksOverrides$1.evaluate(TestRuleNoInstanceHooksOverrides.java:53)
> [junit4:junit4]   1>    at org.apache.lucene.util.TestRuleNoStaticHooksShadowing$1.evaluate(TestRuleNoStaticHooksShadowing.java:52)
> [junit4:junit4]   1>    at org.apache.lucene.util.TestRuleAssertionsRequired$1.evaluate(TestRuleAssertionsRequired.java:36)
> [junit4:junit4]   1>    at org.apache.lucene.util.TestRuleMarkFailure$1.evaluate(TestRuleMarkFailure.java:48)
> [junit4:junit4]   1>    at org.apache.lucene.util.TestRuleIgnoreAfterMaxFailures$1.evaluate(TestRuleIgnoreAfterMaxFailures.java:70)
> [junit4:junit4]   1>    at org.apache.lucene.util.TestRuleIgnoreTestSuites$1.evaluate(TestRuleIgnoreTestSuites.java:55)
> [junit4:junit4]   1>    at com.carrotsearch.randomizedtesting.RandomizedRunner.runSuite(RandomizedRunner.java:605)
> [junit4:junit4]   1>    at com.carrotsearch.randomizedtesting.RandomizedRunner.access$400(RandomizedRunner.java:132)
> [junit4:junit4]   1>    at com.carrotsearch.randomizedtesting.RandomizedRunner$2.run(RandomizedRunner.java:551)
> [junit4:junit4]   1>     test: DocValues........OK [0 total doc Count; Num DocValues Fields 0
> [junit4:junit4]   1> FAILED
> [junit4:junit4]   1>     WARNING: fixIndex() would remove reference to this segment; full exception:
> [junit4:junit4]   1> java.lang.RuntimeException: Term Vector test failed
> [junit4:junit4]   1>    at org.apache.lucene.index.CheckIndex.checkIndex(CheckIndex.java:587)
> [junit4:junit4]   1>    at org.apache.lucene.util._TestUtil.checkIndex(_TestUtil.java:192)
> [junit4:junit4]   1>    at org.apache.lucene.store.MockDirectoryWrapper.close(MockDirectoryWrapper.java:587)
> [junit4:junit4]   1>    at org.apache.lucene.util.IOUtils.close(IOUtils.java:144)
> [junit4:junit4]   1>    at org.apache.lucene.analysis.BaseTokenStreamTestCase.checkRandomData(BaseTokenStreamTestCase.java:469)
> [junit4:junit4]   1>    at org.apache.lucene.analysis.core.TestRandomChains.testRandomChains(TestRandomChains.java:860)
> [junit4:junit4]   1>    at sun.reflect.NativeMethodAccessorImpl.invoke0(Native Method)
> [junit4:junit4]   1>    at sun.reflect.NativeMethodAccessorImpl.invoke(NativeMethodAccessorImpl.java:57)
> [junit4:junit4]   1>    at sun.reflect.DelegatingMethodAccessorImpl.invoke(DelegatingMethodAccessorImpl.java:43)
> [junit4:junit4]   1>    at java.lang.reflect.Method.invoke(Method.java:601)
> [junit4:junit4]   1>    at com.carrotsearch.randomizedtesting.RandomizedRunner.invoke(RandomizedRunner.java:1995)
> [junit4:junit4]   1>    at com.carrotsearch.randomizedtesting.RandomizedRunner.access$1100(RandomizedRunner.java:132)
> [junit4:junit4]   1>    at com.carrotsearch.randomizedtesting.RandomizedRunner$6.evaluate(RandomizedRunner.java:818)
> [junit4:junit4]   1>    at com.carrotsearch.randomizedtesting.RandomizedRunner$7.evaluate(RandomizedRunner.java:877)
> [junit4:junit4]   1>    at com.carrotsearch.randomizedtesting.RandomizedRunner$8.evaluate(RandomizedRunner.java:891)
> [junit4:junit4]   1>    at org.apache.lucene.util.TestRuleSetupTeardownChained$1.evaluate(TestRuleSetupTeardownChained.java:50)
> [junit4:junit4]   1>    at org.apache.lucene.util.TestRuleFieldCacheSanity$1.evaluate(TestRuleFieldCacheSanity.java:32)
> [junit4:junit4]   1>    at org.apache.lucene.util.AbstractBeforeAfterRule$1.evaluate(AbstractBeforeAfterRule.java:45)
> [junit4:junit4]   1>    at com.carrotsearch.randomizedtesting.rules.SystemPropertiesInvariantRule$1.evaluate(SystemPropertiesInvariantRule.java:55)
> [junit4:junit4]   1>    at org.apache.lucene.util.TestRuleReportUncaughtExceptions$1.evaluate(TestRuleReportUncaughtExceptions.java:68)
> [junit4:junit4]   1>    at org.apache.lucene.util.TestRuleThreadAndTestName$1.evaluate(TestRuleThreadAndTestName.java:48)
> [junit4:junit4]   1>    at org.apache.lucene.util.TestRuleIgnoreAfterMaxFailures$1.evaluate(TestRuleIgnoreAfterMaxFailures.java:70)
> [junit4:junit4]   1>    at org.apache.lucene.util.TestRuleMarkFailure$1.evaluate(TestRuleMarkFailure.java:48)
> [junit4:junit4]   1>    at com.carrotsearch.randomizedtesting.RandomizedRunner.runSingleTest(RandomizedRunner.java:825)
> [junit4:junit4]   1>    at com.carrotsearch.randomizedtesting.RandomizedRunner.access$700(RandomizedRunner.java:132)
> [junit4:junit4]   1>    at com.carrotsearch.randomizedtesting.RandomizedRunner$3$1.run(RandomizedRunner.java:671)
> [junit4:junit4]   1>    at com.carrotsearch.randomizedtesting.RandomizedRunner$3.evaluate(RandomizedRunner.java:697)
> [junit4:junit4]   1>    at com.carrotsearch.randomizedtesting.RandomizedRunner$4.evaluate(RandomizedRunner.java:736)
> [junit4:junit4]   1>    at com.carrotsearch.randomizedtesting.RandomizedRunner$5.evaluate(RandomizedRunner.java:747)
> [junit4:junit4]   1>    at org.apache.lucene.util.AbstractBeforeAfterRule$1.evaluate(AbstractBeforeAfterRule.java:45)
> [junit4:junit4]   1>    at org.apache.lucene.util.TestRuleReportUncaughtExceptions$1.evaluate(TestRuleReportUncaughtExceptions.java:68)
> [junit4:junit4]   1>    at org.apache.lucene.util.TestRuleStoreClassName$1.evaluate(TestRuleStoreClassName.java:38)
> [junit4:junit4]   1>    at org.apache.lucene.util.TestRuleIcuHack$1.evaluate(TestRuleIcuHack.java:51)
> [junit4:junit4]   1>    at com.carrotsearch.randomizedtesting.rules.SystemPropertiesInvariantRule$1.evaluate(SystemPropertiesInvariantRule.java:55)
> [junit4:junit4]   1>    at org.apache.lucene.util.TestRuleNoInstanceHooksOverrides$1.evaluate(TestRuleNoInstanceHooksOverrides.java:53)
> [junit4:junit4]   1>    at org.apache.lucene.util.TestRuleNoStaticHooksShadowing$1.evaluate(TestRuleNoStaticHooksShadowing.java:52)
> [junit4:junit4]   1>    at org.apache.lucene.util.TestRuleAssertionsRequired$1.evaluate(TestRuleAssertionsRequired.java:36)
> [junit4:junit4]   1>    at org.apache.lucene.util.TestRuleMarkFailure$1.evaluate(TestRuleMarkFailure.java:48)
> [junit4:junit4]   1>    at org.apache.lucene.util.TestRuleIgnoreAfterMaxFailures$1.evaluate(TestRuleIgnoreAfterMaxFailures.java:70)
> [junit4:junit4]   1>    at org.apache.lucene.util.TestRuleIgnoreTestSuites$1.evaluate(TestRuleIgnoreTestSuites.java:55)
> [junit4:junit4]   1>    at com.carrotsearch.randomizedtesting.RandomizedRunner.runSuite(RandomizedRunner.java:605)
> [junit4:junit4]   1>    at com.carrotsearch.randomizedtesting.RandomizedRunner.access$400(RandomizedRunner.java:132)
> [junit4:junit4]   1>    at com.carrotsearch.randomizedtesting.RandomizedRunner$2.run(RandomizedRunner.java:551)
> [junit4:junit4]   1>
> [junit4:junit4]   1> WARNING: 9 broken segments (containing 525 documents) detected
> [junit4:junit4]   1>
> [junit4:junit4]   2> Exception from random analyzer:
> [junit4:junit4]   2> charfilters=
> [junit4:junit4]   2> tokenizer=
> [junit4:junit4]   2>   org.apache.lucene.analysis.pattern.PatternTokenizer(org.apache.lucene.analysis.core.TestRandomChains$CheckThatYouDidntReadAnythingReaderWrapper@60cdee08, a, -70)
> [junit4:junit4]   2> filters=
> [junit4:junit4]   2>   org.apache.lucene.analysis.shingle.ShingleFilter(org.apache.lucene.analysis.ValidatingTokenFilter@37caea, <HIRAGANA>)
> [junit4:junit4]   2>   org.apache.lucene.analysis.miscellaneous.LengthFilter(true, org.apache.lucene.analysis.ValidatingTokenFilter@37caea, -47, 72)
> [junit4:junit4]   2>   org.apache.lucene.analysis.cjk.CJKBigramFilter(org.apache.lucene.analysis.ValidatingTokenFilter@37caea)
> [junit4:junit4]   2> offsetsAreCorrect=false
> [junit4:junit4]   2> NOTE: reproduce with: ant test  -Dtestcase=TestRandomChains -Dtests.method=testRandomChains -Dtests.seed=29948CE66F6BB97A -Dtests.multiplier=3 -Dtests.slow=true -Dtests.locale=sr_CS -Dtests.timezone=Etc/Universal -Dtests.file.encoding=ISO-8859-1
> [junit4:junit4]   1>
> [junit4:junit4]   2>
> [junit4:junit4]    > (@AfterClass output)
> [junit4:junit4]   2> NOTE: test params are: codec=Lucene40: {dummy=Lucene40(minBlockSize=70 maxBlockSize=191)}, sim=RandomSimilarityProvider(queryNorm=false,coord=true): {dummy=DFR I(ne)B2}, locale=sr_CS, timezone=Etc/Universal
> [junit4:junit4]   2> NOTE: Linux 3.2.0-26-generic amd64/Oracle Corporation 1.7.0_04 (64-bit)/cpus=8,threads=1,free=69646560,total=330301440
> [junit4:junit4]   2> NOTE: All tests run in this JVM: [TestIndonesianAnalyzer, TestAnalyzers, TestPersianNormalizationFilter, TokenRangeSinkTokenizerTest, TestSnowballVocab, TestSwedishLightStemFilter, HunspellDictionaryTest, TestIndicNormalizer, TestSingleTokenTokenFilter, TestBulgarianAnalyzer, TestHungarianLightStemFilter, TestSpanishLightStemFilter, TestPortugueseAnalyzer, TestStopFilter, TestPortugueseLightStemFilter, TestReversePathHierarchyTokenizer, TestStandardAnalyzer, TestArabicStemFilter, TestRandomChains]
> [junit4:junit4]   2>
> [junit4:junit4] Completed on J0 in 6.97s, 1 test, 1 error <<< FAILURES!
>
> [...truncated 355 lines...]
> BUILD FAILED
> /mnt/ssd/jenkins/workspace/Lucene-Solr-4.x-Linux-Java7-64/checkout/build.xml:29: The following error occurred while executing this line:
> /mnt/ssd/jenkins/workspace/Lucene-Solr-4.x-Linux-Java7-64/checkout/lucene/build.xml:508: The following error occurred while executing this line:
> /mnt/ssd/jenkins/workspace/Lucene-Solr-4.x-Linux-Java7-64/checkout/lucene/common-build.xml:1495: The following error occurred while executing this line:
> /mnt/ssd/jenkins/workspace/Lucene-Solr-4.x-Linux-Java7-64/checkout/lucene/analysis/build.xml:101: The following error occurred while executing this line:
> /mnt/ssd/jenkins/workspace/Lucene-Solr-4.x-Linux-Java7-64/checkout/lucene/analysis/build.xml:38: The following error occurred while executing this line:
> /mnt/ssd/jenkins/workspace/Lucene-Solr-4.x-Linux-Java7-64/checkout/lucene/module-build.xml:62: The following error occurred while executing this line:
> /mnt/ssd/jenkins/workspace/Lucene-Solr-4.x-Linux-Java7-64/checkout/lucene/common-build.xml:1093: The following error occurred while executing this line:
> /mnt/ssd/jenkins/workspace/Lucene-Solr-4.x-Linux-Java7-64/checkout/lucene/common-build.xml:788: There were test failures: 145 suites, 950 tests, 1 error, 1 ignored
>
> Total time: 8 minutes 20 seconds
> Build step 'Execute shell' marked build as failure
> Archiving artifacts
> Recording test results
> Email was triggered for: Failure
> Sending email for trigger: Failure
>
>
>
>
>
> ---------------------------------------------------------------------
> To unsubscribe, e-mail: dev-unsubscribe@lucene.apache.org
> For additional commands, e-mail: dev-help@lucene.apache.org



-- 
lucidimagination.com

---------------------------------------------------------------------
To unsubscribe, e-mail: dev-unsubscribe@lucene.apache.org
For additional commands, e-mail: dev-help@lucene.apache.org


Mime
View raw message