lucene-dev mailing list archives

Site index · List index
Message view « Date » · « Thread »
Top « Date » · « Thread »
From Robert Muir <rcm...@gmail.com>
Subject Re: [JENKINS] Lucene-Solr-4.x-Linux-JRockit6-64 - Build # 1 - Failure!
Date Sun, 29 Jul 2012 16:20:56 GMT
this is a jvm bug.

the test is correct: IndexWriter detects and throws IAE here.

with this broken jvm, it does not (so it passes thru to freqprox and
only then hits an assertion error)

On Sun, Jul 29, 2012 at 12:15 PM, Policeman Jenkins Server
<jenkins@sd-datasolutions.de> wrote:
> Build: http://jenkins.sd-datasolutions.de/job/Lucene-Solr-4.x-Linux-JRockit6-64/1/
>
> 1 tests failed.
> FAILED:  org.apache.lucene.index.TestPostingsOffsets.testBackwardsOffsets
>
> Error Message:
>
>
> Stack Trace:
> java.lang.AssertionError
>         at __randomizedtesting.SeedInfo.seed([82B056EC580022BD:F7A0BEABEDE653C0]:0)
>         at org.apache.lucene.index.FreqProxTermsWriterPerField.writeOffsets(FreqProxTermsWriterPerField.java:157)
>         at org.apache.lucene.index.FreqProxTermsWriterPerField.addTerm(FreqProxTermsWriterPerField.java:241)
>         at org.apache.lucene.index.TermsHashPerField.add(TermsHashPerField.java:235)
>         at org.apache.lucene.index.DocInverterPerField.processFields(DocInverterPerField.java:167)
>         at org.apache.lucene.index.DocFieldProcessor.processDocument(DocFieldProcessor.java:305)
>         at org.apache.lucene.index.DocumentsWriterPerThread.updateDocument(DocumentsWriterPerThread.java:243)
>         at org.apache.lucene.index.DocumentsWriter.updateDocument(DocumentsWriter.java:375)
>         at org.apache.lucene.index.IndexWriter.updateDocument(IndexWriter.java:1359)
>         at org.apache.lucene.index.IndexWriter.addDocument(IndexWriter.java:1110)
>         at org.apache.lucene.index.RandomIndexWriter.addDocument(RandomIndexWriter.java:186)
>         at org.apache.lucene.index.RandomIndexWriter.addDocument(RandomIndexWriter.java:146)
>         at org.apache.lucene.index.TestPostingsOffsets.checkTokens(TestPostingsOffsets.java:490)
>         at org.apache.lucene.index.TestPostingsOffsets.testBackwardsOffsets(TestPostingsOffsets.java:435)
>         at sun.reflect.NativeMethodAccessorImpl.invoke0(Native Method)
>         at sun.reflect.NativeMethodAccessorImpl.invoke(NativeMethodAccessorImpl.java:39)
>         at sun.reflect.DelegatingMethodAccessorImpl.invoke(DelegatingMethodAccessorImpl.java:25)
>         at java.lang.reflect.Method.invoke(Method.java:597)
>         at com.carrotsearch.randomizedtesting.RandomizedRunner.invoke(RandomizedRunner.java:1995)
>         at com.carrotsearch.randomizedtesting.RandomizedRunner.access$1100(RandomizedRunner.java:132)
>         at com.carrotsearch.randomizedtesting.RandomizedRunner$6.evaluate(RandomizedRunner.java:819)
>         at com.carrotsearch.randomizedtesting.RandomizedRunner$7.evaluate(RandomizedRunner.java:878)
>         at com.carrotsearch.randomizedtesting.RandomizedRunner$8.evaluate(RandomizedRunner.java:891)
>         at org.apache.lucene.util.TestRuleSetupTeardownChained$1.evaluate(TestRuleSetupTeardownChained.java:50)
>         at org.apache.lucene.util.TestRuleFieldCacheSanity$1.evaluate(TestRuleFieldCacheSanity.java:32)
>         at org.apache.lucene.util.AbstractBeforeAfterRule$1.evaluate(AbstractBeforeAfterRule.java:45)
>         at com.carrotsearch.randomizedtesting.rules.SystemPropertiesInvariantRule$1.evaluate(SystemPropertiesInvariantRule.java:55)
>         at org.apache.lucene.util.TestRuleReportUncaughtExceptions$1.evaluate(TestRuleReportUncaughtExceptions.java:68)
>         at org.apache.lucene.util.TestRuleThreadAndTestName$1.evaluate(TestRuleThreadAndTestName.java:48)
>         at org.apache.lucene.util.TestRuleIgnoreAfterMaxFailures$1.evaluate(TestRuleIgnoreAfterMaxFailures.java:70)
>         at org.apache.lucene.util.TestRuleMarkFailure$1.evaluate(TestRuleMarkFailure.java:48)
>         at com.carrotsearch.randomizedtesting.RandomizedRunner.runSingleTest(RandomizedRunner.java:825)
>         at com.carrotsearch.randomizedtesting.RandomizedRunner.access$700(RandomizedRunner.java:132)
>         at com.carrotsearch.randomizedtesting.RandomizedRunner$3$1.run(RandomizedRunner.java:671)
>         at com.carrotsearch.randomizedtesting.RandomizedRunner$3.evaluate(RandomizedRunner.java:697)
>         at com.carrotsearch.randomizedtesting.RandomizedRunner$4.evaluate(RandomizedRunner.java:737)
>         at com.carrotsearch.randomizedtesting.RandomizedRunner$5.evaluate(RandomizedRunner.java:747)
>         at org.apache.lucene.util.AbstractBeforeAfterRule$1.evaluate(AbstractBeforeAfterRule.java:45)
>         at org.apache.lucene.util.TestRuleReportUncaughtExceptions$1.evaluate(TestRuleReportUncaughtExceptions.java:68)
>         at org.apache.lucene.util.TestRuleStoreClassName$1.evaluate(TestRuleStoreClassName.java:38)
>         at com.carrotsearch.randomizedtesting.rules.SystemPropertiesInvariantRule$1.evaluate(SystemPropertiesInvariantRule.java:55)
>         at org.apache.lucene.util.TestRuleNoInstanceHooksOverrides$1.evaluate(TestRuleNoInstanceHooksOverrides.java:54)
>         at org.apache.lucene.util.TestRuleNoStaticHooksShadowing$1.evaluate(TestRuleNoStaticHooksShadowing.java:53)
>         at org.apache.lucene.util.TestRuleAssertionsRequired$1.evaluate(TestRuleAssertionsRequired.java:37)
>         at org.apache.lucene.util.TestRuleMarkFailure$1.evaluate(TestRuleMarkFailure.java:48)
>         at org.apache.lucene.util.TestRuleIgnoreAfterMaxFailures$1.evaluate(TestRuleIgnoreAfterMaxFailures.java:70)
>         at org.apache.lucene.util.TestRuleIgnoreTestSuites$1.evaluate(TestRuleIgnoreTestSuites.java:56)
>         at com.carrotsearch.randomizedtesting.RandomizedRunner.runSuite(RandomizedRunner.java:605)
>         at com.carrotsearch.randomizedtesting.RandomizedRunner.access$400(RandomizedRunner.java:132)
>         at com.carrotsearch.randomizedtesting.RandomizedRunner$2.run(RandomizedRunner.java:551)
>
>
>
>
> Build Log:
> [...truncated 7782 lines...]
> [junit4:junit4] Suite: org.apache.lucene.index.TestPostingsOffsets
> [junit4:junit4] FAILURE 0.02s J1 | TestPostingsOffsets.testBackwardsOffsets
> [junit4:junit4]    > Throwable #1: java.lang.AssertionError
> [junit4:junit4]    >    at __randomizedtesting.SeedInfo.seed([82B056EC580022BD:F7A0BEABEDE653C0]:0)
> [junit4:junit4]    >    at org.apache.lucene.index.FreqProxTermsWriterPerField.writeOffsets(FreqProxTermsWriterPerField.java:157)
> [junit4:junit4]    >    at org.apache.lucene.index.FreqProxTermsWriterPerField.addTerm(FreqProxTermsWriterPerField.java:241)
> [junit4:junit4]    >    at org.apache.lucene.index.TermsHashPerField.add(TermsHashPerField.java:235)
> [junit4:junit4]    >    at org.apache.lucene.index.DocInverterPerField.processFields(DocInverterPerField.java:167)
> [junit4:junit4]    >    at org.apache.lucene.index.DocFieldProcessor.processDocument(DocFieldProcessor.java:305)
> [junit4:junit4]    >    at org.apache.lucene.index.DocumentsWriterPerThread.updateDocument(DocumentsWriterPerThread.java:243)
> [junit4:junit4]    >    at org.apache.lucene.index.DocumentsWriter.updateDocument(DocumentsWriter.java:375)
> [junit4:junit4]    >    at org.apache.lucene.index.IndexWriter.updateDocument(IndexWriter.java:1359)
> [junit4:junit4]    >    at org.apache.lucene.index.IndexWriter.addDocument(IndexWriter.java:1110)
> [junit4:junit4]    >    at org.apache.lucene.index.RandomIndexWriter.addDocument(RandomIndexWriter.java:186)
> [junit4:junit4]    >    at org.apache.lucene.index.RandomIndexWriter.addDocument(RandomIndexWriter.java:146)
> [junit4:junit4]    >    at org.apache.lucene.index.TestPostingsOffsets.checkTokens(TestPostingsOffsets.java:490)
> [junit4:junit4]    >    at org.apache.lucene.index.TestPostingsOffsets.testBackwardsOffsets(TestPostingsOffsets.java:435)
> [junit4:junit4]    >    at sun.reflect.NativeMethodAccessorImpl.invoke0(Native Method)
> [junit4:junit4]    >    at sun.reflect.NativeMethodAccessorImpl.invoke(NativeMethodAccessorImpl.java:39)
> [junit4:junit4]    >    at sun.reflect.DelegatingMethodAccessorImpl.invoke(DelegatingMethodAccessorImpl.java:25)
> [junit4:junit4]    >    at java.lang.reflect.Method.invoke(Method.java:597)
> [junit4:junit4]    >    at com.carrotsearch.randomizedtesting.RandomizedRunner.invoke(RandomizedRunner.java:1995)
> [junit4:junit4]    >    at com.carrotsearch.randomizedtesting.RandomizedRunner.access$1100(RandomizedRunner.java:132)
> [junit4:junit4]    >    at com.carrotsearch.randomizedtesting.RandomizedRunner$6.evaluate(RandomizedRunner.java:819)
> [junit4:junit4]    >    at com.carrotsearch.randomizedtesting.RandomizedRunner$7.evaluate(RandomizedRunner.java:878)
> [junit4:junit4]    >    at com.carrotsearch.randomizedtesting.RandomizedRunner$8.evaluate(RandomizedRunner.java:891)
> [junit4:junit4]    >    at org.apache.lucene.util.TestRuleSetupTeardownChained$1.evaluate(TestRuleSetupTeardownChained.java:50)
> [junit4:junit4]    >    at org.apache.lucene.util.TestRuleFieldCacheSanity$1.evaluate(TestRuleFieldCacheSanity.java:32)
> [junit4:junit4]    >    at org.apache.lucene.util.AbstractBeforeAfterRule$1.evaluate(AbstractBeforeAfterRule.java:45)
> [junit4:junit4]    >    at com.carrotsearch.randomizedtesting.rules.SystemPropertiesInvariantRule$1.evaluate(SystemPropertiesInvariantRule.java:55)
> [junit4:junit4]    >    at org.apache.lucene.util.TestRuleReportUncaughtExceptions$1.evaluate(TestRuleReportUncaughtExceptions.java:68)
> [junit4:junit4]    >    at org.apache.lucene.util.TestRuleThreadAndTestName$1.evaluate(TestRuleThreadAndTestName.java:48)
> [junit4:junit4]    >    at org.apache.lucene.util.TestRuleIgnoreAfterMaxFailures$1.evaluate(TestRuleIgnoreAfterMaxFailures.java:70)
> [junit4:junit4]    >    at org.apache.lucene.util.TestRuleMarkFailure$1.evaluate(TestRuleMarkFailure.java:48)
> [junit4:junit4]    >    at com.carrotsearch.randomizedtesting.RandomizedRunner.runSingleTest(RandomizedRunner.java:825)
> [junit4:junit4]    >    at com.carrotsearch.randomizedtesting.RandomizedRunner.access$700(RandomizedRunner.java:132)
> [junit4:junit4]    >    at com.carrotsearch.randomizedtesting.RandomizedRunner$3$1.run(RandomizedRunner.java:671)
> [junit4:junit4]    >    at com.carrotsearch.randomizedtesting.RandomizedRunner$3.evaluate(RandomizedRunner.java:697)
> [junit4:junit4]    >    at com.carrotsearch.randomizedtesting.RandomizedRunner$4.evaluate(RandomizedRunner.java:737)
> [junit4:junit4]    >    at com.carrotsearch.randomizedtesting.RandomizedRunner$5.evaluate(RandomizedRunner.java:747)
> [junit4:junit4]    >    at org.apache.lucene.util.AbstractBeforeAfterRule$1.evaluate(AbstractBeforeAfterRule.java:45)
> [junit4:junit4]    >    at org.apache.lucene.util.TestRuleReportUncaughtExceptions$1.evaluate(TestRuleReportUncaughtExceptions.java:68)
> [junit4:junit4]    >    at org.apache.lucene.util.TestRuleStoreClassName$1.evaluate(TestRuleStoreClassName.java:38)
> [junit4:junit4]    >    at com.carrotsearch.randomizedtesting.rules.SystemPropertiesInvariantRule$1.evaluate(SystemPropertiesInvariantRule.java:55)
> [junit4:junit4]    >    at org.apache.lucene.util.TestRuleNoInstanceHooksOverrides$1.evaluate(TestRuleNoInstanceHooksOverrides.java:54)
> [junit4:junit4]    >    at org.apache.lucene.util.TestRuleNoStaticHooksShadowing$1.evaluate(TestRuleNoStaticHooksShadowing.java:53)
> [junit4:junit4]    >    at org.apache.lucene.util.TestRuleAssertionsRequired$1.evaluate(TestRuleAssertionsRequired.java:37)
> [junit4:junit4]    >    at org.apache.lucene.util.TestRuleMarkFailure$1.evaluate(TestRuleMarkFailure.java:48)
> [junit4:junit4]    >    at org.apache.lucene.util.TestRuleIgnoreAfterMaxFailures$1.evaluate(TestRuleIgnoreAfterMaxFailures.java:70)
> [junit4:junit4]    >    at org.apache.lucene.util.TestRuleIgnoreTestSuites$1.evaluate(TestRuleIgnoreTestSuites.java:56)
> [junit4:junit4]    >    at com.carrotsearch.randomizedtesting.RandomizedRunner.runSuite(RandomizedRunner.java:605)
> [junit4:junit4]    >    at com.carrotsearch.randomizedtesting.RandomizedRunner.access$400(RandomizedRunner.java:132)
> [junit4:junit4]    >    at com.carrotsearch.randomizedtesting.RandomizedRunner$2.run(RandomizedRunner.java:551)
> [junit4:junit4]    >
> [junit4:junit4]   2> NOTE: reproduce with: ant test  -Dtestcase=TestPostingsOffsets
-Dtests.method=testBackwardsOffsets -Dtests.seed=82B056EC580022BD -Dtests.multiplier=3 -Dtests.slow=true
-Dtests.locale=bg_BG -Dtests.timezone=America/Halifax -Dtests.file.encoding=UTF-8
> [junit4:junit4]   2>
> [junit4:junit4]    > (@AfterClass output)
> [junit4:junit4]   2> NOTE: test params are: codec=Lucene40: {oddeven=Pulsing40(freqCutoff=19
minBlockSize=15 maxBlockSize=101), id=Pulsing40(freqCutoff=19 minBlockSize=15 maxBlockSize=101),
content=PostingsFormat(name=Memory doPackFST= false), body=Pulsing40(freqCutoff=4 minBlockSize=15
maxBlockSize=101), numbers=Pulsing40(freqCutoff=4 minBlockSize=15 maxBlockSize=101), content3=Pulsing40(freqCutoff=4
minBlockSize=15 maxBlockSize=101), foo=Pulsing40(freqCutoff=4 minBlockSize=15 maxBlockSize=101)},
sim=RandomSimilarityProvider(queryNorm=false,coord=false): {oddeven=IB LL-LZ(0.3), content=IB
LL-DZ(0.3), body=DFR I(ne)2, numbers=DFR G1, content3=DFR I(F)2, foo=DFR I(ne)2}, locale=bg_BG,
timezone=America/Halifax
> [junit4:junit4]   2> NOTE: Linux 3.2.0-27-generic amd64/Oracle Corporation 1.6.0_33
(64-bit)/cpus=8,threads=1,free=140718808,total=388567040
> [junit4:junit4]   2> NOTE: All tests run in this JVM: [TestDocTermOrds, TestCachingWrapperFilter,
TestSimilarityBase, TestIdentityHashSet, TestVirtualMethod, TestBinaryDocument, TestTwoPhaseCommitTool,
TestWildcard, TestConsistentFieldNumbers, TestFieldsReader, TestNumericRangeQuery64, TestBooleanOr,
TestIndexWriterUnicode, TestImpersonation, TestSimpleSearchEquivalence, TestBooleanMinShouldMatch,
TestDocumentsWriterStallControl, TestForceMergeForever, TestCloseableThreadLocal, TestPrefixFilter,
TestSentinelIntSet, TestHugeRamFile, TestLock, TestRegexpRandom2, TestTermsEnum, TestTermRangeFilter,
TestSimilarity, TestDocValuesTypeCompatibility, TestIndexInput, TestFSTs, TestPerSegmentDeletes,
TestMultiThreadTermVectors, TestExplanations, TestSegmentTermDocs, Nested1, Nested2, Nested3,
TestIndexWriterMerging, TestToken, TestPhrasePrefixQuery, TestRamUsageEstimator, TestCrash,
TestMultiTermQueryRewrites, TestIOUtils, TestDocIdSet, TestComplexExplanationsOfNonMatches,
TestDocument, TestQueryWrapperFilter, TestSpanMultiTermQueryWrapper, TestPerFieldPostingsFormat,
TestNeverDelete, TestSimpleAttributeImpl, TestForTooMuchCloning, TestDirectoryReader, TestSubScorerFreqs,
TestNorms, TestSegmentMerger, Test10KPulsings, TestDateTools, TestBytesRefHash, TestIndexWriterMergePolicy,
TestMatchAllDocsQuery, TestRamUsageEstimatorOnWildAnimals, TestBinaryTerms, TestMultiLevelSkipList,
TestAutomatonQuery, TestLookaheadTokenFilter, TestUTF32ToUTF8, TestSearchWithThreads, Test2BPostings,
TestSimpleExplanations, TestThreadedForceMerge, TestPayloadExplanations, TestSegmentTermEnum,
TestFieldValueFilter, TestCharTermAttributeImpl, TestConcurrentMergeScheduler, TestTermVectorsWriter,
TestSimilarity2, TestGraphTokenizers, TestIndexWriterExceptions, TestSearcherManager, TestBasics,
TestDuelingCodecs, TestOpenBitSet, TestMinimize, TestPersistentSnapshotDeletionPolicy, TestBackwardsCompatibility,
TestNRTManager, TestSort, TestArrayUtil, TestIndexWriterDelete, TestCompoundFile, TestCustomNorms,
TestStressIndexing, TestSnapshotDeletionPolicy, TestMockAnalyzer, TestDeterminizeLexicon,
TestRollingCharBuffer, TestNRTReaderWithThreads, TestDocValuesIndexing, TestSloppyPhraseQuery2,
TestStressNRT, TestLockFactory, TestFieldCacheRewriteMethod, TestComplexExplanations, TestCrashCausesCorruptIndex,
TestStressAdvance, TestRAMDirectory, TestDocValues, TestLevenshteinAutomata, TestMultiValuedNumericRangeQuery,
TestDeterminism, TestTransactions, TestPostingsOffsets]
> [junit4:junit4]   2>
> [junit4:junit4] Completed on J1 in 7.43s, 11 tests, 1 failure <<< FAILURES!
>
> [...truncated 319 lines...]
> BUILD FAILED
> /mnt/ssd/jenkins/workspace/Lucene-Solr-4.x-Linux-JRockit6-64/checkout/build.xml:29: The
following error occurred while executing this line:
> /mnt/ssd/jenkins/workspace/Lucene-Solr-4.x-Linux-JRockit6-64/checkout/lucene/build.xml:50:
The following error occurred while executing this line:
> /mnt/ssd/jenkins/workspace/Lucene-Solr-4.x-Linux-JRockit6-64/checkout/lucene/common-build.xml:1095:
The following error occurred while executing this line:
> /mnt/ssd/jenkins/workspace/Lucene-Solr-4.x-Linux-JRockit6-64/checkout/lucene/common-build.xml:790:
There were test failures: 309 suites, 1734 tests, 1 failure, 13 ignored (11 assumptions)
>
> Total time: 11 minutes 8 seconds
> Build step 'Execute shell' marked build as failure
> Archiving artifacts
> Recording test results
> Email was triggered for: Failure
> Sending email for trigger: Failure
>
>
>
>
>
> ---------------------------------------------------------------------
> To unsubscribe, e-mail: dev-unsubscribe@lucene.apache.org
> For additional commands, e-mail: dev-help@lucene.apache.org



-- 
lucidimagination.com

---------------------------------------------------------------------
To unsubscribe, e-mail: dev-unsubscribe@lucene.apache.org
For additional commands, e-mail: dev-help@lucene.apache.org


Mime
View raw message