lucene-dev mailing list archives

Site index · List index
Message view « Date » · « Thread »
Top « Date » · « Thread »
From Robert Muir <rcm...@gmail.com>
Subject Re: [JENKINS] Lucene-Solr-tests-only-4.x-java7 - Build # 204 - Failure
Date Fri, 27 Jul 2012 10:28:35 GMT
This test is broken for locales other than 'en' !

On Fri, Jul 27, 2012 at 1:13 AM, Apache Jenkins Server
<jenkins@builds.apache.org> wrote:
> Build: https://builds.apache.org/job/Lucene-Solr-tests-only-4.x-java7/204/
>
> 1 tests failed.
> FAILED:  org.apache.solr.core.CoreContainerCoreInitFailuresTest.testFlowBadFromStart
>
> Error Message:
> reload exception doesn't mention bad prolog: El contenido no está permitido en el prólogo.
>
> Stack Trace:
> java.lang.AssertionError: reload exception doesn't mention bad prolog: El contenido no
está permitido en el prólogo.
>         at __randomizedtesting.SeedInfo.seed([769CD3367D6B0633:EC6618CE99948837]:0)
>         at org.junit.Assert.fail(Assert.java:93)
>         at org.junit.Assert.assertTrue(Assert.java:43)
>         at org.apache.solr.core.CoreContainerCoreInitFailuresTest.testFlowBadFromStart(CoreContainerCoreInitFailuresTest.java:255)
>         at sun.reflect.NativeMethodAccessorImpl.invoke0(Native Method)
>         at sun.reflect.NativeMethodAccessorImpl.invoke(NativeMethodAccessorImpl.java:57)
>         at sun.reflect.DelegatingMethodAccessorImpl.invoke(DelegatingMethodAccessorImpl.java:43)
>         at java.lang.reflect.Method.invoke(Method.java:601)
>         at com.carrotsearch.randomizedtesting.RandomizedRunner.invoke(RandomizedRunner.java:1995)
>         at com.carrotsearch.randomizedtesting.RandomizedRunner.access$1100(RandomizedRunner.java:132)
>         at com.carrotsearch.randomizedtesting.RandomizedRunner$6.evaluate(RandomizedRunner.java:818)
>         at com.carrotsearch.randomizedtesting.RandomizedRunner$7.evaluate(RandomizedRunner.java:877)
>         at com.carrotsearch.randomizedtesting.RandomizedRunner$8.evaluate(RandomizedRunner.java:891)
>         at com.carrotsearch.randomizedtesting.rules.SystemPropertiesRestoreRule$1.evaluate(SystemPropertiesRestoreRule.java:53)
>         at org.apache.lucene.util.TestRuleSetupTeardownChained$1.evaluate(TestRuleSetupTeardownChained.java:50)
>         at org.apache.lucene.util.TestRuleFieldCacheSanity$1.evaluate(TestRuleFieldCacheSanity.java:32)
>         at org.apache.lucene.util.AbstractBeforeAfterRule$1.evaluate(AbstractBeforeAfterRule.java:45)
>         at com.carrotsearch.randomizedtesting.rules.SystemPropertiesInvariantRule$1.evaluate(SystemPropertiesInvariantRule.java:55)
>         at org.apache.lucene.util.TestRuleReportUncaughtExceptions$1.evaluate(TestRuleReportUncaughtExceptions.java:68)
>         at org.apache.lucene.util.TestRuleThreadAndTestName$1.evaluate(TestRuleThreadAndTestName.java:48)
>         at org.apache.lucene.util.TestRuleIgnoreAfterMaxFailures$1.evaluate(TestRuleIgnoreAfterMaxFailures.java:70)
>         at org.apache.lucene.util.TestRuleMarkFailure$1.evaluate(TestRuleMarkFailure.java:48)
>         at com.carrotsearch.randomizedtesting.RandomizedRunner.runSingleTest(RandomizedRunner.java:825)
>         at com.carrotsearch.randomizedtesting.RandomizedRunner.access$700(RandomizedRunner.java:132)
>         at com.carrotsearch.randomizedtesting.RandomizedRunner$3$1.run(RandomizedRunner.java:671)
>         at com.carrotsearch.randomizedtesting.RandomizedRunner$3.evaluate(RandomizedRunner.java:697)
>         at com.carrotsearch.randomizedtesting.RandomizedRunner$4.evaluate(RandomizedRunner.java:736)
>         at com.carrotsearch.randomizedtesting.RandomizedRunner$5.evaluate(RandomizedRunner.java:747)
>         at com.carrotsearch.randomizedtesting.rules.SystemPropertiesRestoreRule$1.evaluate(SystemPropertiesRestoreRule.java:53)
>         at org.apache.lucene.util.AbstractBeforeAfterRule$1.evaluate(AbstractBeforeAfterRule.java:45)
>         at org.apache.lucene.util.TestRuleReportUncaughtExceptions$1.evaluate(TestRuleReportUncaughtExceptions.java:68)
>         at org.apache.lucene.util.TestRuleStoreClassName$1.evaluate(TestRuleStoreClassName.java:38)
>         at org.apache.lucene.util.TestRuleIcuHack$1.evaluate(TestRuleIcuHack.java:51)
>         at com.carrotsearch.randomizedtesting.rules.SystemPropertiesInvariantRule$1.evaluate(SystemPropertiesInvariantRule.java:55)
>         at org.apache.lucene.util.TestRuleNoInstanceHooksOverrides$1.evaluate(TestRuleNoInstanceHooksOverrides.java:53)
>         at org.apache.lucene.util.TestRuleNoStaticHooksShadowing$1.evaluate(TestRuleNoStaticHooksShadowing.java:52)
>         at org.apache.lucene.util.TestRuleAssertionsRequired$1.evaluate(TestRuleAssertionsRequired.java:36)
>         at org.apache.lucene.util.TestRuleMarkFailure$1.evaluate(TestRuleMarkFailure.java:48)
>         at org.apache.lucene.util.TestRuleIgnoreAfterMaxFailures$1.evaluate(TestRuleIgnoreAfterMaxFailures.java:70)
>         at org.apache.lucene.util.TestRuleIgnoreTestSuites$1.evaluate(TestRuleIgnoreTestSuites.java:55)
>         at com.carrotsearch.randomizedtesting.RandomizedRunner.runSuite(RandomizedRunner.java:605)
>         at com.carrotsearch.randomizedtesting.RandomizedRunner.access$400(RandomizedRunner.java:132)
>         at com.carrotsearch.randomizedtesting.RandomizedRunner$2.run(RandomizedRunner.java:551)
>
>
>
>
> Build Log:
> [...truncated 10770 lines...]
> [junit4:junit4]   2> 47 T5539 oasc.CoreContainer.<init> New CoreContainer 685998348
> [junit4:junit4]   2> 54 T5539 oasc.CoreContainer.load Loading CoreContainer using
Solr Home: '/usr/home/hudson/hudson-slave/workspace/Lucene-Solr-tests-only-4.x-java7/checkout/solr/build/solr-core/test/J0/./org.apache.solr.core.CoreContainerCoreInitFailuresTest_bad_flow'
> [junit4:junit4]   2> 54 T5539 oasc.SolrResourceLoader.<init> new SolrResourceLoader
for directory: '/usr/home/hudson/hudson-slave/workspace/Lucene-Solr-tests-only-4.x-java7/checkout/solr/build/solr-core/test/J0/./org.apache.solr.core.CoreContainerCoreInitFailuresTest_bad_flow/'
> [junit4:junit4]   2> 72 T5539 oasc.CoreContainer.load Registering Log Listener
> [junit4:junit4]   2> 94 T5539 oasc.CoreContainer.create Creating SolrCore 'col_ok'
using instanceDir: /usr/home/hudson/hudson-slave/workspace/Lucene-Solr-tests-only-4.x-java7/checkout/solr/build/solr-core/test/J0/./org.apache.solr.core.CoreContainerCoreInitFailuresTest_bad_flow/col_ok
> [junit4:junit4]   2> 95 T5539 oasc.SolrResourceLoader.<init> new SolrResourceLoader
for directory: '/usr/home/hudson/hudson-slave/workspace/Lucene-Solr-tests-only-4.x-java7/checkout/solr/build/solr-core/test/J0/./org.apache.solr.core.CoreContainerCoreInitFailuresTest_bad_flow/col_ok/'
> [junit4:junit4]   2> 134 T5539 oasc.SolrConfig.<init> Using Lucene MatchVersion:
LUCENE_40
> [junit4:junit4]   2> 194 T5539 oasc.SolrConfig.<init> Loaded SolrConfig: solrconfig.xml
> [junit4:junit4]   2> 194 T5539 oass.IndexSchema.readSchema Reading Solr Schema
> [junit4:junit4]   2> 198 T5539 oass.IndexSchema.readSchema Schema name=minimal
> [junit4:junit4]   2> 214 T5539 oass.IndexSchema.readSchema WARNING no uniqueKey specified
in schema.
> [junit4:junit4]   2> 216 T5539 oasc.SolrCore.<init> [col_ok] Opening new SolrCore
at /usr/home/hudson/hudson-slave/workspace/Lucene-Solr-tests-only-4.x-java7/checkout/solr/build/solr-core/test/J0/./org.apache.solr.core.CoreContainerCoreInitFailuresTest_bad_flow/col_ok/,
dataDir=/usr/home/hudson/hudson-slave/workspace/Lucene-Solr-tests-only-4.x-java7/checkout/solr/build/solr-core/test/J0/./org.apache.solr.core.CoreContainerCoreInitFailuresTest_bad_flow/col_ok/data/
> [junit4:junit4]   2> 216 T5539 oasc.SolrCore.<init> JMX monitoring not detected
for core: col_ok
> [junit4:junit4]   2> 217 T5539 oasc.SolrCore.getNewIndexDir WARNING New index directory
detected: old=null new=/usr/home/hudson/hudson-slave/workspace/Lucene-Solr-tests-only-4.x-java7/checkout/solr/build/solr-core/test/J0/./org.apache.solr.core.CoreContainerCoreInitFailuresTest_bad_flow/col_ok/data/index/
> [junit4:junit4]   2> 218 T5539 oasc.SolrCore.initIndex WARNING [col_ok] Solr index
directory '/usr/home/hudson/hudson-slave/workspace/Lucene-Solr-tests-only-4.x-java7/checkout/solr/build/solr-core/test/J0/./org.apache.solr.core.CoreContainerCoreInitFailuresTest_bad_flow/col_ok/data/index'
doesn't exist. Creating new index...
> [junit4:junit4]   2> 220 T5539 oasc.SolrDeletionPolicy.onCommit SolrDeletionPolicy.onCommit:
commits:num=1
> [junit4:junit4]   2>            commit{dir=MockDirWrapper(org.apache.lucene.store.RAMDirectory@6ed599a5
lockFactory=org.apache.lucene.store.NativeFSLockFactory@a6739b0),segFN=segments_1,generation=1,filenames=[segments_1]
> [junit4:junit4]   2> 221 T5539 oasc.SolrDeletionPolicy.updateCommits newest commit
= 1
> [junit4:junit4]   2> 222 T5539 oasc.RequestHandlers.initHandlersFromConfig created
standard: solr.StandardRequestHandler
> [junit4:junit4]   2> 225 T5539 oass.SolrIndexSearcher.<init> Opening Searcher@c6c662d
main
> [junit4:junit4]   2> 226 T5539 oass.SolrIndexSearcher.getIndexDir WARNING WARNING:
Directory impl does not support setting indexDir: org.apache.lucene.store.MockDirectoryWrapper
> [junit4:junit4]   2> 226 T5539 oasu.CommitTracker.<init> Hard AutoCommit: disabled
> [junit4:junit4]   2> 226 T5539 oasu.CommitTracker.<init> Soft AutoCommit: disabled
> [junit4:junit4]   2> 227 T5539 oashc.HttpShardHandlerFactory.getParameter Setting
socketTimeout to: 0
> [junit4:junit4]   2> 227 T5539 oashc.HttpShardHandlerFactory.getParameter Setting
urlScheme to: http://
> [junit4:junit4]   2> 228 T5539 oashc.HttpShardHandlerFactory.getParameter Setting
connTimeout to: 0
> [junit4:junit4]   2> 228 T5539 oashc.HttpShardHandlerFactory.getParameter Setting
maxConnectionsPerHost to: 20
> [junit4:junit4]   2> 228 T5539 oashc.HttpShardHandlerFactory.getParameter Setting
corePoolSize to: 0
> [junit4:junit4]   2> 228 T5539 oashc.HttpShardHandlerFactory.getParameter Setting
maximumPoolSize to: 2147483647
> [junit4:junit4]   2> 229 T5539 oashc.HttpShardHandlerFactory.getParameter Setting
maxThreadIdleTime to: 5
> [junit4:junit4]   2> 229 T5539 oashc.HttpShardHandlerFactory.getParameter Setting
sizeOfQueue to: -1
> [junit4:junit4]   2> 229 T5539 oashc.HttpShardHandlerFactory.getParameter Setting
fairnessPolicy to: false
> [junit4:junit4]   2> 230 T5539 oascsi.HttpClientUtil.createClient Creating new http
client, config:maxConnectionsPerHost=20&maxConnections=10000&socketTimeout=0&connTimeout=0&retry=false
> [junit4:junit4]   2> 241 T5540 oasc.SolrCore.registerSearcher [col_ok] Registered
new searcher Searcher@c6c662d main{StandardDirectoryReader(segments_1:1)}
> [junit4:junit4]   2> 241 T5539 oasc.CoreContainer.register registering core: col_ok
> [junit4:junit4]   2> 243 T5539 oasc.CoreContainer.create Creating SolrCore 'col_bad'
using instanceDir: /usr/home/hudson/hudson-slave/workspace/Lucene-Solr-tests-only-4.x-java7/checkout/solr/build/solr-core/test/J0/./org.apache.solr.core.CoreContainerCoreInitFailuresTest_bad_flow/col_bad
> [junit4:junit4]   2> 243 T5539 oasc.SolrResourceLoader.<init> new SolrResourceLoader
for directory: '/usr/home/hudson/hudson-slave/workspace/Lucene-Solr-tests-only-4.x-java7/checkout/solr/build/solr-core/test/J0/./org.apache.solr.core.CoreContainerCoreInitFailuresTest_bad_flow/col_bad/'
> [junit4:junit4]   2> 282 T5539 oasc.SolrConfig.<init> Using Lucene MatchVersion:
LUCENE_40
> [junit4:junit4]   2> 343 T5539 oasc.SolrConfig.<init> Loaded SolrConfig: solrconfig.xml
> [junit4:junit4]   2> 343 T5539 oass.IndexSchema.readSchema Reading Solr Schema
> [junit4:junit4]   2> 347 T5539 oass.IndexSchema.readSchema Schema name=minimal
> [junit4:junit4]   2> 363 T5539 oass.IndexSchema.readSchema WARNING no uniqueKey specified
in schema.
> [junit4:junit4]   2> 365 T5539 oasc.SolrCore.<init> [col_bad] Opening new SolrCore
at /usr/home/hudson/hudson-slave/workspace/Lucene-Solr-tests-only-4.x-java7/checkout/solr/build/solr-core/test/J0/./org.apache.solr.core.CoreContainerCoreInitFailuresTest_bad_flow/col_bad/,
dataDir=/usr/home/hudson/hudson-slave/workspace/Lucene-Solr-tests-only-4.x-java7/checkout/solr/build/solr-core/test/J0/./org.apache.solr.core.CoreContainerCoreInitFailuresTest_bad_flow/col_bad/data/
> [junit4:junit4]   2> 365 T5539 oasc.SolrCore.<init> JMX monitoring not detected
for core: col_bad
> [junit4:junit4]   2> 366 T5539 oasc.SolrCore.getNewIndexDir WARNING New index directory
detected: old=null new=/usr/home/hudson/hudson-slave/workspace/Lucene-Solr-tests-only-4.x-java7/checkout/solr/build/solr-core/test/J0/./org.apache.solr.core.CoreContainerCoreInitFailuresTest_bad_flow/col_bad/data/index/
> [junit4:junit4]   2> 367 T5539 oasc.SolrCore.initIndex WARNING [col_bad] Solr index
directory '/usr/home/hudson/hudson-slave/workspace/Lucene-Solr-tests-only-4.x-java7/checkout/solr/build/solr-core/test/J0/./org.apache.solr.core.CoreContainerCoreInitFailuresTest_bad_flow/col_bad/data/index'
doesn't exist. Creating new index...
> [junit4:junit4]   2> 371 T5539 oasc.SolrException.log Ignoring exception matching
\QDummyMergePolicy\E
> [junit4:junit4]   2> 373 T5539 oasc.CoreContainer.create Creating SolrCore 'col_bad'
using instanceDir: /usr/home/hudson/hudson-slave/workspace/Lucene-Solr-tests-only-4.x-java7/checkout/solr/build/solr-core/test/J0/./org.apache.solr.core.CoreContainerCoreInitFailuresTest_bad_flow/col_bad
> [junit4:junit4]   2> 373 T5539 oasc.SolrResourceLoader.<init> new SolrResourceLoader
for directory: '/usr/home/hudson/hudson-slave/workspace/Lucene-Solr-tests-only-4.x-java7/checkout/solr/build/solr-core/test/J0/./org.apache.solr.core.CoreContainerCoreInitFailuresTest_bad_flow/col_bad/'
> [junit4:junit4]   2> 412 T5539 oasc.SolrConfig.<init> Using Lucene MatchVersion:
LUCENE_40
> [junit4:junit4]   2> 472 T5539 oasc.SolrConfig.<init> Loaded SolrConfig: solrconfig.xml
> [junit4:junit4]   2> 473 T5539 oass.IndexSchema.readSchema Reading Solr Schema
> [junit4:junit4]   2> 477 T5539 oass.IndexSchema.readSchema Schema name=minimal
> [junit4:junit4]   2> 493 T5539 oass.IndexSchema.readSchema WARNING no uniqueKey specified
in schema.
> [junit4:junit4]   2> 495 T5539 oasc.SolrCore.<init> [col_bad] Opening new SolrCore
at /usr/home/hudson/hudson-slave/workspace/Lucene-Solr-tests-only-4.x-java7/checkout/solr/build/solr-core/test/J0/./org.apache.solr.core.CoreContainerCoreInitFailuresTest_bad_flow/col_bad/,
dataDir=/usr/home/hudson/hudson-slave/workspace/Lucene-Solr-tests-only-4.x-java7/checkout/solr/build/solr-core/test/J0/./org.apache.solr.core.CoreContainerCoreInitFailuresTest_bad_flow/col_bad/data/
> [junit4:junit4]   2> 495 T5539 oasc.SolrCore.<init> JMX monitoring not detected
for core: col_bad
> [junit4:junit4]   2> 495 T5539 oasc.SolrCore.getNewIndexDir WARNING New index directory
detected: old=null new=/usr/home/hudson/hudson-slave/workspace/Lucene-Solr-tests-only-4.x-java7/checkout/solr/build/solr-core/test/J0/./org.apache.solr.core.CoreContainerCoreInitFailuresTest_bad_flow/col_bad/data/index/
> [junit4:junit4]   2> 496 T5539 oasc.SolrCore.initIndex WARNING [col_bad] Solr index
directory '/usr/home/hudson/hudson-slave/workspace/Lucene-Solr-tests-only-4.x-java7/checkout/solr/build/solr-core/test/J0/./org.apache.solr.core.CoreContainerCoreInitFailuresTest_bad_flow/col_bad/data/index'
doesn't exist. Creating new index...
> [junit4:junit4]   2> 498 T5539 oasc.SolrDeletionPolicy.onCommit SolrDeletionPolicy.onCommit:
commits:num=1
> [junit4:junit4]   2>            commit{dir=MockDirWrapper(org.apache.lucene.store.RAMDirectory@71238399
lockFactory=org.apache.lucene.store.NativeFSLockFactory@2f0758f5),segFN=segments_1,generation=1,filenames=[segments_1]
> [junit4:junit4]   2> 499 T5539 oasc.SolrDeletionPolicy.updateCommits newest commit
= 1
> [junit4:junit4]   2> 500 T5539 oasc.RequestHandlers.initHandlersFromConfig created
standard: solr.StandardRequestHandler
> [junit4:junit4]   2> 503 T5539 oass.SolrIndexSearcher.<init> Opening Searcher@4e82ad63
main
> [junit4:junit4]   2> 504 T5539 oass.SolrIndexSearcher.getIndexDir WARNING WARNING:
Directory impl does not support setting indexDir: org.apache.lucene.store.MockDirectoryWrapper
> [junit4:junit4]   2> 504 T5539 oasu.CommitTracker.<init> Hard AutoCommit: disabled
> [junit4:junit4]   2> 504 T5539 oasu.CommitTracker.<init> Soft AutoCommit: disabled
> [junit4:junit4]   2> 505 T5541 oasc.SolrCore.registerSearcher [col_bad] Registered
new searcher Searcher@4e82ad63 main{StandardDirectoryReader(segments_1:1)}
> [junit4:junit4]   2> 505 T5539 oasc.CoreContainer.register registering core: col_bad
> [junit4:junit4]   2> 505 T5539 oasc.CoreContainer.create Creating SolrCore 'bogus'
using instanceDir: /usr/home/hudson/hudson-slave/workspace/Lucene-Solr-tests-only-4.x-java7/checkout/solr/build/solr-core/test/J0/./org.apache.solr.core.CoreContainerCoreInitFailuresTest_bad_flow/bogus_path
> [junit4:junit4]   2> 506 T5539 oasc.SolrResourceLoader.<init> new SolrResourceLoader
for directory: '/usr/home/hudson/hudson-slave/workspace/Lucene-Solr-tests-only-4.x-java7/checkout/solr/build/solr-core/test/J0/./org.apache.solr.core.CoreContainerCoreInitFailuresTest_bad_flow/bogus_path/'
> [junit4:junit4]   2> 515 T5539 oasc.CoreContainer.register registering core: bogus
> [junit4:junit4]   2> 516 T5539 oasc.CoreContainer.reload Reloading SolrCore 'col_bad'
using instanceDir: /usr/home/hudson/hudson-slave/workspace/Lucene-Solr-tests-only-4.x-java7/checkout/solr/build/solr-core/test/J0/./org.apache.solr.core.CoreContainerCoreInitFailuresTest_bad_flow/col_bad
> [junit4:junit4]   2> 516 T5539 oasc.SolrResourceLoader.<init> new SolrResourceLoader
for directory: '/usr/home/hudson/hudson-slave/workspace/Lucene-Solr-tests-only-4.x-java7/checkout/solr/build/solr-core/test/J0/./org.apache.solr.core.CoreContainerCoreInitFailuresTest_bad_flow/col_bad/'
> [junit4:junit4]   2> 529 T5539 oasc.SolrException.log SEVERE Exception during parsing
file: solrconfig.xml:org.xml.sax.SAXParseException; systemId: solrres:/solrconfig.xml; lineNumber:
1; columnNumber: 1; El contenido no est? permitido en el pr?logo.
> [junit4:junit4]   2>            at com.sun.org.apache.xerces.internal.util.ErrorHandlerWrapper.createSAXParseException(ErrorHandlerWrapper.java:198)
> [junit4:junit4]   2>            at com.sun.org.apache.xerces.internal.util.ErrorHandlerWrapper.fatalError(ErrorHandlerWrapper.java:177)
> [junit4:junit4]   2>            at com.sun.org.apache.xerces.internal.impl.XMLErrorReporter.reportError(XMLErrorReporter.java:441)
> [junit4:junit4]   2>            at com.sun.org.apache.xerces.internal.impl.XMLErrorReporter.reportError(XMLErrorReporter.java:368)
> [junit4:junit4]   2>            at com.sun.org.apache.xerces.internal.impl.XMLScanner.reportFatalError(XMLScanner.java:1375)
> [junit4:junit4]   2>            at com.sun.org.apache.xerces.internal.impl.XMLDocumentScannerImpl$PrologDriver.next(XMLDocumentScannerImpl.java:996)
> [junit4:junit4]   2>            at com.sun.org.apache.xerces.internal.impl.XMLDocumentScannerImpl.next(XMLDocumentScannerImpl.java:607)
> [junit4:junit4]   2>            at com.sun.org.apache.xerces.internal.impl.XMLNSDocumentScannerImpl.next(XMLNSDocumentScannerImpl.java:116)
> [junit4:junit4]   2>            at com.sun.org.apache.xerces.internal.impl.XMLDocumentFragmentScannerImpl.scanDocument(XMLDocumentFragmentScannerImpl.java:488)
> [junit4:junit4]   2>            at com.sun.org.apache.xerces.internal.parsers.XML11Configuration.parse(XML11Configuration.java:835)
> [junit4:junit4]   2>            at com.sun.org.apache.xerces.internal.parsers.XML11Configuration.parse(XML11Configuration.java:764)
> [junit4:junit4]   2>            at com.sun.org.apache.xerces.internal.parsers.XMLParser.parse(XMLParser.java:123)
> [junit4:junit4]   2>            at com.sun.org.apache.xerces.internal.parsers.DOMParser.parse(DOMParser.java:237)
> [junit4:junit4]   2>            at com.sun.org.apache.xerces.internal.jaxp.DocumentBuilderImpl.parse(DocumentBuilderImpl.java:300)
> [junit4:junit4]   2>            at org.apache.solr.core.Config.<init>(Config.java:129)
> [junit4:junit4]   2>            at org.apache.solr.core.Config.<init>(Config.java:78)
> [junit4:junit4]   2>            at org.apache.solr.core.SolrConfig.<init>(SolrConfig.java:117)
> [junit4:junit4]   2>            at org.apache.solr.core.SolrCore.reload(SolrCore.java:364)
> [junit4:junit4]   2>            at org.apache.solr.core.CoreContainer.reload(CoreContainer.java:1015)
> [junit4:junit4]   2>            at org.apache.solr.core.CoreContainerCoreInitFailuresTest.testFlowBadFromStart(CoreContainerCoreInitFailuresTest.java:250)
> [junit4:junit4]   2>            at sun.reflect.NativeMethodAccessorImpl.invoke0(Native
Method)
> [junit4:junit4]   2>            at sun.reflect.NativeMethodAccessorImpl.invoke(NativeMethodAccessorImpl.java:57)
> [junit4:junit4]   2>            at sun.reflect.DelegatingMethodAccessorImpl.invoke(DelegatingMethodAccessorImpl.java:43)
> [junit4:junit4]   2>            at java.lang.reflect.Method.invoke(Method.java:601)
> [junit4:junit4]   2>            at com.carrotsearch.randomizedtesting.RandomizedRunner.invoke(RandomizedRunner.java:1995)
> [junit4:junit4]   2>            at com.carrotsearch.randomizedtesting.RandomizedRunner.access$1100(RandomizedRunner.java:132)
> [junit4:junit4]   2>            at com.carrotsearch.randomizedtesting.RandomizedRunner$6.evaluate(RandomizedRunner.java:818)
> [junit4:junit4]   2>            at com.carrotsearch.randomizedtesting.RandomizedRunner$7.evaluate(RandomizedRunner.java:877)
> [junit4:junit4]   2>            at com.carrotsearch.randomizedtesting.RandomizedRunner$8.evaluate(RandomizedRunner.java:891)
> [junit4:junit4]   2>            at com.carrotsearch.randomizedtesting.rules.SystemPropertiesRestoreRule$1.evaluate(SystemPropertiesRestoreRule.java:53)
> [junit4:junit4]   2>            at org.apache.lucene.util.TestRuleSetupTeardownChained$1.evaluate(TestRuleSetupTeardownChained.java:50)
> [junit4:junit4]   2>            at org.apache.lucene.util.TestRuleFieldCacheSanity$1.evaluate(TestRuleFieldCacheSanity.java:32)
> [junit4:junit4]   2>            at org.apache.lucene.util.AbstractBeforeAfterRule$1.evaluate(AbstractBeforeAfterRule.java:45)
> [junit4:junit4]   2>            at com.carrotsearch.randomizedtesting.rules.SystemPropertiesInvariantRule$1.evaluate(SystemPropertiesInvariantRule.java:55)
> [junit4:junit4]   2>            at org.apache.lucene.util.TestRuleReportUncaughtExceptions$1.evaluate(TestRuleReportUncaughtExceptions.java:68)
> [junit4:junit4]   2>            at org.apache.lucene.util.TestRuleThreadAndTestName$1.evaluate(TestRuleThreadAndTestName.java:48)
> [junit4:junit4]   2>            at org.apache.lucene.util.TestRuleIgnoreAfterMaxFailures$1.evaluate(TestRuleIgnoreAfterMaxFailures.java:70)
> [junit4:junit4]   2>            at org.apache.lucene.util.TestRuleMarkFailure$1.evaluate(TestRuleMarkFailure.java:48)
> [junit4:junit4]   2>            at com.carrotsearch.randomizedtesting.RandomizedRunner.runSingleTest(RandomizedRunner.java:825)
> [junit4:junit4]   2>            at com.carrotsearch.randomizedtesting.RandomizedRunner.access$700(RandomizedRunner.java:132)
> [junit4:junit4]   2>            at com.carrotsearch.randomizedtesting.RandomizedRunner$3$1.run(RandomizedRunner.java:671)
> [junit4:junit4]   2>            at com.carrotsearch.randomizedtesting.RandomizedRunner$3.evaluate(RandomizedRunner.java:697)
> [junit4:junit4]   2>            at com.carrotsearch.randomizedtesting.RandomizedRunner$4.evaluate(RandomizedRunner.java:736)
> [junit4:junit4]   2>            at com.carrotsearch.randomizedtesting.RandomizedRunner$5.evaluate(RandomizedRunner.java:747)
> [junit4:junit4]   2>            at com.carrotsearch.randomizedtesting.rules.SystemPropertiesRestoreRule$1.evaluate(SystemPropertiesRestoreRule.java:53)
> [junit4:junit4]   2>            at org.apache.lucene.util.AbstractBeforeAfterRule$1.evaluate(AbstractBeforeAfterRule.java:45)
> [junit4:junit4]   2>            at org.apache.lucene.util.TestRuleReportUncaughtExceptions$1.evaluate(TestRuleReportUncaughtExceptions.java:68)
> [junit4:junit4]   2>            at org.apache.lucene.util.TestRuleStoreClassName$1.evaluate(TestRuleStoreClassName.java:38)
> [junit4:junit4]   2>            at org.apache.lucene.util.TestRuleIcuHack$1.evaluate(TestRuleIcuHack.java:51)
> [junit4:junit4]   2>            at com.carrotsearch.randomizedtesting.rules.SystemPropertiesInvariantRule$1.evaluate(SystemPropertiesInvariantRule.java:55)
> [junit4:junit4]   2>            at org.apache.lucene.util.TestRuleNoInstanceHooksOverrides$1.evaluate(TestRuleNoInstanceHooksOverrides.java:53)
> [junit4:junit4]   2>            at org.apache.lucene.util.TestRuleNoStaticHooksShadowing$1.evaluate(TestRuleNoStaticHooksShadowing.java:52)
> [junit4:junit4]   2>            at org.apache.lucene.util.TestRuleAssertionsRequired$1.evaluate(TestRuleAssertionsRequired.java:36)
> [junit4:junit4]   2>            at org.apache.lucene.util.TestRuleMarkFailure$1.evaluate(TestRuleMarkFailure.java:48)
> [junit4:junit4]   2>            at org.apache.lucene.util.TestRuleIgnoreAfterMaxFailures$1.evaluate(TestRuleIgnoreAfterMaxFailures.java:70)
> [junit4:junit4]   2>            at org.apache.lucene.util.TestRuleIgnoreTestSuites$1.evaluate(TestRuleIgnoreTestSuites.java:55)
> [junit4:junit4]   2>            at com.carrotsearch.randomizedtesting.RandomizedRunner.runSuite(RandomizedRunner.java:605)
> [junit4:junit4]   2>            at com.carrotsearch.randomizedtesting.RandomizedRunner.access$400(RandomizedRunner.java:132)
> [junit4:junit4]   2>            at com.carrotsearch.randomizedtesting.RandomizedRunner$2.run(RandomizedRunner.java:551)
> [junit4:junit4]   2>
> [junit4:junit4]   2> 530 T5539 oasc.CoreContainer.shutdown Shutting down CoreContainer
instance=685998348
> [junit4:junit4]   2> 530 T5539 oasc.SolrCore.close [col_bad]  CLOSING SolrCore org.apache.solr.core.SolrCore@2ef15c6e
> [junit4:junit4]   2> 531 T5539 oasc.SolrCore.closeSearcher [col_bad] Closing main
searcher on request.
> [junit4:junit4]   2> 531 T5539 oasu.DirectUpdateHandler2.close closing DirectUpdateHandler2{commits=0,autocommits=0,soft
autocommits=0,optimizes=0,rollbacks=0,expungeDeletes=0,docsPending=0,adds=0,deletesById=0,deletesByQuery=0,errors=0,cumulative_adds=0,cumulative_deletesById=0,cumulative_deletesByQuery=0,cumulative_errors=0}
> [junit4:junit4]   2> 531 T5539 oasc.SolrCore.close [bogus]  CLOSING SolrCore org.apache.solr.core.SolrCore@4a486fcd
> [junit4:junit4]   2> 531 T5539 oasc.SolrCore.closeSearcher [bogus] Closing main searcher
on request.
> [junit4:junit4]   2> 532 T5539 oasu.DirectUpdateHandler2.close closing DirectUpdateHandler2{commits=0,autocommits=0,soft
autocommits=0,optimizes=0,rollbacks=0,expungeDeletes=0,docsPending=0,adds=0,deletesById=0,deletesByQuery=0,errors=0,cumulative_adds=0,cumulative_deletesById=0,cumulative_deletesByQuery=0,cumulative_errors=0}
> [junit4:junit4]   2> 536 T5539 oas.SolrTestCaseJ4.tearDown ###Ending testFlowBadFromStart
> [junit4:junit4]   2> NOTE: reproduce with: ant test  -Dtestcase=CoreContainerCoreInitFailuresTest
-Dtests.method=testFlowBadFromStart -Dtests.seed=769CD3367D6B0633 -Dtests.multiplier=3 -Dtests.slow=true
-Dtests.locale=es_CO -Dtests.timezone=Asia/Bangkok -Dtests.file.encoding=US-ASCII
> [junit4:junit4]   2>
> [junit4:junit4]    > (@AfterClass output)
> [junit4:junit4]   2> 556 T5539 oas.SolrTestCaseJ4.deleteCore ###deleteCore
> [junit4:junit4]   2> NOTE: test params are: codec=Lucene3x, sim=RandomSimilarityProvider(queryNorm=false,coord=true):
{}, locale=es_CO, timezone=Asia/Bangkok
> [junit4:junit4]   2> NOTE: FreeBSD 9.0-RELEASE amd64/Oracle Corporation 1.7.0_04 (64-bit)/cpus=16,threads=1,free=196286896,total=495976448
> [junit4:junit4]   2> NOTE: All tests run in this JVM: [DocumentAnalysisRequestHandlerTest,
LoggingHandlerTest, DistanceFunctionTest, FullSolrCloudDistribCmdsTest, TestDefaultSimilarityFactory,
ResourceLoaderTest, TestIndexingPerformance, RecoveryZkTest, MoreLikeThisHandlerTest, TestDistributedGrouping,
TestRangeQuery, SolrCmdDistributorTest, TestJmxMonitoredMap, RAMDirectoryFactoryTest, TestXIncludeConfig,
TestSurroundQueryParser, AutoCommitTest, TestSort, CSVRequestHandlerTest, SOLR749Test, TestBadConfig,
CoreAdminHandlerTest, SpellPossibilityIteratorTest, TestPerFieldSimilarity, TestValueSourceCache,
SyncSliceTest, TestRecovery, SolrCoreCheckLockOnStartupTest, PluginInfoTest, TestConfig, TestJmxIntegration,
NotRequiredUniqueKeyTest, CurrencyFieldTest, TestExtendedDismaxParser, XmlUpdateRequestHandlerTest,
NumericFieldsTest, BinaryUpdateRequestHandlerTest, NoCacheHeaderTest, TestMultiCoreConfBootstrap,
IndexSchemaRuntimeFieldTest, PeerSyncTest, TestLFUCache, UniqFieldsUpdateProcessorFactoryTest,
HighlighterConfigTest, FileBasedSpellCheckerTest, MBeansHandlerTest, TestFastLRUCache, DirectSolrSpellCheckerTest,
DateMathParserTest, DistributedTermsComponentTest, TestIBSimilarityFactory, DistributedSpellCheckComponentTest,
TestReplicationHandler, LeaderElectionIntegrationTest, TestRandomFaceting, SpellCheckCollatorTest,
ZkSolrClientTest, WordBreakSolrSpellCheckerTest, TestHashPartitioner, TestJoin, QueryElevationComponentTest,
SortByFunctionTest, SignatureUpdateProcessorFactoryTest, TestBinaryResponseWriter, SampleTest,
TestIndexSearcher, TestTrie, SolrRequestParserTest, DirectSolrConnectionTest, CacheHeaderTest,
QueryEqualityTest, TestWordDelimiterFilterFactory, PolyFieldTest, SpatialFilterTest, DistributedQueryElevationComponentTest,
TestPseudoReturnFields, TermsComponentTest, SolrInfoMBeanTest, XsltUpdateRequestHandlerTest,
MinimalSchemaTest, StandardRequestHandlerTest, FieldAnalysisRequestHandlerTest, PingRequestHandlerTest,
TermVectorComponentTest, DirectUpdateHandlerOptimizeTest, TestSolrQueryParser, SolrPluginUtilsTest,
FastVectorHighlighterTest, TestReversedWildcardFilterFactory, DebugComponentTest, JSONWriterTest,
RequestHandlersTest, SearchHandlerTest, SuggesterFSTTest, CopyFieldTest, TestQueryUtils, SuggesterTSTTest,
UpdateParamsTest, ShowFileRequestHandlerTest, TestSearchPerf, BadIndexSchemaTest, TestSolrDeletionPolicy1,
TestLuceneMatchVersion, UpdateRequestProcessorFactoryTest, TestPropInject, TestWriterPerf,
PrimitiveFieldTypeTest, AlternateDirectoryTest, BadComponentTest, TestBinaryField, DefaultValueUpdateProcessorTest,
TestDocSet, TestQuerySenderListener, TestCollationField, SolrIndexConfigTest, TestQuerySenderNoQuery,
IndexReaderFactoryTest, TestNumberUtils, TestSolrCoreProperties, EchoParamsTest, TestLMDirichletSimilarityFactory,
LegacyHTMLStripCharFilterTest, TestLMJelinekMercerSimilarityFactory, TimeZoneUtilsTest, URLClassifyProcessorTest,
PrimUtilsTest, TestSystemIdResolver, DateFieldTest, SpellingQueryConverterTest, CloudStateTest,
TestSuggestSpellingConverter, DOMUtilTest, UUIDFieldTest, SystemInfoHandlerTest, TestUtils,
PreAnalyzedFieldTest, CircularListTest, AnalysisAfterCoreReloadTest, TestDocumentBuilder,
TestCharFilters, CoreContainerCoreInitFailuresTest]
> [junit4:junit4]   2>
> [junit4:junit4] Completed on J0 in 0.57s, 2 tests, 1 failure <<< FAILURES!
> [...truncated 43 lines...]
>
> [...truncated 10964 lines...]
>
> [...truncated 10964 lines...]
>
> [...truncated 10964 lines...]
>
> [...truncated 10964 lines...]
>
> [...truncated 10951 lines...]
> BUILD FAILED
> /usr/home/hudson/hudson-slave/workspace/Lucene-Solr-tests-only-4.x-java7/checkout/build.xml:29:
The following error occurred while executing this line:
> /usr/home/hudson/hudson-slave/workspace/Lucene-Solr-tests-only-4.x-java7/checkout/solr/build.xml:144:
The following error occurred while executing this line:
> /usr/home/hudson/hudson-slave/workspace/Lucene-Solr-tests-only-4.x-java7/checkout/lucene/module-build.xml:62:
The following error occurred while executing this line:
> /usr/home/hudson/hudson-slave/workspace/Lucene-Solr-tests-only-4.x-java7/checkout/lucene/common-build.xml:1094:
The following error occurred while executing this line:
> /usr/home/hudson/hudson-slave/workspace/Lucene-Solr-tests-only-4.x-java7/checkout/lucene/common-build.xml:789:
There were test failures: 223 suites, 901 tests, 1 failure, 5 ignored
>
> Total time: 37 minutes 16 seconds
> Build step 'Execute shell' marked build as failure
> Archiving artifacts
> Recording test results
> Email was triggered for: Failure
> Sending email for trigger: Failure
>
>
>
>
> ---------------------------------------------------------------------
> To unsubscribe, e-mail: dev-unsubscribe@lucene.apache.org
> For additional commands, e-mail: dev-help@lucene.apache.org



-- 
lucidimagination.com

---------------------------------------------------------------------
To unsubscribe, e-mail: dev-unsubscribe@lucene.apache.org
For additional commands, e-mail: dev-help@lucene.apache.org


Mime
View raw message