lucene-dev mailing list archives

Site index · List index
Message view « Date » · « Thread »
Top « Date » · « Thread »
From Dawid Weiss <dawid.we...@gmail.com>
Subject Re: [JENKINS] Lucene-Solr-trunk-Linux-Java7-64 - Build # 666 - Failure!
Date Sun, 22 Jul 2012 09:00:25 GMT
#666... Couldn't be any different.
On Jul 22, 2012 10:08 AM, "Policeman Jenkins Server" <
jenkins@sd-datasolutions.de> wrote:

> Build:
> http://jenkins.sd-datasolutions.de/job/Lucene-Solr-trunk-Linux-Java7-64/666/
>
> 8 tests failed.
> REGRESSION:
>  org.apache.solr.handler.dataimport.TestSqlEntityProcessorDelta2.testCompositePk_DeltaImport_replace_nodelete
>
> Error Message:
> Exception during query
>
> Stack Trace:
> java.lang.RuntimeException: Exception during query
>         at
> __randomizedtesting.SeedInfo.seed([35621805D30986AD:B81829D4E867C647]:0)
>         at org.apache.solr.SolrTestCaseJ4.assertQ(SolrTestCaseJ4.java:486)
>         at org.apache.solr.SolrTestCaseJ4.assertQ(SolrTestCaseJ4.java:453)
>         at
> org.apache.solr.handler.dataimport.TestSqlEntityProcessorDelta2.add1document(TestSqlEntityProcessorDelta2.java:85)
>         at
> org.apache.solr.handler.dataimport.TestSqlEntityProcessorDelta2.testCompositePk_DeltaImport_replace_nodelete(TestSqlEntityProcessorDelta2.java:178)
>         at sun.reflect.NativeMethodAccessorImpl.invoke0(Native Method)
>         at
> sun.reflect.NativeMethodAccessorImpl.invoke(NativeMethodAccessorImpl.java:57)
>         at
> sun.reflect.DelegatingMethodAccessorImpl.invoke(DelegatingMethodAccessorImpl.java:43)
>         at java.lang.reflect.Method.invoke(Method.java:601)
>         at
> com.carrotsearch.randomizedtesting.RandomizedRunner.invoke(RandomizedRunner.java:1995)
>         at
> com.carrotsearch.randomizedtesting.RandomizedRunner.access$1100(RandomizedRunner.java:132)
>         at
> com.carrotsearch.randomizedtesting.RandomizedRunner$6.evaluate(RandomizedRunner.java:818)
>         at
> com.carrotsearch.randomizedtesting.RandomizedRunner$7.evaluate(RandomizedRunner.java:877)
>         at
> com.carrotsearch.randomizedtesting.RandomizedRunner$8.evaluate(RandomizedRunner.java:891)
>         at
> com.carrotsearch.randomizedtesting.rules.SystemPropertiesRestoreRule$1.evaluate(SystemPropertiesRestoreRule.java:53)
>         at
> org.apache.lucene.util.TestRuleSetupTeardownChained$1.evaluate(TestRuleSetupTeardownChained.java:50)
>         at
> org.apache.lucene.util.TestRuleFieldCacheSanity$1.evaluate(TestRuleFieldCacheSanity.java:32)
>         at
> org.apache.lucene.util.AbstractBeforeAfterRule$1.evaluate(AbstractBeforeAfterRule.java:45)
>         at
> com.carrotsearch.randomizedtesting.rules.SystemPropertiesInvariantRule$1.evaluate(SystemPropertiesInvariantRule.java:55)
>         at
> org.apache.lucene.util.TestRuleReportUncaughtExceptions$1.evaluate(TestRuleReportUncaughtExceptions.java:68)
>         at
> org.apache.lucene.util.TestRuleThreadAndTestName$1.evaluate(TestRuleThreadAndTestName.java:48)
>         at
> org.apache.lucene.util.TestRuleIgnoreAfterMaxFailures$1.evaluate(TestRuleIgnoreAfterMaxFailures.java:70)
>         at
> org.apache.lucene.util.TestRuleMarkFailure$1.evaluate(TestRuleMarkFailure.java:48)
>         at
> com.carrotsearch.randomizedtesting.RandomizedRunner.runSingleTest(RandomizedRunner.java:825)
>         at
> com.carrotsearch.randomizedtesting.RandomizedRunner.access$700(RandomizedRunner.java:132)
>         at
> com.carrotsearch.randomizedtesting.RandomizedRunner$3$1.run(RandomizedRunner.java:671)
>         at
> com.carrotsearch.randomizedtesting.RandomizedRunner$3.evaluate(RandomizedRunner.java:697)
>         at
> com.carrotsearch.randomizedtesting.RandomizedRunner$4.evaluate(RandomizedRunner.java:736)
>         at
> com.carrotsearch.randomizedtesting.RandomizedRunner$5.evaluate(RandomizedRunner.java:747)
>         at
> com.carrotsearch.randomizedtesting.rules.SystemPropertiesRestoreRule$1.evaluate(SystemPropertiesRestoreRule.java:53)
>         at
> org.apache.lucene.util.AbstractBeforeAfterRule$1.evaluate(AbstractBeforeAfterRule.java:45)
>         at
> org.apache.lucene.util.TestRuleReportUncaughtExceptions$1.evaluate(TestRuleReportUncaughtExceptions.java:68)
>         at
> org.apache.lucene.util.TestRuleStoreClassName$1.evaluate(TestRuleStoreClassName.java:38)
>         at
> org.apache.lucene.util.TestRuleIcuHack$1.evaluate(TestRuleIcuHack.java:51)
>         at
> com.carrotsearch.randomizedtesting.rules.SystemPropertiesInvariantRule$1.evaluate(SystemPropertiesInvariantRule.java:55)
>         at
> org.apache.lucene.util.TestRuleNoInstanceHooksOverrides$1.evaluate(TestRuleNoInstanceHooksOverrides.java:53)
>         at
> org.apache.lucene.util.TestRuleNoStaticHooksShadowing$1.evaluate(TestRuleNoStaticHooksShadowing.java:52)
>         at
> org.apache.lucene.util.TestRuleAssertionsRequired$1.evaluate(TestRuleAssertionsRequired.java:36)
>         at
> org.apache.lucene.util.TestRuleMarkFailure$1.evaluate(TestRuleMarkFailure.java:48)
>         at
> org.apache.lucene.util.TestRuleIgnoreAfterMaxFailures$1.evaluate(TestRuleIgnoreAfterMaxFailures.java:70)
>         at
> org.apache.lucene.util.TestRuleIgnoreTestSuites$1.evaluate(TestRuleIgnoreTestSuites.java:55)
>         at
> com.carrotsearch.randomizedtesting.RandomizedRunner.runSuite(RandomizedRunner.java:605)
>         at
> com.carrotsearch.randomizedtesting.RandomizedRunner.access$400(RandomizedRunner.java:132)
>         at
> com.carrotsearch.randomizedtesting.RandomizedRunner$2.run(RandomizedRunner.java:551)
> Caused by: java.lang.RuntimeException: REQUEST FAILED:
> xpath=//*[@numFound='1']
>         xml response was: <?xml version="1.0" encoding="UTF-8"?>
> <response>
> <lst name="responseHeader"><int name="status">0</int><int
> name="QTime">1</int><lst name="params"><str name="start">0</str><str
> name="q">*:* OR add1document</str><str name="qt">standard</str><str
> name="rows">20</str><str name="version">2.2</str></lst></lst><result
> name="response" numFound="0" start="0"></result>
> </response>
>
>         request
> was:start=0&q=*:*+OR+add1document&qt=standard&rows=20&version=2.2
>         at org.apache.solr.SolrTestCaseJ4.assertQ(SolrTestCaseJ4.java:479)
>         ... 42 more
>
>
> REGRESSION:
>  org.apache.solr.handler.dataimport.TestSqlEntityProcessorDelta2.testCompositePk_DeltaImport_delete
>
> Error Message:
> org.apache.lucene.store.AlreadyClosedException: this IndexWriter is closed
>
> Stack Trace:
> org.apache.solr.common.SolrException:
> org.apache.lucene.store.AlreadyClosedException: this IndexWriter is closed
>         at
> __randomizedtesting.SeedInfo.seed([35621805D30986AD:145FEE1BB674AEC1]:0)
>         at org.apache.solr.util.TestHarness.update(TestHarness.java:248)
>         at
> org.apache.solr.util.TestHarness.checkUpdateStatus(TestHarness.java:294)
>         at
> org.apache.solr.util.TestHarness.validateUpdate(TestHarness.java:264)
>         at
> org.apache.solr.SolrTestCaseJ4.checkUpdateU(SolrTestCaseJ4.java:440)
>         at org.apache.solr.SolrTestCaseJ4.assertU(SolrTestCaseJ4.java:419)
>         at org.apache.solr.SolrTestCaseJ4.assertU(SolrTestCaseJ4.java:413)
>         at
> org.apache.solr.SolrTestCaseJ4.clearIndex(SolrTestCaseJ4.java:785)
>         at
> org.apache.solr.handler.dataimport.TestSqlEntityProcessorDelta2.setUp(TestSqlEntityProcessorDelta2.java:68)
>         at sun.reflect.NativeMethodAccessorImpl.invoke0(Native Method)
>         at
> sun.reflect.NativeMethodAccessorImpl.invoke(NativeMethodAccessorImpl.java:57)
>         at
> sun.reflect.DelegatingMethodAccessorImpl.invoke(DelegatingMethodAccessorImpl.java:43)
>         at java.lang.reflect.Method.invoke(Method.java:601)
>         at
> com.carrotsearch.randomizedtesting.RandomizedRunner.invoke(RandomizedRunner.java:1995)
>         at
> com.carrotsearch.randomizedtesting.RandomizedRunner.access$1100(RandomizedRunner.java:132)
>         at
> com.carrotsearch.randomizedtesting.RandomizedRunner$7.evaluate(RandomizedRunner.java:875)
>         at
> com.carrotsearch.randomizedtesting.RandomizedRunner$8.evaluate(RandomizedRunner.java:891)
>         at
> com.carrotsearch.randomizedtesting.rules.SystemPropertiesRestoreRule$1.evaluate(SystemPropertiesRestoreRule.java:53)
>         at
> org.apache.lucene.util.TestRuleSetupTeardownChained$1.evaluate(TestRuleSetupTeardownChained.java:50)
>         at
> org.apache.lucene.util.TestRuleFieldCacheSanity$1.evaluate(TestRuleFieldCacheSanity.java:32)
>         at
> org.apache.lucene.util.AbstractBeforeAfterRule$1.evaluate(AbstractBeforeAfterRule.java:45)
>         at
> com.carrotsearch.randomizedtesting.rules.SystemPropertiesInvariantRule$1.evaluate(SystemPropertiesInvariantRule.java:55)
>         at
> org.apache.lucene.util.TestRuleReportUncaughtExceptions$1.evaluate(TestRuleReportUncaughtExceptions.java:68)
>         at
> org.apache.lucene.util.TestRuleThreadAndTestName$1.evaluate(TestRuleThreadAndTestName.java:48)
>         at
> org.apache.lucene.util.TestRuleIgnoreAfterMaxFailures$1.evaluate(TestRuleIgnoreAfterMaxFailures.java:70)
>         at
> org.apache.lucene.util.TestRuleMarkFailure$1.evaluate(TestRuleMarkFailure.java:48)
>         at
> com.carrotsearch.randomizedtesting.RandomizedRunner.runSingleTest(RandomizedRunner.java:825)
>         at
> com.carrotsearch.randomizedtesting.RandomizedRunner.access$700(RandomizedRunner.java:132)
>         at
> com.carrotsearch.randomizedtesting.RandomizedRunner$3$1.run(RandomizedRunner.java:671)
>         at
> com.carrotsearch.randomizedtesting.RandomizedRunner$3.evaluate(RandomizedRunner.java:697)
>         at
> com.carrotsearch.randomizedtesting.RandomizedRunner$4.evaluate(RandomizedRunner.java:736)
>         at
> com.carrotsearch.randomizedtesting.RandomizedRunner$5.evaluate(RandomizedRunner.java:747)
>         at
> com.carrotsearch.randomizedtesting.rules.SystemPropertiesRestoreRule$1.evaluate(SystemPropertiesRestoreRule.java:53)
>         at
> org.apache.lucene.util.AbstractBeforeAfterRule$1.evaluate(AbstractBeforeAfterRule.java:45)
>         at
> org.apache.lucene.util.TestRuleReportUncaughtExceptions$1.evaluate(TestRuleReportUncaughtExceptions.java:68)
>         at
> org.apache.lucene.util.TestRuleStoreClassName$1.evaluate(TestRuleStoreClassName.java:38)
>         at
> org.apache.lucene.util.TestRuleIcuHack$1.evaluate(TestRuleIcuHack.java:51)
>         at
> com.carrotsearch.randomizedtesting.rules.SystemPropertiesInvariantRule$1.evaluate(SystemPropertiesInvariantRule.java:55)
>         at
> org.apache.lucene.util.TestRuleNoInstanceHooksOverrides$1.evaluate(TestRuleNoInstanceHooksOverrides.java:53)
>         at
> org.apache.lucene.util.TestRuleNoStaticHooksShadowing$1.evaluate(TestRuleNoStaticHooksShadowing.java:52)
>         at
> org.apache.lucene.util.TestRuleAssertionsRequired$1.evaluate(TestRuleAssertionsRequired.java:36)
>         at
> org.apache.lucene.util.TestRuleMarkFailure$1.evaluate(TestRuleMarkFailure.java:48)
>         at
> org.apache.lucene.util.TestRuleIgnoreAfterMaxFailures$1.evaluate(TestRuleIgnoreAfterMaxFailures.java:70)
>         at
> org.apache.lucene.util.TestRuleIgnoreTestSuites$1.evaluate(TestRuleIgnoreTestSuites.java:55)
>         at
> com.carrotsearch.randomizedtesting.RandomizedRunner.runSuite(RandomizedRunner.java:605)
>         at
> com.carrotsearch.randomizedtesting.RandomizedRunner.access$400(RandomizedRunner.java:132)
>         at
> com.carrotsearch.randomizedtesting.RandomizedRunner$2.run(RandomizedRunner.java:551)
> Caused by: org.apache.lucene.store.AlreadyClosedException: this
> IndexWriter is closed
>         at
> org.apache.lucene.index.IndexWriter.ensureOpen(IndexWriter.java:551)
>         at
> org.apache.lucene.index.IndexWriter.ensureOpen(IndexWriter.java:556)
>         at
> org.apache.lucene.index.IndexWriter.deleteAll(IndexWriter.java:1881)
>         at
> org.apache.solr.update.DirectUpdateHandler2.deleteAll(DirectUpdateHandler2.java:142)
>         at
> org.apache.solr.update.DirectUpdateHandler2.deleteByQuery(DirectUpdateHandler2.java:361)
>         at
> org.apache.solr.update.processor.RunUpdateProcessor.processDelete(RunUpdateProcessorFactory.java:67)
>         at
> org.apache.solr.update.processor.UpdateRequestProcessor.processDelete(UpdateRequestProcessor.java:55)
>         at
> org.apache.solr.update.processor.DistributedUpdateProcessor.doDeleteByQuery(DistributedUpdateProcessor.java:733)
>         at
> org.apache.solr.update.processor.DistributedUpdateProcessor.processDelete(DistributedUpdateProcessor.java:606)
>         at
> org.apache.solr.update.processor.UpdateRequestProcessor.processDelete(UpdateRequestProcessor.java:55)
>         at
> org.apache.solr.handler.dataimport.AbstractDataImportHandlerTestCase$TestUpdateRequestProcessor.processDelete(AbstractDataImportHandlerTestCase.java:364)
>         at
> org.apache.solr.handler.loader.XMLLoader.processDelete(XMLLoader.java:330)
>         at
> org.apache.solr.handler.loader.XMLLoader.processUpdate(XMLLoader.java:261)
>         at
> org.apache.solr.handler.loader.XMLLoader.load(XMLLoader.java:157)
>         at
> org.apache.solr.handler.UpdateRequestHandler$1.load(UpdateRequestHandler.java:92)
>         at
> org.apache.solr.handler.ContentStreamHandlerBase.handleRequestBody(ContentStreamHandlerBase.java:74)
>         at
> org.apache.solr.handler.RequestHandlerBase.handleRequest(RequestHandlerBase.java:129)
>         at org.apache.solr.core.SolrCore.execute(SolrCore.java:1624)
>         at
> org.apache.solr.servlet.DirectSolrConnection.request(DirectSolrConnection.java:131)
>         at org.apache.solr.util.TestHarness.update(TestHarness.java:244)
>         ... 45 more
>
>
> REGRESSION:
>  org.apache.solr.handler.dataimport.TestSqlEntityProcessorDelta2.testCompositePk_DeltaImport_add
>
> Error Message:
> org.apache.lucene.store.AlreadyClosedException: this IndexWriter is closed
>
> Stack Trace:
> org.apache.solr.common.SolrException:
> org.apache.lucene.store.AlreadyClosedException: this IndexWriter is closed
>         at
> __randomizedtesting.SeedInfo.seed([35621805D30986AD:E784CD5F692355E6]:0)
>         at org.apache.solr.util.TestHarness.update(TestHarness.java:248)
>         at
> org.apache.solr.util.TestHarness.checkUpdateStatus(TestHarness.java:294)
>         at
> org.apache.solr.util.TestHarness.validateUpdate(TestHarness.java:264)
>         at
> org.apache.solr.SolrTestCaseJ4.checkUpdateU(SolrTestCaseJ4.java:440)
>         at org.apache.solr.SolrTestCaseJ4.assertU(SolrTestCaseJ4.java:419)
>         at org.apache.solr.SolrTestCaseJ4.assertU(SolrTestCaseJ4.java:413)
>         at
> org.apache.solr.SolrTestCaseJ4.clearIndex(SolrTestCaseJ4.java:785)
>         at
> org.apache.solr.handler.dataimport.TestSqlEntityProcessorDelta2.setUp(TestSqlEntityProcessorDelta2.java:68)
>         at sun.reflect.NativeMethodAccessorImpl.invoke0(Native Method)
>         at
> sun.reflect.NativeMethodAccessorImpl.invoke(NativeMethodAccessorImpl.java:57)
>         at
> sun.reflect.DelegatingMethodAccessorImpl.invoke(DelegatingMethodAccessorImpl.java:43)
>         at java.lang.reflect.Method.invoke(Method.java:601)
>         at
> com.carrotsearch.randomizedtesting.RandomizedRunner.invoke(RandomizedRunner.java:1995)
>         at
> com.carrotsearch.randomizedtesting.RandomizedRunner.access$1100(RandomizedRunner.java:132)
>         at
> com.carrotsearch.randomizedtesting.RandomizedRunner$7.evaluate(RandomizedRunner.java:875)
>         at
> com.carrotsearch.randomizedtesting.RandomizedRunner$8.evaluate(RandomizedRunner.java:891)
>         at
> com.carrotsearch.randomizedtesting.rules.SystemPropertiesRestoreRule$1.evaluate(SystemPropertiesRestoreRule.java:53)
>         at
> org.apache.lucene.util.TestRuleSetupTeardownChained$1.evaluate(TestRuleSetupTeardownChained.java:50)
>         at
> org.apache.lucene.util.TestRuleFieldCacheSanity$1.evaluate(TestRuleFieldCacheSanity.java:32)
>         at
> org.apache.lucene.util.AbstractBeforeAfterRule$1.evaluate(AbstractBeforeAfterRule.java:45)
>         at
> com.carrotsearch.randomizedtesting.rules.SystemPropertiesInvariantRule$1.evaluate(SystemPropertiesInvariantRule.java:55)
>         at
> org.apache.lucene.util.TestRuleReportUncaughtExceptions$1.evaluate(TestRuleReportUncaughtExceptions.java:68)
>         at
> org.apache.lucene.util.TestRuleThreadAndTestName$1.evaluate(TestRuleThreadAndTestName.java:48)
>         at
> org.apache.lucene.util.TestRuleIgnoreAfterMaxFailures$1.evaluate(TestRuleIgnoreAfterMaxFailures.java:70)
>         at
> org.apache.lucene.util.TestRuleMarkFailure$1.evaluate(TestRuleMarkFailure.java:48)
>         at
> com.carrotsearch.randomizedtesting.RandomizedRunner.runSingleTest(RandomizedRunner.java:825)
>         at
> com.carrotsearch.randomizedtesting.RandomizedRunner.access$700(RandomizedRunner.java:132)
>         at
> com.carrotsearch.randomizedtesting.RandomizedRunner$3$1.run(RandomizedRunner.java:671)
>         at
> com.carrotsearch.randomizedtesting.RandomizedRunner$3.evaluate(RandomizedRunner.java:697)
>         at
> com.carrotsearch.randomizedtesting.RandomizedRunner$4.evaluate(RandomizedRunner.java:736)
>         at
> com.carrotsearch.randomizedtesting.RandomizedRunner$5.evaluate(RandomizedRunner.java:747)
>         at
> com.carrotsearch.randomizedtesting.rules.SystemPropertiesRestoreRule$1.evaluate(SystemPropertiesRestoreRule.java:53)
>         at
> org.apache.lucene.util.AbstractBeforeAfterRule$1.evaluate(AbstractBeforeAfterRule.java:45)
>         at
> org.apache.lucene.util.TestRuleReportUncaughtExceptions$1.evaluate(TestRuleReportUncaughtExceptions.java:68)
>         at
> org.apache.lucene.util.TestRuleStoreClassName$1.evaluate(TestRuleStoreClassName.java:38)
>         at
> org.apache.lucene.util.TestRuleIcuHack$1.evaluate(TestRuleIcuHack.java:51)
>         at
> com.carrotsearch.randomizedtesting.rules.SystemPropertiesInvariantRule$1.evaluate(SystemPropertiesInvariantRule.java:55)
>         at
> org.apache.lucene.util.TestRuleNoInstanceHooksOverrides$1.evaluate(TestRuleNoInstanceHooksOverrides.java:53)
>         at
> org.apache.lucene.util.TestRuleNoStaticHooksShadowing$1.evaluate(TestRuleNoStaticHooksShadowing.java:52)
>         at
> org.apache.lucene.util.TestRuleAssertionsRequired$1.evaluate(TestRuleAssertionsRequired.java:36)
>         at
> org.apache.lucene.util.TestRuleMarkFailure$1.evaluate(TestRuleMarkFailure.java:48)
>         at
> org.apache.lucene.util.TestRuleIgnoreAfterMaxFailures$1.evaluate(TestRuleIgnoreAfterMaxFailures.java:70)
>         at
> org.apache.lucene.util.TestRuleIgnoreTestSuites$1.evaluate(TestRuleIgnoreTestSuites.java:55)
>         at
> com.carrotsearch.randomizedtesting.RandomizedRunner.runSuite(RandomizedRunner.java:605)
>         at
> com.carrotsearch.randomizedtesting.RandomizedRunner.access$400(RandomizedRunner.java:132)
>         at
> com.carrotsearch.randomizedtesting.RandomizedRunner$2.run(RandomizedRunner.java:551)
> Caused by: org.apache.lucene.store.AlreadyClosedException: this
> IndexWriter is closed
>         at
> org.apache.lucene.index.IndexWriter.ensureOpen(IndexWriter.java:551)
>         at
> org.apache.lucene.index.IndexWriter.ensureOpen(IndexWriter.java:556)
>         at
> org.apache.lucene.index.IndexWriter.deleteAll(IndexWriter.java:1881)
>         at
> org.apache.solr.update.DirectUpdateHandler2.deleteAll(DirectUpdateHandler2.java:142)
>         at
> org.apache.solr.update.DirectUpdateHandler2.deleteByQuery(DirectUpdateHandler2.java:361)
>         at
> org.apache.solr.update.processor.RunUpdateProcessor.processDelete(RunUpdateProcessorFactory.java:67)
>         at
> org.apache.solr.update.processor.UpdateRequestProcessor.processDelete(UpdateRequestProcessor.java:55)
>         at
> org.apache.solr.update.processor.DistributedUpdateProcessor.doDeleteByQuery(DistributedUpdateProcessor.java:733)
>         at
> org.apache.solr.update.processor.DistributedUpdateProcessor.processDelete(DistributedUpdateProcessor.java:606)
>         at
> org.apache.solr.update.processor.UpdateRequestProcessor.processDelete(UpdateRequestProcessor.java:55)
>         at
> org.apache.solr.handler.dataimport.AbstractDataImportHandlerTestCase$TestUpdateRequestProcessor.processDelete(AbstractDataImportHandlerTestCase.java:364)
>         at
> org.apache.solr.handler.loader.XMLLoader.processDelete(XMLLoader.java:330)
>         at
> org.apache.solr.handler.loader.XMLLoader.processUpdate(XMLLoader.java:261)
>         at
> org.apache.solr.handler.loader.XMLLoader.load(XMLLoader.java:157)
>         at
> org.apache.solr.handler.UpdateRequestHandler$1.load(UpdateRequestHandler.java:92)
>         at
> org.apache.solr.handler.ContentStreamHandlerBase.handleRequestBody(ContentStreamHandlerBase.java:74)
>         at
> org.apache.solr.handler.RequestHandlerBase.handleRequest(RequestHandlerBase.java:129)
>         at org.apache.solr.core.SolrCore.execute(SolrCore.java:1624)
>         at
> org.apache.solr.servlet.DirectSolrConnection.request(DirectSolrConnection.java:131)
>         at org.apache.solr.util.TestHarness.update(TestHarness.java:244)
>         ... 45 more
>
>
> REGRESSION:
>  org.apache.solr.handler.dataimport.TestSqlEntityProcessorDelta2.testCompositePk_DeltaImport_empty
>
> Error Message:
> org.apache.lucene.store.AlreadyClosedException: this IndexWriter is closed
>
> Stack Trace:
> org.apache.solr.common.SolrException:
> org.apache.lucene.store.AlreadyClosedException: this IndexWriter is closed
>         at
> __randomizedtesting.SeedInfo.seed([35621805D30986AD:F261836A729CDBAF]:0)
>         at org.apache.solr.util.TestHarness.update(TestHarness.java:248)
>         at
> org.apache.solr.util.TestHarness.checkUpdateStatus(TestHarness.java:294)
>         at
> org.apache.solr.util.TestHarness.validateUpdate(TestHarness.java:264)
>         at
> org.apache.solr.SolrTestCaseJ4.checkUpdateU(SolrTestCaseJ4.java:440)
>         at org.apache.solr.SolrTestCaseJ4.assertU(SolrTestCaseJ4.java:419)
>         at org.apache.solr.SolrTestCaseJ4.assertU(SolrTestCaseJ4.java:413)
>         at
> org.apache.solr.SolrTestCaseJ4.clearIndex(SolrTestCaseJ4.java:785)
>         at
> org.apache.solr.handler.dataimport.TestSqlEntityProcessorDelta2.setUp(TestSqlEntityProcessorDelta2.java:68)
>         at sun.reflect.NativeMethodAccessorImpl.invoke0(Native Method)
>         at
> sun.reflect.NativeMethodAccessorImpl.invoke(NativeMethodAccessorImpl.java:57)
>         at
> sun.reflect.DelegatingMethodAccessorImpl.invoke(DelegatingMethodAccessorImpl.java:43)
>         at java.lang.reflect.Method.invoke(Method.java:601)
>         at
> com.carrotsearch.randomizedtesting.RandomizedRunner.invoke(RandomizedRunner.java:1995)
>         at
> com.carrotsearch.randomizedtesting.RandomizedRunner.access$1100(RandomizedRunner.java:132)
>         at
> com.carrotsearch.randomizedtesting.RandomizedRunner$7.evaluate(RandomizedRunner.java:875)
>         at
> com.carrotsearch.randomizedtesting.RandomizedRunner$8.evaluate(RandomizedRunner.java:891)
>         at
> com.carrotsearch.randomizedtesting.rules.SystemPropertiesRestoreRule$1.evaluate(SystemPropertiesRestoreRule.java:53)
>         at
> org.apache.lucene.util.TestRuleSetupTeardownChained$1.evaluate(TestRuleSetupTeardownChained.java:50)
>         at
> org.apache.lucene.util.TestRuleFieldCacheSanity$1.evaluate(TestRuleFieldCacheSanity.java:32)
>         at
> org.apache.lucene.util.AbstractBeforeAfterRule$1.evaluate(AbstractBeforeAfterRule.java:45)
>         at
> com.carrotsearch.randomizedtesting.rules.SystemPropertiesInvariantRule$1.evaluate(SystemPropertiesInvariantRule.java:55)
>         at
> org.apache.lucene.util.TestRuleReportUncaughtExceptions$1.evaluate(TestRuleReportUncaughtExceptions.java:68)
>         at
> org.apache.lucene.util.TestRuleThreadAndTestName$1.evaluate(TestRuleThreadAndTestName.java:48)
>         at
> org.apache.lucene.util.TestRuleIgnoreAfterMaxFailures$1.evaluate(TestRuleIgnoreAfterMaxFailures.java:70)
>         at
> org.apache.lucene.util.TestRuleMarkFailure$1.evaluate(TestRuleMarkFailure.java:48)
>         at
> com.carrotsearch.randomizedtesting.RandomizedRunner.runSingleTest(RandomizedRunner.java:825)
>         at
> com.carrotsearch.randomizedtesting.RandomizedRunner.access$700(RandomizedRunner.java:132)
>         at
> com.carrotsearch.randomizedtesting.RandomizedRunner$3$1.run(RandomizedRunner.java:671)
>         at
> com.carrotsearch.randomizedtesting.RandomizedRunner$3.evaluate(RandomizedRunner.java:697)
>         at
> com.carrotsearch.randomizedtesting.RandomizedRunner$4.evaluate(RandomizedRunner.java:736)
>         at
> com.carrotsearch.randomizedtesting.RandomizedRunner$5.evaluate(RandomizedRunner.java:747)
>         at
> com.carrotsearch.randomizedtesting.rules.SystemPropertiesRestoreRule$1.evaluate(SystemPropertiesRestoreRule.java:53)
>         at
> org.apache.lucene.util.AbstractBeforeAfterRule$1.evaluate(AbstractBeforeAfterRule.java:45)
>         at
> org.apache.lucene.util.TestRuleReportUncaughtExceptions$1.evaluate(TestRuleReportUncaughtExceptions.java:68)
>         at
> org.apache.lucene.util.TestRuleStoreClassName$1.evaluate(TestRuleStoreClassName.java:38)
>         at
> org.apache.lucene.util.TestRuleIcuHack$1.evaluate(TestRuleIcuHack.java:51)
>         at
> com.carrotsearch.randomizedtesting.rules.SystemPropertiesInvariantRule$1.evaluate(SystemPropertiesInvariantRule.java:55)
>         at
> org.apache.lucene.util.TestRuleNoInstanceHooksOverrides$1.evaluate(TestRuleNoInstanceHooksOverrides.java:53)
>         at
> org.apache.lucene.util.TestRuleNoStaticHooksShadowing$1.evaluate(TestRuleNoStaticHooksShadowing.java:52)
>         at
> org.apache.lucene.util.TestRuleAssertionsRequired$1.evaluate(TestRuleAssertionsRequired.java:36)
>         at
> org.apache.lucene.util.TestRuleMarkFailure$1.evaluate(TestRuleMarkFailure.java:48)
>         at
> org.apache.lucene.util.TestRuleIgnoreAfterMaxFailures$1.evaluate(TestRuleIgnoreAfterMaxFailures.java:70)
>         at
> org.apache.lucene.util.TestRuleIgnoreTestSuites$1.evaluate(TestRuleIgnoreTestSuites.java:55)
>         at
> com.carrotsearch.randomizedtesting.RandomizedRunner.runSuite(RandomizedRunner.java:605)
>         at
> com.carrotsearch.randomizedtesting.RandomizedRunner.access$400(RandomizedRunner.java:132)
>         at
> com.carrotsearch.randomizedtesting.RandomizedRunner$2.run(RandomizedRunner.java:551)
> Caused by: org.apache.lucene.store.AlreadyClosedException: this
> IndexWriter is closed
>         at
> org.apache.lucene.index.IndexWriter.ensureOpen(IndexWriter.java:551)
>         at
> org.apache.lucene.index.IndexWriter.ensureOpen(IndexWriter.java:556)
>         at
> org.apache.lucene.index.IndexWriter.deleteAll(IndexWriter.java:1881)
>         at
> org.apache.solr.update.DirectUpdateHandler2.deleteAll(DirectUpdateHandler2.java:142)
>         at
> org.apache.solr.update.DirectUpdateHandler2.deleteByQuery(DirectUpdateHandler2.java:361)
>         at
> org.apache.solr.update.processor.RunUpdateProcessor.processDelete(RunUpdateProcessorFactory.java:67)
>         at
> org.apache.solr.update.processor.UpdateRequestProcessor.processDelete(UpdateRequestProcessor.java:55)
>         at
> org.apache.solr.update.processor.DistributedUpdateProcessor.doDeleteByQuery(DistributedUpdateProcessor.java:733)
>         at
> org.apache.solr.update.processor.DistributedUpdateProcessor.processDelete(DistributedUpdateProcessor.java:606)
>         at
> org.apache.solr.update.processor.UpdateRequestProcessor.processDelete(UpdateRequestProcessor.java:55)
>         at
> org.apache.solr.handler.dataimport.AbstractDataImportHandlerTestCase$TestUpdateRequestProcessor.processDelete(AbstractDataImportHandlerTestCase.java:364)
>         at
> org.apache.solr.handler.loader.XMLLoader.processDelete(XMLLoader.java:330)
>         at
> org.apache.solr.handler.loader.XMLLoader.processUpdate(XMLLoader.java:261)
>         at
> org.apache.solr.handler.loader.XMLLoader.load(XMLLoader.java:157)
>         at
> org.apache.solr.handler.UpdateRequestHandler$1.load(UpdateRequestHandler.java:92)
>         at
> org.apache.solr.handler.ContentStreamHandlerBase.handleRequestBody(ContentStreamHandlerBase.java:74)
>         at
> org.apache.solr.handler.RequestHandlerBase.handleRequest(RequestHandlerBase.java:129)
>         at org.apache.solr.core.SolrCore.execute(SolrCore.java:1624)
>         at
> org.apache.solr.servlet.DirectSolrConnection.request(DirectSolrConnection.java:131)
>         at org.apache.solr.util.TestHarness.update(TestHarness.java:244)
>         ... 45 more
>
>
> REGRESSION:
>  org.apache.solr.handler.dataimport.TestSqlEntityProcessorDelta2.testCompositePk_DeltaImport_replace_delete
>
> Error Message:
> org.apache.lucene.store.AlreadyClosedException: this IndexWriter is closed
>
> Stack Trace:
> org.apache.solr.common.SolrException:
> org.apache.lucene.store.AlreadyClosedException: this IndexWriter is closed
>         at
> __randomizedtesting.SeedInfo.seed([35621805D30986AD:372D78AA3D8D9EA8]:0)
>         at org.apache.solr.util.TestHarness.update(TestHarness.java:248)
>         at
> org.apache.solr.util.TestHarness.checkUpdateStatus(TestHarness.java:294)
>         at
> org.apache.solr.util.TestHarness.validateUpdate(TestHarness.java:264)
>         at
> org.apache.solr.SolrTestCaseJ4.checkUpdateU(SolrTestCaseJ4.java:440)
>         at org.apache.solr.SolrTestCaseJ4.assertU(SolrTestCaseJ4.java:419)
>         at org.apache.solr.SolrTestCaseJ4.assertU(SolrTestCaseJ4.java:413)
>         at
> org.apache.solr.SolrTestCaseJ4.clearIndex(SolrTestCaseJ4.java:785)
>         at
> org.apache.solr.handler.dataimport.TestSqlEntityProcessorDelta2.setUp(TestSqlEntityProcessorDelta2.java:68)
>         at sun.reflect.NativeMethodAccessorImpl.invoke0(Native Method)
>         at
> sun.reflect.NativeMethodAccessorImpl.invoke(NativeMethodAccessorImpl.java:57)
>         at
> sun.reflect.DelegatingMethodAccessorImpl.invoke(DelegatingMethodAccessorImpl.java:43)
>         at java.lang.reflect.Method.invoke(Method.java:601)
>         at
> com.carrotsearch.randomizedtesting.RandomizedRunner.invoke(RandomizedRunner.java:1995)
>         at
> com.carrotsearch.randomizedtesting.RandomizedRunner.access$1100(RandomizedRunner.java:132)
>         at
> com.carrotsearch.randomizedtesting.RandomizedRunner$7.evaluate(RandomizedRunner.java:875)
>         at
> com.carrotsearch.randomizedtesting.RandomizedRunner$8.evaluate(RandomizedRunner.java:891)
>         at
> com.carrotsearch.randomizedtesting.rules.SystemPropertiesRestoreRule$1.evaluate(SystemPropertiesRestoreRule.java:53)
>         at
> org.apache.lucene.util.TestRuleSetupTeardownChained$1.evaluate(TestRuleSetupTeardownChained.java:50)
>         at
> org.apache.lucene.util.TestRuleFieldCacheSanity$1.evaluate(TestRuleFieldCacheSanity.java:32)
>         at
> org.apache.lucene.util.AbstractBeforeAfterRule$1.evaluate(AbstractBeforeAfterRule.java:45)
>         at
> com.carrotsearch.randomizedtesting.rules.SystemPropertiesInvariantRule$1.evaluate(SystemPropertiesInvariantRule.java:55)
>         at
> org.apache.lucene.util.TestRuleReportUncaughtExceptions$1.evaluate(TestRuleReportUncaughtExceptions.java:68)
>         at
> org.apache.lucene.util.TestRuleThreadAndTestName$1.evaluate(TestRuleThreadAndTestName.java:48)
>         at
> org.apache.lucene.util.TestRuleIgnoreAfterMaxFailures$1.evaluate(TestRuleIgnoreAfterMaxFailures.java:70)
>         at
> org.apache.lucene.util.TestRuleMarkFailure$1.evaluate(TestRuleMarkFailure.java:48)
>         at
> com.carrotsearch.randomizedtesting.RandomizedRunner.runSingleTest(RandomizedRunner.java:825)
>         at
> com.carrotsearch.randomizedtesting.RandomizedRunner.access$700(RandomizedRunner.java:132)
>         at
> com.carrotsearch.randomizedtesting.RandomizedRunner$3$1.run(RandomizedRunner.java:671)
>         at
> com.carrotsearch.randomizedtesting.RandomizedRunner$3.evaluate(RandomizedRunner.java:697)
>         at
> com.carrotsearch.randomizedtesting.RandomizedRunner$4.evaluate(RandomizedRunner.java:736)
>         at
> com.carrotsearch.randomizedtesting.RandomizedRunner$5.evaluate(RandomizedRunner.java:747)
>         at
> com.carrotsearch.randomizedtesting.rules.SystemPropertiesRestoreRule$1.evaluate(SystemPropertiesRestoreRule.java:53)
>         at
> org.apache.lucene.util.AbstractBeforeAfterRule$1.evaluate(AbstractBeforeAfterRule.java:45)
>         at
> org.apache.lucene.util.TestRuleReportUncaughtExceptions$1.evaluate(TestRuleReportUncaughtExceptions.java:68)
>         at
> org.apache.lucene.util.TestRuleStoreClassName$1.evaluate(TestRuleStoreClassName.java:38)
>         at
> org.apache.lucene.util.TestRuleIcuHack$1.evaluate(TestRuleIcuHack.java:51)
>         at
> com.carrotsearch.randomizedtesting.rules.SystemPropertiesInvariantRule$1.evaluate(SystemPropertiesInvariantRule.java:55)
>         at
> org.apache.lucene.util.TestRuleNoInstanceHooksOverrides$1.evaluate(TestRuleNoInstanceHooksOverrides.java:53)
>         at
> org.apache.lucene.util.TestRuleNoStaticHooksShadowing$1.evaluate(TestRuleNoStaticHooksShadowing.java:52)
>         at
> org.apache.lucene.util.TestRuleAssertionsRequired$1.evaluate(TestRuleAssertionsRequired.java:36)
>         at
> org.apache.lucene.util.TestRuleMarkFailure$1.evaluate(TestRuleMarkFailure.java:48)
>         at
> org.apache.lucene.util.TestRuleIgnoreAfterMaxFailures$1.evaluate(TestRuleIgnoreAfterMaxFailures.java:70)
>         at
> org.apache.lucene.util.TestRuleIgnoreTestSuites$1.evaluate(TestRuleIgnoreTestSuites.java:55)
>         at
> com.carrotsearch.randomizedtesting.RandomizedRunner.runSuite(RandomizedRunner.java:605)
>         at
> com.carrotsearch.randomizedtesting.RandomizedRunner.access$400(RandomizedRunner.java:132)
>         at
> com.carrotsearch.randomizedtesting.RandomizedRunner$2.run(RandomizedRunner.java:551)
> Caused by: org.apache.lucene.store.AlreadyClosedException: this
> IndexWriter is closed
>         at
> org.apache.lucene.index.IndexWriter.ensureOpen(IndexWriter.java:551)
>         at
> org.apache.lucene.index.IndexWriter.ensureOpen(IndexWriter.java:556)
>         at
> org.apache.lucene.index.IndexWriter.deleteAll(IndexWriter.java:1881)
>         at
> org.apache.solr.update.DirectUpdateHandler2.deleteAll(DirectUpdateHandler2.java:142)
>         at
> org.apache.solr.update.DirectUpdateHandler2.deleteByQuery(DirectUpdateHandler2.java:361)
>         at
> org.apache.solr.update.processor.RunUpdateProcessor.processDelete(RunUpdateProcessorFactory.java:67)
>         at
> org.apache.solr.update.processor.UpdateRequestProcessor.processDelete(UpdateRequestProcessor.java:55)
>         at
> org.apache.solr.update.processor.DistributedUpdateProcessor.doDeleteByQuery(DistributedUpdateProcessor.java:733)
>         at
> org.apache.solr.update.processor.DistributedUpdateProcessor.processDelete(DistributedUpdateProcessor.java:606)
>         at
> org.apache.solr.update.processor.UpdateRequestProcessor.processDelete(UpdateRequestProcessor.java:55)
>         at
> org.apache.solr.handler.dataimport.AbstractDataImportHandlerTestCase$TestUpdateRequestProcessor.processDelete(AbstractDataImportHandlerTestCase.java:364)
>         at
> org.apache.solr.handler.loader.XMLLoader.processDelete(XMLLoader.java:330)
>         at
> org.apache.solr.handler.loader.XMLLoader.processUpdate(XMLLoader.java:261)
>         at
> org.apache.solr.handler.loader.XMLLoader.load(XMLLoader.java:157)
>         at
> org.apache.solr.handler.UpdateRequestHandler$1.load(UpdateRequestHandler.java:92)
>         at
> org.apache.solr.handler.ContentStreamHandlerBase.handleRequestBody(ContentStreamHandlerBase.java:74)
>         at
> org.apache.solr.handler.RequestHandlerBase.handleRequest(RequestHandlerBase.java:129)
>         at org.apache.solr.core.SolrCore.execute(SolrCore.java:1624)
>         at
> org.apache.solr.servlet.DirectSolrConnection.request(DirectSolrConnection.java:131)
>         at org.apache.solr.util.TestHarness.update(TestHarness.java:244)
>         ... 45 more
>
>
> REGRESSION:
>  org.apache.solr.handler.dataimport.TestSqlEntityProcessorDelta2.testCompositePk_DeltaImport_add_delete
>
> Error Message:
> org.apache.lucene.store.AlreadyClosedException: this IndexWriter is closed
>
> Stack Trace:
> org.apache.solr.common.SolrException:
> org.apache.lucene.store.AlreadyClosedException: this IndexWriter is closed
>         at
> __randomizedtesting.SeedInfo.seed([35621805D30986AD:E7C3306A5A0E8D5F]:0)
>         at org.apache.solr.util.TestHarness.update(TestHarness.java:248)
>         at
> org.apache.solr.util.TestHarness.checkUpdateStatus(TestHarness.java:294)
>         at
> org.apache.solr.util.TestHarness.validateUpdate(TestHarness.java:264)
>         at
> org.apache.solr.SolrTestCaseJ4.checkUpdateU(SolrTestCaseJ4.java:440)
>         at org.apache.solr.SolrTestCaseJ4.assertU(SolrTestCaseJ4.java:419)
>         at org.apache.solr.SolrTestCaseJ4.assertU(SolrTestCaseJ4.java:413)
>         at
> org.apache.solr.SolrTestCaseJ4.clearIndex(SolrTestCaseJ4.java:785)
>         at
> org.apache.solr.handler.dataimport.TestSqlEntityProcessorDelta2.setUp(TestSqlEntityProcessorDelta2.java:68)
>         at sun.reflect.NativeMethodAccessorImpl.invoke0(Native Method)
>         at
> sun.reflect.NativeMethodAccessorImpl.invoke(NativeMethodAccessorImpl.java:57)
>         at
> sun.reflect.DelegatingMethodAccessorImpl.invoke(DelegatingMethodAccessorImpl.java:43)
>         at java.lang.reflect.Method.invoke(Method.java:601)
>         at
> com.carrotsearch.randomizedtesting.RandomizedRunner.invoke(RandomizedRunner.java:1995)
>         at
> com.carrotsearch.randomizedtesting.RandomizedRunner.access$1100(RandomizedRunner.java:132)
>         at
> com.carrotsearch.randomizedtesting.RandomizedRunner$7.evaluate(RandomizedRunner.java:875)
>         at
> com.carrotsearch.randomizedtesting.RandomizedRunner$8.evaluate(RandomizedRunner.java:891)
>         at
> com.carrotsearch.randomizedtesting.rules.SystemPropertiesRestoreRule$1.evaluate(SystemPropertiesRestoreRule.java:53)
>         at
> org.apache.lucene.util.TestRuleSetupTeardownChained$1.evaluate(TestRuleSetupTeardownChained.java:50)
>         at
> org.apache.lucene.util.TestRuleFieldCacheSanity$1.evaluate(TestRuleFieldCacheSanity.java:32)
>         at
> org.apache.lucene.util.AbstractBeforeAfterRule$1.evaluate(AbstractBeforeAfterRule.java:45)
>         at
> com.carrotsearch.randomizedtesting.rules.SystemPropertiesInvariantRule$1.evaluate(SystemPropertiesInvariantRule.java:55)
>         at
> org.apache.lucene.util.TestRuleReportUncaughtExceptions$1.evaluate(TestRuleReportUncaughtExceptions.java:68)
>         at
> org.apache.lucene.util.TestRuleThreadAndTestName$1.evaluate(TestRuleThreadAndTestName.java:48)
>         at
> org.apache.lucene.util.TestRuleIgnoreAfterMaxFailures$1.evaluate(TestRuleIgnoreAfterMaxFailures.java:70)
>         at
> org.apache.lucene.util.TestRuleMarkFailure$1.evaluate(TestRuleMarkFailure.java:48)
>         at
> com.carrotsearch.randomizedtesting.RandomizedRunner.runSingleTest(RandomizedRunner.java:825)
>         at
> com.carrotsearch.randomizedtesting.RandomizedRunner.access$700(RandomizedRunner.java:132)
>         at
> com.carrotsearch.randomizedtesting.RandomizedRunner$3$1.run(RandomizedRunner.java:671)
>         at
> com.carrotsearch.randomizedtesting.RandomizedRunner$3.evaluate(RandomizedRunner.java:697)
>         at
> com.carrotsearch.randomizedtesting.RandomizedRunner$4.evaluate(RandomizedRunner.java:736)
>         at
> com.carrotsearch.randomizedtesting.RandomizedRunner$5.evaluate(RandomizedRunner.java:747)
>         at
> com.carrotsearch.randomizedtesting.rules.SystemPropertiesRestoreRule$1.evaluate(SystemPropertiesRestoreRule.java:53)
>         at
> org.apache.lucene.util.AbstractBeforeAfterRule$1.evaluate(AbstractBeforeAfterRule.java:45)
>         at
> org.apache.lucene.util.TestRuleReportUncaughtExceptions$1.evaluate(TestRuleReportUncaughtExceptions.java:68)
>         at
> org.apache.lucene.util.TestRuleStoreClassName$1.evaluate(TestRuleStoreClassName.java:38)
>         at
> org.apache.lucene.util.TestRuleIcuHack$1.evaluate(TestRuleIcuHack.java:51)
>         at
> com.carrotsearch.randomizedtesting.rules.SystemPropertiesInvariantRule$1.evaluate(SystemPropertiesInvariantRule.java:55)
>         at
> org.apache.lucene.util.TestRuleNoInstanceHooksOverrides$1.evaluate(TestRuleNoInstanceHooksOverrides.java:53)
>         at
> org.apache.lucene.util.TestRuleNoStaticHooksShadowing$1.evaluate(TestRuleNoStaticHooksShadowing.java:52)
>         at
> org.apache.lucene.util.TestRuleAssertionsRequired$1.evaluate(TestRuleAssertionsRequired.java:36)
>         at
> org.apache.lucene.util.TestRuleMarkFailure$1.evaluate(TestRuleMarkFailure.java:48)
>         at
> org.apache.lucene.util.TestRuleIgnoreAfterMaxFailures$1.evaluate(TestRuleIgnoreAfterMaxFailures.java:70)
>         at
> org.apache.lucene.util.TestRuleIgnoreTestSuites$1.evaluate(TestRuleIgnoreTestSuites.java:55)
>         at
> com.carrotsearch.randomizedtesting.RandomizedRunner.runSuite(RandomizedRunner.java:605)
>         at
> com.carrotsearch.randomizedtesting.RandomizedRunner.access$400(RandomizedRunner.java:132)
>         at
> com.carrotsearch.randomizedtesting.RandomizedRunner$2.run(RandomizedRunner.java:551)
> Caused by: org.apache.lucene.store.AlreadyClosedException: this
> IndexWriter is closed
>         at
> org.apache.lucene.index.IndexWriter.ensureOpen(IndexWriter.java:551)
>         at
> org.apache.lucene.index.IndexWriter.ensureOpen(IndexWriter.java:556)
>         at
> org.apache.lucene.index.IndexWriter.deleteAll(IndexWriter.java:1881)
>         at
> org.apache.solr.update.DirectUpdateHandler2.deleteAll(DirectUpdateHandler2.java:142)
>         at
> org.apache.solr.update.DirectUpdateHandler2.deleteByQuery(DirectUpdateHandler2.java:361)
>         at
> org.apache.solr.update.processor.RunUpdateProcessor.processDelete(RunUpdateProcessorFactory.java:67)
>         at
> org.apache.solr.update.processor.UpdateRequestProcessor.processDelete(UpdateRequestProcessor.java:55)
>         at
> org.apache.solr.update.processor.DistributedUpdateProcessor.doDeleteByQuery(DistributedUpdateProcessor.java:733)
>         at
> org.apache.solr.update.processor.DistributedUpdateProcessor.processDelete(DistributedUpdateProcessor.java:606)
>         at
> org.apache.solr.update.processor.UpdateRequestProcessor.processDelete(UpdateRequestProcessor.java:55)
>         at
> org.apache.solr.handler.dataimport.AbstractDataImportHandlerTestCase$TestUpdateRequestProcessor.processDelete(AbstractDataImportHandlerTestCase.java:364)
>         at
> org.apache.solr.handler.loader.XMLLoader.processDelete(XMLLoader.java:330)
>         at
> org.apache.solr.handler.loader.XMLLoader.processUpdate(XMLLoader.java:261)
>         at
> org.apache.solr.handler.loader.XMLLoader.load(XMLLoader.java:157)
>         at
> org.apache.solr.handler.UpdateRequestHandler$1.load(UpdateRequestHandler.java:92)
>         at
> org.apache.solr.handler.ContentStreamHandlerBase.handleRequestBody(ContentStreamHandlerBase.java:74)
>         at
> org.apache.solr.handler.RequestHandlerBase.handleRequest(RequestHandlerBase.java:129)
>         at org.apache.solr.core.SolrCore.execute(SolrCore.java:1624)
>         at
> org.apache.solr.servlet.DirectSolrConnection.request(DirectSolrConnection.java:131)
>         at org.apache.solr.util.TestHarness.update(TestHarness.java:244)
>         ... 45 more
>
>
> REGRESSION:
>  org.apache.solr.handler.dataimport.TestSqlEntityProcessorDelta2.testCompositePk_DeltaImport_nodelta
>
> Error Message:
> org.apache.lucene.store.AlreadyClosedException: this IndexWriter is closed
>
> Stack Trace:
> org.apache.solr.common.SolrException:
> org.apache.lucene.store.AlreadyClosedException: this IndexWriter is closed
>         at
> __randomizedtesting.SeedInfo.seed([35621805D30986AD:E69BECF7B0447031]:0)
>         at org.apache.solr.util.TestHarness.update(TestHarness.java:248)
>         at
> org.apache.solr.util.TestHarness.checkUpdateStatus(TestHarness.java:294)
>         at
> org.apache.solr.util.TestHarness.validateUpdate(TestHarness.java:264)
>         at
> org.apache.solr.SolrTestCaseJ4.checkUpdateU(SolrTestCaseJ4.java:440)
>         at org.apache.solr.SolrTestCaseJ4.assertU(SolrTestCaseJ4.java:419)
>         at org.apache.solr.SolrTestCaseJ4.assertU(SolrTestCaseJ4.java:413)
>         at
> org.apache.solr.SolrTestCaseJ4.clearIndex(SolrTestCaseJ4.java:785)
>         at
> org.apache.solr.handler.dataimport.TestSqlEntityProcessorDelta2.setUp(TestSqlEntityProcessorDelta2.java:68)
>         at sun.reflect.NativeMethodAccessorImpl.invoke0(Native Method)
>         at
> sun.reflect.NativeMethodAccessorImpl.invoke(NativeMethodAccessorImpl.java:57)
>         at
> sun.reflect.DelegatingMethodAccessorImpl.invoke(DelegatingMethodAccessorImpl.java:43)
>         at java.lang.reflect.Method.invoke(Method.java:601)
>         at
> com.carrotsearch.randomizedtesting.RandomizedRunner.invoke(RandomizedRunner.java:1995)
>         at
> com.carrotsearch.randomizedtesting.RandomizedRunner.access$1100(RandomizedRunner.java:132)
>         at
> com.carrotsearch.randomizedtesting.RandomizedRunner$7.evaluate(RandomizedRunner.java:875)
>         at
> com.carrotsearch.randomizedtesting.RandomizedRunner$8.evaluate(RandomizedRunner.java:891)
>         at
> com.carrotsearch.randomizedtesting.rules.SystemPropertiesRestoreRule$1.evaluate(SystemPropertiesRestoreRule.java:53)
>         at
> org.apache.lucene.util.TestRuleSetupTeardownChained$1.evaluate(TestRuleSetupTeardownChained.java:50)
>         at
> org.apache.lucene.util.TestRuleFieldCacheSanity$1.evaluate(TestRuleFieldCacheSanity.java:32)
>         at
> org.apache.lucene.util.AbstractBeforeAfterRule$1.evaluate(AbstractBeforeAfterRule.java:45)
>         at
> com.carrotsearch.randomizedtesting.rules.SystemPropertiesInvariantRule$1.evaluate(SystemPropertiesInvariantRule.java:55)
>         at
> org.apache.lucene.util.TestRuleReportUncaughtExceptions$1.evaluate(TestRuleReportUncaughtExceptions.java:68)
>         at
> org.apache.lucene.util.TestRuleThreadAndTestName$1.evaluate(TestRuleThreadAndTestName.java:48)
>         at
> org.apache.lucene.util.TestRuleIgnoreAfterMaxFailures$1.evaluate(TestRuleIgnoreAfterMaxFailures.java:70)
>         at
> org.apache.lucene.util.TestRuleMarkFailure$1.evaluate(TestRuleMarkFailure.java:48)
>         at
> com.carrotsearch.randomizedtesting.RandomizedRunner.runSingleTest(RandomizedRunner.java:825)
>         at
> com.carrotsearch.randomizedtesting.RandomizedRunner.access$700(RandomizedRunner.java:132)
>         at
> com.carrotsearch.randomizedtesting.RandomizedRunner$3$1.run(RandomizedRunner.java:671)
>         at
> com.carrotsearch.randomizedtesting.RandomizedRunner$3.evaluate(RandomizedRunner.java:697)
>         at
> com.carrotsearch.randomizedtesting.RandomizedRunner$4.evaluate(RandomizedRunner.java:736)
>         at
> com.carrotsearch.randomizedtesting.RandomizedRunner$5.evaluate(RandomizedRunner.java:747)
>         at
> com.carrotsearch.randomizedtesting.rules.SystemPropertiesRestoreRule$1.evaluate(SystemPropertiesRestoreRule.java:53)
>         at
> org.apache.lucene.util.AbstractBeforeAfterRule$1.evaluate(AbstractBeforeAfterRule.java:45)
>         at
> org.apache.lucene.util.TestRuleReportUncaughtExceptions$1.evaluate(TestRuleReportUncaughtExceptions.java:68)
>         at
> org.apache.lucene.util.TestRuleStoreClassName$1.evaluate(TestRuleStoreClassName.java:38)
>         at
> org.apache.lucene.util.TestRuleIcuHack$1.evaluate(TestRuleIcuHack.java:51)
>         at
> com.carrotsearch.randomizedtesting.rules.SystemPropertiesInvariantRule$1.evaluate(SystemPropertiesInvariantRule.java:55)
>         at
> org.apache.lucene.util.TestRuleNoInstanceHooksOverrides$1.evaluate(TestRuleNoInstanceHooksOverrides.java:53)
>         at
> org.apache.lucene.util.TestRuleNoStaticHooksShadowing$1.evaluate(TestRuleNoStaticHooksShadowing.java:52)
>         at
> org.apache.lucene.util.TestRuleAssertionsRequired$1.evaluate(TestRuleAssertionsRequired.java:36)
>         at
> org.apache.lucene.util.TestRuleMarkFailure$1.evaluate(TestRuleMarkFailure.java:48)
>         at
> org.apache.lucene.util.TestRuleIgnoreAfterMaxFailures$1.evaluate(TestRuleIgnoreAfterMaxFailures.java:70)
>         at
> org.apache.lucene.util.TestRuleIgnoreTestSuites$1.evaluate(TestRuleIgnoreTestSuites.java:55)
>         at
> com.carrotsearch.randomizedtesting.RandomizedRunner.runSuite(RandomizedRunner.java:605)
>         at
> com.carrotsearch.randomizedtesting.RandomizedRunner.access$400(RandomizedRunner.java:132)
>         at
> com.carrotsearch.randomizedtesting.RandomizedRunner$2.run(RandomizedRunner.java:551)
> Caused by: org.apache.lucene.store.AlreadyClosedException: this
> IndexWriter is closed
>         at
> org.apache.lucene.index.IndexWriter.ensureOpen(IndexWriter.java:551)
>         at
> org.apache.lucene.index.IndexWriter.ensureOpen(IndexWriter.java:556)
>         at
> org.apache.lucene.index.IndexWriter.deleteAll(IndexWriter.java:1881)
>         at
> org.apache.solr.update.DirectUpdateHandler2.deleteAll(DirectUpdateHandler2.java:142)
>         at
> org.apache.solr.update.DirectUpdateHandler2.deleteByQuery(DirectUpdateHandler2.java:361)
>         at
> org.apache.solr.update.processor.RunUpdateProcessor.processDelete(RunUpdateProcessorFactory.java:67)
>         at
> org.apache.solr.update.processor.UpdateRequestProcessor.processDelete(UpdateRequestProcessor.java:55)
>         at
> org.apache.solr.update.processor.DistributedUpdateProcessor.doDeleteByQuery(DistributedUpdateProcessor.java:733)
>         at
> org.apache.solr.update.processor.DistributedUpdateProcessor.processDelete(DistributedUpdateProcessor.java:606)
>         at
> org.apache.solr.update.processor.UpdateRequestProcessor.processDelete(UpdateRequestProcessor.java:55)
>         at
> org.apache.solr.handler.dataimport.AbstractDataImportHandlerTestCase$TestUpdateRequestProcessor.processDelete(AbstractDataImportHandlerTestCase.java:364)
>         at
> org.apache.solr.handler.loader.XMLLoader.processDelete(XMLLoader.java:330)
>         at
> org.apache.solr.handler.loader.XMLLoader.processUpdate(XMLLoader.java:261)
>         at
> org.apache.solr.handler.loader.XMLLoader.load(XMLLoader.java:157)
>         at
> org.apache.solr.handler.UpdateRequestHandler$1.load(UpdateRequestHandler.java:92)
>         at
> org.apache.solr.handler.ContentStreamHandlerBase.handleRequestBody(ContentStreamHandlerBase.java:74)
>         at
> org.apache.solr.handler.RequestHandlerBase.handleRequest(RequestHandlerBase.java:129)
>         at org.apache.solr.core.SolrCore.execute(SolrCore.java:1624)
>         at
> org.apache.solr.servlet.DirectSolrConnection.request(DirectSolrConnection.java:131)
>         at org.apache.solr.util.TestHarness.update(TestHarness.java:244)
>         ... 45 more
>
>
> REGRESSION:
>  org.apache.solr.handler.dataimport.TestSqlEntityProcessorDelta2.testCompositePk_FullImport
>
> Error Message:
> org.apache.lucene.store.AlreadyClosedException: this IndexWriter is closed
>
> Stack Trace:
> org.apache.solr.common.SolrException:
> org.apache.lucene.store.AlreadyClosedException: this IndexWriter is closed
>         at
> __randomizedtesting.SeedInfo.seed([35621805D30986AD:6B0B56320951D67B]:0)
>         at org.apache.solr.util.TestHarness.update(TestHarness.java:248)
>         at
> org.apache.solr.util.TestHarness.checkUpdateStatus(TestHarness.java:294)
>         at
> org.apache.solr.util.TestHarness.validateUpdate(TestHarness.java:264)
>         at
> org.apache.solr.SolrTestCaseJ4.checkUpdateU(SolrTestCaseJ4.java:440)
>         at org.apache.solr.SolrTestCaseJ4.assertU(SolrTestCaseJ4.java:419)
>         at org.apache.solr.SolrTestCaseJ4.assertU(SolrTestCaseJ4.java:413)
>         at
> org.apache.solr.SolrTestCaseJ4.clearIndex(SolrTestCaseJ4.java:785)
>         at
> org.apache.solr.handler.dataimport.TestSqlEntityProcessorDelta2.setUp(TestSqlEntityProcessorDelta2.java:68)
>         at sun.reflect.NativeMethodAccessorImpl.invoke0(Native Method)
>         at
> sun.reflect.NativeMethodAccessorImpl.invoke(NativeMethodAccessorImpl.java:57)
>         at
> sun.reflect.DelegatingMethodAccessorImpl.invoke(DelegatingMethodAccessorImpl.java:43)
>         at java.lang.reflect.Method.invoke(Method.java:601)
>         at
> com.carrotsearch.randomizedtesting.RandomizedRunner.invoke(RandomizedRunner.java:1995)
>         at
> com.carrotsearch.randomizedtesting.RandomizedRunner.access$1100(RandomizedRunner.java:132)
>         at
> com.carrotsearch.randomizedtesting.RandomizedRunner$7.evaluate(RandomizedRunner.java:875)
>         at
> com.carrotsearch.randomizedtesting.RandomizedRunner$8.evaluate(RandomizedRunner.java:891)
>         at
> com.carrotsearch.randomizedtesting.rules.SystemPropertiesRestoreRule$1.evaluate(SystemPropertiesRestoreRule.java:53)
>         at
> org.apache.lucene.util.TestRuleSetupTeardownChained$1.evaluate(TestRuleSetupTeardownChained.java:50)
>         at
> org.apache.lucene.util.TestRuleFieldCacheSanity$1.evaluate(TestRuleFieldCacheSanity.java:32)
>         at
> org.apache.lucene.util.AbstractBeforeAfterRule$1.evaluate(AbstractBeforeAfterRule.java:45)
>         at
> com.carrotsearch.randomizedtesting.rules.SystemPropertiesInvariantRule$1.evaluate(SystemPropertiesInvariantRule.java:55)
>         at
> org.apache.lucene.util.TestRuleReportUncaughtExceptions$1.evaluate(TestRuleReportUncaughtExceptions.java:68)
>         at
> org.apache.lucene.util.TestRuleThreadAndTestName$1.evaluate(TestRuleThreadAndTestName.java:48)
>         at
> org.apache.lucene.util.TestRuleIgnoreAfterMaxFailures$1.evaluate(TestRuleIgnoreAfterMaxFailures.java:70)
>         at
> org.apache.lucene.util.TestRuleMarkFailure$1.evaluate(TestRuleMarkFailure.java:48)
>         at
> com.carrotsearch.randomizedtesting.RandomizedRunner.runSingleTest(RandomizedRunner.java:825)
>         at
> com.carrotsearch.randomizedtesting.RandomizedRunner.access$700(RandomizedRunner.java:132)
>         at
> com.carrotsearch.randomizedtesting.RandomizedRunner$3$1.run(RandomizedRunner.java:671)
>         at
> com.carrotsearch.randomizedtesting.RandomizedRunner$3.evaluate(RandomizedRunner.java:697)
>         at
> com.carrotsearch.randomizedtesting.RandomizedRunner$4.evaluate(RandomizedRunner.java:736)
>         at
> com.carrotsearch.randomizedtesting.RandomizedRunner$5.evaluate(RandomizedRunner.java:747)
>         at
> com.carrotsearch.randomizedtesting.rules.SystemPropertiesRestoreRule$1.evaluate(SystemPropertiesRestoreRule.java:53)
>         at
> org.apache.lucene.util.AbstractBeforeAfterRule$1.evaluate(AbstractBeforeAfterRule.java:45)
>         at
> org.apache.lucene.util.TestRuleReportUncaughtExceptions$1.evaluate(TestRuleReportUncaughtExceptions.java:68)
>         at
> org.apache.lucene.util.TestRuleStoreClassName$1.evaluate(TestRuleStoreClassName.java:38)
>         at
> org.apache.lucene.util.TestRuleIcuHack$1.evaluate(TestRuleIcuHack.java:51)
>         at
> com.carrotsearch.randomizedtesting.rules.SystemPropertiesInvariantRule$1.evaluate(SystemPropertiesInvariantRule.java:55)
>         at
> org.apache.lucene.util.TestRuleNoInstanceHooksOverrides$1.evaluate(TestRuleNoInstanceHooksOverrides.java:53)
>         at
> org.apache.lucene.util.TestRuleNoStaticHooksShadowing$1.evaluate(TestRuleNoStaticHooksShadowing.java:52)
>         at
> org.apache.lucene.util.TestRuleAssertionsRequired$1.evaluate(TestRuleAssertionsRequired.java:36)
>         at
> org.apache.lucene.util.TestRuleMarkFailure$1.evaluate(TestRuleMarkFailure.java:48)
>         at
> org.apache.lucene.util.TestRuleIgnoreAfterMaxFailures$1.evaluate(TestRuleIgnoreAfterMaxFailures.java:70)
>         at
> org.apache.lucene.util.TestRuleIgnoreTestSuites$1.evaluate(TestRuleIgnoreTestSuites.java:55)
>         at
> com.carrotsearch.randomizedtesting.RandomizedRunner.runSuite(RandomizedRunner.java:605)
>         at
> com.carrotsearch.randomizedtesting.RandomizedRunner.access$400(RandomizedRunner.java:132)
>         at
> com.carrotsearch.randomizedtesting.RandomizedRunner$2.run(RandomizedRunner.java:551)
> Caused by: org.apache.lucene.store.AlreadyClosedException: this
> IndexWriter is closed
>         at
> org.apache.lucene.index.IndexWriter.ensureOpen(IndexWriter.java:551)
>         at
> org.apache.lucene.index.IndexWriter.ensureOpen(IndexWriter.java:556)
>         at
> org.apache.lucene.index.IndexWriter.deleteAll(IndexWriter.java:1881)
>         at
> org.apache.solr.update.DirectUpdateHandler2.deleteAll(DirectUpdateHandler2.java:142)
>         at
> org.apache.solr.update.DirectUpdateHandler2.deleteByQuery(DirectUpdateHandler2.java:361)
>         at
> org.apache.solr.update.processor.RunUpdateProcessor.processDelete(RunUpdateProcessorFactory.java:67)
>         at
> org.apache.solr.update.processor.UpdateRequestProcessor.processDelete(UpdateRequestProcessor.java:55)
>         at
> org.apache.solr.update.processor.DistributedUpdateProcessor.doDeleteByQuery(DistributedUpdateProcessor.java:733)
>         at
> org.apache.solr.update.processor.DistributedUpdateProcessor.processDelete(DistributedUpdateProcessor.java:606)
>         at
> org.apache.solr.update.processor.UpdateRequestProcessor.processDelete(UpdateRequestProcessor.java:55)
>         at
> org.apache.solr.handler.dataimport.AbstractDataImportHandlerTestCase$TestUpdateRequestProcessor.processDelete(AbstractDataImportHandlerTestCase.java:364)
>         at
> org.apache.solr.handler.loader.XMLLoader.processDelete(XMLLoader.java:330)
>         at
> org.apache.solr.handler.loader.XMLLoader.processUpdate(XMLLoader.java:261)
>         at
> org.apache.solr.handler.loader.XMLLoader.load(XMLLoader.java:157)
>         at
> org.apache.solr.handler.UpdateRequestHandler$1.load(UpdateRequestHandler.java:92)
>         at
> org.apache.solr.handler.ContentStreamHandlerBase.handleRequestBody(ContentStreamHandlerBase.java:74)
>         at
> org.apache.solr.handler.RequestHandlerBase.handleRequest(RequestHandlerBase.java:129)
>         at org.apache.solr.core.SolrCore.execute(SolrCore.java:1624)
>         at
> org.apache.solr.servlet.DirectSolrConnection.request(DirectSolrConnection.java:131)
>         at org.apache.solr.util.TestHarness.update(TestHarness.java:244)
>         ... 45 more
>
>
>
>
> Build Log:
> [...truncated 9823 lines...]
> [junit4:junit4] Suite:
> org.apache.solr.handler.dataimport.TestSqlEntityProcessorDelta2
> [junit4:junit4]    > (@BeforeClass output)
> [junit4:junit4]   2> 0 T53 oas.SolrTestCaseJ4.initCore ####initCore
> [junit4:junit4]   2> Creating dataDir:
> /mnt/ssd/jenkins/workspace/Lucene-Solr-trunk-Linux-Java7-64/checkout/solr/build/contrib/solr-dataimporthandler/test/J1/./solrtest-TestSqlEntityProcessorDelta2-1342944407443
> [junit4:junit4]   2> 1 T53 oasc.SolrResourceLoader.<init> new
> SolrResourceLoader for directory:
> '/mnt/ssd/jenkins/workspace/Lucene-Solr-trunk-Linux-Java7-64/checkout/solr/build/contrib/solr-dataimporthandler/test-files/dih/solr/collection1/'
> [junit4:junit4]   2> 25 T53 oasc.SolrConfig.<init> Using Lucene
> MatchVersion: LUCENE_50
> [junit4:junit4]   2> 64 T53 oasc.SolrConfig.<init> Loaded SolrConfig:
> dataimport-solrconfig.xml
> [junit4:junit4]   2> 64 T53 oass.IndexSchema.readSchema Reading Solr Schema
> [junit4:junit4]   2> 75 T53 oass.IndexSchema.readSchema Schema name=test
> [junit4:junit4]   2> 233 T53 oass.IndexSchema.readSchema default search
> field in schema is desc
> [junit4:junit4]   2> 234 T53 oass.IndexSchema.readSchema query parser
> default operator is OR
> [junit4:junit4]   2> 235 T53 oass.IndexSchema.readSchema unique key field:
> solr_id
> [junit4:junit4]   2> 236 T53 oasc.SolrResourceLoader.locateSolrHome JNDI
> not configured for solr (NoInitialContextEx)
> [junit4:junit4]   2> 237 T53 oasc.SolrResourceLoader.locateSolrHome using
> system property solr.solr.home:
> /mnt/ssd/jenkins/workspace/Lucene-Solr-trunk-Linux-Java7-64/checkout/solr/build/contrib/solr-dataimporthandler/test-files/dih/solr
> [junit4:junit4]   2> 237 T53 oasc.SolrResourceLoader.<init> new
> SolrResourceLoader for directory:
> '/mnt/ssd/jenkins/workspace/Lucene-Solr-trunk-Linux-Java7-64/checkout/solr/build/contrib/solr-dataimporthandler/test-files/dih/solr/'
> [junit4:junit4]   2> 237 T53 oasc.CoreContainer.<init> New CoreContainer
> 1517475417
> [junit4:junit4]   2> 238 T53 oasc.SolrCore.<init> [collection1] Opening
> new SolrCore at
> /mnt/ssd/jenkins/workspace/Lucene-Solr-trunk-Linux-Java7-64/checkout/solr/build/contrib/solr-dataimporthandler/test-files/dih/solr/collection1/,
> dataDir=/mnt/ssd/jenkins/workspace/Lucene-Solr-trunk-Linux-Java7-64/checkout/solr/build/contrib/solr-dataimporthandler/test/J1/./solrtest-TestSqlEntityProcessorDelta2-1342944407443/
> [junit4:junit4]   2> 238 T53 oasc.SolrCore.<init> JMX monitoring not
> detected for core: collection1
> [junit4:junit4]   2> 238 T53 oasc.SolrCore.initListeners [collection1]
> Added SolrEventListener for newSearcher:
> org.apache.solr.core.QuerySenderListener{queries=[{q=solr,start=0,rows=10},
> {q=rocks,start=0,rows=10}, {q=static newSearcher warming query from
> solrconfig.xml}]}
> [junit4:junit4]   2> 238 T53 oasc.SolrCore.initListeners [collection1]
> Added SolrEventListener for firstSearcher:
> org.apache.solr.core.QuerySenderListener{queries=[]}
> [junit4:junit4]   2> 239 T53 oasc.SolrCore.getNewIndexDir WARNING New
> index directory detected: old=null
> new=/mnt/ssd/jenkins/workspace/Lucene-Solr-trunk-Linux-Java7-64/checkout/solr/build/contrib/solr-dataimporthandler/test/J1/./solrtest-TestSqlEntityProcessorDelta2-1342944407443/index/
> [junit4:junit4]   2> 239 T53 oasc.SolrCore.initIndex WARNING [collection1]
> Solr index directory
> '/mnt/ssd/jenkins/workspace/Lucene-Solr-trunk-Linux-Java7-64/checkout/solr/build/contrib/solr-dataimporthandler/test/J1/./solrtest-TestSqlEntityProcessorDelta2-1342944407443/index'
> doesn't exist. Creating new index...
> [junit4:junit4]   2> 241 T53 oasc.SolrDeletionPolicy.onCommit
> SolrDeletionPolicy.onCommit: commits:num=1
> [junit4:junit4]   2>
>  commit{dir=MockDirWrapper(org.apache.lucene.store.RAMDirectory@29569b73lockFactory=org.apache.lucene.store.NativeFSLockFactory@31526886
> ),segFN=segments_1,generation=1,filenames=[segments_1]
> [junit4:junit4]   2> 241 T53 oasc.SolrDeletionPolicy.updateCommits newest
> commit = 1
> [junit4:junit4]   2> 242 T53 oasup.UpdateRequestProcessorChain.init
> inserting DistributedUpdateProcessorFactory into
> updateRequestProcessorChain "" (default)
> [junit4:junit4]   2> 243 T53 oasc.RequestHandlers.initHandlersFromConfig
> created standard: solr.StandardRequestHandler
> [junit4:junit4]   2> 243 T53 oasc.RequestHandlers.initHandlersFromConfig
> created /dataimport: org.apache.solr.handler.dataimport.DataImportHandler
> [junit4:junit4]   2> 243 T53 oasc.RequestHandlers.initHandlersFromConfig
> created /search: org.apache.solr.handler.component.SearchHandler
> [junit4:junit4]   2> 244 T53 oasc.RequestHandlers.initHandlersFromConfig
> created /update: solr.UpdateRequestHandler
> [junit4:junit4]   2> 244 T53 oashl.XMLLoader.init
> xsltCacheLifetimeSeconds=60
> [junit4:junit4]   2> 247 T53 oass.SolrIndexSearcher.<init> Opening
> Searcher@41bdfd28 main
> [junit4:junit4]   2> 247 T53 oass.SolrIndexSearcher.getIndexDir WARNING
> WARNING: Directory impl does not support setting indexDir:
> org.apache.lucene.store.MockDirectoryWrapper
> [junit4:junit4]   2> 248 T53 oasu.CommitTracker.<init> Hard AutoCommit:
> disabled
> [junit4:junit4]   2> 248 T53 oasu.CommitTracker.<init> Soft AutoCommit:
> disabled
> [junit4:junit4]   2> 248 T53 oashc.HttpShardHandlerFactory.getParameter
> Setting socketTimeout to: 0
> [junit4:junit4]   2> 249 T53 oashc.HttpShardHandlerFactory.getParameter
> Setting urlScheme to: http://
> [junit4:junit4]   2> 249 T53 oashc.HttpShardHandlerFactory.getParameter
> Setting connTimeout to: 0
> [junit4:junit4]   2> 249 T53 oashc.HttpShardHandlerFactory.getParameter
> Setting maxConnectionsPerHost to: 20
> [junit4:junit4]   2> 249 T53 oashc.HttpShardHandlerFactory.getParameter
> Setting corePoolSize to: 0
> [junit4:junit4]   2> 250 T53 oashc.HttpShardHandlerFactory.getParameter
> Setting maximumPoolSize to: 2147483647
> [junit4:junit4]   2> 250 T53 oashc.HttpShardHandlerFactory.getParameter
> Setting maxThreadIdleTime to: 5
> [junit4:junit4]   2> 250 T53 oashc.HttpShardHandlerFactory.getParameter
> Setting sizeOfQueue to: -1
> [junit4:junit4]   2> 250 T53 oashc.HttpShardHandlerFactory.getParameter
> Setting fairnessPolicy to: false
> [junit4:junit4]   2> 251 T53 oascsi.HttpClientUtil.createClient Creating
> new http client,
> config:maxConnectionsPerHost=20&maxConnections=10000&socketTimeout=0&connTimeout=0&retry=false
> [junit4:junit4]   2> 254 T54 oasc.QuerySenderListener.newSearcher
> QuerySenderListener sending requests to Searcher@41bdfd28main{StandardDirectoryReader(segments_1:1)}
> [junit4:junit4]   2> 254 T53 oasc.CoreContainer.register registering core:
> collection1
> [junit4:junit4]   2> 255 T54 oasc.QuerySenderListener.newSearcher
> QuerySenderListener done.
> [junit4:junit4]   2> 255 T54 oasc.SolrCore.registerSearcher [collection1]
> Registered new searcher Searcher@41bdfd28main{StandardDirectoryReader(segments_1:1)}
> [junit4:junit4]   2> 255 T53 oas.SolrTestCaseJ4.initCore ####initCore end
> [junit4:junit4]   2>
> [junit4:junit4] ERROR   0.09s J1 |
> TestSqlEntityProcessorDelta2.testCompositePk_DeltaImport_replace_nodelete
> [junit4:junit4]    > Throwable #1: java.lang.RuntimeException: Exception
> during query
> [junit4:junit4]    >    at
> __randomizedtesting.SeedInfo.seed([35621805D30986AD:B81829D4E867C647]:0)
> [junit4:junit4]    >    at
> org.apache.solr.SolrTestCaseJ4.assertQ(SolrTestCaseJ4.java:486)
> [junit4:junit4]    >    at
> org.apache.solr.SolrTestCaseJ4.assertQ(SolrTestCaseJ4.java:453)
> [junit4:junit4]    >    at
> org.apache.solr.handler.dataimport.TestSqlEntityProcessorDelta2.add1document(TestSqlEntityProcessorDelta2.java:85)
> [junit4:junit4]    >    at
> org.apache.solr.handler.dataimport.TestSqlEntityProcessorDelta2.testCompositePk_DeltaImport_replace_nodelete(TestSqlEntityProcessorDelta2.java:178)
> [junit4:junit4]    >    at
> sun.reflect.NativeMethodAccessorImpl.invoke0(Native Method)
> [junit4:junit4]    >    at
> sun.reflect.NativeMethodAccessorImpl.invoke(NativeMethodAccessorImpl.java:57)
> [junit4:junit4]    >    at
> sun.reflect.DelegatingMethodAccessorImpl.invoke(DelegatingMethodAccessorImpl.java:43)
> [junit4:junit4]    >    at java.lang.reflect.Method.invoke(Method.java:601)
> [junit4:junit4]    >    at
> com.carrotsearch.randomizedtesting.RandomizedRunner.invoke(RandomizedRunner.java:1995)
> [junit4:junit4]    >    at
> com.carrotsearch.randomizedtesting.RandomizedRunner.access$1100(RandomizedRunner.java:132)
> [junit4:junit4]    >    at
> com.carrotsearch.randomizedtesting.RandomizedRunner$6.evaluate(RandomizedRunner.java:818)
> [junit4:junit4]    >    at
> com.carrotsearch.randomizedtesting.RandomizedRunner$7.evaluate(RandomizedRunner.java:877)
> [junit4:junit4]    >    at
> com.carrotsearch.randomizedtesting.RandomizedRunner$8.evaluate(RandomizedRunner.java:891)
> [junit4:junit4]    >    at
> com.carrotsearch.randomizedtesting.rules.SystemPropertiesRestoreRule$1.evaluate(SystemPropertiesRestoreRule.java:53)
> [junit4:junit4]    >    at
> org.apache.lucene.util.TestRuleSetupTeardownChained$1.evaluate(TestRuleSetupTeardownChained.java:50)
> [junit4:junit4]    >    at
> org.apache.lucene.util.TestRuleFieldCacheSanity$1.evaluate(TestRuleFieldCacheSanity.java:32)
> [junit4:junit4]    >    at
> org.apache.lucene.util.AbstractBeforeAfterRule$1.evaluate(AbstractBeforeAfterRule.java:45)
> [junit4:junit4]    >    at
> com.carrotsearch.randomizedtesting.rules.SystemPropertiesInvariantRule$1.evaluate(SystemPropertiesInvariantRule.java:55)
> [junit4:junit4]    >    at
> org.apache.lucene.util.TestRuleReportUncaughtExceptions$1.evaluate(TestRuleReportUncaughtExceptions.java:68)
> [junit4:junit4]    >    at
> org.apache.lucene.util.TestRuleThreadAndTestName$1.evaluate(TestRuleThreadAndTestName.java:48)
> [junit4:junit4]    >    at
> org.apache.lucene.util.TestRuleIgnoreAfterMaxFailures$1.evaluate(TestRuleIgnoreAfterMaxFailures.java:70)
> [junit4:junit4]    >    at
> org.apache.lucene.util.TestRuleMarkFailure$1.evaluate(TestRuleMarkFailure.java:48)
> [junit4:junit4]    >    at
> com.carrotsearch.randomizedtesting.RandomizedRunner.runSingleTest(RandomizedRunner.java:825)
> [junit4:junit4]    >    at
> com.carrotsearch.randomizedtesting.RandomizedRunner.access$700(RandomizedRunner.java:132)
> [junit4:junit4]    >    at
> com.carrotsearch.randomizedtesting.RandomizedRunner$3$1.run(RandomizedRunner.java:671)
> [junit4:junit4]    >    at
> com.carrotsearch.randomizedtesting.RandomizedRunner$3.evaluate(RandomizedRunner.java:697)
> [junit4:junit4]    >    at
> com.carrotsearch.randomizedtesting.RandomizedRunner$4.evaluate(RandomizedRunner.java:736)
> [junit4:junit4]    >    at
> com.carrotsearch.randomizedtesting.RandomizedRunner$5.evaluate(RandomizedRunner.java:747)
> [junit4:junit4]    >    at
> com.carrotsearch.randomizedtesting.rules.SystemPropertiesRestoreRule$1.evaluate(SystemPropertiesRestoreRule.java:53)
> [junit4:junit4]    >    at
> org.apache.lucene.util.AbstractBeforeAfterRule$1.evaluate(AbstractBeforeAfterRule.java:45)
> [junit4:junit4]    >    at
> org.apache.lucene.util.TestRuleReportUncaughtExceptions$1.evaluate(TestRuleReportUncaughtExceptions.java:68)
> [junit4:junit4]    >    at
> org.apache.lucene.util.TestRuleStoreClassName$1.evaluate(TestRuleStoreClassName.java:38)
> [junit4:junit4]    >    at
> org.apache.lucene.util.TestRuleIcuHack$1.evaluate(TestRuleIcuHack.java:51)
> [junit4:junit4]    >    at
> com.carrotsearch.randomizedtesting.rules.SystemPropertiesInvariantRule$1.evaluate(SystemPropertiesInvariantRule.java:55)
> [junit4:junit4]    >    at
> org.apache.lucene.util.TestRuleNoInstanceHooksOverrides$1.evaluate(TestRuleNoInstanceHooksOverrides.java:53)
> [junit4:junit4]    >    at
> org.apache.lucene.util.TestRuleNoStaticHooksShadowing$1.evaluate(TestRuleNoStaticHooksShadowing.java:52)
> [junit4:junit4]    >    at
> org.apache.lucene.util.TestRuleAssertionsRequired$1.evaluate(TestRuleAssertionsRequired.java:36)
> [junit4:junit4]    >    at
> org.apache.lucene.util.TestRuleMarkFailure$1.evaluate(TestRuleMarkFailure.java:48)
> [junit4:junit4]    >    at
> org.apache.lucene.util.TestRuleIgnoreAfterMaxFailures$1.evaluate(TestRuleIgnoreAfterMaxFailures.java:70)
> [junit4:junit4]    >    at
> org.apache.lucene.util.TestRuleIgnoreTestSuites$1.evaluate(TestRuleIgnoreTestSuites.java:55)
> [junit4:junit4]    >    at
> com.carrotsearch.randomizedtesting.RandomizedRunner.runSuite(RandomizedRunner.java:605)
> [junit4:junit4]    >    at
> com.carrotsearch.randomizedtesting.RandomizedRunner.access$400(RandomizedRunner.java:132)
> [junit4:junit4]    >    at
> com.carrotsearch.randomizedtesting.RandomizedRunner$2.run(RandomizedRunner.java:551)
> [junit4:junit4]    > Caused by: java.lang.RuntimeException: REQUEST
> FAILED: xpath=//*[@numFound='1']
> [junit4:junit4]    >    xml response was: <?xml version="1.0"
> encoding="UTF-8"?>
> [junit4:junit4]    > <response>
> [junit4:junit4]    > <lst name="responseHeader"><int
> name="status">0</int><int name="QTime">1</int><lst name="params"><str
> name="start">0</str><str name="q">*:* OR add1document</str><str
> name="qt">standard</str><str name="rows">20</str><str
> name="version">2.2</str></lst></lst><result name="response" numFound="0"
> start="0"></result>
> [junit4:junit4]    > </response>
> [junit4:junit4]    >
> [junit4:junit4]    >    request
> was:start=0&q=*:*+OR+add1document&qt=standard&rows=20&version=2.2
> [junit4:junit4]    >    at
> org.apache.solr.SolrTestCaseJ4.assertQ(SolrTestCaseJ4.java:479)
> [junit4:junit4]    >    ... 42 more
> [junit4:junit4]    >
> [junit4:junit4]   2> 276 T53 oas.SolrTestCaseJ4.setUp ###Starting
> testCompositePk_DeltaImport_replace_nodelete
> [junit4:junit4]   2> ASYNC  NEW_CORE C6 name=collection1
> org.apache.solr.core.SolrCore@60efa746
> [junit4:junit4]   2> 282 T53 C6 oasu.DirectUpdateHandler2.deleteAll
> [collection1] REMOVING ALL DOCUMENTS FROM INDEX
> [junit4:junit4]   2> 284 T53 C6 oasc.SolrDeletionPolicy.onInit
> SolrDeletionPolicy.onInit: commits:num=1
> [junit4:junit4]   2>
>  commit{dir=MockDirWrapper(org.apache.lucene.store.RAMDirectory@29569b73lockFactory=org.apache.lucene.store.NativeFSLockFactory@31526886
> ),segFN=segments_1,generation=1,filenames=[segments_1]
> [junit4:junit4]   2> 284 T53 C6 oasc.SolrDeletionPolicy.updateCommits
> newest commit = 1
> [junit4:junit4]   2> 285 T53 C6 UPDATE [collection1] webapp=null path=null
> params={} {deleteByQuery=*:*} 0 4
> [junit4:junit4]   2> 294 T53 C6 oasu.DirectUpdateHandler2.commit start
> commit{flags=0,version=0,optimize=false,openSearcher=true,waitSearcher=true,expungeDeletes=false,softCommit=false}
> [junit4:junit4]   2> 295 T53 C6 oasc.SolrDeletionPolicy.onCommit
> SolrDeletionPolicy.onCommit: commits:num=2
> [junit4:junit4]   2>
>  commit{dir=MockDirWrapper(org.apache.lucene.store.RAMDirectory@29569b73lockFactory=org.apache.lucene.store.NativeFSLockFactory@31526886
> ),segFN=segments_1,generation=1,filenames=[segments_1]
> [junit4:junit4]   2>
>  commit{dir=MockDirWrapper(org.apache.lucene.store.RAMDirectory@29569b73lockFactory=org.apache.lucene.store.NativeFSLockFactory@31526886
> ),segFN=segments_2,generation=2,filenames=[segments_2]
> [junit4:junit4]   2> 296 T53 C6 oasc.SolrDeletionPolicy.updateCommits
> newest commit = 2
> [junit4:junit4]   2> 297 T53 C6 oass.SolrIndexSearcher.<init> Opening
> Searcher@44cdbc59 main
> [junit4:junit4]   2> 297 T53 C6 oass.SolrIndexSearcher.getIndexDir WARNING
> WARNING: Directory impl does not support setting indexDir:
> org.apache.lucene.store.MockDirectoryWrapper
> [junit4:junit4]   2> 298 T53 C6 oasu.DirectUpdateHandler2.commit
> end_commit_flush
> [junit4:junit4]   2> 298 T54 oasc.QuerySenderListener.newSearcher
> QuerySenderListener sending requests to Searcher@44cdbc59main{StandardDirectoryReader(segments_2:2)}
> [junit4:junit4]   2> 299 T54 C6 REQ [collection1] webapp=null path=null
> params={start=0&event=newSearcher&q=solr&distrib=false&rows=10} hits=0
> status=0 QTime=0
> [junit4:junit4]   2> 300 T54 C6 REQ [collection1] webapp=null path=null
> params={start=0&event=newSearcher&q=rocks&distrib=false&rows=10} hits=0
> status=0 QTime=0
> [junit4:junit4]   2> 300 T54 C6 REQ [collection1] webapp=null path=null
> params={event=newSearcher&q=static+newSearcher+warming+query+from+solrconfig.xml&distrib=false}
> hits=0 status=0 QTime=0
> [junit4:junit4]   2> 301 T54 oasc.QuerySenderListener.newSearcher
> QuerySenderListener done.
> [junit4:junit4]   2> 301 T54 oasc.SolrCore.registerSearcher [collection1]
> Registered new searcher Searcher@44cdbc59main{StandardDirectoryReader(segments_2:2)}
> [junit4:junit4]   2> 302 T53 C6 UPDATE [collection1] webapp=null path=null
> params={} {commit=} 0 8
> [junit4:junit4]   2> 305 T53 C6
> oashd.DataImportHandler.processConfiguration No configuration specified in
> solrconfig.xml for DataImportHandler
> [junit4:junit4]   2> 308 T53 C6 oashd.DataImporter.loadDataConfig Data
> Configuration loaded successfully
> [junit4:junit4]   2> 308 T53 C6 oashd.DataImporter.doFullImport Starting
> Full Import
> [junit4:junit4]   2> 309 T53 C6
> oashd.SimplePropertiesWriter.readIndexerProperties Read
> dataimport.properties
> [junit4:junit4]   2> 310 T53 C6 oasc.SolrException.log SEVERE Full Import
> failed:org.apache.solr.handler.dataimport.DataImportHandlerException:
> Properties is not writable. Delta imports are supported by data config but
> will not work. Processing Document # 1
> [junit4:junit4]   2>            at
> org.apache.solr.handler.dataimport.DataImporter.checkWritablePersistFile(DataImporter.java:350)
> [junit4:junit4]   2>            at
> org.apache.solr.handler.dataimport.DataImporter.doFullImport(DataImporter.java:332)
> [junit4:junit4]   2>            at
> org.apache.solr.handler.dataimport.DataImporter.runCmd(DataImporter.java:399)
> [junit4:junit4]   2>            at
> org.apache.solr.handler.dataimport.DataImportHandler.handleRequestBody(DataImportHandler.java:205)
> [junit4:junit4]   2>            at
> org.apache.solr.handler.RequestHandlerBase.handleRequest(RequestHandlerBase.java:129)
> [junit4:junit4]   2>            at
> org.apache.solr.core.SolrCore.execute(SolrCore.java:1624)
> [junit4:junit4]   2>            at
> org.apache.solr.util.TestHarness.query(TestHarness.java:348)
> [junit4:junit4]   2>            at
> org.apache.solr.handler.dataimport.AbstractDataImportHandlerTestCase.runFullImport(AbstractDataImportHandlerTestCase.java:96)
> [junit4:junit4]   2>            at
> org.apache.solr.handler.dataimport.TestSqlEntityProcessorDelta2.add1document(TestSqlEntityProcessorDelta2.java:83)
> [junit4:junit4]   2>            at
> org.apache.solr.handler.dataimport.TestSqlEntityProcessorDelta2.testCompositePk_DeltaImport_replace_nodelete(TestSqlEntityProcessorDelta2.java:178)
> [junit4:junit4]   2>            at
> sun.reflect.NativeMethodAccessorImpl.invoke0(Native Method)
> [junit4:junit4]   2>            at
> sun.reflect.NativeMethodAccessorImpl.invoke(NativeMethodAccessorImpl.java:57)
> [junit4:junit4]   2>            at
> sun.reflect.DelegatingMethodAccessorImpl.invoke(DelegatingMethodAccessorImpl.java:43)
> [junit4:junit4]   2>            at
> java.lang.reflect.Method.invoke(Method.java:601)
> [junit4:junit4]   2>            at
> com.carrotsearch.randomizedtesting.RandomizedRunner.invoke(RandomizedRunner.java:1995)
> [junit4:junit4]   2>            at
> com.carrotsearch.randomizedtesting.RandomizedRunner.access$1100(RandomizedRunner.java:132)
> [junit4:junit4]   2>            at
> com.carrotsearch.randomizedtesting.RandomizedRunner$6.evaluate(RandomizedRunner.java:818)
> [junit4:junit4]   2>            at
> com.carrotsearch.randomizedtesting.RandomizedRunner$7.evaluate(RandomizedRunner.java:877)
> [junit4:junit4]   2>            at
> com.carrotsearch.randomizedtesting.RandomizedRunner$8.evaluate(RandomizedRunner.java:891)
> [junit4:junit4]   2>            at
> com.carrotsearch.randomizedtesting.rules.SystemPropertiesRestoreRule$1.evaluate(SystemPropertiesRestoreRule.java:53)
> [junit4:junit4]   2>            at
> org.apache.lucene.util.TestRuleSetupTeardownChained$1.evaluate(TestRuleSetupTeardownChained.java:50)
> [junit4:junit4]   2>            at
> org.apache.lucene.util.TestRuleFieldCacheSanity$1.evaluate(TestRuleFieldCacheSanity.java:32)
> [junit4:junit4]   2>            at
> org.apache.lucene.util.AbstractBeforeAfterRule$1.evaluate(AbstractBeforeAfterRule.java:45)
> [junit4:junit4]   2>            at
> com.carrotsearch.randomizedtesting.rules.SystemPropertiesInvariantRule$1.evaluate(SystemPropertiesInvariantRule.java:55)
> [junit4:junit4]   2>            at
> org.apache.lucene.util.TestRuleReportUncaughtExceptions$1.evaluate(TestRuleReportUncaughtExceptions.java:68)
> [junit4:junit4]   2>            at
> org.apache.lucene.util.TestRuleThreadAndTestName$1.evaluate(TestRuleThreadAndTestName.java:48)
> [junit4:junit4]   2>            at
> org.apache.lucene.util.TestRuleIgnoreAfterMaxFailures$1.evaluate(TestRuleIgnoreAfterMaxFailures.java:70)
> [junit4:junit4]   2>            at
> org.apache.lucene.util.TestRuleMarkFailure$1.evaluate(TestRuleMarkFailure.java:48)
> [junit4:junit4]   2>            at
> com.carrotsearch.randomizedtesting.RandomizedRunner.runSingleTest(RandomizedRunner.java:825)
> [junit4:junit4]   2>            at
> com.carrotsearch.randomizedtesting.RandomizedRunner.access$700(RandomizedRunner.java:132)
> [junit4:junit4]   2>            at
> com.carrotsearch.randomizedtesting.RandomizedRunner$3$1.run(RandomizedRunner.java:671)
> [junit4:junit4]   2>            at
> com.carrotsearch.randomizedtesting.RandomizedRunner$3.evaluate(RandomizedRunner.java:697)
> [junit4:junit4]   2>            at
> com.carrotsearch.randomizedtesting.RandomizedRunner$4.evaluate(RandomizedRunner.java:736)
> [junit4:junit4]   2>            at
> com.carrotsearch.randomizedtesting.RandomizedRunner$5.evaluate(RandomizedRunner.java:747)
> [junit4:junit4]   2>            at
> com.carrotsearch.randomizedtesting.rules.SystemPropertiesRestoreRule$1.evaluate(SystemPropertiesRestoreRule.java:53)
> [junit4:junit4]   2>            at
> org.apache.lucene.util.AbstractBeforeAfterRule$1.evaluate(AbstractBeforeAfterRule.java:45)
> [junit4:junit4]   2>            at
> org.apache.lucene.util.TestRuleReportUncaughtExceptions$1.evaluate(TestRuleReportUncaughtExceptions.java:68)
> [junit4:junit4]   2>            at
> org.apache.lucene.util.TestRuleStoreClassName$1.evaluate(TestRuleStoreClassName.java:38)
> [junit4:junit4]   2>            at
> org.apache.lucene.util.TestRuleIcuHack$1.evaluate(TestRuleIcuHack.java:51)
> [junit4:junit4]   2>            at
> com.carrotsearch.randomizedtesting.rules.SystemPropertiesInvariantRule$1.evaluate(SystemPropertiesInvariantRule.java:55)
> [junit4:junit4]   2>            at
> org.apache.lucene.util.TestRuleNoInstanceHooksOverrides$1.evaluate(TestRuleNoInstanceHooksOverrides.java:53)
> [junit4:junit4]   2>            at
> org.apache.lucene.util.TestRuleNoStaticHooksShadowing$1.evaluate(TestRuleNoStaticHooksShadowing.java:52)
> [junit4:junit4]   2>            at
> org.apache.lucene.util.TestRuleAssertionsRequired$1.evaluate(TestRuleAssertionsRequired.java:36)
> [junit4:junit4]   2>            at
> org.apache.lucene.util.TestRuleMarkFailure$1.evaluate(TestRuleMarkFailure.java:48)
> [junit4:junit4]   2>            at
> org.apache.lucene.util.TestRuleIgnoreAfterMaxFailures$1.evaluate(TestRuleIgnoreAfterMaxFailures.java:70)
> [junit4:junit4]   2>            at
> org.apache.lucene.util.TestRuleIgnoreTestSuites$1.evaluate(TestRuleIgnoreTestSuites.java:55)
> [junit4:junit4]   2>            at
> com.carrotsearch.randomizedtesting.RandomizedRunner.runSuite(RandomizedRunner.java:605)
> [junit4:junit4]   2>            at
> com.carrotsearch.randomizedtesting.RandomizedRunner.access$400(RandomizedRunner.java:132)
> [junit4:junit4]   2>            at
> com.carrotsearch.randomizedtesting.RandomizedRunner$2.run(RandomizedRunner.java:551)
> [junit4:junit4]   2>
> [junit4:junit4]   2> 311 T53 C6 oasu.DirectUpdateHandler2.rollback start
> rollback{flags=0,version=0}
> [junit4:junit4]   2> 313 T53 C6 oashd.SolrWriter.rollback SEVERE Exception
> while solr rollback. org.apache.lucene.index.IndexNotFoundException: no
> segments* file found in
> BaseDirectoryWrapper(org.apache.lucene.store.RAMDirectory@28459ffalockFactory=org.apache.lucene.store.NativeFSLockFactory@1012594c):
> files: []
> [junit4:junit4]   2>    at
> org.apache.lucene.index.SegmentInfos$FindSegmentsFile.run(SegmentInfos.java:596)
> [junit4:junit4]   2>    at
> org.apache.lucene.index.SegmentInfos$FindSegmentsFile.run(SegmentInfos.java:486)
> [junit4:junit4]   2>    at
> org.apache.lucene.index.SegmentInfos.read(SegmentInfos.java:319)
> [junit4:junit4]   2>    at
> org.apache.lucene.index.IndexWriter.<init>(IndexWriter.java:632)
> [junit4:junit4]   2>    at
> org.apache.solr.update.SolrIndexWriter.<init>(SolrIndexWriter.java:58)
> [junit4:junit4]   2>    at
> org.apache.solr.update.DefaultSolrCoreState.createMainIndexWriter(DefaultSolrCoreState.java:162)
> [junit4:junit4]   2>    at
> org.apache.solr.update.DefaultSolrCoreState.newIndexWriter(DefaultSolrCoreState.java:106)
> [junit4:junit4]   2>    at
> org.apache.solr.update.DefaultSolrCoreState.rollbackIndexWriter(DefaultSolrCoreState.java:157)
> [junit4:junit4]   2>    at
> org.apache.solr.update.DirectUpdateHandler2.rollbackWriter(DirectUpdateHandler2.java:150)
> [junit4:junit4]   2>    at
> org.apache.solr.update.DirectUpdateHandler2.rollback(DirectUpdateHandler2.java:625)
> [junit4:junit4]   2>    at
> org.apache.solr.update.processor.RunUpdateProcessor.processRollback(RunUpdateProcessorFactory.java:93)
> [junit4:junit4]   2>    at
> org.apache.solr.update.processor.UpdateRequestProcessor.processRollback(UpdateRequestProcessor.java:72)
> [junit4:junit4]   2>    at
> org.apache.solr.update.processor.UpdateRequestProcessor.processRollback(UpdateRequestProcessor.java:72)
> [junit4:junit4]   2>    at
> org.apache.solr.handler.dataimport.AbstractDataImportHandlerTestCase$TestUpdateRequestProcessor.processRollback(AbstractDataImportHandlerTestCase.java:376)
> [junit4:junit4]   2>    at
> org.apache.solr.handler.dataimport.SolrWriter.rollback(SolrWriter.java:117)
> [junit4:junit4]   2>    at
> org.apache.solr.handler.dataimport.DocBuilder.rollback(DocBuilder.java:319)
> [junit4:junit4]   2>    at
> org.apache.solr.handler.dataimport.DataImporter.doFullImport(DataImporter.java:338)
> [junit4:junit4]   2>    at
> org.apache.solr.handler.dataimport.DataImporter.runCmd(DataImporter.java:399)
> [junit4:junit4]   2>    at
> org.apache.solr.handler.dataimport.DataImportHandler.handleRequestBody(DataImportHandler.java:205)
> [junit4:junit4]   2>    at
> org.apache.solr.handler.RequestHandlerBase.handleRequest(RequestHandlerBase.java:129)
> [junit4:junit4]   2>    at
> org.apache.solr.core.SolrCore.execute(SolrCore.java:1624)
> [junit4:junit4]   2>    at
> org.apache.solr.util.TestHarness.query(TestHarness.java:348)
> [junit4:junit4]   2>    at
> org.apache.solr.handler.dataimport.AbstractDataImportHandlerTestCase.runFullImport(AbstractDataImportHandlerTestCase.java:96)
> [junit4:junit4]   2>    at
> org.apache.solr.handler.dataimport.TestSqlEntityProcessorDelta2.add1document(TestSqlEntityProcessorDelta2.java:83)
> [junit4:junit4]   2>    at
> org.apache.solr.handler.dataimport.TestSqlEntityProcessorDelta2.testCompositePk_DeltaImport_replace_nodelete(TestSqlEntityProcessorDelta2.java:178)
> [junit4:junit4]   2>    at
> sun.reflect.NativeMethodAccessorImpl.invoke0(Native Method)
> [junit4:junit4]   2>    at
> sun.reflect.NativeMethodAccessorImpl.invoke(NativeMethodAccessorImpl.java:57)
> [junit4:junit4]   2>    at
> sun.reflect.DelegatingMethodAccessorImpl.invoke(DelegatingMethodAccessorImpl.java:43)
> [junit4:junit4]   2>    at java.lang.reflect.Method.invoke(Method.java:601)
> [junit4:junit4]   2>    at
> com.carrotsearch.randomizedtesting.RandomizedRunner.invoke(RandomizedRunner.java:1995)
> [junit4:junit4]   2>    at
> com.carrotsearch.randomizedtesting.RandomizedRunner.access$1100(RandomizedRunner.java:132)
> [junit4:junit4]   2>    at
> com.carrotsearch.randomizedtesting.RandomizedRunner$6.evaluate(RandomizedRunner.java:818)
> [junit4:junit4]   2>    at
> com.carrotsearch.randomizedtesting.RandomizedRunner$7.evaluate(RandomizedRunner.java:877)
> [junit4:junit4]   2>    at
> com.carrotsearch.randomizedtesting.RandomizedRunner$8.evaluate(RandomizedRunner.java:891)
> [junit4:junit4]   2>    at
> com.carrotsearch.randomizedtesting.rules.SystemPropertiesRestoreRule$1.evaluate(SystemPropertiesRestoreRule.java:53)
> [junit4:junit4]   2>    at
> org.apache.lucene.util.TestRuleSetupTeardownChained$1.evaluate(TestRuleSetupTeardownChained.java:50)
> [junit4:junit4]   2>    at
> org.apache.lucene.util.TestRuleFieldCacheSanity$1.evaluate(TestRuleFieldCacheSanity.java:32)
> [junit4:junit4]   2>    at
> org.apache.lucene.util.AbstractBeforeAfterRule$1.evaluate(AbstractBeforeAfterRule.java:45)
> [junit4:junit4]   2>    at
> com.carrotsearch.randomizedtesting.rules.SystemPropertiesInvariantRule$1.evaluate(SystemPropertiesInvariantRule.java:55)
> [junit4:junit4]   2>    at
> org.apache.lucene.util.TestRuleReportUncaughtExceptions$1.evaluate(TestRuleReportUncaughtExceptions.java:68)
> [junit4:junit4]   2>    at
> org.apache.lucene.util.TestRuleThreadAndTestName$1.evaluate(TestRuleThreadAndTestName.java:48)
> [junit4:junit4]   2>    at
> org.apache.lucene.util.TestRuleIgnoreAfterMaxFailures$1.evaluate(TestRuleIgnoreAfterMaxFailures.java:70)
> [junit4:junit4]   2>    at
> org.apache.lucene.util.TestRuleMarkFailure$1.evaluate(TestRuleMarkFailure.java:48)
> [junit4:junit4]   2>    at
> com.carrotsearch.randomizedtesting.RandomizedRunner.runSingleTest(RandomizedRunner.java:825)
> [junit4:junit4]   2>    at
> com.carrotsearch.randomizedtesting.RandomizedRunner.access$700(RandomizedRunner.java:132)
> [junit4:junit4]   2>    at
> com.carrotsearch.randomizedtesting.RandomizedRunner$3$1.run(RandomizedRunner.java:671)
> [junit4:junit4]   2>    at
> com.carrotsearch.randomizedtesting.RandomizedRunner$3.evaluate(RandomizedRunner.java:697)
> [junit4:junit4]   2>    at
> com.carrotsearch.randomizedtesting.RandomizedRunner$4.evaluate(RandomizedRunner.java:736)
> [junit4:junit4]   2>    at
> com.carrotsearch.randomizedtesting.RandomizedRunner$5.evaluate(RandomizedRunner.java:747)
> [junit4:junit4]   2>    at
> com.carrotsearch.randomizedtesting.rules.SystemPropertiesRestoreRule$1.evaluate(SystemPropertiesRestoreRule.java:53)
> [junit4:junit4]   2>    at
> org.apache.lucene.util.AbstractBeforeAfterRule$1.evaluate(AbstractBeforeAfterRule.java:45)
> [junit4:junit4]   2>    at
> org.apache.lucene.util.TestRuleReportUncaughtExceptions$1.evaluate(TestRuleReportUncaughtExceptions.java:68)
> [junit4:junit4]   2>    at
> org.apache.lucene.util.TestRuleStoreClassName$1.evaluate(TestRuleStoreClassName.java:38)
> [junit4:junit4]   2>    at
> org.apache.lucene.util.TestRuleIcuHack$1.evaluate(TestRuleIcuHack.java:51)
> [junit4:junit4]   2>    at
> com.carrotsearch.randomizedtesting.rules.SystemPropertiesInvariantRule$1.evaluate(SystemPropertiesInvariantRule.java:55)
> [junit4:junit4]   2>    at
> org.apache.lucene.util.TestRuleNoInstanceHooksOverrides$1.evaluate(TestRuleNoInstanceHooksOverrides.java:53)
> [junit4:junit4]   2>    at
> org.apache.lucene.util.TestRuleNoStaticHooksShadowing$1.evaluate(TestRuleNoStaticHooksShadowing.java:52)
> [junit4:junit4]   2>    at
> org.apache.lucene.util.TestRuleAssertionsRequired$1.evaluate(TestRuleAssertionsRequired.java:36)
> [junit4:junit4]   2>    at
> org.apache.lucene.util.TestRuleMarkFailure$1.evaluate(TestRuleMarkFailure.java:48)
> [junit4:junit4]   2>    at
> org.apache.lucene.util.TestRuleIgnoreAfterMaxFailures$1.evaluate(TestRuleIgnoreAfterMaxFailures.java:70)
> [junit4:junit4]   2>    at
> org.apache.lucene.util.TestRuleIgnoreTestSuites$1.evaluate(TestRuleIgnoreTestSuites.java:55)
> [junit4:junit4]   2>    at
> com.carrotsearch.randomizedtesting.RandomizedRunner.runSuite(RandomizedRunner.java:605)
> [junit4:junit4]   2>    at
> com.carrotsearch.randomizedtesting.RandomizedRunner.access$400(RandomizedRunner.java:132)
> [junit4:junit4]   2>    at
> com.carrotsearch.randomizedtesting.RandomizedRunner$2.run(RandomizedRunner.java:551)
> [junit4:junit4]   2>
> [junit4:junit4]   2> 317 T53 C6 REQ [collection1] webapp=null path=null
> params={clean=true&dataConfig=<dataConfig>++<dataSource++type%3D"MockDataSource"/>%0a++<document>%0a++++<entity+name%3D"x"+transformer%3D"TemplateTransformer"++++++++++++query%3D"select+*+from+x"++++++++++++deletedPkQuery%3D"select+id+from+x+where+last_modified+>+NOW+AND+deleted%3D'true'"++++++++++++deltaImportQuery%3D"select+*+from+x+where+id%3D'${
> dih.delta.id
> }'"++++++++++++deltaQuery%3D"select+id+from+x+where+last_modified+>+NOW">%0a++++++<field+column%3D"tmpid"+template%3D"prefix-${
> x.id
> }"+name%3D"solr_id"/>%0a++++++<entity+name%3D"y"+query%3D"select+*+from+y+where+y.A%3D'${
> x.id}'">%0a++++++++<field+column%3D"desc"+/>%0a++++++</entity>%0a++++</entity>%0a++</document>%0a</dataConfig>%0a&commit=true&command=full-import&debug=on}
> status=0 QTime=12
> [junit4:junit4]   2> 318 T53 C6 REQ [collection1] webapp=null path=null
> params={start=0&q=*:*+OR+add1document&qt=standard&rows=20&version=2.2}
> hits=0 status=0 QTime=1
> [junit4:junit4]   2> 320 T53 oas.SolrTestCaseJ4.assertQ SEVERE REQUEST
> FAILED: xpath=//*[@numFound='1']
> [junit4:junit4]   2>            xml response was: <?xml version="1.0"
> encoding="UTF-8"?>
> [junit4:junit4]   2>    <response>
> [junit4:junit4]   2>    <lst name="responseHeader"><int
> name="status">0</int><int name="QTime">1</int><lst name="params"><str
> name="start">0</str><str name="q">*:* OR add1document</str><str
> name="qt">standard</str><str name="rows">20</str><str
> name="version">2.2</str></lst></lst><result name="response" numFound="0"
> start="0"></result>
> [junit4:junit4]   2>    </response>
> [junit4:junit4]   2>
> [junit4:junit4]   2>            request
> was:start=0&q=*:*+OR+add1document&qt=standard&rows=20&version=2.2
> [junit4:junit4]   2> 321 T53 oasc.SolrException.log SEVERE REQUEST FAILED:
> start=0&q=*:*+OR+add1document&qt=standard&rows=20&version=2.2:java.lang.RuntimeException:
> REQUEST FAILED: xpath=//*[@numFound='1']
> [junit4:junit4]   2>            xml response was: <?xml version="1.0"
> encoding="UTF-8"?>
> [junit4:junit4]   2>    <response>
> [junit4:junit4]   2>    <lst name="responseHeader"><int
> name="status">0</int><int name="QTime">1</int><lst name="params"><str
> name="start">0</str><str name="q">*:* OR add1document</str><str
> name="qt">standard</str><str name="rows">20</str><str
> name="version">2.2</str></lst></lst><result name="response" numFound="0"
> start="0"></result>
> [junit4:junit4]   2>    </response>
> [junit4:junit4]   2>
> [junit4:junit4]   2>            request
> was:start=0&q=*:*+OR+add1document&qt=standard&rows=20&version=2.2
> [junit4:junit4]   2>            at
> org.apache.solr.SolrTestCaseJ4.assertQ(SolrTestCaseJ4.java:479)
> [junit4:junit4]   2>            at
> org.apache.solr.SolrTestCaseJ4.assertQ(SolrTestCaseJ4.java:453)
> [junit4:junit4]   2>            at
> org.apache.solr.handler.dataimport.TestSqlEntityProcessorDelta2.add1document(TestSqlEntityProcessorDelta2.java:85)
> [junit4:junit4]   2>            at
> org.apache.solr.handler.dataimport.TestSqlEntityProcessorDelta2.testCompositePk_DeltaImport_replace_nodelete(TestSqlEntityProcessorDelta2.java:178)
> [junit4:junit4]   2>            at
> sun.reflect.NativeMethodAccessorImpl.invoke0(Native Method)
> [junit4:junit4]   2>            at
> sun.reflect.NativeMethodAccessorImpl.invoke(NativeMethodAccessorImpl.java:57)
> [junit4:junit4]   2>            at
> sun.reflect.DelegatingMethodAccessorImpl.invoke(DelegatingMethodAccessorImpl.java:43)
> [junit4:junit4]   2>            at
> java.lang.reflect.Method.invoke(Method.java:601)
> [junit4:junit4]   2>            at
> com.carrotsearch.randomizedtesting.RandomizedRunner.invoke(RandomizedRunner.java:1995)
> [junit4:junit4]   2>            at
> com.carrotsearch.randomizedtesting.RandomizedRunner.access$1100(RandomizedRunner.java:132)
> [junit4:junit4]   2>            at
> com.carrotsearch.randomizedtesting.RandomizedRunner$6.evaluate(RandomizedRunner.java:818)
> [junit4:junit4]   2>            at
> com.carrotsearch.randomizedtesting.RandomizedRunner$7.evaluate(RandomizedRunner.java:877)
> [junit4:junit4]   2>            at
> com.carrotsearch.randomizedtesting.RandomizedRunner$8.evaluate(RandomizedRunner.java:891)
> [junit4:junit4]   2>            at
> com.carrotsearch.randomizedtesting.rules.SystemPropertiesRestoreRule$1.evaluate(SystemPropertiesRestoreRule.java:53)
> [junit4:junit4]   2>            at
> org.apache.lucene.util.TestRuleSetupTeardownChained$1.evaluate(TestRuleSetupTeardownChained.java:50)
> [junit4:junit4]   2>            at
> org.apache.lucene.util.TestRuleFieldCacheSanity$1.evaluate(TestRuleFieldCacheSanity.java:32)
> [junit4:junit4]   2>            at
> org.apache.lucene.util.AbstractBeforeAfterRule$1.evaluate(AbstractBeforeAfterRule.java:45)
> [junit4:junit4]   2>            at
> com.carrotsearch.randomizedtesting.rules.SystemPropertiesInvariantRule$1.evaluate(SystemPropertiesInvariantRule.java:55)
> [junit4:junit4]   2>            at
> org.apache.lucene.util.TestRuleReportUncaughtExceptions$1.evaluate(TestRuleReportUncaughtExceptions.java:68)
> [junit4:junit4]   2>            at
> org.apache.lucene.util.TestRuleThreadAndTestName$1.evaluate(TestRuleThreadAndTestName.java:48)
> [junit4:junit4]   2>            at
> org.apache.lucene.util.TestRuleIgnoreAfterMaxFailures$1.evaluate(TestRuleIgnoreAfterMaxFailures.java:70)
> [junit4:junit4]   2>            at
> org.apache.lucene.util.TestRuleMarkFailure$1.evaluate(TestRuleMarkFailure.java:48)
> [junit4:junit4]   2>            at
> com.carrotsearch.randomizedtesting.RandomizedRunner.runSingleTest(RandomizedRunner.java:825)
> [junit4:junit4]   2>            at
> com.carrotsearch.randomizedtesting.RandomizedRunner.access$700(RandomizedRunner.java:132)
> [junit4:junit4]   2>            at
> com.carrotsearch.randomizedtesting.RandomizedRunner$3$1.run(RandomizedRunner.java:671)
> [junit4:junit4]   2>            at
> com.carrotsearch.randomizedtesting.RandomizedRunner$3.evaluate(RandomizedRunner.java:697)
> [junit4:junit4]   2>            at
> com.carrotsearch.randomizedtesting.RandomizedRunner$4.evaluate(RandomizedRunner.java:736)
> [junit4:junit4]   2>            at
> com.carrotsearch.randomizedtesting.RandomizedRunner$5.evaluate(RandomizedRunner.java:747)
> [junit4:junit4]   2>            at
> com.carrotsearch.randomizedtesting.rules.SystemPropertiesRestoreRule$1.evaluate(SystemPropertiesRestoreRule.java:53)
> [junit4:junit4]   2>            at
> org.apache.lucene.util.AbstractBeforeAfterRule$1.evaluate(AbstractBeforeAfterRule.java:45)
> [junit4:junit4]   2>            at
> org.apache.lucene.util.TestRuleReportUncaughtExceptions$1.evaluate(TestRuleReportUncaughtExceptions.java:68)
> [junit4:junit4]   2>            at
> org.apache.lucene.util.TestRuleStoreClassName$1.evaluate(TestRuleStoreClassName.java:38)
> [junit4:junit4]   2>            at
> org.apache.lucene.util.TestRuleIcuHack$1.evaluate(TestRuleIcuHack.java:51)
> [junit4:junit4]   2>            at
> com.carrotsearch.randomizedtesting.rules.SystemPropertiesInvariantRule$1.evaluate(SystemPropertiesInvariantRule.java:55)
> [junit4:junit4]   2>            at
> org.apache.lucene.util.TestRuleNoInstanceHooksOverrides$1.evaluate(TestRuleNoInstanceHooksOverrides.java:53)
> [junit4:junit4]   2>            at
> org.apache.lucene.util.TestRuleNoStaticHooksShadowing$1.evaluate(TestRuleNoStaticHooksShadowing.java:52)
> [junit4:junit4]   2>            at
> org.apache.lucene.util.TestRuleAssertionsRequired$1.evaluate(TestRuleAssertionsRequired.java:36)
> [junit4:junit4]   2>            at
> org.apache.lucene.util.TestRuleMarkFailure$1.evaluate(TestRuleMarkFailure.java:48)
> [junit4:junit4]   2>            at
> org.apache.lucene.util.TestRuleIgnoreAfterMaxFailures$1.evaluate(TestRuleIgnoreAfterMaxFailures.java:70)
> [junit4:junit4]   2>            at
> org.apache.lucene.util.TestRuleIgnoreTestSuites$1.evaluate(TestRuleIgnoreTestSuites.java:55)
> [junit4:junit4]   2>            at
> com.carrotsearch.randomizedtesting.RandomizedRunner.runSuite(RandomizedRunner.java:605)
> [junit4:junit4]   2>            at
> com.carrotsearch.randomizedtesting.RandomizedRunner.access$400(RandomizedRunner.java:132)
> [junit4:junit4]   2>            at
> com.carrotsearch.randomizedtesting.RandomizedRunner$2.run(RandomizedRunner.java:551)
> [junit4:junit4]   2>
> [junit4:junit4]   2> 322 T53
> oashd.AbstractDataImportHandlerTestCase.tearDown Looking for
> dataimport.properties at:
> /mnt/ssd/jenkins/workspace/Lucene-Solr-trunk-Linux-Java7-64/checkout/solr/build/contrib/solr-dataimporthandler/test/J1/solr/collection1/conf/dataimport.properties
> [junit4:junit4]   2> 323 T53 oas.SolrTestCaseJ4.tearDown ###Ending
> testCompositePk_DeltaImport_replace_nodelete
> [junit4:junit4]   2> NOTE: reproduce with: ant test
>  -Dtestcase=TestSqlEntityProcessorDelta2
> -Dtests.method=testCompositePk_DeltaImport_replace_nodelete
> -Dtests.seed=35621805D30986AD -Dtests.multiplier=3 -Dtests.slow=true
> -Dtests.locale=sr_BA -Dtests.timezone=EST -Dtests.file.encoding=US-ASCII
> [junit4:junit4]   2>
> [junit4:junit4] ERROR   0.02s J1 |
> TestSqlEntityProcessorDelta2.testCompositePk_DeltaImport_delete
> [junit4:junit4]    > Throwable #1: org.apache.solr.common.SolrException:
> org.apache.lucene.store.AlreadyClosedException: this IndexWriter is closed
> [junit4:junit4]    >    at
> __randomizedtesting.SeedInfo.seed([35621805D30986AD:145FEE1BB674AEC1]:0)
> [junit4:junit4]    >    at
> org.apache.solr.util.TestHarness.update(TestHarness.java:248)
> [junit4:junit4]    >    at
> org.apache.solr.util.TestHarness.checkUpdateStatus(TestHarness.java:294)
> [junit4:junit4]    >    at
> org.apache.solr.util.TestHarness.validateUpdate(TestHarness.java:264)
> [junit4:junit4]    >    at
> org.apache.solr.SolrTestCaseJ4.checkUpdateU(SolrTestCaseJ4.java:440)
> [junit4:junit4]    >    at
> org.apache.solr.SolrTestCaseJ4.assertU(SolrTestCaseJ4.java:419)
> [junit4:junit4]    >    at
> org.apache.solr.SolrTestCaseJ4.assertU(SolrTestCaseJ4.java:413)
> [junit4:junit4]    >    at
> org.apache.solr.SolrTestCaseJ4.clearIndex(SolrTestCaseJ4.java:785)
> [junit4:junit4]    >    at
> org.apache.solr.handler.dataimport.TestSqlEntityProcessorDelta2.setUp(TestSqlEntityProcessorDelta2.java:68)
> [junit4:junit4]    >    at
> sun.reflect.NativeMethodAccessorImpl.invoke0(Native Method)
> [junit4:junit4]    >    at
> sun.reflect.NativeMethodAccessorImpl.invoke(NativeMethodAccessorImpl.java:57)
> [junit4:junit4]    >    at
> sun.reflect.DelegatingMethodAccessorImpl.invoke(DelegatingMethodAccessorImpl.java:43)
> [junit4:junit4]    >    at java.lang.reflect.Method.invoke(Method.java:601)
> [junit4:junit4]    >    at
> com.carrotsearch.randomizedtesting.RandomizedRunner.invoke(RandomizedRunner.java:1995)
> [junit4:junit4]    >    at
> com.carrotsearch.randomizedtesting.RandomizedRunner.access$1100(RandomizedRunner.java:132)
> [junit4:junit4]    >    at
> com.carrotsearch.randomizedtesting.RandomizedRunner$7.evaluate(RandomizedRunner.java:875)
> [junit4:junit4]    >    at
> com.carrotsearch.randomizedtesting.RandomizedRunner$8.evaluate(RandomizedRunner.java:891)
> [junit4:junit4]    >    at
> com.carrotsearch.randomizedtesting.rules.SystemPropertiesRestoreRule$1.evaluate(SystemPropertiesRestoreRule.java:53)
> [junit4:junit4]    >    at
> org.apache.lucene.util.TestRuleSetupTeardownChained$1.evaluate(TestRuleSetupTeardownChained.java:50)
> [junit4:junit4]    >    at
> org.apache.lucene.util.TestRuleFieldCacheSanity$1.evaluate(TestRuleFieldCacheSanity.java:32)
> [junit4:junit4]    >    at
> org.apache.lucene.util.AbstractBeforeAfterRule$1.evaluate(AbstractBeforeAfterRule.java:45)
> [junit4:junit4]    >    at
> com.carrotsearch.randomizedtesting.rules.SystemPropertiesInvariantRule$1.evaluate(SystemPropertiesInvariantRule.java:55)
> [junit4:junit4]    >    at
> org.apache.lucene.util.TestRuleReportUncaughtExceptions$1.evaluate(TestRuleReportUncaughtExceptions.java:68)
> [junit4:junit4]    >    at
> org.apache.lucene.util.TestRuleThreadAndTestName$1.evaluate(TestRuleThreadAndTestName.java:48)
> [junit4:junit4]    >    at
> org.apache.lucene.util.TestRuleIgnoreAfterMaxFailures$1.evaluate(TestRuleIgnoreAfterMaxFailures.java:70)
> [junit4:junit4]    >    at
> org.apache.lucene.util.TestRuleMarkFailure$1.evaluate(TestRuleMarkFailure.java:48)
> [junit4:junit4]    >    at
> com.carrotsearch.randomizedtesting.RandomizedRunner.runSingleTest(RandomizedRunner.java:825)
> [junit4:junit4]    >    at
> com.carrotsearch.randomizedtesting.RandomizedRunner.access$700(RandomizedRunner.java:132)
> [junit4:junit4]    >    at
> com.carrotsearch.randomizedtesting.RandomizedRunner$3$1.run(RandomizedRunner.java:671)
> [junit4:junit4]    >    at
> com.carrotsearch.randomizedtesting.RandomizedRunner$3.evaluate(RandomizedRunner.java:697)
> [junit4:junit4]    >    at
> com.carrotsearch.randomizedtesting.RandomizedRunner$4.evaluate(RandomizedRunner.java:736)
> [junit4:junit4]    >    at
> com.carrotsearch.randomizedtesting.RandomizedRunner$5.evaluate(RandomizedRunner.java:747)
> [junit4:junit4]    >    at
> com.carrotsearch.randomizedtesting.rules.SystemPropertiesRestoreRule$1.evaluate(SystemPropertiesRestoreRule.java:53)
> [junit4:junit4]    >    at
> org.apache.lucene.util.AbstractBeforeAfterRule$1.evaluate(AbstractBeforeAfterRule.java:45)
> [junit4:junit4]    >    at
> org.apache.lucene.util.TestRuleReportUncaughtExceptions$1.evaluate(TestRuleReportUncaughtExceptions.java:68)
> [junit4:junit4]    >    at
> org.apache.lucene.util.TestRuleStoreClassName$1.evaluate(TestRuleStoreClassName.java:38)
> [junit4:junit4]    >    at
> org.apache.lucene.util.TestRuleIcuHack$1.evaluate(TestRuleIcuHack.java:51)
> [junit4:junit4]    >    at
> com.carrotsearch.randomizedtesting.rules.SystemPropertiesInvariantRule$1.evaluate(SystemPropertiesInvariantRule.java:55)
> [junit4:junit4]    >    at
> org.apache.lucene.util.TestRuleNoInstanceHooksOverrides$1.evaluate(TestRuleNoInstanceHooksOverrides.java:53)
> [junit4:junit4]    >    at
> org.apache.lucene.util.TestRuleNoStaticHooksShadowing$1.evaluate(TestRuleNoStaticHooksShadowing.java:52)
> [junit4:junit4]    >    at
> org.apache.lucene.util.TestRuleAssertionsRequired$1.evaluate(TestRuleAssertionsRequired.java:36)
> [junit4:junit4]    >    at
> org.apache.lucene.util.TestRuleMarkFailure$1.evaluate(TestRuleMarkFailure.java:48)
> [junit4:junit4]    >    at
> org.apache.lucene.util.TestRuleIgnoreAfterMaxFailures$1.evaluate(TestRuleIgnoreAfterMaxFailures.java:70)
> [junit4:junit4]    >    at
> org.apache.lucene.util.TestRuleIgnoreTestSuites$1.evaluate(TestRuleIgnoreTestSuites.java:55)
> [junit4:junit4]    >    at
> com.carrotsearch.randomizedtesting.RandomizedRunner.runSuite(RandomizedRunner.java:605)
> [junit4:junit4]    >    at
> com.carrotsearch.randomizedtesting.RandomizedRunner.access$400(RandomizedRunner.java:132)
> [junit4:junit4]    >    at
> com.carrotsearch.randomizedtesting.RandomizedRunner$2.run(RandomizedRunner.java:551)
> [junit4:junit4]    > Caused by:
> org.apache.lucene.store.AlreadyClosedException: this IndexWriter is closed
> [junit4:junit4]    >    at
> org.apache.lucene.index.IndexWriter.ensureOpen(IndexWriter.java:551)
> [junit4:junit4]    >    at
> org.apache.lucene.index.IndexWriter.ensureOpen(IndexWriter.java:556)
> [junit4:junit4]    >    at
> org.apache.lucene.index.IndexWriter.deleteAll(IndexWriter.java:1881)
> [junit4:junit4]    >    at
> org.apache.solr.update.DirectUpdateHandler2.deleteAll(DirectUpdateHandler2.java:142)
> [junit4:junit4]    >    at
> org.apache.solr.update.DirectUpdateHandler2.deleteByQuery(DirectUpdateHandler2.java:361)
> [junit4:junit4]    >    at
> org.apache.solr.update.processor.RunUpdateProcessor.processDelete(RunUpdateProcessorFactory.java:67)
> [junit4:junit4]    >    at
> org.apache.solr.update.processor.UpdateRequestProcessor.processDelete(UpdateRequestProcessor.java:55)
> [junit4:junit4]    >    at
> org.apache.solr.update.processor.DistributedUpdateProcessor.doDeleteByQuery(DistributedUpdateProcessor.java:733)
> [junit4:junit4]    >    at
> org.apache.solr.update.processor.DistributedUpdateProcessor.processDelete(DistributedUpdateProcessor.java:606)
> [junit4:junit4]    >    at
> org.apache.solr.update.processor.UpdateRequestProcessor.processDelete(UpdateRequestProcessor.java:55)
> [junit4:junit4]    >    at
> org.apache.solr.handler.dataimport.AbstractDataImportHandlerTestCase$TestUpdateRequestProcessor.processDelete(AbstractDataImportHandlerTestCase.java:364)
> [junit4:junit4]    >    at
> org.apache.solr.handler.loader.XMLLoader.processDelete(XMLLoader.java:330)
> [junit4:junit4]    >    at
> org.apache.solr.handler.loader.XMLLoader.processUpdate(XMLLoader.java:261)
> [junit4:junit4]    >    at
> org.apache.solr.handler.loader.XMLLoader.load(XMLLoader.java:157)
> [junit4:junit4]    >    at
> org.apache.solr.handler.UpdateRequestHandler$1.load(UpdateRequestHandler.java:92)
> [junit4:junit4]    >    at
> org.apache.solr.handler.ContentStreamHandlerBase.handleRequestBody(ContentStreamHandlerBase.java:74)
> [junit4:junit4]    >    at
> org.apache.solr.handler.RequestHandlerBase.handleRequest(RequestHandlerBase.java:129)
> [junit4:junit4]    >    at
> org.apache.solr.core.SolrCore.execute(SolrCore.java:1624)
> [junit4:junit4]    >    at
> org.apache.solr.servlet.DirectSolrConnection.request(DirectSolrConnection.java:131)
> [junit4:junit4]    >    at
> org.apache.solr.util.TestHarness.update(TestHarness.java:244)
> [junit4:junit4]    >    ... 45 more
> [junit4:junit4]    >
> [junit4:junit4]   2> 354 T53 oas.SolrTestCaseJ4.setUp ###Starting
> testCompositePk_DeltaImport_delete
> [junit4:junit4]   2> 357 T53 C6 oasu.DirectUpdateHandler2.deleteAll
> [collection1] REMOVING ALL DOCUMENTS FROM INDEX
> [junit4:junit4]   2> 358 T53 C6 UPDATE [collection1] webapp=null path=null
> params={} {} 0 1
> [junit4:junit4]   2> 359 T53 C6 oasc.SolrException.log SEVERE
> org.apache.lucene.store.AlreadyClosedException: this IndexWriter is closed
> [junit4:junit4]   2>            at
> org.apache.lucene.index.IndexWriter.ensureOpen(IndexWriter.java:551)
> [junit4:junit4]   2>            at
> org.apache.lucene.index.IndexWriter.ensureOpen(IndexWriter.java:556)
> [junit4:junit4]   2>            at
> org.apache.lucene.index.IndexWriter.deleteAll(IndexWriter.java:1881)
> [junit4:junit4]   2>            at
> org.apache.solr.update.DirectUpdateHandler2.deleteAll(DirectUpdateHandler2.java:142)
> [junit4:junit4]   2>            at
> org.apache.solr.update.DirectUpdateHandler2.deleteByQuery(DirectUpdateHandler2.java:361)
> [junit4:junit4]   2>            at
> org.apache.solr.update.processor.RunUpdateProcessor.processDelete(RunUpdateProcessorFactory.java:67)
> [junit4:junit4]   2>            at
> org.apache.solr.update.processor.UpdateRequestProcessor.processDelete(UpdateRequestProcessor.java:55)
> [junit4:junit4]   2>            at
> org.apache.solr.update.processor.DistributedUpdateProcessor.doDeleteByQuery(DistributedUpdateProcessor.java:733)
> [junit4:junit4]   2>            at
> org.apache.solr.update.processor.DistributedUpdateProcessor.processDelete(DistributedUpdateProcessor.java:606)
> [junit4:junit4]   2>            at
> org.apache.solr.update.processor.UpdateRequestProcessor.processDelete(UpdateRequestProcessor.java:55)
> [junit4:junit4]   2>            at
> org.apache.solr.handler.dataimport.AbstractDataImportHandlerTestCase$TestUpdateRequestProcessor.processDelete(AbstractDataImportHandlerTestCase.java:364)
> [junit4:junit4]   2>            at
> org.apache.solr.handler.loader.XMLLoader.processDelete(XMLLoader.java:330)
> [junit4:junit4]   2>            at
> org.apache.solr.handler.loader.XMLLoader.processUpdate(XMLLoader.java:261)
> [junit4:junit4]   2>            at
> org.apache.solr.handler.loader.XMLLoader.load(XMLLoader.java:157)
> [junit4:junit4]   2>            at
> org.apache.solr.handler.UpdateRequestHandler$1.load(UpdateRequestHandler.java:92)
> [junit4:junit4]   2>            at
> org.apache.solr.handler.ContentStreamHandlerBase.handleRequestBody(ContentStreamHandlerBase.java:74)
> [junit4:junit4]   2>            at
> org.apache.solr.handler.RequestHandlerBase.handleRequest(RequestHandlerBase.java:129)
> [junit4:junit4]   2>            at
> org.apache.solr.core.SolrCore.execute(SolrCore.java:1624)
> [junit4:junit4]   2>            at org.apache.solr
>
> ---------------------------------------------------------------------
> To unsubscribe, e-mail: dev-unsubscribe@lucene.apache.org
> For additional commands, e-mail: dev-help@lucene.apache.org
> ...

Mime
View raw message