lucene-dev mailing list archives

Site index · List index
Message view « Date » · « Thread »
Top « Date » · « Thread »
From Policeman Jenkins Server <jenk...@sd-datasolutions.de>
Subject [JENKINS] Lucene-Solr-4.x-Linux-Java8-64 - Build # 21 - Still Failing!
Date Sun, 22 Jul 2012 16:13:01 GMT
Build: http://jenkins.sd-datasolutions.de/job/Lucene-Solr-4.x-Linux-Java8-64/21/

2 tests failed.
REGRESSION:  org.apache.solr.handler.component.SpellCheckComponentTest.testPerDictionary

Error Message:
mismatch: '0'!='2' @ spellcheck/suggestions/bar/startOffset

Stack Trace:
java.lang.RuntimeException: mismatch: '0'!='2' @ spellcheck/suggestions/bar/startOffset
	at __randomizedtesting.SeedInfo.seed([C916C4B3993A4664:E18301B9156532C]:0)
	at org.apache.solr.SolrTestCaseJ4.assertJQ(SolrTestCaseJ4.java:572)
	at org.apache.solr.SolrTestCaseJ4.assertJQ(SolrTestCaseJ4.java:520)
	at org.apache.solr.handler.component.SpellCheckComponentTest.testPerDictionary(SpellCheckComponentTest.java:102)
	at sun.reflect.NativeMethodAccessorImpl.invoke0(Native Method)
	at sun.reflect.NativeMethodAccessorImpl.invoke(NativeMethodAccessorImpl.java:57)
	at sun.reflect.DelegatingMethodAccessorImpl.invoke(DelegatingMethodAccessorImpl.java:43)
	at java.lang.reflect.Method.invoke(Method.java:474)
	at com.carrotsearch.randomizedtesting.RandomizedRunner.invoke(RandomizedRunner.java:1995)
	at com.carrotsearch.randomizedtesting.RandomizedRunner.access$1100(RandomizedRunner.java:132)
	at com.carrotsearch.randomizedtesting.RandomizedRunner$6.evaluate(RandomizedRunner.java:818)
	at com.carrotsearch.randomizedtesting.RandomizedRunner$7.evaluate(RandomizedRunner.java:877)
	at com.carrotsearch.randomizedtesting.RandomizedRunner$8.evaluate(RandomizedRunner.java:891)
	at com.carrotsearch.randomizedtesting.rules.SystemPropertiesRestoreRule$1.evaluate(SystemPropertiesRestoreRule.java:53)
	at org.apache.lucene.util.TestRuleSetupTeardownChained$1.evaluate(TestRuleSetupTeardownChained.java:50)
	at org.apache.lucene.util.TestRuleFieldCacheSanity$1.evaluate(TestRuleFieldCacheSanity.java:32)
	at org.apache.lucene.util.AbstractBeforeAfterRule$1.evaluate(AbstractBeforeAfterRule.java:45)
	at com.carrotsearch.randomizedtesting.rules.SystemPropertiesInvariantRule$1.evaluate(SystemPropertiesInvariantRule.java:55)
	at org.apache.lucene.util.TestRuleReportUncaughtExceptions$1.evaluate(TestRuleReportUncaughtExceptions.java:68)
	at org.apache.lucene.util.TestRuleThreadAndTestName$1.evaluate(TestRuleThreadAndTestName.java:48)
	at org.apache.lucene.util.TestRuleIgnoreAfterMaxFailures$1.evaluate(TestRuleIgnoreAfterMaxFailures.java:70)
	at org.apache.lucene.util.TestRuleMarkFailure$1.evaluate(TestRuleMarkFailure.java:48)
	at com.carrotsearch.randomizedtesting.RandomizedRunner.runSingleTest(RandomizedRunner.java:825)
	at com.carrotsearch.randomizedtesting.RandomizedRunner.access$700(RandomizedRunner.java:132)
	at com.carrotsearch.randomizedtesting.RandomizedRunner$3$1.run(RandomizedRunner.java:671)
	at com.carrotsearch.randomizedtesting.RandomizedRunner$3.evaluate(RandomizedRunner.java:697)
	at com.carrotsearch.randomizedtesting.RandomizedRunner$4.evaluate(RandomizedRunner.java:736)
	at com.carrotsearch.randomizedtesting.RandomizedRunner$5.evaluate(RandomizedRunner.java:747)
	at com.carrotsearch.randomizedtesting.rules.SystemPropertiesRestoreRule$1.evaluate(SystemPropertiesRestoreRule.java:53)
	at org.apache.lucene.util.AbstractBeforeAfterRule$1.evaluate(AbstractBeforeAfterRule.java:45)
	at org.apache.lucene.util.TestRuleReportUncaughtExceptions$1.evaluate(TestRuleReportUncaughtExceptions.java:68)
	at org.apache.lucene.util.TestRuleStoreClassName$1.evaluate(TestRuleStoreClassName.java:38)
	at org.apache.lucene.util.TestRuleIcuHack$1.evaluate(TestRuleIcuHack.java:51)
	at com.carrotsearch.randomizedtesting.rules.SystemPropertiesInvariantRule$1.evaluate(SystemPropertiesInvariantRule.java:55)
	at org.apache.lucene.util.TestRuleNoInstanceHooksOverrides$1.evaluate(TestRuleNoInstanceHooksOverrides.java:53)
	at org.apache.lucene.util.TestRuleNoStaticHooksShadowing$1.evaluate(TestRuleNoStaticHooksShadowing.java:52)
	at org.apache.lucene.util.TestRuleAssertionsRequired$1.evaluate(TestRuleAssertionsRequired.java:36)
	at org.apache.lucene.util.TestRuleMarkFailure$1.evaluate(TestRuleMarkFailure.java:48)
	at org.apache.lucene.util.TestRuleIgnoreAfterMaxFailures$1.evaluate(TestRuleIgnoreAfterMaxFailures.java:70)
	at org.apache.lucene.util.TestRuleIgnoreTestSuites$1.evaluate(TestRuleIgnoreTestSuites.java:55)
	at com.carrotsearch.randomizedtesting.RandomizedRunner.runSuite(RandomizedRunner.java:605)
	at com.carrotsearch.randomizedtesting.RandomizedRunner.access$400(RandomizedRunner.java:132)
	at com.carrotsearch.randomizedtesting.RandomizedRunner$2.run(RandomizedRunner.java:551)


FAILED:  org.apache.solr.handler.component.DistributedQueryElevationComponentTest.testDistribSearch

Error Message:
.responseHeader.params.size()==9,9skipped=4,5

Stack Trace:
junit.framework.AssertionFailedError: .responseHeader.params.size()==9,9skipped=4,5
	at __randomizedtesting.SeedInfo.seed([C916C4B3993A4664:48F04AABEE652658]:0)
	at junit.framework.Assert.fail(Assert.java:50)
	at org.apache.solr.BaseDistributedSearchTestCase.compareResponses(BaseDistributedSearchTestCase.java:670)
	at org.apache.solr.BaseDistributedSearchTestCase.query(BaseDistributedSearchTestCase.java:392)
	at org.apache.solr.handler.component.DistributedQueryElevationComponentTest.doTest(DistributedQueryElevationComponentTest.java:81)
	at org.apache.solr.BaseDistributedSearchTestCase.testDistribSearch(BaseDistributedSearchTestCase.java:679)
	at sun.reflect.NativeMethodAccessorImpl.invoke0(Native Method)
	at sun.reflect.NativeMethodAccessorImpl.invoke(NativeMethodAccessorImpl.java:57)
	at sun.reflect.DelegatingMethodAccessorImpl.invoke(DelegatingMethodAccessorImpl.java:43)
	at java.lang.reflect.Method.invoke(Method.java:474)
	at com.carrotsearch.randomizedtesting.RandomizedRunner.invoke(RandomizedRunner.java:1995)
	at com.carrotsearch.randomizedtesting.RandomizedRunner.access$1100(RandomizedRunner.java:132)
	at com.carrotsearch.randomizedtesting.RandomizedRunner$6.evaluate(RandomizedRunner.java:818)
	at com.carrotsearch.randomizedtesting.RandomizedRunner$7.evaluate(RandomizedRunner.java:877)
	at com.carrotsearch.randomizedtesting.RandomizedRunner$8.evaluate(RandomizedRunner.java:891)
	at com.carrotsearch.randomizedtesting.rules.SystemPropertiesRestoreRule$1.evaluate(SystemPropertiesRestoreRule.java:53)
	at org.apache.lucene.util.TestRuleSetupTeardownChained$1.evaluate(TestRuleSetupTeardownChained.java:50)
	at org.apache.lucene.util.TestRuleFieldCacheSanity$1.evaluate(TestRuleFieldCacheSanity.java:32)
	at org.apache.lucene.util.AbstractBeforeAfterRule$1.evaluate(AbstractBeforeAfterRule.java:45)
	at com.carrotsearch.randomizedtesting.rules.SystemPropertiesInvariantRule$1.evaluate(SystemPropertiesInvariantRule.java:55)
	at org.apache.lucene.util.TestRuleReportUncaughtExceptions$1.evaluate(TestRuleReportUncaughtExceptions.java:68)
	at org.apache.lucene.util.TestRuleThreadAndTestName$1.evaluate(TestRuleThreadAndTestName.java:48)
	at org.apache.lucene.util.TestRuleIgnoreAfterMaxFailures$1.evaluate(TestRuleIgnoreAfterMaxFailures.java:70)
	at org.apache.lucene.util.TestRuleMarkFailure$1.evaluate(TestRuleMarkFailure.java:48)
	at com.carrotsearch.randomizedtesting.RandomizedRunner.runSingleTest(RandomizedRunner.java:825)
	at com.carrotsearch.randomizedtesting.RandomizedRunner.access$700(RandomizedRunner.java:132)
	at com.carrotsearch.randomizedtesting.RandomizedRunner$3$1.run(RandomizedRunner.java:671)
	at com.carrotsearch.randomizedtesting.RandomizedRunner$3.evaluate(RandomizedRunner.java:697)
	at com.carrotsearch.randomizedtesting.RandomizedRunner$4.evaluate(RandomizedRunner.java:736)
	at com.carrotsearch.randomizedtesting.RandomizedRunner$5.evaluate(RandomizedRunner.java:747)
	at com.carrotsearch.randomizedtesting.rules.SystemPropertiesRestoreRule$1.evaluate(SystemPropertiesRestoreRule.java:53)
	at org.apache.lucene.util.AbstractBeforeAfterRule$1.evaluate(AbstractBeforeAfterRule.java:45)
	at org.apache.lucene.util.TestRuleReportUncaughtExceptions$1.evaluate(TestRuleReportUncaughtExceptions.java:68)
	at org.apache.lucene.util.TestRuleStoreClassName$1.evaluate(TestRuleStoreClassName.java:38)
	at org.apache.lucene.util.TestRuleIcuHack$1.evaluate(TestRuleIcuHack.java:51)
	at com.carrotsearch.randomizedtesting.rules.SystemPropertiesInvariantRule$1.evaluate(SystemPropertiesInvariantRule.java:55)
	at org.apache.lucene.util.TestRuleNoInstanceHooksOverrides$1.evaluate(TestRuleNoInstanceHooksOverrides.java:53)
	at org.apache.lucene.util.TestRuleNoStaticHooksShadowing$1.evaluate(TestRuleNoStaticHooksShadowing.java:52)
	at org.apache.lucene.util.TestRuleAssertionsRequired$1.evaluate(TestRuleAssertionsRequired.java:36)
	at org.apache.lucene.util.TestRuleMarkFailure$1.evaluate(TestRuleMarkFailure.java:48)
	at org.apache.lucene.util.TestRuleIgnoreAfterMaxFailures$1.evaluate(TestRuleIgnoreAfterMaxFailures.java:70)
	at org.apache.lucene.util.TestRuleIgnoreTestSuites$1.evaluate(TestRuleIgnoreTestSuites.java:55)
	at com.carrotsearch.randomizedtesting.RandomizedRunner.runSuite(RandomizedRunner.java:605)
	at com.carrotsearch.randomizedtesting.RandomizedRunner.access$400(RandomizedRunner.java:132)
	at com.carrotsearch.randomizedtesting.RandomizedRunner$2.run(RandomizedRunner.java:551)




Build Log:
[...truncated 6839 lines...]
[junit4:junit4] Suite: org.apache.solr.handler.component.SpellCheckComponentTest
[junit4:junit4]    > (@BeforeClass output)
[junit4:junit4]   2> 0 T38 oas.SolrTestCaseJ4.initCore ####initCore
[junit4:junit4]   2> Creating dataDir: /mnt/ssd/jenkins/workspace/Lucene-Solr-4.x-Linux-Java8-64/checkout/solr/build/solr-core/test/J1/./solrtest-SpellCheckComponentTest-1342973164992
[junit4:junit4]   2> 1 T38 oasc.SolrResourceLoader.<init> new SolrResourceLoader for directory: '/mnt/ssd/jenkins/workspace/Lucene-Solr-4.x-Linux-Java8-64/checkout/solr/build/solr-core/test-files/solr/collection1/'
[junit4:junit4]   2> 1 T38 oasc.SolrResourceLoader.replaceClassLoader Adding 'file:/mnt/ssd/jenkins/workspace/Lucene-Solr-4.x-Linux-Java8-64/checkout/solr/build/solr-core/test-files/solr/collection1/lib/README' to classloader
[junit4:junit4]   2> 2 T38 oasc.SolrResourceLoader.replaceClassLoader Adding 'file:/mnt/ssd/jenkins/workspace/Lucene-Solr-4.x-Linux-Java8-64/checkout/solr/build/solr-core/test-files/solr/collection1/lib/classes/' to classloader
[junit4:junit4]   2> 39 T38 oasc.SolrConfig.<init> Using Lucene MatchVersion: LUCENE_40
[junit4:junit4]   2> 92 T38 oasc.SolrConfig.<init> Loaded SolrConfig: solrconfig-spellcheckcomponent.xml
[junit4:junit4]   2> 92 T38 oass.IndexSchema.readSchema Reading Solr Schema
[junit4:junit4]   2> 104 T38 oass.IndexSchema.readSchema Schema name=test
[junit4:junit4]   2> 504 T38 oass.OpenExchangeRatesOrgProvider.init Initialized with rates=open-exchange-rates.json, refreshInterval=1440.
[junit4:junit4]   2> 509 T38 oass.IndexSchema.readSchema default search field in schema is text
[junit4:junit4]   2> 511 T38 oass.IndexSchema.readSchema unique key field: id
[junit4:junit4]   2> 521 T38 oass.FileExchangeRateProvider.reload Reloading exchange rates from file currency.xml
[junit4:junit4]   2> 524 T38 oass.FileExchangeRateProvider.reload Reloading exchange rates from file currency.xml
[junit4:junit4]   2> 526 T38 oass.OpenExchangeRatesOrgProvider.reload Reloading exchange rates from open-exchange-rates.json
[junit4:junit4]   2> 527 T38 oass.OpenExchangeRatesOrgProvider.reload Reloading exchange rates from open-exchange-rates.json
[junit4:junit4]   2> 528 T38 oasc.SolrResourceLoader.locateSolrHome JNDI not configured for solr (NoInitialContextEx)
[junit4:junit4]   2> 528 T38 oasc.SolrResourceLoader.locateSolrHome using system property solr.solr.home: /mnt/ssd/jenkins/workspace/Lucene-Solr-4.x-Linux-Java8-64/checkout/solr/build/solr-core/test-files/solr
[junit4:junit4]   2> 528 T38 oasc.SolrResourceLoader.<init> new SolrResourceLoader for directory: '/mnt/ssd/jenkins/workspace/Lucene-Solr-4.x-Linux-Java8-64/checkout/solr/build/solr-core/test-files/solr/'
[junit4:junit4]   2> 529 T38 oasc.CoreContainer.<init> New CoreContainer 2137117149
[junit4:junit4]   2> 529 T38 oasc.SolrCore.<init> [collection1] Opening new SolrCore at /mnt/ssd/jenkins/workspace/Lucene-Solr-4.x-Linux-Java8-64/checkout/solr/build/solr-core/test-files/solr/collection1/, dataDir=/mnt/ssd/jenkins/workspace/Lucene-Solr-4.x-Linux-Java8-64/checkout/solr/build/solr-core/test/J1/./solrtest-SpellCheckComponentTest-1342973164992/
[junit4:junit4]   2> 529 T38 oasc.SolrCore.<init> JMX monitoring not detected for core: collection1
[junit4:junit4]   2> 530 T38 oasc.SolrCore.getNewIndexDir WARNING New index directory detected: old=null new=/mnt/ssd/jenkins/workspace/Lucene-Solr-4.x-Linux-Java8-64/checkout/solr/build/solr-core/test/J1/./solrtest-SpellCheckComponentTest-1342973164992/index/
[junit4:junit4]   2> 530 T38 oasc.SolrCore.initIndex WARNING [collection1] Solr index directory '/mnt/ssd/jenkins/workspace/Lucene-Solr-4.x-Linux-Java8-64/checkout/solr/build/solr-core/test/J1/./solrtest-SpellCheckComponentTest-1342973164992/index' doesn't exist. Creating new index...
[junit4:junit4]   2> 536 T38 oasc.SolrDeletionPolicy.onCommit SolrDeletionPolicy.onCommit: commits:num=1
[junit4:junit4]   2> 		commit{dir=MockDirWrapper(org.apache.lucene.store.SimpleFSDirectory@/mnt/ssd/jenkins/workspace/Lucene-Solr-4.x-Linux-Java8-64/checkout/solr/build/solr-core/test/J1/index1443514435tmp lockFactory=org.apache.lucene.store.NativeFSLockFactory@784adbc3),segFN=segments_1,generation=1,filenames=[segments_1]
[junit4:junit4]   2> 536 T38 oasc.SolrDeletionPolicy.updateCommits newest commit = 1
[junit4:junit4]   2> 537 T38 oasc.RequestHandlers.initHandlersFromConfig created standard: solr.StandardRequestHandler
[junit4:junit4]   2> 537 T38 oasc.RequestHandlers.initHandlersFromConfig created spellCheckCompRH: org.apache.solr.handler.component.SearchHandler
[junit4:junit4]   2> 537 T38 oasc.RequestHandlers.initHandlersFromConfig created spellCheckCompRH1: org.apache.solr.handler.component.SearchHandler
[junit4:junit4]   2> 537 T38 oasc.RequestHandlers.initHandlersFromConfig created spellCheckWithWordbreak: org.apache.solr.handler.component.SearchHandler
[junit4:junit4]   2> 541 T38 oass.SolrIndexSearcher.<init> Opening Searcher@734c0647 main
[junit4:junit4]   2> 541 T38 oass.SolrIndexSearcher.getIndexDir WARNING WARNING: Directory impl does not support setting indexDir: org.apache.lucene.store.MockDirectoryWrapper
[junit4:junit4]   2> 541 T38 oasu.CommitTracker.<init> Hard AutoCommit: disabled
[junit4:junit4]   2> 542 T38 oasu.CommitTracker.<init> Soft AutoCommit: disabled
[junit4:junit4]   2> 542 T38 oashc.SpellCheckComponent.inform Initializing spell checkers
[junit4:junit4]   2> 564 T38 oashc.SpellCheckComponent.inform Registering newSearcher listener for spellchecker: default
[junit4:junit4]   2> 569 T38 oashc.SpellCheckComponent.inform Registering newSearcher listener for spellchecker: default_teststop
[junit4:junit4]   2> 572 T38 oass.DirectSolrSpellChecker.init init: {name=direct,classname=solr.DirectSolrSpellChecker,minQueryLength=3,maxQueryFrequency=100.0,field=teststop}
[junit4:junit4]   2> 573 T38 oass.DirectSolrSpellChecker.init init: {name=direct_lowerfilt,classname=solr.DirectSolrSpellChecker,minQueryLength=3,maxQueryFrequency=100.0,field=lowerfilt}
[junit4:junit4]   2> 576 T38 oashc.SpellCheckComponent.inform Registering newSearcher listener for spellchecker: threshold
[junit4:junit4]   2> 576 T38 oass.DirectSolrSpellChecker.init init: {name=threshold_direct,classname=solr.DirectSolrSpellChecker,field=lowerfilt,spellcheckIndexDir=spellcheckerThreshold,buildOnCommit=true,thresholdTokenFrequency=0.29}
[junit4:junit4]   2> 577 T38 oashc.SpellCheckComponent.inform Registering newSearcher listener for spellchecker: threshold_direct
[junit4:junit4]   2> 580 T38 oashc.SpellCheckComponent.inform Registering newSearcher listener for spellchecker: multipleFields
[junit4:junit4]   2> 589 T38 oashc.SpellCheckComponent.inform Registering newSearcher listener for spellchecker: freq
[junit4:junit4]   2> 592 T38 oashc.SpellCheckComponent.inform Registering newSearcher listener for spellchecker: fqcn
[junit4:junit4]   2> 593 T38 oashc.HttpShardHandlerFactory.getParameter Setting socketTimeout to: 0
[junit4:junit4]   2> 593 T38 oashc.HttpShardHandlerFactory.getParameter Setting urlScheme to: http://
[junit4:junit4]   2> 593 T38 oashc.HttpShardHandlerFactory.getParameter Setting connTimeout to: 0
[junit4:junit4]   2> 594 T38 oashc.HttpShardHandlerFactory.getParameter Setting maxConnectionsPerHost to: 20
[junit4:junit4]   2> 594 T38 oashc.HttpShardHandlerFactory.getParameter Setting corePoolSize to: 0
[junit4:junit4]   2> 594 T38 oashc.HttpShardHandlerFactory.getParameter Setting maximumPoolSize to: 2147483647
[junit4:junit4]   2> 594 T38 oashc.HttpShardHandlerFactory.getParameter Setting maxThreadIdleTime to: 5
[junit4:junit4]   2> 594 T38 oashc.HttpShardHandlerFactory.getParameter Setting sizeOfQueue to: -1
[junit4:junit4]   2> 594 T38 oashc.HttpShardHandlerFactory.getParameter Setting fairnessPolicy to: false
[junit4:junit4]   2> 595 T38 oascsi.HttpClientUtil.createClient Creating new http client, config:maxConnectionsPerHost=20&maxConnections=10000&socketTimeout=0&connTimeout=0&retry=false
[junit4:junit4]   2> 598 T39 oasc.SolrCore.registerSearcher [collection1] Registered new searcher Searcher@734c0647 main{StandardDirectoryReader(segments_1:1)}
[junit4:junit4]   2> 598 T38 oasc.CoreContainer.register registering core: collection1
[junit4:junit4]   2> 599 T38 oas.SolrTestCaseJ4.initCore ####initCore end
[junit4:junit4]   2> 
[junit4:junit4] ERROR   0.51s J1 | SpellCheckComponentTest.testPerDictionary
[junit4:junit4]    > Throwable #1: java.lang.RuntimeException: mismatch: '0'!='2' @ spellcheck/suggestions/bar/startOffset
[junit4:junit4]    > 	at __randomizedtesting.SeedInfo.seed([C916C4B3993A4664:E18301B9156532C]:0)
[junit4:junit4]    > 	at org.apache.solr.SolrTestCaseJ4.assertJQ(SolrTestCaseJ4.java:572)
[junit4:junit4]    > 	at org.apache.solr.SolrTestCaseJ4.assertJQ(SolrTestCaseJ4.java:520)
[junit4:junit4]    > 	at org.apache.solr.handler.component.SpellCheckComponentTest.testPerDictionary(SpellCheckComponentTest.java:102)
[junit4:junit4]    > 	at sun.reflect.NativeMethodAccessorImpl.invoke0(Native Method)
[junit4:junit4]    > 	at sun.reflect.NativeMethodAccessorImpl.invoke(NativeMethodAccessorImpl.java:57)
[junit4:junit4]    > 	at sun.reflect.DelegatingMethodAccessorImpl.invoke(DelegatingMethodAccessorImpl.java:43)
[junit4:junit4]    > 	at java.lang.reflect.Method.invoke(Method.java:474)
[junit4:junit4]    > 	at com.carrotsearch.randomizedtesting.RandomizedRunner.invoke(RandomizedRunner.java:1995)
[junit4:junit4]    > 	at com.carrotsearch.randomizedtesting.RandomizedRunner.access$1100(RandomizedRunner.java:132)
[junit4:junit4]    > 	at com.carrotsearch.randomizedtesting.RandomizedRunner$6.evaluate(RandomizedRunner.java:818)
[junit4:junit4]    > 	at com.carrotsearch.randomizedtesting.RandomizedRunner$7.evaluate(RandomizedRunner.java:877)
[junit4:junit4]    > 	at com.carrotsearch.randomizedtesting.RandomizedRunner$8.evaluate(RandomizedRunner.java:891)
[junit4:junit4]    > 	at com.carrotsearch.randomizedtesting.rules.SystemPropertiesRestoreRule$1.evaluate(SystemPropertiesRestoreRule.java:53)
[junit4:junit4]    > 	at org.apache.lucene.util.TestRuleSetupTeardownChained$1.evaluate(TestRuleSetupTeardownChained.java:50)
[junit4:junit4]    > 	at org.apache.lucene.util.TestRuleFieldCacheSanity$1.evaluate(TestRuleFieldCacheSanity.java:32)
[junit4:junit4]    > 	at org.apache.lucene.util.AbstractBeforeAfterRule$1.evaluate(AbstractBeforeAfterRule.java:45)
[junit4:junit4]    > 	at com.carrotsearch.randomizedtesting.rules.SystemPropertiesInvariantRule$1.evaluate(SystemPropertiesInvariantRule.java:55)
[junit4:junit4]    > 	at org.apache.lucene.util.TestRuleReportUncaughtExceptions$1.evaluate(TestRuleReportUncaughtExceptions.java:68)
[junit4:junit4]    > 	at org.apache.lucene.util.TestRuleThreadAndTestName$1.evaluate(TestRuleThreadAndTestName.java:48)
[junit4:junit4]    > 	at org.apache.lucene.util.TestRuleIgnoreAfterMaxFailures$1.evaluate(TestRuleIgnoreAfterMaxFailures.java:70)
[junit4:junit4]    > 	at org.apache.lucene.util.TestRuleMarkFailure$1.evaluate(TestRuleMarkFailure.java:48)
[junit4:junit4]    > 	at com.carrotsearch.randomizedtesting.RandomizedRunner.runSingleTest(RandomizedRunner.java:825)
[junit4:junit4]    > 	at com.carrotsearch.randomizedtesting.RandomizedRunner.access$700(RandomizedRunner.java:132)
[junit4:junit4]    > 	at com.carrotsearch.randomizedtesting.RandomizedRunner$3$1.run(RandomizedRunner.java:671)
[junit4:junit4]    > 	at com.carrotsearch.randomizedtesting.RandomizedRunner$3.evaluate(RandomizedRunner.java:697)
[junit4:junit4]    > 	at com.carrotsearch.randomizedtesting.RandomizedRunner$4.evaluate(RandomizedRunner.java:736)
[junit4:junit4]    > 	at com.carrotsearch.randomizedtesting.RandomizedRunner$5.evaluate(RandomizedRunner.java:747)
[junit4:junit4]    > 	at com.carrotsearch.randomizedtesting.rules.SystemPropertiesRestoreRule$1.evaluate(SystemPropertiesRestoreRule.java:53)
[junit4:junit4]    > 	at org.apache.lucene.util.AbstractBeforeAfterRule$1.evaluate(AbstractBeforeAfterRule.java:45)
[junit4:junit4]    > 	at org.apache.lucene.util.TestRuleReportUncaughtExceptions$1.evaluate(TestRuleReportUncaughtExceptions.java:68)
[junit4:junit4]    > 	at org.apache.lucene.util.TestRuleStoreClassName$1.evaluate(TestRuleStoreClassName.java:38)
[junit4:junit4]    > 	at org.apache.lucene.util.TestRuleIcuHack$1.evaluate(TestRuleIcuHack.java:51)
[junit4:junit4]    > 	at com.carrotsearch.randomizedtesting.rules.SystemPropertiesInvariantRule$1.evaluate(SystemPropertiesInvariantRule.java:55)
[junit4:junit4]    > 	at org.apache.lucene.util.TestRuleNoInstanceHooksOverrides$1.evaluate(TestRuleNoInstanceHooksOverrides.java:53)
[junit4:junit4]    > 	at org.apache.lucene.util.TestRuleNoStaticHooksShadowing$1.evaluate(TestRuleNoStaticHooksShadowing.java:52)
[junit4:junit4]    > 	at org.apache.lucene.util.TestRuleAssertionsRequired$1.evaluate(TestRuleAssertionsRequired.java:36)
[junit4:junit4]    > 	at org.apache.lucene.util.TestRuleMarkFailure$1.evaluate(TestRuleMarkFailure.java:48)
[junit4:junit4]    > 	at org.apache.lucene.util.TestRuleIgnoreAfterMaxFailures$1.evaluate(TestRuleIgnoreAfterMaxFailures.java:70)
[junit4:junit4]    > 	at org.apache.lucene.util.TestRuleIgnoreTestSuites$1.evaluate(TestRuleIgnoreTestSuites.java:55)
[junit4:junit4]    > 	at com.carrotsearch.randomizedtesting.RandomizedRunner.runSuite(RandomizedRunner.java:605)
[junit4:junit4]    > 	at com.carrotsearch.randomizedtesting.RandomizedRunner.access$400(RandomizedRunner.java:132)
[junit4:junit4]    > 	at com.carrotsearch.randomizedtesting.RandomizedRunner$2.run(RandomizedRunner.java:551)
[junit4:junit4]    > 
[junit4:junit4]   2> 3906 T38 oas.SolrTestCaseJ4.setUp ###Starting testPerDictionary
[junit4:junit4]   2> 3911 T38 C1 UPDATE [collection1] webapp=null path=null params={} {add=[0]} 0 2
[junit4:junit4]   2> 3917 T38 C1 UPDATE [collection1] webapp=null path=null params={} {add=[1]} 0 1
[junit4:junit4]   2> 3922 T38 C1 UPDATE [collection1] webapp=null path=null params={} {add=[2]} 0 1
[junit4:junit4]   2> 3927 T38 C1 UPDATE [collection1] webapp=null path=null params={} {add=[3]} 0 1
[junit4:junit4]   2> 3933 T38 C1 UPDATE [collection1] webapp=null path=null params={} {add=[4]} 0 1
[junit4:junit4]   2> 3938 T38 C1 UPDATE [collection1] webapp=null path=null params={} {add=[5]} 0 1
[junit4:junit4]   2> 3943 T38 C1 UPDATE [collection1] webapp=null path=null params={} {add=[6]} 0 0
[junit4:junit4]   2> 3949 T38 C1 UPDATE [collection1] webapp=null path=null params={} {add=[7]} 0 1
[junit4:junit4]   2> 3954 T38 C1 UPDATE [collection1] webapp=null path=null params={} {add=[8]} 0 1
[junit4:junit4]   2> 3958 T38 C1 UPDATE [collection1] webapp=null path=null params={} {add=[9]} 0 1
[junit4:junit4]   2> 3961 T38 C1 oasu.DirectUpdateHandler2.commit start commit{flags=0,version=0,optimize=false,openSearcher=true,waitSearcher=true,expungeDeletes=false,softCommit=false}
[junit4:junit4]   2> 3964 T38 C1 oasc.SolrDeletionPolicy.onCommit SolrDeletionPolicy.onCommit: commits:num=2
[junit4:junit4]   2> 		commit{dir=MockDirWrapper(org.apache.lucene.store.SimpleFSDirectory@/mnt/ssd/jenkins/workspace/Lucene-Solr-4.x-Linux-Java8-64/checkout/solr/build/solr-core/test/J1/index1443514435tmp lockFactory=org.apache.lucene.store.NativeFSLockFactory@784adbc3),segFN=segments_d,generation=13,filenames=[segments_d]
[junit4:junit4]   2> 		commit{dir=MockDirWrapper(org.apache.lucene.store.SimpleFSDirectory@/mnt/ssd/jenkins/workspace/Lucene-Solr-4.x-Linux-Java8-64/checkout/solr/build/solr-core/test/J1/index1443514435tmp lockFactory=org.apache.lucene.store.NativeFSLockFactory@784adbc3),segFN=segments_e,generation=14,filenames=[_7.nrm, _7.fnm, _7.frq, _7.fdt, _7.tis, _7.si, _7.tii, _7.prx, segments_e, _7.fdx]
[junit4:junit4]   2> 3965 T38 C1 oasc.SolrDeletionPolicy.updateCommits newest commit = 14
[junit4:junit4]   2> 3967 T38 C1 oass.SolrIndexSearcher.<init> Opening Searcher@5d05696a main
[junit4:junit4]   2> 3968 T38 C1 oass.SolrIndexSearcher.getIndexDir WARNING WARNING: Directory impl does not support setting indexDir: org.apache.lucene.store.MockDirectoryWrapper
[junit4:junit4]   2> 3968 T39 oashc.SpellCheckComponent$SpellCheckerListener.buildSpellIndex Building spell index for spell checker: default
[junit4:junit4]   2> 3969 T38 C1 oasu.DirectUpdateHandler2.commit end_commit_flush
[junit4:junit4]   2> 4012 T39 oashc.SpellCheckComponent$SpellCheckerListener.buildSpellIndex Building spell index for spell checker: default_teststop
[junit4:junit4]   2> 4033 T39 oashc.SpellCheckComponent$SpellCheckerListener.buildSpellIndex Building spell index for spell checker: threshold
[junit4:junit4]   2> 4072 T39 oashc.SpellCheckComponent$SpellCheckerListener.buildSpellIndex Building spell index for spell checker: threshold_direct
[junit4:junit4]   2> 4072 T39 oashc.SpellCheckComponent$SpellCheckerListener.buildSpellIndex Building spell index for spell checker: multipleFields
[junit4:junit4]   2> 4112 T39 oashc.SpellCheckComponent$SpellCheckerListener.buildSpellIndex Building spell index for spell checker: freq
[junit4:junit4]   2> 4152 T39 oashc.SpellCheckComponent$SpellCheckerListener.buildSpellIndex Building spell index for spell checker: fqcn
[junit4:junit4]   2> 4192 T39 oasc.SolrCore.registerSearcher [collection1] Registered new searcher Searcher@5d05696a main{StandardDirectoryReader(segments_e:23 _7(4.0.0.1):C10)}
[junit4:junit4]   2> 4193 T38 C1 UPDATE [collection1] webapp=null path=null params={} {commit=} 0 232
[junit4:junit4]   2> 4195 T38 C1 REQ [collection1] webapp=null path=null params={spellcheck..perDict.foo=bar&spellcheck.dictionary=perDict&spellcheck=true&qt=spellCheckCompRH&json.nl=map&q=documemt&spellcheck..perDict.bar=foo&spellcheck.build=true} hits=0 status=0 QTime=0 
[junit4:junit4]   2> 4196 T38 oas.SolrTestCaseJ4.assertJQ SEVERE query failed JSON validation. error=mismatch: '0'!='2' @ spellcheck/suggestions/bar/startOffset
[junit4:junit4]   2> 	 expected =/spellcheck/suggestions/bar=={"numFound":1, "startOffset":0, "endOffset":1, "suggestion":["foo"]}
[junit4:junit4]   2> 	 response = {
[junit4:junit4]   2> 	  "responseHeader":{
[junit4:junit4]   2> 	    "status":0,
[junit4:junit4]   2> 	    "QTime":0},
[junit4:junit4]   2> 	  "command":"build",
[junit4:junit4]   2> 	  "response":{"numFound":0,"start":0,"docs":[]
[junit4:junit4]   2> 	  },
[junit4:junit4]   2> 	  "spellcheck":{
[junit4:junit4]   2> 	    "suggestions":{
[junit4:junit4]   2> 	      "foo":{
[junit4:junit4]   2> 	        "numFound":1,
[junit4:junit4]   2> 	        "startOffset":0,
[junit4:junit4]   2> 	        "endOffset":1,
[junit4:junit4]   2> 	        "suggestion":["bar"]},
[junit4:junit4]   2> 	      "bar":{
[junit4:junit4]   2> 	        "numFound":1,
[junit4:junit4]   2> 	        "startOffset":2,
[junit4:junit4]   2> 	        "endOffset":3,
[junit4:junit4]   2> 	        "suggestion":["foo"]}}}}
[junit4:junit4]   2> 	
[junit4:junit4]   2> 	 request = spellcheck..perDict.foo=bar&spellcheck.dictionary=perDict&spellcheck=true&qt=spellCheckCompRH&json.nl=map&q=documemt&spellcheck..perDict.bar=foo&spellcheck.build=true
[junit4:junit4]   2> 4197 T38 oas.SolrTestCaseJ4.tearDown ###Ending testPerDictionary
[junit4:junit4]   2> 4199 T38 C1 oasu.DirectUpdateHandler2.deleteAll [collection1] REMOVING ALL DOCUMENTS FROM INDEX
[junit4:junit4]   2> 4200 T38 C1 UPDATE [collection1] webapp=null path=null params={} {deleteByQuery=*:*} 0 1
[junit4:junit4]   2> 4203 T38 C1 oasu.DirectUpdateHandler2.commit start commit{flags=0,version=0,optimize=false,openSearcher=true,waitSearcher=true,expungeDeletes=false,softCommit=false}
[junit4:junit4]   2> 4211 T38 C1 oasc.SolrDeletionPolicy.onCommit SolrDeletionPolicy.onCommit: commits:num=2
[junit4:junit4]   2> 		commit{dir=MockDirWrapper(org.apache.lucene.store.SimpleFSDirectory@/mnt/ssd/jenkins/workspace/Lucene-Solr-4.x-Linux-Java8-64/checkout/solr/build/solr-core/test/J1/index1443514435tmp lockFactory=org.apache.lucene.store.NativeFSLockFactory@784adbc3),segFN=segments_e,generation=14,filenames=[_7.nrm, _7.fnm, _7.frq, _7.fdt, _7.tis, _7.si, _7.tii, _7.prx, segments_e, _7.fdx]
[junit4:junit4]   2> 		commit{dir=MockDirWrapper(org.apache.lucene.store.SimpleFSDirectory@/mnt/ssd/jenkins/workspace/Lucene-Solr-4.x-Linux-Java8-64/checkout/solr/build/solr-core/test/J1/index1443514435tmp lockFactory=org.apache.lucene.store.NativeFSLockFactory@784adbc3),segFN=segments_f,generation=15,filenames=[segments_f]
[junit4:junit4]   2> 4211 T38 C1 oasc.SolrDeletionPolicy.updateCommits newest commit = 15
[junit4:junit4]   2> 4213 T38 C1 oass.SolrIndexSearcher.<init> Opening Searcher@7c2e9f41 main
[junit4:junit4]   2> 4213 T38 C1 oass.SolrIndexSearcher.getIndexDir WARNING WARNING: Directory impl does not support setting indexDir: org.apache.lucene.store.MockDirectoryWrapper
[junit4:junit4]   2> 4213 T38 C1 oasu.DirectUpdateHandler2.commit end_commit_flush
[junit4:junit4]   2> 4213 T39 oashc.SpellCheckComponent$SpellCheckerListener.buildSpellIndex Building spell index for spell checker: default
[junit4:junit4]   2> 4223 T39 oashc.SpellCheckComponent$SpellCheckerListener.buildSpellIndex Building spell index for spell checker: default_teststop
[junit4:junit4]   2> 4253 T39 oashc.SpellCheckComponent$SpellCheckerListener.buildSpellIndex Building spell index for spell checker: threshold
[junit4:junit4]   2> 4273 T39 oashc.SpellCheckComponent$SpellCheckerListener.buildSpellIndex Building spell index for spell checker: threshold_direct
[junit4:junit4]   2> 4273 T39 oashc.SpellCheckComponent$SpellCheckerListener.buildSpellIndex Building spell index for spell checker: multipleFields
[junit4:junit4]   2> 4313 T39 oashc.SpellCheckComponent$SpellCheckerListener.buildSpellIndex Building spell index for spell checker: freq
[junit4:junit4]   2> 4343 T39 oashc.SpellCheckComponent$SpellCheckerListener.buildSpellIndex Building spell index for spell checker: fqcn
[junit4:junit4]   2> 4373 T39 oasc.SolrCore.registerSearcher [collection1] Registered new searcher Searcher@7c2e9f41 main{StandardDirectoryReader(segments_f:24)}
[junit4:junit4]   2> 4374 T38 C1 UPDATE [collection1] webapp=null path=null params={} {commit=} 0 171
[junit4:junit4]   2> NOTE: reproduce with: ant test  -Dtestcase=SpellCheckComponentTest -Dtests.method=testPerDictionary -Dtests.seed=C916C4B3993A4664 -Dtests.multiplier=3 -Dtests.slow=true -Dtests.locale=ar_KW -Dtests.timezone=SystemV/YST9 -Dtests.file.encoding=UTF-8
[junit4:junit4]   2>
[junit4:junit4]    > (@AfterClass output)
[junit4:junit4]   2> 5921 T38 oas.SolrTestCaseJ4.deleteCore ###deleteCore
[junit4:junit4]   2> 5921 T38 oasc.CoreContainer.shutdown Shutting down CoreContainer instance=2137117149
[junit4:junit4]   2> 5922 T38 oasc.SolrCore.close [collection1]  CLOSING SolrCore org.apache.solr.core.SolrCore@154d7534
[junit4:junit4]   2> 5922 T38 oasc.SolrCore.closeSearcher [collection1] Closing main searcher on request.
[junit4:junit4]   2> 5922 T38 oasu.DirectUpdateHandler2.close closing DirectUpdateHandler2{commits=20,autocommits=0,soft autocommits=0,optimizes=0,rollbacks=0,expungeDeletes=0,docsPending=0,adds=0,deletesById=0,deletesByQuery=0,errors=0,cumulative_adds=92,cumulative_deletesById=0,cumulative_deletesByQuery=9,cumulative_errors=0}
[junit4:junit4]   2> NOTE: test params are: codec=Lucene3x, sim=DefaultSimilarity, locale=ar_KW, timezone=SystemV/YST9
[junit4:junit4]   2> NOTE: Linux 3.2.0-26-generic amd64/Oracle Corporation 1.8.0-ea (64-bit)/cpus=8,threads=1,free=198556424,total=243007488
[junit4:junit4]   2> NOTE: All tests run in this JVM: [TestCoreContainer, TestSolrDeletionPolicy2, TestSystemIdResolver, SearchHandlerTest, TestChineseTokenizerFactory, TestSynonymMap, TestJmxMonitoredMap, SpellCheckComponentTest]
[junit4:junit4]   2> 
[junit4:junit4] Completed on J1 in 6.03s, 9 tests, 1 error <<< FAILURES!

[...truncated 428 lines...]
[junit4:junit4] Suite: org.apache.solr.handler.component.DistributedQueryElevationComponentTest
[junit4:junit4] FAILURE 1.09s J0 | DistributedQueryElevationComponentTest.testDistribSearch
[junit4:junit4]    > Throwable #1: junit.framework.AssertionFailedError: .responseHeader.params.size()==9,9skipped=4,5
[junit4:junit4]    > 	at __randomizedtesting.SeedInfo.seed([C916C4B3993A4664:48F04AABEE652658]:0)
[junit4:junit4]    > 	at junit.framework.Assert.fail(Assert.java:50)
[junit4:junit4]    > 	at org.apache.solr.BaseDistributedSearchTestCase.compareResponses(BaseDistributedSearchTestCase.java:670)
[junit4:junit4]    > 	at org.apache.solr.BaseDistributedSearchTestCase.query(BaseDistributedSearchTestCase.java:392)
[junit4:junit4]    > 	at org.apache.solr.handler.component.DistributedQueryElevationComponentTest.doTest(DistributedQueryElevationComponentTest.java:81)
[junit4:junit4]    > 	at org.apache.solr.BaseDistributedSearchTestCase.testDistribSearch(BaseDistributedSearchTestCase.java:679)
[junit4:junit4]    > 	at sun.reflect.NativeMethodAccessorImpl.invoke0(Native Method)
[junit4:junit4]    > 	at sun.reflect.NativeMethodAccessorImpl.invoke(NativeMethodAccessorImpl.java:57)
[junit4:junit4]    > 	at sun.reflect.DelegatingMethodAccessorImpl.invoke(DelegatingMethodAccessorImpl.java:43)
[junit4:junit4]    > 	at java.lang.reflect.Method.invoke(Method.java:474)
[junit4:junit4]    > 	at com.carrotsearch.randomizedtesting.RandomizedRunner.invoke(RandomizedRunner.java:1995)
[junit4:junit4]    > 	at com.carrotsearch.randomizedtesting.RandomizedRunner.access$1100(RandomizedRunner.java:132)
[junit4:junit4]    > 	at com.carrotsearch.randomizedtesting.RandomizedRunner$6.evaluate(RandomizedRunner.java:818)
[junit4:junit4]    > 	at com.carrotsearch.randomizedtesting.RandomizedRunner$7.evaluate(RandomizedRunner.java:877)
[junit4:junit4]    > 	at com.carrotsearch.randomizedtesting.RandomizedRunner$8.evaluate(RandomizedRunner.java:891)
[junit4:junit4]    > 	at com.carrotsearch.randomizedtesting.rules.SystemPropertiesRestoreRule$1.evaluate(SystemPropertiesRestoreRule.java:53)
[junit4:junit4]    > 	at org.apache.lucene.util.TestRuleSetupTeardownChained$1.evaluate(TestRuleSetupTeardownChained.java:50)
[junit4:junit4]    > 	at org.apache.lucene.util.TestRuleFieldCacheSanity$1.evaluate(TestRuleFieldCacheSanity.java:32)
[junit4:junit4]    > 	at org.apache.lucene.util.AbstractBeforeAfterRule$1.evaluate(AbstractBeforeAfterRule.java:45)
[junit4:junit4]    > 	at com.carrotsearch.randomizedtesting.rules.SystemPropertiesInvariantRule$1.evaluate(SystemPropertiesInvariantRule.java:55)
[junit4:junit4]    > 	at org.apache.lucene.util.TestRuleReportUncaughtExceptions$1.evaluate(TestRuleReportUncaughtExceptions.java:68)
[junit4:junit4]    > 	at org.apache.lucene.util.TestRuleThreadAndTestName$1.evaluate(TestRuleThreadAndTestName.java:48)
[junit4:junit4]    > 	at org.apache.lucene.util.TestRuleIgnoreAfterMaxFailures$1.evaluate(TestRuleIgnoreAfterMaxFailures.java:70)
[junit4:junit4]    > 	at org.apache.lucene.util.TestRuleMarkFailure$1.evaluate(TestRuleMarkFailure.java:48)
[junit4:junit4]    > 	at com.carrotsearch.randomizedtesting.RandomizedRunner.runSingleTest(RandomizedRunner.java:825)
[junit4:junit4]    > 	at com.carrotsearch.randomizedtesting.RandomizedRunner.access$700(RandomizedRunner.java:132)
[junit4:junit4]    > 	at com.carrotsearch.randomizedtesting.RandomizedRunner$3$1.run(RandomizedRunner.java:671)
[junit4:junit4]    > 	at com.carrotsearch.randomizedtesting.RandomizedRunner$3.evaluate(RandomizedRunner.java:697)
[junit4:junit4]    > 	at com.carrotsearch.randomizedtesting.RandomizedRunner$4.evaluate(RandomizedRunner.java:736)
[junit4:junit4]    > 	at com.carrotsearch.randomizedtesting.RandomizedRunner$5.evaluate(RandomizedRunner.java:747)
[junit4:junit4]    > 	at com.carrotsearch.randomizedtesting.rules.SystemPropertiesRestoreRule$1.evaluate(SystemPropertiesRestoreRule.java:53)
[junit4:junit4]    > 	at org.apache.lucene.util.AbstractBeforeAfterRule$1.evaluate(AbstractBeforeAfterRule.java:45)
[junit4:junit4]    > 	at org.apache.lucene.util.TestRuleReportUncaughtExceptions$1.evaluate(TestRuleReportUncaughtExceptions.java:68)
[junit4:junit4]    > 	at org.apache.lucene.util.TestRuleStoreClassName$1.evaluate(TestRuleStoreClassName.java:38)
[junit4:junit4]    > 	at org.apache.lucene.util.TestRuleIcuHack$1.evaluate(TestRuleIcuHack.java:51)
[junit4:junit4]    > 	at com.carrotsearch.randomizedtesting.rules.SystemPropertiesInvariantRule$1.evaluate(SystemPropertiesInvariantRule.java:55)
[junit4:junit4]    > 	at org.apache.lucene.util.TestRuleNoInstanceHooksOverrides$1.evaluate(TestRuleNoInstanceHooksOverrides.java:53)
[junit4:junit4]    > 	at org.apache.lucene.util.TestRuleNoStaticHooksShadowing$1.evaluate(TestRuleNoStaticHooksShadowing.java:52)
[junit4:junit4]    > 	at org.apache.lucene.util.TestRuleAssertionsRequired$1.evaluate(TestRuleAssertionsRequired.java:36)
[junit4:junit4]    > 	at org.apache.lucene.util.TestRuleMarkFailure$1.evaluate(TestRuleMarkFailure.java:48)
[junit4:junit4]    > 	at org.apache.lucene.util.TestRuleIgnoreAfterMaxFailures$1.evaluate(TestRuleIgnoreAfterMaxFailures.java:70)
[junit4:junit4]    > 	at org.apache.lucene.util.TestRuleIgnoreTestSuites$1.evaluate(TestRuleIgnoreTestSuites.java:55)
[junit4:junit4]    > 	at com.carrotsearch.randomizedtesting.RandomizedRunner.runSuite(RandomizedRunner.java:605)
[junit4:junit4]    > 	at com.carrotsearch.randomizedtesting.RandomizedRunner.access$400(RandomizedRunner.java:132)
[junit4:junit4]    > 	at com.carrotsearch.randomizedtesting.RandomizedRunner$2.run(RandomizedRunner.java:551)
[junit4:junit4]    > 
[junit4:junit4]   2> 2 T1373 oas.SolrTestCaseJ4.setUp ###Starting testDistribSearch
[junit4:junit4]   2> 3 T1373 oejs.Server.doStart jetty-8.1.2.v20120308
[junit4:junit4]   2> 11 T1373 oejs.AbstractConnector.doStart Started SocketConnector@0.0.0.0:57705
[junit4:junit4]   2> 12 T1373 oasc.SolrResourceLoader.locateSolrHome JNDI not configured for solr (NoInitialContextEx)
[junit4:junit4]   2> 12 T1373 oasc.SolrResourceLoader.locateSolrHome using system property solr.solr.home: /mnt/ssd/jenkins/workspace/Lucene-Solr-4.x-Linux-Java8-64/checkout/solr/build/solr-core/test-files/solr
[junit4:junit4]   2> 12 T1373 oasc.SolrResourceLoader.<init> new SolrResourceLoader for deduced Solr Home: '/mnt/ssd/jenkins/workspace/Lucene-Solr-4.x-Linux-Java8-64/checkout/solr/build/solr-core/test-files/solr/'
[junit4:junit4]   2> 16 T1373 oass.SolrDispatchFilter.init SolrDispatchFilter.init()
[junit4:junit4]   2> 16 T1373 oasc.SolrResourceLoader.locateSolrHome JNDI not configured for solr (NoInitialContextEx)
[junit4:junit4]   2> 16 T1373 oasc.SolrResourceLoader.locateSolrHome using system property solr.solr.home: /mnt/ssd/jenkins/workspace/Lucene-Solr-4.x-Linux-Java8-64/checkout/solr/build/solr-core/test-files/solr
[junit4:junit4]   2> 16 T1373 oasc.CoreContainer$Initializer.initialize looking for solr.xml: /mnt/ssd/jenkins/workspace/Lucene-Solr-4.x-Linux-Java8-64/checkout/solr/build/solr-core/test-files/solr/solr.xml
[junit4:junit4]   2> 17 T1373 oasc.CoreContainer.<init> New CoreContainer 1963270708
[junit4:junit4]   2> 17 T1373 oasc.CoreContainer.load Loading CoreContainer using Solr Home: '/mnt/ssd/jenkins/workspace/Lucene-Solr-4.x-Linux-Java8-64/checkout/solr/build/solr-core/test-files/solr/'
[junit4:junit4]   2> 17 T1373 oasc.SolrResourceLoader.<init> new SolrResourceLoader for directory: '/mnt/ssd/jenkins/workspace/Lucene-Solr-4.x-Linux-Java8-64/checkout/solr/build/solr-core/test-files/solr/'
[junit4:junit4]   2> 23 T1373 oasc.CoreContainer.load Registering Log Listener
[junit4:junit4]   2> 40 T1373 oashc.HttpShardHandlerFactory.getParameter Setting socketTimeout to: 0
[junit4:junit4]   2> 41 T1373 oashc.HttpShardHandlerFactory.getParameter Setting urlScheme to: http://
[junit4:junit4]   2> 41 T1373 oashc.HttpShardHandlerFactory.getParameter Setting connTimeout to: 0
[junit4:junit4]   2> 42 T1373 oashc.HttpShardHandlerFactory.getParameter Setting maxConnectionsPerHost to: 20
[junit4:junit4]   2> 42 T1373 oashc.HttpShardHandlerFactory.getParameter Setting corePoolSize to: 0
[junit4:junit4]   2> 42 T1373 oashc.HttpShardHandlerFactory.getParameter Setting maximumPoolSize to: 2147483647
[junit4:junit4]   2> 42 T1373 oashc.HttpShardHandlerFactory.getParameter Setting maxThreadIdleTime to: 5
[junit4:junit4]   2> 43 T1373 oashc.HttpShardHandlerFactory.getParameter Setting sizeOfQueue to: -1
[junit4:junit4]   2> 43 T1373 oashc.HttpShardHandlerFactory.getParameter Setting fairnessPolicy to: false
[junit4:junit4]   2> 43 T1373 oascsi.HttpClientUtil.createClient Creating new http client, config:maxConnectionsPerHost=20&maxConnections=10000&socketTimeout=0&connTimeout=0&retry=false
[junit4:junit4]   2> 49 T1373 oasc.CoreContainer.create Creating SolrCore 'collection1' using instanceDir: /mnt/ssd/jenkins/workspace/Lucene-Solr-4.x-Linux-Java8-64/checkout/solr/build/solr-core/test-files/solr/collection1
[junit4:junit4]   2> 49 T1373 oasc.SolrResourceLoader.<init> new SolrResourceLoader for directory: '/mnt/ssd/jenkins/workspace/Lucene-Solr-4.x-Linux-Java8-64/checkout/solr/build/solr-core/test-files/solr/collection1/'
[junit4:junit4]   2> 50 T1373 oasc.SolrResourceLoader.replaceClassLoader Adding 'file:/mnt/ssd/jenkins/workspace/Lucene-Solr-4.x-Linux-Java8-64/checkout/solr/build/solr-core/test-files/solr/collection1/lib/README' to classloader
[junit4:junit4]   2> 50 T1373 oasc.SolrResourceLoader.replaceClassLoader Adding 'file:/mnt/ssd/jenkins/workspace/Lucene-Solr-4.x-Linux-Java8-64/checkout/solr/build/solr-core/test-files/solr/collection1/lib/classes/' to classloader
[junit4:junit4]   2> 62 T1373 oasc.SolrConfig.<init> Using Lucene MatchVersion: LUCENE_40
[junit4:junit4]   2> 85 T1373 oasc.SolrConfig.<init> Loaded SolrConfig: solrconfig-elevate.xml
[junit4:junit4]   2> 86 T1373 oass.IndexSchema.readSchema Reading Solr Schema
[junit4:junit4]   2> 88 T1373 oass.IndexSchema.readSchema Schema name=example
[junit4:junit4]   2> 184 T1373 oass.IndexSchema.readSchema default search field in schema is text
[junit4:junit4]   2> 186 T1373 oass.IndexSchema.readSchema unique key field: id
[junit4:junit4]   2> 188 T1373 oasc.SolrCore.<init> [collection1] Opening new SolrCore at /mnt/ssd/jenkins/workspace/Lucene-Solr-4.x-Linux-Java8-64/checkout/solr/build/solr-core/test-files/solr/collection1/, dataDir=./org.apache.solr.handler.component.DistributedQueryElevationComponentTest-1342973446523/control/data/
[junit4:junit4]   2> 188 T1373 oasc.JmxMonitoredMap.<init> JMX monitoring is enabled. Adding Solr mbeans to JMX Server: com.sun.jmx.mbeanserver.JmxMBeanServer@bf38e9a
[junit4:junit4]   2> 188 T1373 oasc.SolrCore.getNewIndexDir WARNING New index directory detected: old=null new=./org.apache.solr.handler.component.DistributedQueryElevationComponentTest-1342973446523/control/data/index/
[junit4:junit4]   2> 189 T1373 oasc.SolrCore.initIndex WARNING [collection1] Solr index directory './org.apache.solr.handler.component.DistributedQueryElevationComponentTest-1342973446523/control/data/index' doesn't exist. Creating new index...
[junit4:junit4]   2> 190 T1373 oasc.SolrDeletionPolicy.onCommit SolrDeletionPolicy.onCommit: commits:num=1
[junit4:junit4]   2> 		commit{dir=MockDirWrapper(org.apache.lucene.store.RAMDirectory@7dd30644 lockFactory=org.apache.lucene.store.SingleInstanceLockFactory@5079458b),segFN=segments_1,generation=1,filenames=[segments_1]
[junit4:junit4]   2> 190 T1373 oasc.SolrDeletionPolicy.updateCommits newest commit = 1
[junit4:junit4]   2> 191 T1373 oasc.RequestHandlers.initHandlersFromConfig created /update: solr.UpdateRequestHandler
[junit4:junit4]   2> 191 T1373 oasc.RequestHandlers.initHandlersFromConfig created /elevate: org.apache.solr.handler.component.SearchHandler
[junit4:junit4]   2> 191 T1373 oasc.RequestHandlers.initHandlersFromConfig created /dataElevate: org.apache.solr.handler.component.SearchHandler
[junit4:junit4]   2> 192 T1373 oashl.XMLLoader.init xsltCacheLifetimeSeconds=60
[junit4:junit4]   2> 192 T1373 oasc.RequestHandlers.initHandlersFromConfig WARNING no default request handler is registered (either '/select' or 'standard')
[junit4:junit4]   2> 193 T1373 oasc.SolrCore.initDeprecatedSupport WARNING solrconfig.xml uses deprecated <admin/gettableFiles>, Please update your config to use the ShowFileRequestHandler.
[junit4:junit4]   2> 193 T1373 oasc.SolrCore.initDeprecatedSupport WARNING adding ShowFileRequestHandler with hidden files: [SCHEMA-SIM.XML, KEEP-1.TXT, SCHEMA.XML, SCHEMA-REPLICATION2.XML, HUNSPELL-TEST.DIC, SCHEMA12.XML, BAD_SOLRCONFIG.XML, SCHEMA_CODEC.XML, STOPWORDS.TXT, SOLRCONFIG-PHRASESUGGEST.XML, WDFTYPES.TXT, SCHEMA-PHRASESUGGEST.XML, CONDITIONAL.UPDATEPROCESSOR.JS, SOLRCONFIG_CODEC.XML, SOLRCONFIG-LAZYWRITER.XML, SOLRCONFIG-SOLR-749.XML, SOLRCONFIG-SCRIPT-UPDATEPROCESSOR.XML, FRENCHARTICLES.TXT, SCHEMA-SPELLCHECKER.XML, SOLRCONFIG-MASTER1-KEEPONEBACKUP.XML, BAD-SCHEMA-UNIQUEKEY-IS-COPYFIELD-DEST.XML, SCHEMA-IB.XML, SOLRCONFIG-BASIC-LUCENEVERSION31.XML, STOP-SNOWBALL.TXT, KEEP-2.TXT, SOLRCONFIG-REPEATER.XML, DA_UTF8.XML, PROTWORDS.TXT, SCHEMA-COPYFIELD-TEST.XML, SOLRCONFIG-MASTER2.XML, STOPTYPES-2.TXT, SCHEMA-NOT-REQUIRED-UNIQUE-KEY.XML, STOP-1.TXT, SCHEMA-REPLICATION1.XML, SOLRCONFIG-MASTER3.XML, SCHEMA-LUCENEMATCHVERSION.XML, SOLRCONFIG-PROPINJECT-INDEXDEFAULT.XML, SCHEMA-TRIE.XML, OLD_SYNONYMS.TXT, BAD-SCHEMA-NOT-INDEXED-BUT-NORMS.XML, XSLT, BAD-SCHEMA-CODEC-GLOBAL-VS-FT-MISMATCH.XML, THROW.ERROR.ON.ADD.UPDATEPROCESSOR.JS, SOLRCONFIG-SLAVE.XML, SOLRCONFIG-NOCACHE.XML, SCHEMA-COLLATE.XML, SOLRCONFIG-ELEVATE.XML, SOLRCONFIG-ENABLEPLUGIN.XML, BAD-SOLRCONFIG-MISSING-SCRIPTFILE.XML, MISSLEADING.EXTENSION.UPDATEPROCESSOR.JS.TXT, SCHEMA-LMDIRICHLET.XML, SCHEMA-TFIDF.XML, SOLRCONFIG-MASTER.XML, BAD-SCHEMA-DUP-FIELDTYPE.XML, SOLRCONFIG-TLOG.XML, STOP-2.TXT, SOLRCONFIG-HIGHLIGHT.XML, SOLRCONFIG-TERMINDEX.XML, BAD-SCHEMA-DUP-DYNAMICFIELD.XML, SOLRCONFIG-CACHING.XML, SOLRCONFIG_PERF.XML, BAD-SOLRCONFIG-BOGUS-SCRIPTENGINE-NAME.XML, MISSING.FUNCTIONS.UPDATEPROCESSOR.JS, SCHEMA-DFR.XML, SOLRCONFIG-UPDATE-PROCESSOR-CHAINS.XML, SCHEMA-CHARFILTERS.XML, ADDFIELDS.UPDATEPROCESSOR.JS, SOLRCONFIG-REQHANDLER.INCL, STOPWITHBOM.TXT, SOLRCONFIG-PROPINJECT.XML, TRIVIAL.UPDATEPROCESSOR0.JS, MAPPING-ISOLATIN1ACCENT.TXT, SOLRCONFIG-NATIVELOCK.XML, BAD-SOLRCONFIG-INVALID-SCRIPTFILE.XML, SCHEMA11.XML, BAD-SCHEMA-NONTEXT-ANALYZER.XML, SCHEMA-BINARYFIELD.XML, HYPHENATION.DTD, SOLRCONFIG-QUERYSENDER-NOQUERY.XML, SOLRCONFIG-SIMPLELOCK.XML, BAD-SCHEMA-OMIT-TF-BUT-NOT-POS.XML, SCHEMA-COLLATEFILTER.XML, SOLRCONFIG-DELPOLICY2.XML, BAD-SCHEMA-NOT-INDEXED-BUT-TF.XML, SOLRCONFIG-BASIC.XML, SOLRCONFIG-DELPOLICY1.XML, SOLRCONFIG-QUERYSENDER.XML, SOLRCONFIG-SOLCOREPROPERTIES.XML, SOLRCONFIG-SPELLCHECKCOMPONENT.XML, COMPOUNDDICTIONARY.TXT, SCHEMA-BM25.XML, SOLRCONFIG-SPELLCHECKER.XML, STOPTYPES-1.TXT, ELEVATE.XML, TRIVIAL.UPDATEPROCESSOR1.JS, SCHEMA-STOP-KEEP.XML, BAD-MP-SOLRCONFIG.XML, SCHEMA-REVERSED.XML, STOPWORDSWRONGENCODING.TXT, BAD-SCHEMA-SIM-GLOBAL-VS-FT-MISMATCH.XML, CURRENCY.XML, BAD-SCHEMA-NOT-INDEXED-BUT-POS.XML, SOLRCONFIG-MERGEPOLICY.XML, SOLRCONFIG-MASTER1.XML, OPEN-EXCHANGE-RATES.JSON, STEMDICT.TXT, BAD-SCHEMA-EXTERNAL-FILEFIELD.XML, DA_COMPOUNDDICTIONARY.TXT, SOLRCONFIG-ALTDIRECTORY.XML, SYNONYMS.TXT, SCHEMA-MINIMAL.XML, SOLRCONFIG-FUNCTIONQUERY.XML, SCHEMASURROUND.XML, SOLRCONFIG-XINCLUDE.XML, SCHEMA15.XML, HUNSPELL-TEST.AFF, SCHEMA-NUMERIC.XML, SCHEMA-LMJELINEKMERCER.XML, BAD-SCHEMA-UNIQUEKEY-USES-DEFAULT.XML, BAD-SCHEMA-DUP-FIELD.XML, SCHEMA-FOLDING.XML, SCHEMA-REQUIRED-FIELDS.XML, SOLRCONFIG-TRANSFORMERS.XML, PHRASESUGGEST.TXT, SOLRCONFIG-SLAVE1.XML]
[junit4:junit4]   2> 195 T1373 oass.SolrIndexSearcher.<init> Opening Searcher@606d1cdf main
[junit4:junit4]   2> 195 T1373 oass.SolrIndexSearcher.getIndexDir WARNING WARNING: Directory impl does not support setting indexDir: org.apache.lucene.store.MockDirectoryWrapper
[junit4:junit4]   2> 195 T1373 oasu.CommitTracker.<init> Hard AutoCommit: disabled
[junit4:junit4]   2> 196 T1373 oasu.CommitTracker.<init> Soft AutoCommit: disabled
[junit4:junit4]   2> 198 T1373 oashc.QueryElevationComponent.inform Loading QueryElevation from: /mnt/ssd/jenkins/workspace/Lucene-Solr-4.x-Linux-Java8-64/checkout/solr/build/solr-core/test-files/solr/collection1/conf/elevate.xml
[junit4:junit4]   2> 203 T1373 oashc.QueryElevationComponent.inform Loading QueryElevation from: /mnt/ssd/jenkins/workspace/Lucene-Solr-4.x-Linux-Java8-64/checkout/solr/build/solr-core/test-files/solr/collection1/conf/elevate.xml
[junit4:junit4]   2> 208 T1373 oasc.CoreContainer.register registering core: collection1
[junit4:junit4]   2> 208 T1373 oass.SolrDispatchFilter.init user.dir=/mnt/ssd/jenkins/workspace/Lucene-Solr-4.x-Linux-Java8-64/checkout/solr/build/solr-core/test/J0
[junit4:junit4]   2> 209 T1373 oass.SolrDispatchFilter.init SolrDispatchFilter.init() done
[junit4:junit4]   2> 209 T1373 oascsi.HttpClientUtil.createClient Creating new http client, config:maxConnections=128&maxConnectionsPerHost=32&followRedirects=false
[junit4:junit4]   2> 209 T1383 oasc.SolrCore.registerSearcher [collection1] Registered new searcher Searcher@606d1cdf main{StandardDirectoryReader(segments_1:1)}
[junit4:junit4]   2> 211 T1373 oejs.Server.doStart jetty-8.1.2.v20120308
[junit4:junit4]   2> 212 T1373 oejs.AbstractConnector.doStart Started SocketConnector@0.0.0.0:56915
[junit4:junit4]   2> 213 T1373 oasc.SolrResourceLoader.locateSolrHome JNDI not configured for solr (NoInitialContextEx)
[junit4:junit4]   2> 213 T1373 oasc.SolrResourceLoader.locateSolrHome using system property solr.solr.home: /mnt/ssd/jenkins/workspace/Lucene-Solr-4.x-Linux-Java8-64/checkout/solr/build/solr-core/test-files/solr
[junit4:junit4]   2> 213 T1373 oasc.SolrResourceLoader.<init> new SolrResourceLoader for deduced Solr Home: '/mnt/ssd/jenkins/workspace/Lucene-Solr-4.x-Linux-Java8-64/checkout/solr/build/solr-core/test-files/solr/'
[junit4:junit4]   2> 216 T1373 oass.SolrDispatchFilter.init SolrDispatchFilter.init()
[junit4:junit4]   2> 216 T1373 oasc.SolrResourceLoader.locateSolrHome JNDI not configured for solr (NoInitialContextEx)
[junit4:junit4]   2> 216 T1373 oasc.SolrResourceLoader.locateSolrHome using system property solr.solr.home: /mnt/ssd/jenkins/workspace/Lucene-Solr-4.x-Linux-Java8-64/checkout/solr/build/solr-core/test-files/solr
[junit4:junit4]   2> 217 T1373 oasc.CoreContainer$Initializer.initialize looking for solr.xml: /mnt/ssd/jenkins/workspace/Lucene-Solr-4.x-Linux-Java8-64/checkout/solr/build/solr-core/test-files/solr/solr.xml
[junit4:junit4]   2> 217 T1373 oasc.CoreContainer.<init> New CoreContainer 931111689
[junit4:junit4]   2> 217 T1373 oasc.CoreContainer.load Loading CoreContainer using Solr Home: '/mnt/ssd/jenkins/workspace/Lucene-Solr-4.x-Linux-Java8-64/checkout/solr/build/solr-core/test-files/solr/'
[junit4:junit4]   2> 217 T1373 oasc.SolrResourceLoader.<init> new SolrResourceLoader for directory: '/mnt/ssd/jenkins/workspace/Lucene-Solr-4.x-Linux-Java8-64/checkout/solr/build/solr-core/test-files/solr/'
[junit4:junit4]   2> 221 T1373 oasc.CoreContainer.load Registering Log Listener
[junit4:junit4]   2> 227 T1373 oashc.HttpShardHandlerFactory.getParameter Setting socketTimeout to: 0
[junit4:junit4]   2> 227 T1373 oashc.HttpShardHandlerFactory.getParameter Setting urlScheme to: http://
[junit4:junit4]   2> 227 T1373 oashc.HttpShardHandlerFactory.getParameter Setting connTimeout to: 0
[junit4:junit4]   2> 228 T1373 oashc.HttpShardHandlerFactory.getParameter Setting maxConnectionsPerHost to: 20
[junit4:junit4]   2> 228 T1373 oashc.HttpShardHandlerFactory.getParameter Setting corePoolSize to: 0
[junit4:junit4]   2> 228 T1373 oashc.HttpShardHandlerFactory.getParameter Setting maximumPoolSize to: 2147483647
[junit4:junit4]   2> 228 T1373 oashc.HttpShardHandlerFactory.getParameter Setting maxThreadIdleTime to: 5
[junit4:junit4]   2> 228 T1373 oashc.HttpShardHandlerFactory.getParameter Setting sizeOfQueue to: -1
[junit4:junit4]   2> 229 T1373 oashc.HttpShardHandlerFactory.getParameter Setting fairnessPolicy to: false
[junit4:junit4]   2> 229 T1373 oascsi.HttpClientUtil.createClient Creating new http client, config:maxConnectionsPerHost=20&maxConnections=10000&socketTimeout=0&connTimeout=0&retry=false
[junit4:junit4]   2> 232 T1373 oasc.CoreContainer.create Creating SolrCore 'collection1' using instanceDir: /mnt/ssd/jenkins/workspace/Lucene-Solr-4.x-Linux-Java8-64/checkout/solr/build/solr-core/test-files/solr/collection1
[junit4:junit4]   2> 233 T1373 oasc.SolrResourceLoader.<init> new SolrResourceLoader for directory: '/mnt/ssd/jenkins/workspace/Lucene-Solr-4.x-Linux-Java8-64/checkout/solr/build/solr-core/test-files/solr/collection1/'
[junit4:junit4]   2> 233 T1373 oasc.SolrResourceLoader.replaceClassLoader Adding 'file:/mnt/ssd/jenkins/workspace/Lucene-Solr-4.x-Linux-Java8-64/checkout/solr/build/solr-core/test-files/solr/collection1/lib/README' to classloader
[junit4:junit4]   2> 233 T1373 oasc.SolrResourceLoader.replaceClassLoader Adding 'file:/mnt/ssd/jenkins/workspace/Lucene-Solr-4.x-Linux-Java8-64/checkout/solr/build/solr-core/test-files/solr/collection1/lib/classes/' to classloader
[junit4:junit4]   2> 245 T1373 oasc.SolrConfig.<init> Using Lucene MatchVersion: LUCENE_40
[junit4:junit4]   2> 267 T1373 oasc.SolrConfig.<init> Loaded SolrConfig: solrconfig-elevate.xml
[junit4:junit4]   2> 268 T1373 oass.IndexSchema.readSchema Reading Solr Schema
[junit4:junit4]   2> 270 T1373 oass.IndexSchema.readSchema Schema name=example
[junit4:junit4]   2> 366 T1373 oass.IndexSchema.readSchema default search field in schema is text
[junit4:junit4]   2> 367 T1373 oass.IndexSchema.readSchema unique key field: id
[junit4:junit4]   2> 369 T1373 oasc.SolrCore.<init> [collection1] Opening new SolrCore at /mnt/ssd/jenkins/workspace/Lucene-Solr-4.x-Linux-Java8-64/checkout/solr/build/solr-core/test-files/solr/collection1/, dataDir=./org.apache.solr.handler.component.DistributedQueryElevationComponentTest-1342973446523/shard0/data/
[junit4:junit4]   2> 369 T1373 oasc.JmxMonitoredMap.<init> JMX monitoring is enabled. Adding Solr mbeans to JMX Server: com.sun.jmx.mbeanserver.JmxMBeanServer@bf38e9a
[junit4:junit4]   2> 370 T1373 oasc.SolrCore.getNewIndexDir WARNING New index directory detected: old=null new=./org.apache.solr.handler.component.DistributedQueryElevationComponentTest-1342973446523/shard0/data/index/
[junit4:junit4]   2> 370 T1373 oasc.SolrCore.initIndex WARNING [collection1] Solr index directory './org.apache.solr.handler.component.DistributedQueryElevationComponentTest-1342973446523/shard0/data/index' doesn't exist. Creating new index...
[junit4:junit4]   2> 371 T1373 oasc.SolrDeletionPolicy.onCommit SolrDeletionPolicy.onCommit: commits:num=1
[junit4:junit4]   2> 		commit{dir=MockDirWrapper(org.apache.lucene.store.RAMDirectory@493f4ae lockFactory=org.apache.lucene.store.SingleInstanceLockFactory@3ec6ebdc),segFN=segments_1,generation=1,filenames=[segments_1]
[junit4:junit4]   2> 371 T1373 oasc.SolrDeletionPolicy.updateCommits newest commit = 1
[junit4:junit4]   2> 372 T1373 oasc.RequestHandlers.initHandlersFromConfig created /update: solr.UpdateRequestHandler
[junit4:junit4]   2> 372 T1373 oasc.RequestHandlers.initHandlersFromConfig created /elevate: org.apache.solr.handler.component.SearchHandler
[junit4:junit4]   2> 372 T1373 oasc.RequestHandlers.initHandlersFromConfig created /dataElevate: org.apache.solr.handler.component.SearchHandler
[junit4:junit4]   2> 373 T1373 oashl.XMLLoader.init xsltCacheLifetimeSeconds=60
[junit4:junit4]   2> 373 T1373 oasc.RequestHandlers.initHandlersFromConfig WARNING no default request handler is registered (either '/select' or 'standard')
[junit4:junit4]   2> 374 T1373 oasc.SolrCore.initDeprecatedSupport WARNING solrconfig.xml uses deprecated <admin/gettableFiles>, Please update your config to use the ShowFileRequestHandler.
[junit4:junit4]   2> 374 T1373 oasc.SolrCore.initDeprecatedSupport WARNING adding ShowFileRequestHandler with hidden files: [SCHEMA-SIM.XML, KEEP-1.TXT, SCHEMA.XML, SCHEMA-REPLICATION2.XML, HUNSPELL-TEST.DIC, SCHEMA12.XML, BAD_SOLRCONFIG.XML, SCHEMA_CODEC.XML, STOPWORDS.TXT, SOLRCONFIG-PHRASESUGGEST.XML, WDFTYPES.TXT, SCHEMA-PHRASESUGGEST.XML, CONDITIONAL.UPDATEPROCESSOR.JS, SOLRCONFIG_CODEC.XML, SOLRCONFIG-LAZYWRITER.XML, SOLRCONFIG-SOLR-749.XML, SOLRCONFIG-SCRIPT-UPDATEPROCESSOR.XML, FRENCHARTICLES.TXT, SCHEMA-SPELLCHECKER.XML, SOLRCONFIG-MASTER1-KEEPONEBACKUP.XML, BAD-SCHEMA-UNIQUEKEY-IS-COPYFIELD-DEST.XML, SCHEMA-IB.XML, SOLRCONFIG-BASIC-LUCENEVERSION31.XML, STOP-SNOWBALL.TXT, KEEP-2.TXT, SOLRCONFIG-REPEATER.XML, DA_UTF8.XML, PROTWORDS.TXT, SCHEMA-COPYFIELD-TEST.XML, SOLRCONFIG-MASTER2.XML, STOPTYPES-2.TXT, SCHEMA-NOT-REQUIRED-UNIQUE-KEY.XML, STOP-1.TXT, SCHEMA-REPLICATION1.XML, SOLRCONFIG-MASTER3.XML, SCHEMA-LUCENEMATCHVERSION.XML, SOLRCONFIG-PROPINJECT-INDEXDEFAULT.XML, SCHEMA-TRIE.XML, OLD_SYNONYMS.TXT, BAD-SCHEMA-NOT-INDEXED-BUT-NORMS.XML, XSLT, BAD-SCHEMA-CODEC-GLOBAL-VS-FT-MISMATCH.XML, THROW.ERROR.ON.ADD.UPDATEPROCESSOR.JS, SOLRCONFIG-SLAVE.XML, SOLRCONFIG-NOCACHE.XML, SCHEMA-COLLATE.XML, SOLRCONFIG-ELEVATE.XML, SOLRCONFIG-ENABLEPLUGIN.XML, BAD-SOLRCONFIG-MISSING-SCRIPTFILE.XML, MISSLEADING.EXTENSION.UPDATEPROCESSOR.JS.TXT, SCHEMA-LMDIRICHLET.XML, SCHEMA-TFIDF.XML, SOLRCONFIG-MASTER.XML, BAD-SCHEMA-DUP-FIELDTYPE.XML, SOLRCONFIG-TLOG.XML, STOP-2.TXT, SOLRCONFIG-HIGHLIGHT.XML, SOLRCONFIG-TERMINDEX.XML, BAD-SCHEMA-DUP-DYNAMICFIELD.XML, SOLRCONFIG-CACHING.XML, SOLRCONFIG_PERF.XML, BAD-SOLRCONFIG-BOGUS-SCRIPTENGINE-NAME.XML, MISSING.FUNCTIONS.UPDATEPROCESSOR.JS, SCHEMA-DFR.XML, SOLRCONFIG-UPDATE-PROCESSOR-CHAINS.XML, SCHEMA-CHARFILTERS.XML, ADDFIELDS.UPDATEPROCESSOR.JS, SOLRCONFIG-REQHANDLER.INCL, STOPWITHBOM.TXT, SOLRCONFIG-PROPINJECT.XML, TRIVIAL.UPDATEPROCESSOR0.JS, MAPPING-ISOLATIN1ACCENT.TXT, SOLRCONFIG-NATIVELOCK.XML, BAD-SOLRCONFIG-INVALID-SCRIPTFILE.XML, SCHEMA11.XML, BAD-SCHEMA-NONTEXT-ANALYZER.XML, SCHEMA-BINARYFIELD.XML, HYPHENATION.DTD, SOLRCONFIG-QUERYSENDER-NOQUERY.XML, SOLRCONFIG-SIMPLELOCK.XML, BAD-SCHEMA-OMIT-TF-BUT-NOT-POS.XML, SCHEMA-COLLATEFILTER.XML, SOLRCONFIG-DELPOLICY2.XML, BAD-SCHEMA-NOT-INDEXED-BUT-TF.XML, SOLRCONFIG-BASIC.XML, SOLRCONFIG-DELPOLICY1.XML, SOLRCONFIG-QUERYSENDER.XML, SOLRCONFIG-SOLCOREPROPERTIES.XML, SOLRCONFIG-SPELLCHECKCOMPONENT.XML, COMPOUNDDICTIONARY.TXT, SCHEMA-BM25.XML, SOLRCONFIG-SPELLCHECKER.XML, STOPTYPES-1.TXT, ELEVATE.XML, TRIVIAL.UPDATEPROCESSOR1.JS, SCHEMA-STOP-KEEP.XML, BAD-MP-SOLRCONFIG.XML, SCHEMA-REVERSED.XML, STOPWORDSWRONGENCODING.TXT, BAD-SCHEMA-SIM-GLOBAL-VS-FT-MISMATCH.XML, CURRENCY.XML, BAD-SCHEMA-NOT-INDEXED-BUT-POS.XML, SOLRCONFIG-MERGEPOLICY.XML, SOLRCONFIG-MASTER1.XML, OPEN-EXCHANGE-RATES.JSON, STEMDICT.TXT, BAD-SCHEMA-EXTERNAL-FILEFIELD.XML, DA_COMPOUNDDICTIONARY.TXT, SOLRCONFIG-ALTDIRECTORY.XML, SYNONYMS.TXT, SCHEMA-MINIMAL.XML, SOLRCONFIG-FUNCTIONQUERY.XML, SCHEMASURROUND.XML, SOLRCONFIG-XINCLUDE.XML, SCHEMA15.XML, HUNSPELL-TEST.AFF, SCHEMA-NUMERIC.XML, SCHEMA-LMJELINEKMERCER.XML, BAD-SCHEMA-UNIQUEKEY-USES-DEFAULT.XML, BAD-SCHEMA-DUP-FIELD.XML, SCHEMA-FOLDING.XML, SCHEMA-REQUIRED-FIELDS.XML, SOLRCONFIG-TRANSFORMERS.XML, PHRASESUGGEST.TXT, SOLRCONFIG-SLAVE1.XML]
[junit4:junit4]   2> 376 T1373 oass.SolrIndexSearcher.<init> Opening Searcher@61884853 main
[junit4:junit4]   2> 376 T1373 oass.SolrIndexSearcher.getIndexDir WARNING WARNING: Directory impl does not support setting indexDir: org.apache.lucene.store.MockDirectoryWrapper
[junit4:junit4]   2> 377 T1373 oasu.CommitTracker.<init> Hard AutoCommit: disabled
[junit4:junit4]   2> 377 T1373 oasu.CommitTracker.<init> Soft AutoCommit: disabled
[junit4:junit4]   2> 377 T1373 oashc.QueryElevationComponent.inform Loading QueryElevation from: /mnt/ssd/jenkins/workspace/Lucene-Solr-4.x-Linux-Java8-64/checkout/solr/build/solr-core/test-files/solr/collection1/conf/elevate.xml
[junit4:junit4]   2> 382 T1373 oashc.QueryElevationComponent.inform Loading QueryElevation from: /mnt/ssd/jenkins/workspace/Lucene-Solr-4.x-Linux-Java8-64/checkout/solr/build/solr-core/test-files/solr/collection1/conf/elevate.xml
[junit4:junit4]   2> 387 T1393 oasc.SolrCore.registerSearcher [collection1] Registered new searcher Searcher@61884853 main{StandardDirectoryReader(segments_1:1)}
[junit4:junit4]   2> 387 T1373 oasc.CoreContainer.register registering core: collection1
[junit4:junit4]   2> 388 T1373 oass.SolrDispatchFilter.init user.dir=/mnt/ssd/jenkins/workspace/Lucene-Solr-4.x-Linux-Java8-64/checkout/solr/build/solr-core/test/J0
[junit4:junit4]   2> 388 T1373 oass.SolrDispatchFilter.init SolrDispatchFilter.init() done
[junit4:junit4]   2> 388 T1373 oascsi.HttpClientUtil.createClient Creating new http client, config:maxConnections=128&maxConnectionsPerHost=32&followRedirects=false
[junit4:junit4]   2> 390 T1373 oejs.Server.doStart jetty-8.1.2.v20120308
[junit4:junit4]   2> 391 T1373 oejs.AbstractConnector.doStart Started SocketConnector@0.0.0.0:54693
[junit4:junit4]   2> 392 T1373 oasc.SolrResourceLoader.locateSolrHome JNDI not configured for solr (NoInitialContextEx)
[junit4:junit4]   2> 392 T1373 oasc.SolrResourceLoader.locateSolrHome using system property solr.solr.home: /mnt/ssd/jenkins/workspace/Lucene-Solr-4.x-Linux-Java8-64/checkout/solr/build/solr-core/test-files/solr
[junit4:junit4]   2> 392 T1373 oasc.SolrResourceLoader.<init> new SolrResourceLoader for deduced Solr Home: '/mnt/ssd/jenkins/workspace/Lucene-Solr-4.x-Linux-Java8-64/checkout/solr/build/solr-core/test-files/solr/'
[junit4:junit4]   2> 395 T1373 oass.SolrDispatchFilter.init SolrDispatchFilter.init()
[junit4:junit4]   2> 395 T1373 oasc.SolrResourceLoader.locateSolrHome JNDI not configured for solr (NoInitialContextEx)
[junit4:junit4]   2> 395 T1373 oasc.SolrResourceLoader.locateSolrHome using system property solr.solr.home: /mnt/ssd/jenkins/workspace/Lucene-Solr-4.x-Linux-Java8-64/checkout/solr/build/solr-core/test-files/solr
[junit4:junit4]   2> 395 T1373 oasc.CoreContainer$Initializer.initialize looking for solr.xml: /mnt/ssd/jenkins/workspace/Lucene-Solr-4.x-Linux-Java8-64/checkout/solr/build/solr-core/test-files/solr/solr.xml
[junit4:junit4]   2> 396 T1373 oasc.CoreContainer.<init> New CoreContainer 843006532
[junit4:junit4]   2> 396 T1373 oasc.CoreContainer.load Loading CoreContainer using Solr Home: '/mnt/ssd/jenkins/workspace/Lucene-Solr-4.x-Linux-Java8-64/checkout/solr/build/solr-core/test-files/solr/'
[junit4:junit4]   2> 396 T1373 oasc.SolrResourceLoader.<init> new SolrResourceLoader for directory: '/mnt/ssd/jenkins/workspace/Lucene-Solr-4.x-Linux-Java8-64/checkout/solr/build/solr-core/test-files/solr/'
[junit4:junit4]   2> 400 T1373 oasc.CoreContainer.load Registering Log Listener
[junit4:junit4]   2> 406 T1373 oashc.HttpShardHandlerFactory.getParameter Setting socketTimeout to: 0
[junit4:junit4]   2> 406 T1373 oashc.HttpShardHandlerFactory.getParameter Setting urlScheme to: http://
[junit4:junit4]   2> 406 T1373 oashc.HttpShardHandlerFactory.getParameter Setting connTimeout to: 0
[junit4:junit4]   2> 407 T1373 oashc.HttpShardHandlerFactory.getParameter Setting maxConnectionsPerHost to: 20
[junit4:junit4]   2> 407 T1373 oashc.HttpShardHandlerFactory.getParameter Setting corePoolSize to: 0
[junit4:junit4]   2> 407 T1373 oashc.HttpShardHandlerFactory.getParameter Setting maximumPoolSize to: 2147483647
[junit4:junit4]   2> 407 T1373 oashc.HttpShardHandlerFactory.getParameter Setting maxThreadIdleTime to: 5
[junit4:junit4]   2> 408 T1373 oashc.HttpShardHandlerFactory.getParameter Setting sizeOfQueue to: -1
[junit4:junit4]   2> 408 T1373 oashc.HttpShardHandlerFactory.getParameter Setting fairnessPolicy to: false
[junit4:junit4]   2> 408 T1373 oascsi.HttpClientUtil.createClient Creating new http client, config:maxConnectionsPerHost=20&maxConnections=10000&socketTimeout=0&connTimeout=0&retry=false
[junit4:junit4]   2> 411 T1373 oasc.CoreContainer.create Creating SolrCore 'collection1' using instanceDir: /mnt/ssd/jenkins/workspace/Lucene-Solr-4.x-Linux-Java8-64/checkout/solr/build/solr-core/test-files/solr/collection1
[junit4:junit4]   2> 412 T1373 oasc.SolrResourceLoader.<init> new SolrResourceLoader for directory: '/mnt/ssd/jenkins/workspace/Lucene-Solr-4.x-Linux-Java8-64/checkout/solr/build/solr-core/test-files/solr/collection1/'
[junit4:junit4]   2> 412 T1373 oasc.SolrResourceLoader.replaceClassLoader Adding 'file:/mnt/ssd/jenkins/workspace/Lucene-Solr-4.x-Linux-Java8-64/checkout/solr/build/solr-core/test-files/solr/collection1/lib/README' to classloader
[junit4:junit4]   2> 412 T1373 oasc.SolrResourceLoader.replaceClassLoader Adding 'file:/mnt/ssd/jenkins/workspace/Lucene-Solr-4.x-Linux-Java8-64/checkout/solr/build/solr-core/test-files/solr/collection1/lib/classes/' to classloader
[junit4:junit4]   2> 424 T1373 oasc.SolrConfig.<init> Using Lucene MatchVersion: LUCENE_40
[junit4:junit4]   2> 447 T1373 oasc.SolrConfig.<init> Loaded SolrConfig: solrconfig-elevate.xml
[junit4:junit4]   2> 447 T1373 oass.IndexSchema.readSchema Reading Solr Schema
[junit4:junit4]   2> 449 T1373 oass.IndexSchema.readSchema Schema name=example
[junit4:junit4]   2> 550 T1373 oass.IndexSchema.readSchema default search field in schema is text
[junit4:junit4]   2> 552 T1373 oass.IndexSchema.readSchema unique key field: id
[junit4:junit4]   2> 553 T1373 oasc.SolrCore.<init> [collection1] Opening new SolrCore at /mnt/ssd/jenkins/workspace/Lucene-Solr-4.x-Linux-Java8-64/checkout/solr/build/solr-core/test-files/solr/collection1/, dataDir=./org.apache.solr.handler.component.DistributedQueryElevationComponentTest-1342973446523/shard1/data/
[junit4:junit4]   2> 554 T1373 oasc.JmxMonitoredMap.<init> JMX monitoring is enabled. Adding Solr mbeans to JMX Server: com.sun.jmx.mbeanserver.JmxMBeanServer@bf38e9a
[junit4:junit4]   2> 554 T1373 oasc.SolrCore.getNewIndexDir WARNING New index directory detected: old=null new=./org.apache.solr.handler.component.DistributedQueryElevationComponentTest-1342973446523/shard1/data/index/
[junit4:junit4]   2> 555 T1373 oasc.SolrCore.initIndex WARNING [collection1] Solr index directory './org.apache.solr.handler.component.DistributedQueryElevationComponentTest-1342973446523/shard1/data/index' doesn't exist. Creating new index...
[junit4:junit4]   2> 556 T1373 oasc.SolrDeletionPolicy.onCommit SolrDeletionPolicy.onCommit: commits:num=1
[junit4:junit4]   2> 		commit{dir=MockDirWrapper(org.apache.lucene.store.RAMDirectory@61d2c706 lockFactory=org.apache.lucene.store.SingleInstanceLockFactory@2466caf7),segFN=segments_1,generation=1,filenames=[segments_1]
[junit4:junit4]   2> 556 T1373 oasc.SolrDeletionPolicy.updateCommits newest commit = 1
[junit4:junit4]   2> 557 T1373 oasc.RequestHandlers.initHandlersFromConfig created /update: solr.UpdateRequestHandler
[junit4:junit4]   2> 557 T1373 oasc.RequestHandlers.initHandlersFromConfig created /elevate: org.apache.solr.handler.component.SearchHandler
[junit4:junit4]   2> 557 T1373 oasc.RequestHandlers.initHandlersFromConfig created /dataElevate: org.apache.solr.handler.component.SearchHandler
[junit4:junit4]   2> 558 T1373 oashl.XMLLoader.init xsltCacheLifetimeSeconds=60
[junit4:junit4]   2> 558 T1373 oasc.RequestHandlers.initHandlersFromConfig WARNING no default request handler is registered (either '/select' or 'standard')
[junit4:junit4]   2> 559 T1373 oasc.SolrCore.initDeprecatedSupport WARNING solrconfig.xml uses deprecated <admin/gettableFiles>, Please update your config to use the ShowFileRequestHandler.
[junit4:junit4]   2> 559 T1373 oasc.SolrCore.initDeprecatedSupport WARNING adding ShowFileRequestHandler with hidden files: [SCHEMA-SIM.XML, KEEP-1.TXT, SCHEMA.XML, SCHEMA-REPLICATION2.XML, HUNSPELL-TEST.DIC, SCHEMA12.XML, BAD_SOLRCONFIG.XML, SCHEMA_CODEC.XML, STOPWORDS.TXT, SOLRCONFIG-PHRASESUGGEST.XML, WDFTYPES.TXT, SCHEMA-PHRASESUGGEST.XML, CONDITIONAL.UPDATEPROCESSOR.JS, SOLRCONFIG_CODEC.XML, SOLRCONFIG-LAZYWRITER.XML, SOLRCONFIG-SOLR-749.XML, SOLRCONFIG-SCRIPT-UPDATEPROCESSOR.XML, FRENCHARTICLES.TXT, SCHEMA-SPELLCHECKER.XML, SOLRCONFIG-MASTER1-KEEPONEBACKUP.XML, BAD-SCHEMA-UNIQUEKEY-IS-COPYFIELD-DEST.XML, SCHEMA-IB.XML, SOLRCONFIG-BASIC-LUCENEVERSION31.XML, STOP-SNOWBALL.TXT, KEEP-2.TXT, SOLRCONFIG-REPEATER.XML, DA_UTF8.XML, PROTWORDS.TXT, SCHEMA-COPYFIELD-TEST.XML, SOLRCONFIG-MASTER2.XML, STOPTYPES-2.TXT, SCHEMA-NOT-REQUIRED-UNIQUE-KEY.XML, STOP-1.TXT, SCHEMA-REPLICATION1.XML, SOLRCONFIG-MASTER3.XML, SCHEMA-LUCENEMATCHVERSION.XML, SOLRCONFIG-PROPINJECT-INDEXDEFAULT.XML, SCHEMA-TRIE.XML, OLD_SYNONYMS.TXT, BAD-SCHEMA-NOT-INDEXED-BUT-NORMS.XML, XSLT, BAD-SCHEMA-CODEC-GLOBAL-VS-FT-MISMATCH.XML, THROW.ERROR.ON.ADD.UPDATEPROCESSOR.JS, SOLRCONFIG-SLAVE.XML, SOLRCONFIG-NOCACHE.XML, SCHEMA-COLLATE.XML, SOLRCONFIG-ELEVATE.XML, SOLRCONFIG-ENABLEPLUGIN.XML, BAD-SOLRCONFIG-MISSING-SCRIPTFILE.XML, MISSLEADING.EXTENSION.UPDATEPROCESSOR.JS.TXT, SCHEMA-LMDIRICHLET.XML, SCHEMA-TFIDF.XML, SOLRCONFIG-MASTER.XML, BAD-SCHEMA-DUP-FIELDTYPE.XML, SOLRCONFIG-TLOG.XML, STOP-2.TXT, SOLRCONFIG-HIGHLIGHT.XML, SOLRCONFIG-TERMINDEX.XML, BAD-SCHEMA-DUP-DYNAMICFIELD.XML, SOLRCONFIG-CACHING.XML, SOLRCONFIG_PERF.XML, BAD-SOLRCONFIG-BOGUS-SCRIPTENGINE-NAME.XML, MISSING.FUNCTIONS.UPDATEPROCESSOR.JS, SCHEMA-DFR.XML, SOLRCONFIG-UPDATE-PROCESSOR-CHAINS.XML, SCHEMA-CHARFILTERS.XML, ADDFIELDS.UPDATEPROCESSOR.JS, SOLRCONFIG-REQHANDLER.INCL, STOPWITHBOM.TXT, SOLRCONFIG-PROPINJECT.XML, TRIVIAL.UPDATEPROCESSOR0.JS, MAPPING-ISOLATIN1ACCENT.TXT, SOLRCONFIG-NATIVELOCK.XML, BAD-SOLRCONFIG-INVALID-SCRIPTFILE.XML, SCHEMA11.XML, BAD-SCHEMA-NONTEXT-ANALYZER.XML, SCHEMA-BINARYFIELD.XML, HYPHENATION.DTD, SOLRCONFIG-QUERYSENDER-NOQUERY.XML, SOLRCONFIG-SIMPLELOCK.XML, BAD-SCHEMA-OMIT-TF-BUT-NOT-POS.XML, SCHEMA-COLLATEFILTER.XML, SOLRCONFIG-DELPOLICY2.XML, BAD-SCHEMA-NOT-INDEXED-BUT-TF.XML, SOLRCONFIG-BASIC.XML, SOLRCONFIG-DELPOLICY1.XML, SOLRCONFIG-QUERYSENDER.XML, SOLRCONFIG-SOLCOREPROPERTIES.XML, SOLRCONFIG-SPELLCHECKCOMPONENT.XML, COMPOUNDDICTIONARY.TXT, SCHEMA-BM25.XML, SOLRCONFIG-SPELLCHECKER.XML, STOPTYPES-1.TXT, ELEVATE.XML, TRIVIAL.UPDATEPROCESSOR1.JS, SCHEMA-STOP-KEEP.XML, BAD-MP-SOLRCONFIG.XML, SCHEMA-REVERSED.XML, STOPWORDSWRONGENCODING.TXT, BAD-SCHEMA-SIM-GLOBAL-VS-FT-MISMATCH.XML, CURRENCY.XML, BAD-SCHEMA-NOT-INDEXED-BUT-POS.XML, SOLRCONFIG-MERGEPOLICY.XML, SOLRCONFIG-MASTER1.XML, OPEN-EXCHANGE-RATES.JSON, STEMDICT.TXT, BAD-SCHEMA-EXTERNAL-FILEFIELD.XML, DA_COMPOUNDDICTIONARY.TXT, SOLRCONFIG-ALTDIRECTORY.XML, SYNONYMS.TXT, SCHEMA-MINIMAL.XML, SOLRCONFIG-FUNCTIONQUERY.XML, SCHEMASURROUND.XML, SOLRCONFIG-XINCLUDE.XML, SCHEMA15.XML, HUNSPELL-TEST.AFF, SCHEMA-NUMERIC.XML, SCHEMA-LMJELINEKMERCER.XML, BAD-SCHEMA-UNIQUEKEY-USES-DEFAULT.XML, BAD-SCHEMA-DUP-FIELD.XML, SCHEMA-FOLDING.XML, SCHEMA-REQUIRED-FIELDS.XML, SOLRCONFIG-TRANSFORMERS.XML, PHRASESUGGEST.TXT, SOLRCONFIG-SLAVE1.XML]
[junit4:junit4]   2> 561 T1373 oass.SolrIndexSearcher.<init> Opening Searcher@5557a95e main
[junit4:junit4]   2> 561 T1373 oass.SolrIndexSearcher.getIndexDir WARNING WARNING: Directory impl does not support setting indexDir: org.apache.lucene.store.MockDirectoryWrapper
[junit4:junit4]   2> 562 T1373 oasu.CommitTracker.<init> Hard AutoCommit: disabled
[junit4:junit4]   2> 562 T1373 oasu.CommitTracker.<init> Soft AutoCommit: disabled
[junit4:junit4]   2> 562 T1373 oashc.QueryElevationComponent.inform Loading QueryElevation from: /mnt/ssd/jenkins/workspace/Lucene-Solr-4.x-Linux-Java8-64/checkout/solr/build/solr-core/test-files/solr/collection1/conf/elevate.xml
[junit4:junit4]   2> 567 T1373 oashc.QueryElevationComponent.inform Loading QueryElevation from: /mnt/ssd/jenkins/workspace/Lucene-Solr-4.x-Linux-Java8-64/checkout/solr/build/solr-core/test-files/solr/collection1/conf/elevate.xml
[junit4:junit4]   2> 572 T1403 oasc.SolrCore.registerSearcher [collection1] Registered new searcher Searcher@5557a95e main{StandardDirectoryReader(segments_1:1)}
[junit4:junit4]   2> 572 T1373 oasc.CoreContainer.register registering core: collection1
[junit4:junit4]   2> 573 T1373 oass.SolrDispatchFilter.init user.dir=/mnt/ssd/jenkins/workspace/Lucene-Solr-4.x-Linux-Java8-64/checkout/solr/build/solr-core/test/J0
[junit4:junit4]   2> 573 T1373 oass.SolrDispatchFilter.init SolrDispatchFilter.init() done
[junit4:junit4]   2> 573 T1373 oascsi.HttpClientUtil.createClient Creating new http client, config:maxConnections=128&maxConnectionsPerHost=32&followRedirects=false
[junit4:junit4]   2> 575 T1373 oejs.Server.doStart jetty-8.1.2.v20120308
[junit4:junit4]   2> 577 T1373 oejs.AbstractConnector.doStart Started SocketConnector@0.0.0.0:57684
[junit4:junit4]   2> 577 T1373 oasc.SolrResourceLoader.locateSolrHome JNDI not configured for solr (NoInitialContextEx)
[junit4:junit4]   2> 578 T1373 oasc.SolrResourceLoader.locateSolrHome using system property solr.solr.home: /mnt/ssd/jenkins/workspace/Lucene-Solr-4.x-Linux-Java8-64/checkout/solr/build/solr-core/test-files/solr
[junit4:junit4]   2> 578 T1373 oasc.SolrResourceLoader.<init> new SolrResourceLoader for deduced Solr Home: '/mnt/ssd/jenkins/workspace/Lucene-Solr-4.x-Linux-Java8-64/checkout/solr/build/solr-core/test-files/solr/'
[junit4:junit4]   2> 580 T1373 oass.SolrDispatchFilter.init SolrDispatchFilter.init()
[junit4:junit4]   2> 581 T1373 oasc.SolrResourceLoader.locateSolrHome JNDI not configured for solr (NoInitialContextEx)
[junit4:junit4]   2> 581 T1373 oasc.SolrResourceLoader.locateSolrHome using system property solr.solr.home: /mnt/ssd/jenkins/workspace/Lucene-Solr-4.x-Linux-Java8-64/checkout/solr/build/solr-core/test-files/solr
[junit4:junit4]   2> 581 T1373 oasc.CoreContainer$Initializer.initialize looking for solr.xml: /mnt/ssd/jenkins/workspace/Lucene-Solr-4.x-Linux-Java8-64/checkout/solr/build/solr-core/test-files/solr/solr.xml
[junit4:junit4]   2> 581 T1373 oasc.CoreContainer.<init> New CoreContainer 1059807244
[junit4:junit4]   2> 582 T1373 oasc.CoreContainer.load Loading CoreContainer using Solr Home: '/mnt/ssd/jenkins/workspace/Lucene-Solr-4.x-Linux-Java8-64/checkout/solr/build/solr-core/test-files/solr/'
[junit4:junit4]   2> 582 T1373 oasc.SolrResourceLoader.<init> new SolrResourceLoader for directory: '/mnt/ssd/jenkins/workspace/Lucene-Solr-4.x-Linux-Java8-64/checkout/solr/build/solr-core/test-files/solr/'
[junit4:junit4]   2> 586 T1373 oasc.CoreContainer.load Registering Log Listener
[junit4:junit4]   2> 592 T1373 oashc.HttpShardHandlerFactory.getParameter Setting socketTimeout to: 0
[junit4:junit4]   2> 592 T1373 oashc.HttpShardHandlerFactory.getParameter Setting urlScheme to: http://
[junit4:junit4]   2> 593 T1373 oashc.HttpShardHandlerFactory.getParameter Setting connTimeout to: 0
[junit4:junit4]   2> 593 T1373 oashc.HttpShardHandlerFactory.getParameter Setting maxConnectionsPerHost to: 20
[junit4:junit4]   2> 593 T1373 oashc.HttpShardHandlerFactory.getParameter Setting corePoolSize to: 0
[junit4:junit4]   2> 593 T1373 oashc.HttpShardHandlerFactory.getParameter Setting maximumPoolSize to: 2147483647
[junit4:junit4]   2> 593 T1373 oashc.HttpShardHandlerFactory.getParameter Setting maxThreadIdleTime to: 5
[junit4:junit4]   2> 594 T1373 oashc.HttpShardHandlerFactory.getParameter Setting sizeOfQueue to: -1
[junit4:junit4]   2> 594 T1373 oashc.HttpShardHandlerFactory.getParameter Setting fairnessPolicy to: false
[junit4:junit4]   2> 594 T1373 oascsi.HttpClientUtil.createClient Creating new http client, config:maxConnectionsPerHost=20&maxConnections=10000&socketTimeout=0&connTimeout=0&retry=false
[junit4:junit4]   2> 598 T1373 oasc.CoreContainer.create Creating SolrCore 'collection1' using instanceDir: /mnt/ssd/jenkins/workspace/Lucene-Solr-4.x-Linux-Java8-64/checkout/solr/build/solr-core/test-files/solr/collection1
[junit4:junit4]   2> 598 T1373 oasc.SolrResourceLoader.<init> new SolrResourceLoader for directory: '/mnt/ssd/jenkins/workspace/Lucene-Solr-4.x-Linux-Java8-64/checkout/solr/build/solr-core/test-files/solr/collection1/'
[junit4:junit4]   2> 598 T1373 oasc.SolrResourceLoader.replaceClassLoader Adding 'file:/mnt/ssd/jenkins/workspace/Lucene-Solr-4.x-Linux-Java8-64/checkout/solr/build/solr-core/test-files/solr/collection1/lib/README' to classloader
[junit4:junit4]   2> 599 T1373 oasc.SolrResourceLoader.replaceClassLoader Adding 'file:/mnt/ssd/jenkins/workspace/Lucene-Solr-4.x-Linux-Java8-64/checkout/solr/build/solr-core/test-files/solr/collection1/lib/classes/' to classloader
[junit4:junit4]   2> 611 T1373 oasc.SolrConfig.<init> Using Lucene MatchVersion: LUCENE_40
[junit4:junit4]   2> 634 T1373 oasc.SolrConfig.<init> Loaded SolrConfig: solrconfig-elevate.xml
[junit4:junit4]   2> 635 T1373 oass.IndexSchema.readSchema Reading Solr Schema
[junit4:junit4]   2> 637 T1373 oass.IndexSchema.readSchema Schema name=example
[junit4:junit4]   2> 732 T1373 oass.IndexSchema.readSchema default search field in schema is text
[junit4:junit4]   2> 734 T1373 oass.IndexSchema.readSchema unique key field: id
[junit4:junit4]   2> 735 T1373 oasc.SolrCore.<init> [collection1] Opening new SolrCore at /mnt/ssd/jenkins/workspace/Lucene-Solr-4.x-Linux-Java8-64/checkout/solr/build/solr-core/test-files/solr/collection1/, dataDir=./org.apache.solr.handler.component.DistributedQueryElevationComponentTest-1342973446523/shard2/data/
[junit4:junit4]   2> 736 T1373 oasc.JmxMonitoredMap.<init> JMX monitoring is enabled. Adding Solr mbeans to JMX Server: com.sun.jmx.mbeanserver.JmxMBeanServer@bf38e9a
[junit4:junit4]   2> 736 T1373 oasc.SolrCore.getNewIndexDir WARNING New index directory detected: old=null new=./org.apache.solr.handler.component.DistributedQueryElevationComponentTest-1342973446523/shard2/data/index/
[junit4:junit4]   2> 737 T1373 oasc.SolrCore.initIndex WARNING [collection1] Solr index directory './org.apache.solr.handler.component.DistributedQueryElevationComponentTest-1342973446523/shard2/data/index' doesn't exist. Creating new index...
[junit4:junit4]   2> 737 T1373 oasc.SolrDeletionPolicy.onCommit SolrDeletionPolicy.onCommit: commits:num=1
[junit4:junit4]   2> 		commit{dir=MockDirWrapper(org.apache.lucene.store.RAMDirectory@71478d1 lockFactory=org.apache.lucene.store.SingleInstanceLockFactory@5d497f57),segFN=segments_1,generation=1,filenames=[segments_1]
[junit4:junit4]   2> 738 T1373 oasc.SolrDeletionPolicy.updateCommits newest commit = 1
[junit4:junit4]   2> 739 T1373 oasc.RequestHandlers.initHandlersFromConfig created /update: solr.UpdateRequestHandler
[junit4:junit4]   2> 739 T1373 oasc.RequestHandlers.initHandlersFromConfig created /elevate: org.apache.solr.handler.component.SearchHandler
[junit4:junit4]   2> 739 T1373 oasc.RequestHandlers.initHandlersFromConfig created /dataElevate: org.apache.solr.handler.component.SearchHandler
[junit4:junit4]   2> 740 T1373 oashl.XMLLoader.init xsltCacheLifetimeSeconds=60
[junit4:junit4]   2> 740 T1373 oasc.RequestHandlers.initHandlersFromConfig WARNING no default request handler is registered (either '/select' or 'standard')
[junit4:junit4]   2> 741 T1373 oasc.SolrCore.initDeprecatedSupport WARNING solrconfig.xml uses deprecated <admin/gettableFiles>, Please update your config to use the ShowFileRequestHandler.
[junit4:junit4]   2> 741 T1373 oasc.SolrCore.initDeprecatedSupport WARNING adding ShowFileRequestHandler with hidden files: [SCHEMA-SIM.XML, KEEP-1.TXT, SCHEMA.XML, SCHEMA-REPLICATION2.XML, HUNSPELL-TEST.DIC, SCHEMA12.XML, BAD_SOLRCONFIG.XML, SCHEMA_CODEC.XML, STOPWORDS.TXT, SOLRCONFIG-PHRASESUGGEST.XML, WDFTYPES.TXT, SCHEMA-PHRASESUGGEST.XML, CONDITIONAL.UPDATEPROCESSOR.JS, SOLRCONFIG_CODEC.XML, SOLRCONFIG-LAZYWRITER.XML, SOLRCONFIG-SOLR-749.XML, SOLRCONFIG-SCRIPT-UPDATEPROCESSOR.XML, FRENCHARTICLES.TXT, SCHEMA-SPELLCHECKER.XML, SOLRCONFIG-MASTER1-KEEPONEBACKUP.XML, BAD-SCHEMA-UNIQUEKEY-IS-COPYFIELD-DEST.XML, SCHEMA-IB.XML, SOLRCONFIG-BASIC-LUCENEVERSION31.XML, STOP-SNOWBALL.TXT, KEEP-2.TXT, SOLRCONFIG-REPEATER.XML, DA_UTF8.XML, PROTWORDS.TXT, SCHEMA-COPYFIELD-TEST.XML, SOLRCONFIG-MASTER2.XML, STOPTYPES-2.TXT, SCHEMA-NOT-REQUIRED-UNIQUE-KEY.XML, STOP-1.TXT, SCHEMA-REPLICATION1.XML, SOLRCONFIG-MASTER3.XML, SCHEMA-LUCENEMATCHVERSION.XML, SOLRCONFIG-PROPINJECT-INDEXDEFAULT.XML, SCHEMA-TRIE.XML, OLD_SYNONYMS.TXT, BAD-SCHEMA-NOT-INDEXED-BUT-NORMS.XML, XSLT, BAD-SCHEMA-CODEC-GLOBAL-VS-FT-MISMATCH.XML, THROW.ERROR.ON.ADD.UPDATEPROCESSOR.JS, SOLRCONFIG-SLAVE.XML, SOLRCONFIG-NOCACHE.XML, SCHEMA-COLLATE.XML, SOLRCONFIG-ELEVATE.XML, SOLRCONFIG-ENABLEPLUGIN.XML, BAD-SOLRCONFIG-MISSING-SCRIPTFILE.XML, MISSLEADING.EXTENSION.UPDATEPROCESSOR.JS.TXT, SCHEMA-LMDIRICHLET.XML, SCHEMA-TFIDF.XML, SOLRCONFIG-MASTER.XML, BAD-SCHEMA-DUP-FIELDTYPE.XML, SOLRCONFIG-TLOG.XML, STOP-2.TXT, SOLRCONFIG-HIGHLIGHT.XML, SOLRCONFIG-TERMINDEX.XML, BAD-SCHEMA-DUP-DYNAMICFIELD.XML, SOLRCONFIG-CACHING.XML, SOLRCONFIG_PERF.XML, BAD-SOLRCONFIG-BOGUS-SCRIPTENGINE-NAME.XML, MISSING.FUNCTIONS.UPDATEPROCESSOR.JS, SCHEMA-DFR.XML, SOLRCONFIG-UPDATE-PROCESSOR-CHAINS.XML, SCHEMA-CHARFILTERS.XML, ADDFIELDS.UPDATEPROCESSOR.JS, SOLRCONFIG-REQHANDLER.INCL, STOPWITHBOM.TXT, SOLRCONFIG-PROPINJECT.XML, TRIVIAL.UPDATEPROCESSOR0.JS, MAPPING-ISOLATIN1ACCENT.TXT, SOLRCONFIG-NATIVELOCK.XML, BAD-SOLRCONFIG-INVALID-SCRIPTFILE.XML, SCHEMA11.XML, BAD-SCHEMA-NONTEXT-ANALYZER.XML, SCHEMA-BINARYFIELD.XML, HYPHENATION.DTD, SOLRCONFIG-QUERYSENDER-NOQUERY.XML, SOLRCONFIG-SIMPLELOCK.XML, BAD-SCHEMA-OMIT-TF-BUT-NOT-POS.XML, SCHEMA-COLLATEFILTER.XML, SOLRCONFIG-DELPOLICY2.XML, BAD-SCHEMA-NOT-INDEXED-BUT-TF.XML, SOLRCONFIG-BASIC.XML, SOLRCONFIG-DELPOLICY1.XML, SOLRCONFIG-QUERYSENDER.XML, SOLRCONFIG-SOLCOREPROPERTIES.XML, SOLRCONFIG-SPELLCHECKCOMPONENT.XML, COMPOUNDDICTIONARY.TXT, SCHEMA-BM25.XML, SOLRCONFIG-SPELLCHECKER.XML, STOPTYPES-1.TXT, ELEVATE.XML, TRIVIAL.UPDATEPROCESSOR1.JS, SCHEMA-STOP-KEEP.XML, BAD-MP-SOLRCONFIG.XML, SCHEMA-REVERSED.XML, STOPWORDSWRONGENCODING.TXT, BAD-SCHEMA-SIM-GLOBAL-VS-FT-MISMATCH.XML, CURRENCY.XML, BAD-SCHEMA-NOT-INDEXED-BUT-POS.XML, SOLRCONFIG-MERGEPOLICY.XML, SOLRCONFIG-MASTER1.XML, OPEN-EXCHANGE-RATES.JSON, STEMDICT.TXT, BAD-SCHEMA-EXTERNAL-FILEFIELD.XML, DA_COMPOUNDDICTIONARY.TXT, SOLRCONFIG-ALTDIRECTORY.XML, SYNONYMS.TXT, SCHEMA-MINIMAL.XML, SOLRCONFIG-FUNCTIONQUERY.XML, SCHEMASURROUND.XML, SOLRCONFIG-XINCLUDE.XML, SCHEMA15.XML, HUNSPELL-TEST.AFF, SCHEMA-NUMERIC.XML, SCHEMA-LMJELINEKMERCER.XML, BAD-SCHEMA-UNIQUEKEY-USES-DEFAULT.XML, BAD-SCHEMA-DUP-FIELD.XML, SCHEMA-FOLDING.XML, SCHEMA-REQUIRED-FIELDS.XML, SOLRCONFIG-TRANSFORMERS.XML, PHRASESUGGEST.TXT, SOLRCONFIG-SLAVE1.XML]
[junit4:junit4]   2> 743 T1373 oass.SolrIndexSearcher.<init> Opening Searcher@18e5d445 main
[junit4:junit4]   2> 743 T1373 oass.SolrIndexSearcher.getIndexDir WARNING WARNING: Directory impl does not support setting indexDir: org.apache.lucene.store.MockDirectoryWrapper
[junit4:junit4]   2> 743 T1373 oasu.CommitTracker.<init> Hard AutoCommit: disabled
[junit4:junit4]   2> 744 T1373 oasu.CommitTracker.<init> Soft AutoCommit: disabled
[junit4:junit4]   2> 744 T1373 oashc.QueryElevationComponent.inform Loading QueryElevation from: /mnt/ssd/jenkins/workspace/Lucene-Solr-4.x-Linux-Java8-64/checkout/solr/build/solr-core/test-files/solr/collection1/conf/elevate.xml
[junit4:junit4]   2> 748 T1373 oashc.QueryElevationComponent.inform Loading QueryElevation from: /mnt/ssd/jenkins/workspace/Lucene-Solr-4.x-Linux-Java8-64/checkout/solr/build/solr-core/test-files/solr/collection1/conf/elevate.xml
[junit4:junit4]   2> 754 T1413 oasc.SolrCore.registerSearcher [collection1] Registered new searcher Searcher@18e5d445 main{StandardDirectoryReader(segments_1:1)}
[junit4:junit4]   2> 754 T1373 oasc.CoreContainer.register registering core: collection1
[junit4:junit4]   2> 754 T1373 oass.SolrDispatchFilter.init user.dir=/mnt/ssd/jenkins/workspace/Lucene-Solr-4.x-Linux-Java8-64/checkout/solr/build/solr-core/test/J0
[junit4:junit4]   2> 754 T1373 oass.SolrDispatchFilter.init SolrDispatchFilter.init() done
[junit4:junit4]   2> 755 T1373 oascsi.HttpClientUtil.createClient Creating new http client, config:maxConnections=128&maxConnectionsPerHost=32&followRedirects=false
[junit4:junit4]   2> ASYNC  NEW_CORE C110 name=collection1 org.apache.solr.core.SolrCore@61fa645c
[junit4:junit4]   2> 760 T1376 C110 oasu.DirectUpdateHandler2.deleteAll [collection1] REMOVING ALL DOCUMENTS FROM INDEX
[junit4:junit4]   2> 761 T1376 C110 oasc.SolrDeletionPolicy.onInit SolrDeletionPolicy.onInit: commits:num=1
[junit4:junit4]   2> 		commit{dir=MockDirWrapper(org.apache.lucene.store.RAMDirectory@7dd30644 lockFactory=org.apache.lucene.store.SingleInstanceLockFactory@5079458b),segFN=segments_1,generation=1,filenames=[segments_1]
[junit4:junit4]   2> 762 T1376 C110 oasc.SolrDeletionPolicy.updateCommits newest commit = 1
[junit4:junit4]   2> 762 T1376 C110 UPDATE [collection1] webapp=/solr path=/update params={wt=javabin&version=2} {deleteByQuery=*:*} 0 3
[junit4:junit4]   2> ASYNC  NEW_CORE C111 name=collection1 org.apache.solr.core.SolrCore@629484b2
[junit4:junit4]   2> 766 T1386 C111 oasu.DirectUpdateHandler2.deleteAll [collection1] REMOVING ALL DOCUMENTS FROM INDEX
[junit4:junit4]   2> 767 T1386 C111 oasc.SolrDeletionPolicy.onInit SolrDeletionPolicy.onInit: commits:num=1
[junit4:junit4]   2> 		commit{dir=MockDirWrapper(org.apache.lucene.store.RAMDirectory@493f4ae lockFactory=org.apache.lucene.store.SingleInstanceLockFactory@3ec6ebdc),segFN=segments_1,generation=1,filenames=[segments_1]
[junit4:junit4]   2> 767 T1386 C111 oasc.SolrDeletionPolicy.updateCommits newest commit = 1
[junit4:junit4]   2> 768 T1386 C111 UPDATE [collection1] webapp=/solr path=/update params={wt=javabin&version=2} {deleteByQuery=*:*} 0 2
[junit4:junit4]   2> ASYNC  NEW_CORE C112 name=collection1 org.apache.solr.core.SolrCore@28723478
[junit4:junit4]   2> 771 T1396 C112 oasu.DirectUpdateHandler2.deleteAll [collection1] REMOVING ALL DOCUMENTS FROM INDEX
[junit4:junit4]   2> 771 T1396 C112 oasc.SolrDeletionPolicy.onInit SolrDeletionPolicy.onInit: commits:num=1
[junit4:junit4]   2> 		commit{dir=MockDirWrapper(org.apache.lucene.store.RAMDirectory@61d2c706 lockFactory=org.apache.lucene.store.SingleInstanceLockFactory@2466caf7),segFN=segments_1,generation=1,filenames=[segments_1]
[junit4:junit4]   2> 772 T1396 C112 oasc.SolrDeletionPolicy.updateCommits newest commit = 1
[junit4:junit4]   2> 772 T1396 C112 UPDATE [collection1] webapp=/solr path=/update params={wt=javabin&version=2} {deleteByQuery=*:*} 0 2
[junit4:junit4]   2> ASYNC  NEW_CORE C113 name=collection1 org.apache.solr.core.SolrCore@67ca2063
[junit4:junit4]   2> 776 T1406 C113 oasu.DirectUpdateHandler2.deleteAll [collection1] REMOVING ALL DOCUMENTS FROM INDEX
[junit4:junit4]   2> 777 T1406 C113 oasc.SolrDeletionPolicy.onInit SolrDeletionPolicy.onInit: commits:num=1
[junit4:junit4]   2> 		commit{dir=MockDirWrapper(org.apache.lucene.store.RAMDirectory@71478d1 lockFactory=org.apache.lucene.store.SingleInstanceLockFactory@5d497f57),segFN=segments_1,generation=1,filenames=[segments_1]
[junit4:junit4]   2> 777 T1406 C113 oasc.SolrDeletionPolicy.updateCommits newest commit = 1
[junit4:junit4]   2> 778 T1406 C113 UPDATE [collection1] webapp=/solr path=/update params={wt=javabin&version=2} {deleteByQuery=*:*} 0 2
[junit4:junit4]   2> 781 T1376 C110 UPDATE [collection1] webapp=/solr path=/update params={wt=javabin&version=2} {add=[1]} 0 2
[junit4:junit4]   2> 783 T1386 C111 UPDATE [collection1] webapp=/solr path=/update params={wt=javabin&version=2} {add=[1]} 0 0
[junit4:junit4]   2> 785 T1376 C110 UPDATE [collection1] webapp=/solr path=/update params={wt=javabin&version=2} {add=[2]} 0 0
[junit4:junit4]   2> 787 T1396 C112 UPDATE [collection1] webapp=/solr path=/update params={wt=javabin&version=2} {add=[2]} 0 1
[junit4:junit4]   2> 788 T1376 C110 UPDATE [collection1] webapp=/solr path=/update params={wt=javabin&version=2} {add=[3]} 0 0
[junit4:junit4]   2> 790 T1406 C113 UPDATE [collection1] webapp=/solr path=/update params={wt=javabin&version=2} {add=[3]} 0 0
[junit4:junit4]   2> 792 T1376 C110 UPDATE [collection1] webapp=/solr path=/update params={wt=javabin&version=2} {add=[4]} 0 1
[junit4:junit4]   2> 793 T1386 C111 UPDATE [collection1] webapp=/solr path=/update params={wt=javabin&version=2} {add=[4]} 0 0
[junit4:junit4]   2> 795 T1376 C110 UPDATE [collection1] webapp=/solr path=/update params={wt=javabin&version=2} {add=[5]} 0 0
[junit4:junit4]   2> 797 T1396 C112 UPDATE [collection1] webapp=/solr path=/update params={wt=javabin&version=2} {add=[5]} 0 0
[junit4:junit4]   2> 798 T1376 C110 UPDATE [collection1] webapp=/solr path=/update params={wt=javabin&version=2} {add=[6]} 0 0
[junit4:junit4]   2> 800 T1406 C113 UPDATE [collection1] webapp=/solr path=/update params={wt=javabin&version=2} {add=[6]} 0 0
[junit4:junit4]   2> 801 T1376 C110 UPDATE [collection1] webapp=/solr path=/update params={wt=javabin&version=2} {add=[7]} 0 0
[junit4:junit4]   2> 803 T1406 C113 UPDATE [collection1] webapp=/solr path=/update params={wt=javabin&version=2} {add=[7]} 0 0
[junit4:junit4]   2> 804 T1376 C110 oasu.DirectUpdateHandler2.commit start commit{flags=0,version=0,optimize=false,openSearcher=true,waitSearcher=true,expungeDeletes=false,softCommit=false}
[junit4:junit4]   2> 805 T1376 C110 oasc.SolrDeletionPolicy.onCommit SolrDeletionPolicy.onCommit: commits:num=2
[junit4:junit4]   2> 		commit{dir=MockDirWrapper(org.apache.lucene.store.RAMDirectory@7dd30644 lockFactory=org.apache.lucene.store.SingleInstanceLockFactory@5079458b),segFN=segments_1,generation=1,filenames=[segments_1]
[junit4:junit4]   2> 		commit{dir=MockDirWrapper(org.apache.lucene.store.RAMDirectory@7dd30644 lockFactory=org.apache.lucene.store.SingleInstanceLockFactory@5079458b),segFN=segments_2,generation=2,filenames=[_0.tip, segments_2, _0_nrm.cfe, _0.fdx, _0.si, _0.fdt, _0_nrm.cfs, _0.tim, _0.fnm, _0.frq, _0.prx]
[junit4:junit4]   2> 805 T1376 C110 oasc.SolrDeletionPolicy.updateCommits newest commit = 2
[junit4:junit4]   2> 806 T1376 C110 oass.SolrIndexSearcher.<init> Opening Searcher@ab56d65 main
[junit4:junit4]   2> 806 T1376 C110 oass.SolrIndexSearcher.getIndexDir WARNING WARNING: Directory impl does not support setting indexDir: org.apache.lucene.store.MockDirectoryWrapper
[junit4:junit4]   2> 807 T1376 C110 oasu.DirectUpdateHandler2.commit end_commit_flush
[junit4:junit4]   2> 807 T1383 oasc.SolrCore.registerSearcher [collection1] Registered new searcher Searcher@ab56d65 main{StandardDirectoryReader(segments_2:4 _0(4.0.0.1):C7)}
[junit4:junit4]   2> 808 T1376 C110 UPDATE [collection1] webapp=/solr path=/update params={wt=javabin&version=2&commit=true&waitSearcher=true&softCommit=false} {commit=} 0 4
[junit4:junit4]   2> 809 T1386 C111 oasu.DirectUpdateHandler2.commit start commit{flags=0,version=0,optimize=false,openSearcher=true,waitSearcher=true,expungeDeletes=false,softCommit=false}
[junit4:junit4]   2> 810 T1386 C111 oasc.SolrDeletionPolicy.onCommit SolrDeletionPolicy.onCommit: commits:num=2
[junit4:junit4]   2> 		commit{dir=MockDirWrapper(org.apache.lucene.store.RAMDirectory@493f4ae lockFactory=org.apache.lucene.store.SingleInstanceLockFactory@3ec6ebdc),segFN=segments_1,generation=1,filenames=[segments_1]
[junit4:junit4]   2> 		commit{dir=MockDirWrapper(org.apache.lucene.store.RAMDirectory@493f4ae lockFactory=org.apache.lucene.store.SingleInstanceLockFactory@3ec6ebdc),segFN=segments_2,generation=2,filenames=[_0.tip, segments_2, _0_nrm.cfe, _0.fdx, _0.si, _0.fdt, _0_nrm.cfs, _0.tim, _0.fnm, _0.frq, _0.prx]
[junit4:junit4]   2> 810 T1386 C111 oasc.SolrDeletionPolicy.updateCommits newest commit = 2
[junit4:junit4]   2> 811 T1386 C111 oass.SolrIndexSearcher.<init> Opening Searcher@2e840307 main
[junit4:junit4]   2> 812 T1386 C111 oass.SolrIndexSearcher.getIndexDir WARNING WARNING: Directory impl does not support setting indexDir: org.apache.lucene.store.MockDirectoryWrapper
[junit4:junit4]   2> 812 T1386 C111 oasu.DirectUpdateHandler2.commit end_commit_flush
[junit4:junit4]   2> 812 T1393 oasc.SolrCore.registerSearcher [collection1] Registered new searcher Searcher@2e840307 main{StandardDirectoryReader(segments_2:4 _0(4.0.0.1):C2)}
[junit4:junit4]   2> 813 T1386 C111 UPDATE [collection1] webapp=/solr path=/update params={wt=javabin&version=2&commit=true&waitSearcher=true&softCommit=false} {commit=} 0 4
[junit4:junit4]   2> 814 T1396 C112 oasu.DirectUpdateHandler2.commit start commit{flags=0,version=0,optimize=false,openSearcher=true,waitSearcher=true,expungeDeletes=false,softCommit=false}
[junit4:junit4]   2> 815 T1396 C112 oasc.SolrDeletionPolicy.onCommit SolrDeletionPolicy.onCommit: commits:num=2
[junit4:junit4]   2> 		commit{dir=MockDirWrapper(org.apache.lucene.store.RAMDirectory@61d2c706 lockFactory=org.apache.lucene.store.SingleInstanceLockFactory@2466caf7),segFN=segments_1,generation=1,filenames=[segments_1]
[junit4:junit4]   2> 		commit{dir=MockDirWrapper(org.apache.lucene.store.RAMDirectory@61d2c706 lockFactory=org.apache.lucene.store.SingleInstanceLockFactory@2466caf7),segFN=segments_2,generation=2,filenames=[_0.tip, segments_2, _0_nrm.cfe, _0.fdx, _0.si, _0.fdt, _0_nrm.cfs, _0.tim, _0.fnm, _0.frq, _0.prx]
[junit4:junit4]   2> 815 T1396 C112 oasc.SolrDeletionPolicy.updateCommits newest commit = 2
[junit4:junit4]   2> 816 T1396 C112 oass.SolrIndexSearcher.<init> Opening Searcher@57cee8ad main
[junit4:junit4]   2> 816 T1396 C112 oass.SolrIndexSearcher.getIndexDir WARNING WARNING: Directory impl does not support setting indexDir: org.apache.lucene.store.MockDirectoryWrapper
[junit4:junit4]   2> 816 T1396 C112 oasu.DirectUpdateHandler2.commit end_commit_flush
[junit4:junit4]   2> 816 T1403 oasc.SolrCore.registerSearcher [collection1] Registered new searcher Searcher@57cee8ad main{StandardDirectoryReader(segments_2:4 _0(4.0.0.1):C2)}
[junit4:junit4]   2> 817 T1396 C112 UPDATE [collection1] webapp=/solr path=/update params={wt=javabin&version=2&commit=true&waitSearcher=true&softCommit=false} {commit=} 0 3
[junit4:junit4]   2> 818 T1406 C113 oasu.DirectUpdateHandler2.commit start commit{flags=0,version=0,optimize=false,openSearcher=true,waitSearcher=true,expungeDeletes=false,softCommit=false}
[junit4:junit4]   2> 819 T1406 C113 oasc.SolrDeletionPolicy.onCommit SolrDeletionPolicy.onCommit: commits:num=2
[junit4:junit4]   2> 		commit{dir=MockDirWrapper(org.apache.lucene.store.RAMDirectory@71478d1 lockFactory=org.apache.lucene.store.SingleInstanceLockFactory@5d497f57),segFN=segments_1,generation=1,filenames=[segments_1]
[junit4:junit4]   2> 		commit{dir=MockDirWrapper(org.apache.lucene.store.RAMDirectory@71478d1 lockFactory=org.apache.lucene.store.SingleInstanceLockFactory@5d497f57),segFN=segments_2,generation=2,filenames=[_0.tip, segments_2, _0_nrm.cfe, _0.fdx, _0.si, _0.fdt, _0_nrm.cfs, _0.tim, _0.fnm, _0.frq, _0.prx]
[junit4:junit4]   2> 819 T1406 C113 oasc.SolrDeletionPolicy.updateCommits newest commit = 2
[junit4:junit4]   2> 819 T1406 C113 oass.SolrIndexSearcher.<init> Opening Searcher@22e670d3 main
[junit4:junit4]   2> 819 T1406 C113 oass.SolrIndexSearcher.getIndexDir WARNING WARNING: Directory impl does not support setting indexDir: org.apache.lucene.store.MockDirectoryWrapper
[junit4:junit4]   2> 820 T1406 C113 oasu.DirectUpdateHandler2.commit end_commit_flush
[junit4:junit4]   2> 820 T1413 oasc.SolrCore.registerSearcher [collection1] Registered new searcher Searcher@22e670d3 main{StandardDirectoryReader(segments_2:4 _0(4.0.0.1):C3)}
[junit4:junit4]   2> 820 T1406 C113 UPDATE [collection1] webapp=/solr path=/update params={wt=javabin&version=2&commit=true&waitSearcher=true&softCommit=false} {commit=} 0 2
[junit4:junit4]   2> 828 T1376 C110 REQ [collection1] webapp=/solr path=/elevate params={q=*:*&shards.qt=/elevate&qt=/elevate&distrib=false&rows=500&fl=id,+score,+[elevated]&wt=javabin&version=2&sort=id+desc} hits=7 status=0 QTime=6 
[junit4:junit4]   2> 847 T1387 C111 REQ [collection1] webapp=/solr path=/elevate params={shards.qt=/elevate&qt=/elevate&fsv=true&start=0&shard.url=localhost:56915/solr|[::1]:33332/solr&q=*:*&NOW=1342973447357&distrib=false&isShard=true&rows=500&fl=id,score&wt=javabin&version=2&sort=id+desc} hits=2 status=0 QTime=6 
[junit4:junit4]   2> 847 T1397 C112 REQ [collection1] webapp=/solr path=/elevate params={shards.qt=/elevate&qt=/elevate&fsv=true&start=0&shard.url=localhost:54693/solr&q=*:*&NOW=1342973447357&distrib=false&isShard=true&rows=500&fl=id,score&wt=javabin&version=2&sort=id+desc} hits=2 status=0 QTime=9 
[junit4:junit4]   2> 847 T1407 C113 REQ [collection1] webapp=/solr path=/elevate params={shards.qt=/elevate&qt=/elevate&fsv=true&start=0&shard.url=[::1]:33332/solr|localhost:57684/solr&q=*:*&NOW=1342973447357&distrib=false&isShard=true&rows=500&fl=id,score&wt=javabin&version=2&sort=id+desc} hits=3 status=0 QTime=7 
[junit4:junit4]   2> 849 T1387 C111 REQ [collection1] webapp=/solr path=/elevate params={shards.qt=/elevate&qt=/elevate&ids=4.0,1.0&q=*:*&shard.url=localhost:56915/solr|[::1]:33332/solr&NOW=1342973447357&distrib=false&rows=500&isShard=true&fl=id,+score,+[elevated]&wt=javabin&version=2} status=0 QTime=0 
[junit4:junit4]   2> 849 T1407 C113 REQ [collection1] webapp=/solr path=/elevate params={shards.qt=/elevate&qt=/elevate&ids=3.0,7.0,6.0&q=*:*&shard.url=[::1]:33332/solr|localhost:57684/solr&NOW=1342973447357&distrib=false&rows=500&isShard=true&fl=id,+score,+[elevated]&wt=javabin&version=2} status=0 QTime=0 
[junit4:junit4]   2> 849 T1397 C112 REQ [collection1] webapp=/solr path=/elevate params={shards.qt=/elevate&qt=/elevate&ids=2.0,5.0&q=*:*&shard.url=localhost:54693/solr&NOW=1342973447357&distrib=false&rows=500&isShard=true&fl=id,+score,+[elevated]&wt=javabin&version=2} status=0 QTime=0 
[junit4:junit4]   2> 850 T1406 C113 REQ [collection1] webapp=/solr path=/elevate params={q=*:*&shards.qt=/elevate&qt=/elevate&rows=500&fl=id,+score,+[elevated]&wt=javabin&version=2&sort=id+desc&shards=localhost:56915/solr|[::1]:33332/solr,localhost:54693/solr,[::1]:33332/solr|localhost:57684/solr} status=0 QTime=14 
[junit4:junit4]   2> 850 T1373 oas.BaseDistributedSearchTestCase.compareResponses SEVERE Mismatched responses:
[junit4:junit4]   2> 	{responseHeader={status=0,QTime=14,params={q=*:*,shards.qt=/elevate,qt=/elevate,rows=500,fl=id, score, [elevated],wt=javabin,version=2,sort=id desc,shards=localhost:56915/solr|[::1]:33332/solr,localhost:54693/solr,[::1]:33332/solr|localhost:57684/solr}},response={numFound=7,start=0,maxScore=1.0,docs=[SolrDocument{id=7.0, [elevated]=false, score=1.0}, SolrDocument{id=6.0, [elevated]=false, score=1.0}, SolrDocument{id=5.0, [elevated]=false, score=1.0}, SolrDocument{id=4.0, [elevated]=false, score=1.0}, SolrDocument{id=3.0, [elevated]=false, score=1.0}, SolrDocument{id=2.0, [elevated]=false, score=1.0}, SolrDocument{id=1.0, [elevated]=false, score=1.0}]}}
[junit4:junit4]   2> 	{responseHeader={status=0,QTime=6,params={q=*:*,shards.qt=/elevate,qt=/elevate,distrib=false,rows=500,fl=id, score, [elevated],wt=javabin,version=2,sort=id desc}},response={numFound=7,start=0,maxScore=1.0,docs=[SolrDocument{id=7.0, score=1.0, [elevated]=false}, SolrDocument{id=6.0, score=1.0, [elevated]=false}, SolrDocument{id=5.0, score=1.0, [elevated]=false}, SolrDocument{id=4.0, score=1.0, [elevated]=false}, SolrDocument{id=3.0, score=1.0, [elevated]=false}, SolrDocument{id=2.0, score=1.0, [elevated]=false}, SolrDocument{id=1.0, score=1.0, [elevated]=false}]}}
[junit4:junit4]   2> 852 T1373 oasc.CoreContainer.shutdown Shutting down CoreContainer instance=1963270708
[junit4:junit4]   2> 853 T1373 oasc.SolrCore.close [collection1]  CLOSING SolrCore org.apache.solr.core.SolrCore@61fa645c
[junit4:junit4]   2> 854 T1373 oasc.SolrCore.closeSearcher [collection1] Closing main searcher on request.
[junit4:junit4]   2> 854 T1373 oasu.DirectUpdateHandler2.close closing DirectUpdateHandler2{commits=1,autocommits=0,soft autocommits=0,optimizes=0,rollbacks=0,expungeDeletes=0,docsPending=0,adds=0,deletesById=0,deletesByQuery=0,errors=0,cumulative_adds=7,cumulative_deletesById=0,cumulative_deletesByQuery=1,cumulative_errors=0}
[junit4:junit4]   2> 857 T1373 oejsh.ContextHandler.doStop stopped o.e.j.s.ServletContextHandler{/solr,null}
[junit4:junit4]   2> 910 T1373 oasc.CoreContainer.shutdown Shutting down CoreContainer instance=931111689
[junit4:junit4]   2> 910 T1373 oasc.SolrCore.close [collection1]  CLOSING SolrCore org.apache.solr.core.SolrCore@629484b2
[junit4:junit4]   2> 910 T1373 oasc.SolrCore.closeSearcher [collection1] Closing main searcher on request.
[junit4:junit4]   2> 911 T1373 oasu.DirectUpdateHandler2.close closing DirectUpdateHandler2{commits=1,autocommits=0,soft autocommits=0,optimizes=0,rollbacks=0,expungeDeletes=0,docsPending=0,adds=0,deletesById=0,deletesByQuery=0,errors=0,cumulative_adds=2,cumulative_deletesById=0,cumulative_deletesByQuery=1,cumulative_errors=0}
[junit4:junit4]   2> 914 T1373 oejsh.ContextHandler.doStop stopped o.e.j.s.ServletContextHandler{/solr,null}
[junit4:junit4]   2> 966 T1373 oasc.CoreContainer.shutdown Shutting down CoreContainer instance=843006532
[junit4:junit4]   2> 966 T1373 oasc.SolrCore.close [collection1]  CLOSING SolrCore org.apache.solr.core.SolrCore@28723478
[junit4:junit4]   2> 967 T1373 oasc.SolrCore.closeSearcher [collection1] Closing main searcher on request.
[junit4:junit4]   2> 967 T1373 oasu.DirectUpdateHandler2.close closing DirectUpdateHandler2{commits=1,autocommits=0,soft autocommits=0,optimizes=0,rollbacks=0,expungeDeletes=0,docsPending=0,adds=0,deletesById=0,deletesByQuery=0,errors=0,cumulative_adds=2,cumulative_deletesById=0,cumulative_deletesByQuery=1,cumulative_errors=0}
[junit4:junit4]   2> 970 T1373 oejsh.ContextHandler.doStop stopped o.e.j.s.ServletContextHandler{/solr,null}
[junit4:junit4]   2> 1021 T1373 oasc.CoreContainer.shutdown Shutting down CoreContainer instance=1059807244
[junit4:junit4]   2> 1022 T1373 oasc.SolrCore.close [collection1]  CLOSING SolrCore org.apache.solr.core.SolrCore@67ca2063
[junit4:junit4]   2> 1023 T1373 oasc.SolrCore.closeSearcher [collection1] Closing main searcher on request.
[junit4:junit4]   2> 1023 T1373 oasu.DirectUpdateHandler2.close closing DirectUpdateHandler2{commits=1,autocommits=0,soft autocommits=0,optimizes=0,rollbacks=0,expungeDeletes=0,docsPending=0,adds=0,deletesById=0,deletesByQuery=0,errors=0,cumulative_adds=3,cumulative_deletesById=0,cumulative_deletesByQuery=1,cumulative_errors=0}
[junit4:junit4]   2> 1025 T1373 oejsh.ContextHandler.doStop stopped o.e.j.s.ServletContextHandler{/solr,null}
[junit4:junit4]   2> 1077 T1373 oas.SolrTestCaseJ4.tearDown ###Ending testDistribSearch
[junit4:junit4]   2> NOTE: reproduce with: ant test  -Dtestcase=DistributedQueryElevationComponentTest -Dtests.method=testDistribSearch -Dtests.seed=C916C4B3993A4664 -Dtests.multiplier=3 -Dtests.slow=true -Dtests.locale=ja -Dtests.timezone=America/St_Johns -Dtests.file.encoding=UTF-8
[junit4:junit4]   2>
[junit4:junit4]    > (@AfterClass output)
[junit4:junit4]   2> 1094 T1373 oas.SolrTestCaseJ4.deleteCore ###deleteCore
[junit4:junit4]   2> NOTE: test params are: codec=Appending, sim=RandomSimilarityProvider(queryNorm=true,coord=true): {}, locale=ja, timezone=America/St_Johns
[junit4:junit4]   2> NOTE: Linux 3.2.0-26-generic amd64/Oracle Corporation 1.8.0-ea (64-bit)/cpus=8,threads=1,free=86469592,total=315949056
[junit4:junit4]   2> NOTE: All tests run in this JVM: [XmlUpdateRequestHandlerTest, SpatialFilterTest, TestArabicFilters, MoreLikeThisHandlerTest, SolrCoreCheckLockOnStartupTest, TestPropInject, BasicDistributedZkTest, TestCJKWidthFilterFactory, SOLR749Test, TestHyphenationCompoundWordTokenFilterFactory, FileUtilsTest, TestPhraseSuggestions, SystemInfoHandlerTest, TestMergePolicyConfig, PrimitiveFieldTypeTest, TestJapaneseBaseFormFilterFactory, OpenExchangeRatesOrgProviderTest, TestFoldingMultitermQuery, TestSynonymFilterFactory, DisMaxRequestHandlerTest, TestLFUCache, TestSolrQueryParser, CoreAdminHandlerTest, TestExtendedDismaxParser, RecoveryZkTest, TestPortugueseStemFilterFactory, DirectUpdateHandlerOptimizeTest, TestUpdate, TestCapitalizationFilterFactory, TestSolrCoreProperties, MinimalSchemaTest, JSONWriterTest, LukeRequestHandlerTest, SolrInfoMBeanTest, DateFieldTest, SimpleFacetsTest, TestStressReorder, TestBadConfig, TestPerFieldSimilarity, TestBinaryField, BinaryUpdateRequestHandlerTest, TestPHPSerializedResponseWriter, DateMathParserTest, TestFunctionQuery, TestFinnishLightStemFilterFactory, TestRemoveDuplicatesTokenFilterFactory, TestGreekLowerCaseFilterFactory, TestStemmerOverrideFilterFactory, TestDictionaryCompoundWordTokenFilterFactory, TestBrazilianStemFilterFactory, HighlighterTest, TestItalianLightStemFilterFactory, TestSurroundQueryParser, TestDistributedGrouping, TestRandomFaceting, SnowballPorterFilterFactoryTest, TestKStemFilterFactory, TestQuerySenderListener, TestPatternReplaceCharFilterFactory, TestSwedishLightStemFilterFactory, IndexBasedSpellCheckerTest, TestPhoneticFilterFactory, TestFiltering, TestJapaneseKatakanaStemFilterFactory, TestBM25SimilarityFactory, TestPatternTokenizerFactory, SuggesterWFSTTest, DirectUpdateHandlerTest, TestPortugueseMinimalStemFilterFactory, TestDelimitedPayloadTokenFilterFactory, LeaderElectionIntegrationTest, SolrCmdDistributorTest, TestHashPartitioner, PluginInfoTest, DistributedQueryElevationComponentTest]
[junit4:junit4]   2> 
[junit4:junit4] Completed on J0 in 1.10s, 1 test, 1 failure <<< FAILURES!

[...truncated 460 lines...]
BUILD FAILED
/mnt/ssd/jenkins/workspace/Lucene-Solr-4.x-Linux-Java8-64/checkout/build.xml:29: The following error occurred while executing this line:
/mnt/ssd/jenkins/workspace/Lucene-Solr-4.x-Linux-Java8-64/checkout/solr/build.xml:144: The following error occurred while executing this line:
/mnt/ssd/jenkins/workspace/Lucene-Solr-4.x-Linux-Java8-64/checkout/lucene/module-build.xml:62: The following error occurred while executing this line:
/mnt/ssd/jenkins/workspace/Lucene-Solr-4.x-Linux-Java8-64/checkout/lucene/common-build.xml:1094: The following error occurred while executing this line:
/mnt/ssd/jenkins/workspace/Lucene-Solr-4.x-Linux-Java8-64/checkout/lucene/common-build.xml:789: There were test failures: 304 suites, 1083 tests, 1 error, 1 failure, 6 ignored (1 assumption)

Total time: 19 minutes 9 seconds
Build step 'Execute shell' marked build as failure
Archiving artifacts
Recording test results
Email was triggered for: Failure
Sending email for trigger: Failure




Mime
View raw message