lucene-dev mailing list archives

Site index · List index
Message view « Date » · « Thread »
Top « Date » · « Thread »
From Apache Jenkins Server <jenk...@builds.apache.org>
Subject [JENKINS] Lucene-Solr-tests-only-trunk-java7 - Build # 2964 - Failure
Date Wed, 25 Jul 2012 03:17:49 GMT
Build: https://builds.apache.org/job/Lucene-Solr-tests-only-trunk-java7/2964/

1 tests failed.
FAILED:  junit.framework.TestSuite.org.apache.solr.cloud.SyncSliceTest

Error Message:
ERROR: SolrIndexSearcher opens=28 closes=27

Stack Trace:
java.lang.AssertionError: ERROR: SolrIndexSearcher opens=28 closes=27
	at __randomizedtesting.SeedInfo.seed([7A656DF80D6A8829]:0)
	at org.junit.Assert.fail(Assert.java:93)
	at org.apache.solr.SolrTestCaseJ4.endTrackingSearchers(SolrTestCaseJ4.java:216)
	at org.apache.solr.SolrTestCaseJ4.afterClass(SolrTestCaseJ4.java:82)
	at sun.reflect.NativeMethodAccessorImpl.invoke0(Native Method)
	at sun.reflect.NativeMethodAccessorImpl.invoke(NativeMethodAccessorImpl.java:57)
	at sun.reflect.DelegatingMethodAccessorImpl.invoke(DelegatingMethodAccessorImpl.java:43)
	at java.lang.reflect.Method.invoke(Method.java:601)
	at com.carrotsearch.randomizedtesting.RandomizedRunner.invoke(RandomizedRunner.java:1995)
	at com.carrotsearch.randomizedtesting.RandomizedRunner.access$1100(RandomizedRunner.java:132)
	at com.carrotsearch.randomizedtesting.RandomizedRunner$5.evaluate(RandomizedRunner.java:754)
	at com.carrotsearch.randomizedtesting.rules.SystemPropertiesRestoreRule$1.evaluate(SystemPropertiesRestoreRule.java:53)
	at org.apache.lucene.util.AbstractBeforeAfterRule$1.evaluate(AbstractBeforeAfterRule.java:45)
	at org.apache.lucene.util.TestRuleReportUncaughtExceptions$1.evaluate(TestRuleReportUncaughtExceptions.java:68)
	at org.apache.lucene.util.TestRuleStoreClassName$1.evaluate(TestRuleStoreClassName.java:38)
	at org.apache.lucene.util.TestRuleIcuHack$1.evaluate(TestRuleIcuHack.java:51)
	at com.carrotsearch.randomizedtesting.rules.SystemPropertiesInvariantRule$1.evaluate(SystemPropertiesInvariantRule.java:55)
	at org.apache.lucene.util.TestRuleNoInstanceHooksOverrides$1.evaluate(TestRuleNoInstanceHooksOverrides.java:53)
	at org.apache.lucene.util.TestRuleNoStaticHooksShadowing$1.evaluate(TestRuleNoStaticHooksShadowing.java:52)
	at org.apache.lucene.util.TestRuleAssertionsRequired$1.evaluate(TestRuleAssertionsRequired.java:36)
	at org.apache.lucene.util.TestRuleMarkFailure$1.evaluate(TestRuleMarkFailure.java:48)
	at org.apache.lucene.util.TestRuleIgnoreAfterMaxFailures$1.evaluate(TestRuleIgnoreAfterMaxFailures.java:70)
	at org.apache.lucene.util.TestRuleIgnoreTestSuites$1.evaluate(TestRuleIgnoreTestSuites.java:55)
	at com.carrotsearch.randomizedtesting.RandomizedRunner.runSuite(RandomizedRunner.java:605)
	at com.carrotsearch.randomizedtesting.RandomizedRunner.access$400(RandomizedRunner.java:132)
	at com.carrotsearch.randomizedtesting.RandomizedRunner$2.run(RandomizedRunner.java:551)




Build Log:
[...truncated 9967 lines...]
[junit4:junit4]   2> 69826 T204 oascc.ZkStateReader$3.process Updating live nodes
[junit4:junit4]   2> 69826 T204 oascc.ZkStateReader$3.process WARNING ZooKeeper watch triggered,
but Solr cannot talk to ZK
[junit4:junit4]   2> 69827 T204 oasc.LeaderElector$1.process WARNING  org.apache.zookeeper.KeeperException$SessionExpiredException:
KeeperErrorCode = Session expired for /overseer_elect/election
[junit4:junit4]   2> 	at org.apache.zookeeper.KeeperException.create(KeeperException.java:118)
[junit4:junit4]   2> 	at org.apache.zookeeper.KeeperException.create(KeeperException.java:42)
[junit4:junit4]   2> 	at org.apache.zookeeper.ZooKeeper.getChildren(ZooKeeper.java:1249)
[junit4:junit4]   2> 	at org.apache.solr.common.cloud.SolrZkClient$6.execute(SolrZkClient.java:266)
[junit4:junit4]   2> 	at org.apache.solr.common.cloud.SolrZkClient$6.execute(SolrZkClient.java:263)
[junit4:junit4]   2> 	at org.apache.solr.common.cloud.ZkCmdExecutor.retryOperation(ZkCmdExecutor.java:67)
[junit4:junit4]   2> 	at org.apache.solr.common.cloud.SolrZkClient.getChildren(SolrZkClient.java:263)
[junit4:junit4]   2> 	at org.apache.solr.cloud.LeaderElector.checkIfIamLeader(LeaderElector.java:91)
[junit4:junit4]   2> 	at org.apache.solr.cloud.LeaderElector.access$000(LeaderElector.java:57)
[junit4:junit4]   2> 	at org.apache.solr.cloud.LeaderElector$1.process(LeaderElector.java:125)
[junit4:junit4]   2> 	at org.apache.zookeeper.ClientCnxn$EventThread.processEvent(ClientCnxn.java:526)
[junit4:junit4]   2> 	at org.apache.zookeeper.ClientCnxn$EventThread.run(ClientCnxn.java:502)
[junit4:junit4]   2> 
[junit4:junit4]   2> 69827 T204 oaz.ClientCnxn$EventThread.run EventThread shut down
[junit4:junit4]   2> 95563 T191 oasc.SyncStrategy.syncToMe Could not tell a replica to
recover org.apache.solr.client.solrj.SolrServerException: IOException occured when talking
to server at: http://127.0.0.1:41958/solr/collection1
[junit4:junit4]   2> 	at org.apache.solr.client.solrj.impl.HttpSolrServer.request(HttpSolrServer.java:414)
[junit4:junit4]   2> 	at org.apache.solr.client.solrj.impl.HttpSolrServer.request(HttpSolrServer.java:182)
[junit4:junit4]   2> 	at org.apache.solr.cloud.SyncStrategy.syncToMe(SyncStrategy.java:237)
[junit4:junit4]   2> 	at org.apache.solr.cloud.SyncStrategy.syncReplicas(SyncStrategy.java:119)
[junit4:junit4]   2> 	at org.apache.solr.cloud.SyncStrategy.sync(SyncStrategy.java:82)
[junit4:junit4]   2> 	at org.apache.solr.cloud.ShardLeaderElectionContext.runLeaderProcess(ElectionContext.java:158)
[junit4:junit4]   2> 	at org.apache.solr.cloud.LeaderElector.runIamLeaderProcess(LeaderElector.java:151)
[junit4:junit4]   2> 	at org.apache.solr.cloud.LeaderElector.checkIfIamLeader(LeaderElector.java:96)
[junit4:junit4]   2> 	at org.apache.solr.cloud.LeaderElector.access$000(LeaderElector.java:57)
[junit4:junit4]   2> 	at org.apache.solr.cloud.LeaderElector$1.process(LeaderElector.java:125)
[junit4:junit4]   2> 	at org.apache.zookeeper.ClientCnxn$EventThread.processEvent(ClientCnxn.java:526)
[junit4:junit4]   2> 	at org.apache.zookeeper.ClientCnxn$EventThread.run(ClientCnxn.java:502)
[junit4:junit4]   2> Caused by: org.apache.http.conn.ConnectTimeoutException: Connect to
127.0.0.1:41958 timed out
[junit4:junit4]   2> 	at org.apache.http.conn.scheme.PlainSocketFactory.connectSocket(PlainSocketFactory.java:125)
[junit4:junit4]   2> 	at org.apache.http.impl.conn.DefaultClientConnectionOperator.openConnection(DefaultClientConnectionOperator.java:148)
[junit4:junit4]   2> 	at org.apache.http.impl.conn.AbstractPoolEntry.open(AbstractPoolEntry.java:150)
[junit4:junit4]   2> 	at org.apache.http.impl.conn.AbstractPooledConnAdapter.open(AbstractPooledConnAdapter.java:121)
[junit4:junit4]   2> 	at org.apache.http.impl.client.DefaultRequestDirector.tryConnect(DefaultRequestDirector.java:575)
[junit4:junit4]   2> 	at org.apache.http.impl.client.DefaultRequestDirector.execute(DefaultRequestDirector.java:425)
[junit4:junit4]   2> 	at org.apache.http.impl.client.AbstractHttpClient.execute(AbstractHttpClient.java:820)
[junit4:junit4]   2> 	at org.apache.http.impl.client.AbstractHttpClient.execute(AbstractHttpClient.java:754)
[junit4:junit4]   2> 	at org.apache.http.impl.client.AbstractHttpClient.execute(AbstractHttpClient.java:732)
[junit4:junit4]   2> 	at org.apache.solr.client.solrj.impl.HttpSolrServer.request(HttpSolrServer.java:353)
[junit4:junit4]   2> 	... 11 more
[junit4:junit4]   2> 
[junit4:junit4]   2> 95564 T191 oasc.RecoveryStrategy.close WARNING Stopping recovery for
core collection1 zkNodeName=127.0.0.1:48667_solr_collection1
[junit4:junit4]   2> 95565 T191 oasc.LeaderElector$1.process WARNING  org.apache.zookeeper.KeeperException$SessionExpiredException:
KeeperErrorCode = Session expired for /overseer/queue/qn-
[junit4:junit4]   2> 	at org.apache.zookeeper.KeeperException.create(KeeperException.java:118)
[junit4:junit4]   2> 	at org.apache.zookeeper.KeeperException.create(KeeperException.java:42)
[junit4:junit4]   2> 	at org.apache.zookeeper.ZooKeeper.create(ZooKeeper.java:643)
[junit4:junit4]   2> 	at org.apache.solr.common.cloud.SolrZkClient$5.execute(SolrZkClient.java:244)
[junit4:junit4]   2> 	at org.apache.solr.common.cloud.SolrZkClient$5.execute(SolrZkClient.java:241)
[junit4:junit4]   2> 	at org.apache.solr.common.cloud.ZkCmdExecutor.retryOperation(ZkCmdExecutor.java:67)
[junit4:junit4]   2> 	at org.apache.solr.common.cloud.SolrZkClient.create(SolrZkClient.java:241)
[junit4:junit4]   2> 	at org.apache.solr.cloud.DistributedQueue.offer(DistributedQueue.java:236)
[junit4:junit4]   2> 	at org.apache.solr.cloud.ZkController.publish(ZkController.java:734)
[junit4:junit4]   2> 	at org.apache.solr.cloud.ShardLeaderElectionContext.runLeaderProcess(ElectionContext.java:168)
[junit4:junit4]   2> 	at org.apache.solr.cloud.LeaderElector.runIamLeaderProcess(LeaderElector.java:151)
[junit4:junit4]   2> 	at org.apache.solr.cloud.LeaderElector.checkIfIamLeader(LeaderElector.java:96)
[junit4:junit4]   2> 	at org.apache.solr.cloud.LeaderElector.access$000(LeaderElector.java:57)
[junit4:junit4]   2> 	at org.apache.solr.cloud.LeaderElector$1.process(LeaderElector.java:125)
[junit4:junit4]   2> 	at org.apache.zookeeper.ClientCnxn$EventThread.processEvent(ClientCnxn.java:526)
[junit4:junit4]   2> 	at org.apache.zookeeper.ClientCnxn$EventThread.run(ClientCnxn.java:502)
[junit4:junit4]   2> 
[junit4:junit4]   2> 95566 T191 oasc.LeaderElector$1.process WARNING  org.apache.zookeeper.KeeperException$SessionExpiredException:
KeeperErrorCode = Session expired for /overseer_elect/election
[junit4:junit4]   2> 	at org.apache.zookeeper.KeeperException.create(KeeperException.java:118)
[junit4:junit4]   2> 	at org.apache.zookeeper.KeeperException.create(KeeperException.java:42)
[junit4:junit4]   2> 	at org.apache.zookeeper.ZooKeeper.getChildren(ZooKeeper.java:1249)
[junit4:junit4]   2> 	at org.apache.solr.common.cloud.SolrZkClient$6.execute(SolrZkClient.java:266)
[junit4:junit4]   2> 	at org.apache.solr.common.cloud.SolrZkClient$6.execute(SolrZkClient.java:263)
[junit4:junit4]   2> 	at org.apache.solr.common.cloud.ZkCmdExecutor.retryOperation(ZkCmdExecutor.java:67)
[junit4:junit4]   2> 	at org.apache.solr.common.cloud.SolrZkClient.getChildren(SolrZkClient.java:263)
[junit4:junit4]   2> 	at org.apache.solr.cloud.LeaderElector.checkIfIamLeader(LeaderElector.java:91)
[junit4:junit4]   2> 	at org.apache.solr.cloud.LeaderElector.access$000(LeaderElector.java:57)
[junit4:junit4]   2> 	at org.apache.solr.cloud.LeaderElector$1.process(LeaderElector.java:125)
[junit4:junit4]   2> 	at org.apache.zookeeper.ClientCnxn$EventThread.processEvent(ClientCnxn.java:526)
[junit4:junit4]   2> 	at org.apache.zookeeper.ClientCnxn$EventThread.run(ClientCnxn.java:502)
[junit4:junit4]   2> 
[junit4:junit4]   2> 95567 T191 oascc.ZkStateReader$3.process Updating live nodes
[junit4:junit4]   2> 95567 T191 oascc.ZkStateReader$3.process WARNING ZooKeeper watch triggered,
but Solr cannot talk to ZK
[junit4:junit4]   2> 95567 T191 oaz.ClientCnxn$EventThread.run EventThread shut down
[junit4:junit4]   2> 95737 T183 C12 P48667 oasc.SolrException.log SEVERE shard update error
StdNode: http://127.0.0.1:41958/solr/collection1/:org.apache.solr.client.solrj.SolrServerException:
Server refused connection at: http://127.0.0.1:41958/solr/collection1
[junit4:junit4]   2> 		at org.apache.solr.client.solrj.impl.HttpSolrServer.request(HttpSolrServer.java:407)
[junit4:junit4]   2> 		at org.apache.solr.client.solrj.impl.HttpSolrServer.request(HttpSolrServer.java:182)
[junit4:junit4]   2> 		at org.apache.solr.update.SolrCmdDistributor$1.call(SolrCmdDistributor.java:336)
[junit4:junit4]   2> 		at org.apache.solr.update.SolrCmdDistributor$1.call(SolrCmdDistributor.java:317)
[junit4:junit4]   2> 		at java.util.concurrent.FutureTask$Sync.innerRun(FutureTask.java:334)
[junit4:junit4]   2> 		at java.util.concurrent.FutureTask.run(FutureTask.java:166)
[junit4:junit4]   2> 		at java.util.concurrent.Executors$RunnableAdapter.call(Executors.java:471)
[junit4:junit4]   2> 		at java.util.concurrent.FutureTask$Sync.innerRun(FutureTask.java:334)
[junit4:junit4]   2> 		at java.util.concurrent.FutureTask.run(FutureTask.java:166)
[junit4:junit4]   2> 		at org.apache.solr.update.SolrCmdDistributor$BoundedExecutor$1.run(SolrCmdDistributor.java:538)
[junit4:junit4]   2> 		at java.util.concurrent.ThreadPoolExecutor.runWorker(ThreadPoolExecutor.java:1110)
[junit4:junit4]   2> 		at java.util.concurrent.ThreadPoolExecutor$Worker.run(ThreadPoolExecutor.java:603)
[junit4:junit4]   2> 		at java.lang.Thread.run(Thread.java:722)
[junit4:junit4]   2> 	Caused by: org.apache.http.conn.HttpHostConnectException: Connection
to http://127.0.0.1:41958 refused
[junit4:junit4]   2> 		at org.apache.http.impl.conn.DefaultClientConnectionOperator.openConnection(DefaultClientConnectionOperator.java:158)
[junit4:junit4]   2> 		at org.apache.http.impl.conn.AbstractPoolEntry.open(AbstractPoolEntry.java:150)
[junit4:junit4]   2> 		at org.apache.http.impl.conn.AbstractPooledConnAdapter.open(AbstractPooledConnAdapter.java:121)
[junit4:junit4]   2> 		at org.apache.http.impl.client.DefaultRequestDirector.tryConnect(DefaultRequestDirector.java:575)
[junit4:junit4]   2> 		at org.apache.http.impl.client.DefaultRequestDirector.execute(DefaultRequestDirector.java:425)
[junit4:junit4]   2> 		at org.apache.http.impl.client.AbstractHttpClient.execute(AbstractHttpClient.java:820)
[junit4:junit4]   2> 		at org.apache.http.impl.client.AbstractHttpClient.execute(AbstractHttpClient.java:754)
[junit4:junit4]   2> 		at org.apache.http.impl.client.AbstractHttpClient.execute(AbstractHttpClient.java:732)
[junit4:junit4]   2> 		at org.apache.solr.client.solrj.impl.HttpSolrServer.request(HttpSolrServer.java:353)
[junit4:junit4]   2> 		... 12 more
[junit4:junit4]   2> 	Caused by: java.net.ConnectException: Operation timed out
[junit4:junit4]   2> 		at java.net.PlainSocketImpl.socketConnect(Native Method)
[junit4:junit4]   2> 		at java.net.AbstractPlainSocketImpl.doConnect(AbstractPlainSocketImpl.java:339)
[junit4:junit4]   2> 		at java.net.AbstractPlainSocketImpl.connectToAddress(AbstractPlainSocketImpl.java:200)
[junit4:junit4]   2> 		at java.net.AbstractPlainSocketImpl.connect(AbstractPlainSocketImpl.java:182)
[junit4:junit4]   2> 		at java.net.SocksSocketImpl.connect(SocksSocketImpl.java:391)
[junit4:junit4]   2> 		at java.net.Socket.connect(Socket.java:579)
[junit4:junit4]   2> 		at org.apache.http.conn.scheme.PlainSocketFactory.connectSocket(PlainSocketFactory.java:123)
[junit4:junit4]   2> 		at org.apache.http.impl.conn.DefaultClientConnectionOperator.openConnection(DefaultClientConnectionOperator.java:148)
[junit4:junit4]   2> 		... 20 more
[junit4:junit4]   2> 	
[junit4:junit4]   2> 161306 T145 oas.SolrTestCaseJ4.endTrackingSearchers SEVERE ERROR:
SolrIndexSearcher opens=28 closes=27
[junit4:junit4]   2> NOTE: test params are: codec=Asserting, sim=RandomSimilarityProvider(queryNorm=true,coord=true):
{}, locale=zh_HK, timezone=Pacific/Kosrae
[junit4:junit4]   2> NOTE: FreeBSD 9.0-RELEASE amd64/Oracle Corporation 1.7.0_04 (64-bit)/cpus=16,threads=6,free=72650608,total=212860928
[junit4:junit4]   2> NOTE: All tests run in this JVM: [TestBulgarianStemFilterFactory,
TestDistributedSearch, TestFunctionQuery, EchoParamsTest, NumericFieldsTest, CoreAdminHandlerTest,
SyncSliceTest]
[junit4:junit4]   2> NOTE: reproduce with: ant test  -Dtestcase=SyncSliceTest -Dtests.seed=7A656DF80D6A8829
-Dtests.multiplier=3 -Dtests.slow=true -Dtests.locale=zh_HK -Dtests.timezone=Pacific/Kosrae
-Dtests.file.encoding=UTF-8
[junit4:junit4]   2> 
[junit4:junit4] ERROR   0.00s J0 | SyncSliceTest (suite)
[junit4:junit4]    > Throwable #1: java.lang.AssertionError: ERROR: SolrIndexSearcher opens=28
closes=27
[junit4:junit4]    > 	at __randomizedtesting.SeedInfo.seed([7A656DF80D6A8829]:0)
[junit4:junit4]    > 	at org.junit.Assert.fail(Assert.java:93)
[junit4:junit4]    > 	at org.apache.solr.SolrTestCaseJ4.endTrackingSearchers(SolrTestCaseJ4.java:216)
[junit4:junit4]    > 	at org.apache.solr.SolrTestCaseJ4.afterClass(SolrTestCaseJ4.java:82)
[junit4:junit4]    > 	at sun.reflect.NativeMethodAccessorImpl.invoke0(Native Method)
[junit4:junit4]    > 	at sun.reflect.NativeMethodAccessorImpl.invoke(NativeMethodAccessorImpl.java:57)
[junit4:junit4]    > 	at sun.reflect.DelegatingMethodAccessorImpl.invoke(DelegatingMethodAccessorImpl.java:43)
[junit4:junit4]    > 	at java.lang.reflect.Method.invoke(Method.java:601)
[junit4:junit4]    > 	at com.carrotsearch.randomizedtesting.RandomizedRunner.invoke(RandomizedRunner.java:1995)
[junit4:junit4]    > 	at com.carrotsearch.randomizedtesting.RandomizedRunner.access$1100(RandomizedRunner.java:132)
[junit4:junit4]    > 	at com.carrotsearch.randomizedtesting.RandomizedRunner$5.evaluate(RandomizedRunner.java:754)
[junit4:junit4]    > 	at com.carrotsearch.randomizedtesting.rules.SystemPropertiesRestoreRule$1.evaluate(SystemPropertiesRestoreRule.java:53)
[junit4:junit4]    > 	at org.apache.lucene.util.AbstractBeforeAfterRule$1.evaluate(AbstractBeforeAfterRule.java:45)
[junit4:junit4]    > 	at org.apache.lucene.util.TestRuleReportUncaughtExceptions$1.evaluate(TestRuleReportUncaughtExceptions.java:68)
[junit4:junit4]    > 	at org.apache.lucene.util.TestRuleStoreClassName$1.evaluate(TestRuleStoreClassName.java:38)
[junit4:junit4]    > 	at org.apache.lucene.util.TestRuleIcuHack$1.evaluate(TestRuleIcuHack.java:51)
[junit4:junit4]    > 	at com.carrotsearch.randomizedtesting.rules.SystemPropertiesInvariantRule$1.evaluate(SystemPropertiesInvariantRule.java:55)
[junit4:junit4]    > 	at org.apache.lucene.util.TestRuleNoInstanceHooksOverrides$1.evaluate(TestRuleNoInstanceHooksOverrides.java:53)
[junit4:junit4]    > 	at org.apache.lucene.util.TestRuleNoStaticHooksShadowing$1.evaluate(TestRuleNoStaticHooksShadowing.java:52)
[junit4:junit4]    > 	at org.apache.lucene.util.TestRuleAssertionsRequired$1.evaluate(TestRuleAssertionsRequired.java:36)
[junit4:junit4]    > 	at org.apache.lucene.util.TestRuleMarkFailure$1.evaluate(TestRuleMarkFailure.java:48)
[junit4:junit4]    > 	at org.apache.lucene.util.TestRuleIgnoreAfterMaxFailures$1.evaluate(TestRuleIgnoreAfterMaxFailures.java:70)
[junit4:junit4]    > 	at org.apache.lucene.util.TestRuleIgnoreTestSuites$1.evaluate(TestRuleIgnoreTestSuites.java:55)
[junit4:junit4]    > 	at com.carrotsearch.randomizedtesting.RandomizedRunner.runSuite(RandomizedRunner.java:605)
[junit4:junit4]    > 	at com.carrotsearch.randomizedtesting.RandomizedRunner.access$400(RandomizedRunner.java:132)
[junit4:junit4]    > 	at com.carrotsearch.randomizedtesting.RandomizedRunner$2.run(RandomizedRunner.java:551)
[junit4:junit4]    >
[junit4:junit4] Completed on J0 in 161.39s, 1 test, 1 failure <<< FAILURES!
[...truncated 671 lines...]

[...truncated 10789 lines...]

[...truncated 10789 lines...]

[...truncated 10789 lines...]

[...truncated 10789 lines...]

[...truncated 10082 lines...]
[junit4:junit4]   2> 161306 T145 oas.SolrTestCaseJ4.endTrackingSearchers SEVERE ERROR:
SolrIndexSearcher opens=28 closes=27
[junit4:junit4]   2> NOTE: test params are: codec=Asserting, sim=RandomSimilarityProvider(queryNorm=true,coord=true):
{}, locale=zh_HK, timezone=Pacific/Kosrae
[junit4:junit4]   2> NOTE: FreeBSD 9.0-RELEASE amd64/Oracle Corporation 1.7.0_04 (64-bit)/cpus=16,threads=6,free=72650608,total=212860928
[junit4:junit4]   2> NOTE: All tests run in this JVM: [TestBulgarianStemFilterFactory,
TestDistributedSearch, TestFunctionQuery, EchoParamsTest, NumericFieldsTest, CoreAdminHandlerTest,
SyncSliceTest]
[junit4:junit4]   2> NOTE: reproduce with: ant test  -Dtestcase=SyncSliceTest -Dtests.seed=7A656DF80D6A8829
-Dtests.multiplier=3 -Dtests.slow=true -Dtests.locale=zh_HK -Dtests.timezone=Pacific/Kosrae
-Dtests.file.encoding=UTF-8
[junit4:junit4]   2> 
[junit4:junit4] ERROR   0.00s J0 | SyncSliceTest (suite)
[junit4:junit4]    > Throwable #1: java.lang.AssertionError: ERROR: SolrIndexSearcher opens=28
closes=27
[junit4:junit4]    > 	at __randomizedtesting.SeedInfo.seed([7A656DF80D6A8829]:0)
[junit4:junit4]    > 	at org.junit.Assert.fail(Assert.java:93)
[junit4:junit4]    > 	at org.apache.solr.SolrTestCaseJ4.endTrackingSearchers(SolrTestCaseJ4.java:216)
[junit4:junit4]    > 	at org.apache.solr.SolrTestCaseJ4.afterClass(SolrTestCaseJ4.java:82)
[junit4:junit4]    > 	at sun.reflect.NativeMethodAccessorImpl.invoke0(Native Method)
[junit4:junit4]    > 	at sun.reflect.NativeMethodAccessorImpl.invoke(NativeMethodAccessorImpl.java:57)
[junit4:junit4]    > 	at sun.reflect.DelegatingMethodAccessorImpl.invoke(DelegatingMethodAccessorImpl.java:43)
[junit4:junit4]    > 	at java.lang.reflect.Method.invoke(Method.java:601)
[junit4:junit4]    > 	at com.carrotsearch.randomizedtesting.RandomizedRunner.invoke(RandomizedRunner.java:1995)
[junit4:junit4]    > 	at com.carrotsearch.randomizedtesting.RandomizedRunner.access$1100(RandomizedRunner.java:132)
[junit4:junit4]    > 	at com.carrotsearch.randomizedtesting.RandomizedRunner$5.evaluate(RandomizedRunner.java:754)
[junit4:junit4]    > 	at com.carrotsearch.randomizedtesting.rules.SystemPropertiesRestoreRule$1.evaluate(SystemPropertiesRestoreRule.java:53)
[junit4:junit4]    > 	at org.apache.lucene.util.AbstractBeforeAfterRule$1.evaluate(AbstractBeforeAfterRule.java:45)
[junit4:junit4]    > 	at org.apache.lucene.util.TestRuleReportUncaughtExceptions$1.evaluate(TestRuleReportUncaughtExceptions.java:68)
[junit4:junit4]    > 	at org.apache.lucene.util.TestRuleStoreClassName$1.evaluate(TestRuleStoreClassName.java:38)
[junit4:junit4]    > 	at org.apache.lucene.util.TestRuleIcuHack$1.evaluate(TestRuleIcuHack.java:51)
[junit4:junit4]    > 	at com.carrotsearch.randomizedtesting.rules.SystemPropertiesInvariantRule$1.evaluate(SystemPropertiesInvariantRule.java:55)
[junit4:junit4]    > 	at org.apache.lucene.util.TestRuleNoInstanceHooksOverrides$1.evaluate(TestRuleNoInstanceHooksOverrides.java:53)
[junit4:junit4]    > 	at org.apache.lucene.util.TestRuleNoStaticHooksShadowing$1.evaluate(TestRuleNoStaticHooksShadowing.java:52)
[junit4:junit4]    > 	at org.apache.lucene.util.TestRuleAssertionsRequired$1.evaluate(TestRuleAssertionsRequired.java:36)
[junit4:junit4]    > 	at org.apache.lucene.util.TestRuleMarkFailure$1.evaluate(TestRuleMarkFailure.java:48)
[junit4:junit4]    > 	at org.apache.lucene.util.TestRuleIgnoreAfterMaxFailures$1.evaluate(TestRuleIgnoreAfterMaxFailures.java:70)
[junit4:junit4]    > 	at org.apache.lucene.util.TestRuleIgnoreTestSuites$1.evaluate(TestRuleIgnoreTestSuites.java:55)
[junit4:junit4]    > 	at com.carrotsearch.randomizedtesting.RandomizedRunner.runSuite(RandomizedRunner.java:605)
[junit4:junit4]    > 	at com.carrotsearch.randomizedtesting.RandomizedRunner.access$400(RandomizedRunner.java:132)
[junit4:junit4]    > 	at com.carrotsearch.randomizedtesting.RandomizedRunner$2.run(RandomizedRunner.java:551)
[junit4:junit4]    >
[junit4:junit4] Completed on J0 in 161.39s, 1 test, 1 failure <<< FAILURES!
[junit4:junit4]  
[junit4:junit4] Suite: org.apache.solr.update.TestUpdate
[junit4:junit4] Completed on J0 in 1.96s, 1 test
[junit4:junit4]  
[junit4:junit4] Suite: org.apache.solr.schema.TestBinaryField
[junit4:junit4] Completed on J0 in 0.81s, 1 test
[junit4:junit4]  
[junit4:junit4] Suite: org.apache.solr.analysis.TestPhoneticFilterFactory
[junit4:junit4] Completed on J0 in 16.32s, 5 tests
[junit4:junit4]  
[junit4:junit4] Suite: org.apache.solr.analysis.TestJapaneseKatakanaStemFilterFactory
[junit4:junit4] Completed on J0 in 0.74s, 1 test
[junit4:junit4]  
[junit4:junit4] Suite: org.apache.solr.cloud.FullSolrCloudTest
[junit4:junit4] Completed on J1 in 130.47s, 1 test
[junit4:junit4]  
[junit4:junit4] Suite: org.apache.solr.cloud.LeaderElectionTest
[junit4:junit4] Completed on J1 in 20.77s, 4 tests
[junit4:junit4]  
[junit4:junit4] Suite: org.apache.solr.search.TestRealTimeGet
[junit4:junit4] Completed on J1 in 10.21s, 4 tests
[junit4:junit4]  
[junit4:junit4] Suite: org.apache.solr.cloud.ZkControllerTest
[junit4:junit4] Completed on J1 in 14.84s, 3 tests
[junit4:junit4]  
[junit4:junit4] Suite: org.apache.solr.cloud.CloudStateUpdateTest
[junit4:junit4] Completed on J1 in 15.43s, 1 test
[junit4:junit4]  
[junit4:junit4] Suite: org.apache.solr.cloud.FullSolrCloudDistribCmdsTest
[junit4:junit4] Completed on J0 in 142.25s, 1 test
[junit4:junit4]  
[junit4:junit4] Suite: org.apache.solr.analysis.TestGreekLowerCaseFilterFactory
[junit4:junit4] Completed on J0 in 0.20s, 1 test
[junit4:junit4]  
[junit4:junit4] Suite: org.apache.solr.analysis.TestItalianLightStemFilterFactory
[junit4:junit4] Completed on J0 in 0.10s, 1 test
[junit4:junit4]  
[junit4:junit4] Suite: org.apache.solr.internal.csv.writer.CSVFieldTest
[junit4:junit4] Completed on J0 in 0.08s, 2 tests
[junit4:junit4]  
[junit4:junit4] Suite: org.apache.solr.handler.TestCSVLoader
[junit4:junit4] Completed on J0 in 3.17s, 5 tests
[junit4:junit4]  
[junit4:junit4] Suite: org.apache.solr.update.SoftAutoCommitTest
[junit4:junit4] Completed on J1 in 12.84s, 3 tests
[junit4:junit4]  
[junit4:junit4] Suite: org.apache.solr.update.AutoCommitTest
[junit4:junit4] Completed on J1 in 11.27s, 3 tests
[junit4:junit4]  
[junit4:junit4] Suite: org.apache.solr.TestDistributedGrouping
[junit4:junit4] Completed on J0 in 26.45s, 1 test
[junit4:junit4]  
[junit4:junit4] Suite: org.apache.solr.search.TestSurroundQueryParser
[junit4:junit4] Completed on J0 in 1.43s, 1 test
[junit4:junit4]  
[junit4:junit4] Suite: org.apache.solr.internal.csv.CSVStrategyTest
[junit4:junit4] Completed on J0 in 0.08s, 5 tests
[junit4:junit4]  
[junit4:junit4] Suite: org.apache.solr.analysis.TestDictionaryCompoundWordTokenFilterFactory
[junit4:junit4] Completed on J0 in 0.06s, 1 test
[junit4:junit4]  
[junit4:junit4] Suite: org.apache.solr.update.SolrIndexConfigTest
[junit4:junit4] Completed on J0 in 1.12s, 2 tests
[junit4:junit4]  
[junit4:junit4] Suite: org.apache.solr.AnalysisAfterCoreReloadTest
[junit4:junit4] Completed on J0 in 3.94s, 1 test
[junit4:junit4]  
[junit4:junit4] Suite: org.apache.solr.analysis.TestGalicianStemFilterFactory
[junit4:junit4] Completed on J0 in 0.05s, 1 test
[junit4:junit4]  
[junit4:junit4] Suite: org.apache.solr.request.TestFaceting
[junit4:junit4] Completed on J1 in 24.77s, 3 tests
[junit4:junit4]  
[junit4:junit4] Suite: org.apache.solr.cloud.TestHashPartitioner
[junit4:junit4] Completed on J1 in 10.28s, 1 test
[junit4:junit4]  
[junit4:junit4] Suite: org.apache.solr.handler.component.DistributedTermsComponentTest
[junit4:junit4] Completed on J1 in 13.94s, 1 test
[junit4:junit4]  
[junit4:junit4] Suite: org.apache.solr.core.SolrCoreTest
[junit4:junit4] Completed on J1 in 10.97s, 6 tests
[junit4:junit4]  
[junit4:junit4] Suite: org.apache.solr.spelling.IndexBasedSpellCheckerTest
[junit4:junit4] Completed on J1 in 3.07s, 5 tests
[junit4:junit4]  
[junit4:junit4] Suite: org.apache.solr.search.TestRangeQuery
[junit4:junit4] Completed on J1 in 10.46s, 2 tests
[junit4:junit4]  
[junit4:junit4] Suite: org.apache.solr.update.DirectUpdateHandlerTest
[junit4:junit4] Completed on J1 in 6.10s, 6 tests
[junit4:junit4]  
[junit4:junit4] Suite: org.apache.solr.search.TestStressVersions
[junit4:junit4] Completed on J0 in 13.22s, 1 test
[junit4:junit4]  
[junit4:junit4] Suite: org.apache.solr.analysis.TestTypeTokenFilterFactory
[junit4:junit4] Completed on J0 in 0.06s, 4 tests
[junit4:junit4]  
[junit4:junit4] Suite: org.apache.solr.servlet.SolrRequestParserTest
[junit4:junit4] Completed on J0 in 1.97s, 4 tests
[junit4:junit4]  
[junit4:junit4] Suite: org.apache.solr.SolrInfoMBeanTest
[junit4:junit4] Completed on J0 in 1.58s, 1 test
[junit4:junit4]  
[junit4:junit4] Suite: org.apache.solr.search.similarities.TestBM25SimilarityFactory
[junit4:junit4] Completed on J0 in 0.27s, 2 tests
[junit4:junit4]  
[junit4:junit4] Suite: org.apache.solr.analysis.CommonGramsQueryFilterFactoryTest
[junit4:junit4] Completed on J0 in 0.12s, 2 tests
[junit4:junit4]  
[junit4:junit4] Suite: org.apache.solr.update.TestIndexingPerformance
[junit4:junit4] Completed on J0 in 1.13s, 1 test
[junit4:junit4]  
[junit4:junit4] Suite: org.apache.solr.analysis.TestThaiWordFilterFactory
[junit4:junit4] Completed on J0 in 0.12s, 1 test
[junit4:junit4]  
[junit4:junit4] Suite: org.apache.solr.spelling.suggest.SuggesterWFSTTest
[junit4:junit4] Completed on J0 in 2.74s, 4 tests
[junit4:junit4]  
[junit4:junit4] Suite: org.apache.solr.schema.CurrencyFieldTest
[junit4:junit4] IGNORED 0.00s J0 | CurrencyFieldTest.testPerformance
[junit4:junit4]    > Cause: Annotated @Ignore()
[junit4:junit4] Completed on J0 in 2.29s, 8 tests, 1 skipped
[junit4:junit4]  
[junit4:junit4] Suite: org.apache.solr.request.SimpleFacetsTest
[junit4:junit4] Completed on J1 in 13.52s, 31 tests
[junit4:junit4]  
[junit4:junit4] Suite: org.apache.solr.handler.admin.LukeRequestHandlerTest
[junit4:junit4] Completed on J1 in 4.68s, 3 tests
[junit4:junit4]  
[junit4:junit4] Suite: org.apache.solr.TestGroupingSearch
[junit4:junit4] Completed on J1 in 57.77s, 12 tests
[junit4:junit4]  
[junit4:junit4] Suite: org.apache.solr.spelling.DirectSolrSpellCheckerTest
[junit4:junit4] Completed on J1 in 2.13s, 2 tests
[junit4:junit4]  
[junit4:junit4] Suite: org.apache.solr.TestRandomFaceting
[junit4:junit4] Completed on J0 in 90.84s, 1 test
[junit4:junit4]  
[junit4:junit4] Suite: org.apache.solr.analysis.TestStemmerOverrideFilterFactory
[junit4:junit4] Completed on J0 in 0.09s, 2 tests
[junit4:junit4]  
[junit4:junit4] Suite: org.apache.solr.spelling.suggest.SuggesterTSTTest
[junit4:junit4] Completed on J0 in 3.80s, 4 tests
[junit4:junit4]  
[junit4:junit4] Suite: org.apache.solr.highlight.FastVectorHighlighterTest
[junit4:junit4] Completed on J0 in 1.85s, 2 tests
[junit4:junit4]  
[junit4:junit4] Suite: org.apache.solr.BasicFunctionalityTest
[junit4:junit4] IGNORED 0.00s J0 | BasicFunctionalityTest.testDeepPaging
[junit4:junit4]    > Cause: Annotated @Ignore(See SOLR-1726)
[junit4:junit4] Completed on J0 in 5.42s, 23 tests, 1 skipped
[junit4:junit4]  
[junit4:junit4] Suite: org.apache.solr.core.TestBadConfig
[junit4:junit4] Completed on J0 in 3.62s, 4 tests
[junit4:junit4]  
[junit4:junit4] Suite: org.apache.solr.schema.RequiredFieldsTest
[junit4:junit4] Completed on J0 in 1.58s, 3 tests
[junit4:junit4]  
[junit4:junit4] Suite: org.apache.solr.internal.csv.writer.CSVConfigTest
[junit4:junit4] Completed on J0 in 0.14s, 7 tests
[junit4:junit4]  
[junit4:junit4] Suite: org.apache.solr.analysis.TestNorwegianLightStemFilterFactory
[junit4:junit4] Completed on J0 in 0.13s, 1 test
[junit4:junit4]  
[junit4:junit4] Suite: org.apache.solr.handler.BinaryUpdateRequestHandlerTest
[junit4:junit4] Completed on J0 in 1.85s, 1 test
[junit4:junit4]  
[junit4:junit4] Suite: org.apache.solr.analysis.TestCharFilters
[junit4:junit4] Completed on J0 in 0.48s, 2 tests
[junit4:junit4]  
[junit4:junit4] Suite: org.apache.solr.update.processor.StatelessScriptUpdateProcessorFactoryTest
[junit4:junit4] Completed on J0 in 2.31s, 7 tests
[junit4:junit4]  
[junit4:junit4] Suite: org.apache.solr.search.TestFiltering
[junit4:junit4] Completed on J1 in 30.91s, 2 tests
[junit4:junit4]  
[junit4:junit4] Suite: org.apache.solr.ConvertedLegacyTest
[junit4:junit4] Completed on J1 in 4.65s, 1 test
[junit4:junit4]  
[junit4:junit4] Suite: org.apache.solr.update.PeerSyncTest
[junit4:junit4] Completed on J1 in 6.29s, 1 test
[junit4:junit4]  
[junit4:junit4] Suite: org.apache.solr.handler.component.QueryElevationComponentTest
[junit4:junit4] Completed on J1 in 8.50s, 7 tests
[junit4:junit4]  
[junit4:junit4] Suite: org.apache.solr.highlight.HighlighterTest
[junit4:junit4] Completed on J1 in 4.03s, 27 tests
[junit4:junit4]  
[junit4:junit4] Suite: org.apache.solr.search.TestIndexSearcher
[junit4:junit4] Completed on J1 in 3.33s, 2 tests
[junit4:junit4]  
[junit4:junit4] Suite: org.apache.solr.analysis.TestWordDelimiterFilterFactory
[junit4:junit4] Completed on J1 in 2.30s, 7 tests
[junit4:junit4]  
[junit4:junit4] Suite: org.apache.solr.schema.PolyFieldTest
[junit4:junit4] Completed on J1 in 1.87s, 4 tests
[junit4:junit4]  
[junit4:junit4] Suite: org.apache.solr.search.SpatialFilterTest
[junit4:junit4] Completed on J1 in 2.30s, 3 tests
[junit4:junit4]  
[junit4:junit4] Suite: org.apache.solr.response.TestCSVResponseWriter
[junit4:junit4] Completed on J1 in 1.31s, 1 test
[junit4:junit4]  
[junit4:junit4] Suite: org.apache.solr.handler.MoreLikeThisHandlerTest
[junit4:junit4] Completed on J1 in 1.72s, 1 test
[junit4:junit4]  
[junit4:junit4] Suite: org.apache.solr.DisMaxRequestHandlerTest
[junit4:junit4] Completed on J1 in 1.44s, 2 tests
[junit4:junit4]  
[junit4:junit4] Suite: org.apache.solr.handler.component.TermsComponentTest
[junit4:junit4] Completed on J1 in 2.14s, 13 tests
[junit4:junit4]  
[junit4:junit4] Suite: org.apache.solr.search.function.distance.DistanceFunctionTest
[junit4:junit4] Completed on J1 in 2.05s, 3 tests
[junit4:junit4]  
[junit4:junit4] Suite: org.apache.solr.MinimalSchemaTest
[junit4:junit4] Completed on J1 in 1.00s, 3 tests
[junit4:junit4]  
[junit4:junit4] Suite: org.apache.solr.handler.StandardRequestHandlerTest
[junit4:junit4] Completed on J1 in 1.37s, 1 test
[junit4:junit4]  
[junit4:junit4] Suite: org.apache.solr.search.TestQueryTypes
[junit4:junit4] Completed on J1 in 1.79s, 1 test
[junit4:junit4]  
[junit4:junit4] Suite: org.apache.solr.TestJoin
[junit4:junit4] Completed on J0 in 89.97s, 2 tests
[junit4:junit4]  
[junit4:junit4] Suite: org.apache.solr.handler.XmlUpdateRequestHandlerTest
[junit4:junit4] Completed on J1 in 1.51s, 3 tests
[junit4:junit4]  
[junit4:junit4] Suite: org.apache.solr.handler.FieldAnalysisRequestHandlerTest
[junit4:junit4] Completed on J1 in 1.47s, 4 tests
[junit4:junit4]  
[junit4:junit4] Suite: org.apache.solr.handler.JsonLoaderTest
[junit4:junit4] Completed on J1 in 1.54s, 6 tests
[junit4:junit4]  
[junit4:junit4] Suite: org.apache.solr.schema.IndexSchemaRuntimeFieldTest
[junit4:junit4] Completed on J1 in 1.60s, 1 test
[junit4:junit4]  
[junit4:junit4] Suite: org.apache.solr.util.SolrPluginUtilsTest
[junit4:junit4] Completed on J1 in 1.72s, 7 tests
[junit4:junit4]  
[junit4:junit4] Suite: org.apache.solr.search.TestValueSourceCache
[junit4:junit4] Completed on J1 in 1.17s, 2 tests
[junit4:junit4]  
[junit4:junit4] Suite: org.apache.solr.analysis.TestReversedWildcardFilterFactory
[junit4:junit4] Completed on J1 in 1.57s, 4 tests
[junit4:junit4]  
[junit4:junit4] Suite: org.apache.solr.search.ReturnFieldsTest
[junit4:junit4] Completed on J1 in 1.88s, 10 tests
[junit4:junit4]  
[junit4:junit4] Suite: org.apache.solr.schema.TestOmitPositions
[junit4:junit4] Completed on J1 in 1.21s, 2 tests
[junit4:junit4]  
[junit4:junit4] Suite: org.apache.solr.schema.CopyFieldTest
[junit4:junit4] Completed on J1 in 1.51s, 6 tests
[junit4:junit4]  
[junit4:junit4] Suite: org.apache.solr.core.TestArbitraryIndexDir
[junit4:junit4] Completed on J1 in 1.51s, 1 test
[junit4:junit4]  
[junit4:junit4] Suite: org.apache.solr.search.TestQueryUtils
[junit4:junit4] Completed on J1 in 1.68s, 1 test
[junit4:junit4]  
[junit4:junit4] Suite: org.apache.solr.handler.admin.LoggingHandlerTest
[junit4:junit4] Completed on J1 in 1.33s, 1 test
[junit4:junit4]  
[junit4:junit4] Suite: org.apache.solr.update.SolrCmdDistributorTest
[junit4:junit4] Completed on J1 in 2.35s, 1 test
[junit4:junit4]  
[junit4:junit4] Suite: org.apache.solr.spelling.suggest.SuggesterTest
[junit4:junit4] Completed on J1 in 2.02s, 4 tests
[junit4:junit4]  
[junit4:junit4] Suite: org.apache.solr.handler.admin.ShowFileRequestHandlerTest
[junit4:junit4] Completed on J1 in 2.00s, 2 tests
[junit4:junit4]  
[junit4:junit4] Suite: org.apache.solr.core.SolrCoreCheckLockOnStartupTest
[junit4:junit4] Completed on J1 in 2.15s, 2 tests
[junit4:junit4]  
[junit4:junit4] Suite: org.apache.solr.cloud.RecoveryZkTest
[junit4:junit4] Completed on J0 in 72.48s, 1 test
[junit4:junit4]  
[junit4:junit4] Suite: org.apache.solr.analysis.TestLuceneMatchVersion
[junit4:junit4] Completed on J1 in 0.79s, 1 test
[junit4:junit4]  
[junit4:junit4] Suite: org.apache.solr.update.processor.DefaultValueUpdateProcessorTest
[junit4:junit4] Completed on J0 in 0.84s, 1 test
[junit4:junit4]  
[junit4:junit4] Suite: org.apache.solr.handler.PingRequestHandlerTest
[junit4:junit4] Completed on J0 in 1.57s, 5 tests
[junit4:junit4]  
[junit4:junit4] Suite: org.apache.solr.update.DirectUpdateHandlerOptimizeTest
[junit4:junit4] Completed on J0 in 1.71s, 1 test
[junit4:junit4]  
[junit4:junit4] Suite: org.apache.solr.OutputWriterTest
[junit4:junit4] Completed on J0 in 0.81s, 5 tests
[junit4:junit4]  
[junit4:junit4] Suite: org.apache.solr.core.RequestHandlersTest
[junit4:junit4] Completed on J0 in 1.76s, 3 tests
[junit4:junit4]  
[junit4:junit4] Suite: org.apache.solr.analysis.TestJapaneseBaseFormFilterFactory
[junit4:junit4] Completed on J0 in 0.05s, 1 test
[junit4:junit4]  
[junit4:junit4] Suite: org.apache.solr.request.JSONWriterTest
[junit4:junit4] Completed on J0 in 1.26s, 3 tests
[junit4:junit4]  
[junit4:junit4] Suite: org.apache.solr.update.processor.UpdateRequestProcessorFactoryTest
[junit4:junit4] Completed on J1 in 2.70s, 2 tests
[junit4:junit4]  
[junit4:junit4] Suite: org.apache.solr.core.TestPropInject
[junit4:junit4] Completed on J1 in 2.70s, 2 tests
[junit4:junit4]  
[junit4:junit4] Suite: org.apache.solr.request.TestWriterPerf
[junit4:junit4] Completed on J1 in 1.56s, 1 test
[junit4:junit4]  
[junit4:junit4] Suite: org.apache.solr.servlet.NoCacheHeaderTest
[junit4:junit4] Completed on J1 in 1.69s, 3 tests
[junit4:junit4]  
[junit4:junit4] Suite: org.apache.solr.schema.PrimitiveFieldTypeTest
[junit4:junit4] Completed on J1 in 2.52s, 1 test
[junit4:junit4]  
[junit4:junit4] Suite: org.apache.solr.core.AlternateDirectoryTest
[junit4:junit4] Completed on J1 in 1.65s, 1 test
[junit4:junit4]  
[junit4:junit4] Suite: org.apache.solr.update.processor.FieldMutatingUpdateProcessorTest
[junit4:junit4] Completed on J1 in 2.64s, 25 tests
[junit4:junit4]  
[junit4:junit4] Suite: org.apache.solr.handler.component.BadComponentTest
[junit4:junit4] Completed on J1 in 1.45s, 1 test
[junit4:junit4]  
[junit4:junit4] Suite: org.apache.solr.internal.csv.CSVPrinterTest
[junit4:junit4] Completed on J1 in 1.09s, 6 tests
[junit4:junit4]  
[junit4:junit4] Suite: org.apache.solr.highlight.HighlighterConfigTest
[junit4:junit4] Completed on J1 in 1.31s, 1 test
[junit4:junit4]  
[junit4:junit4] Suite: org.apache.solr.core.SOLR749Test
[junit4:junit4] Completed on J1 in 1.47s, 1 test
[junit4:junit4]  
[junit4:junit4] Suite: org.apache.solr.core.TestPropInjectDefaults
[junit4:junit4] Completed on J1 in 1.34s, 2 tests
[junit4:junit4]  
[junit4:junit4] Suite: org.apache.solr.core.TestMergePolicyConfig
[junit4:junit4] Completed on J1 in 1.16s, 1 test
[junit4:junit4]  
[junit4:junit4] Suite: org.apache.solr.core.TestXIncludeConfig
[junit4:junit4] Completed on J1 in 1.30s, 1 test
[junit4:junit4]  
[junit4:junit4] Suite: org.apache.solr.search.TestDocSet
[junit4:junit4] Completed on J1 in 0.96s, 2 tests
[junit4:junit4]  
[junit4:junit4] Suite: org.apache.solr.search.TestLFUCache
[junit4:junit4] Completed on J1 in 1.89s, 5 tests
[junit4:junit4]  
[junit4:junit4] Suite: org.apache.solr.core.TestQuerySenderListener
[junit4:junit4] Completed on J1 in 1.37s, 3 tests
[junit4:junit4]  
[junit4:junit4] Suite: org.apache.solr.schema.TestCollationField
[junit4:junit4] Completed on J1 in 0.83s, 8 tests
[junit4:junit4]  
[junit4:junit4] Suite: org.apache.solr.core.TestQuerySenderNoQuery
[junit4:junit4] Completed on J1 in 1.11s, 3 tests
[junit4:junit4]  
[junit4:junit4] Suite: org.apache.solr.analysis.TestBeiderMorseFilterFactory
[junit4:junit4] Completed on J1 in 0.56s, 3 tests
[junit4:junit4]  
[junit4:junit4] Suite: org.apache.solr.util.TestNumberUtils
[junit4:junit4] Completed on J1 in 0.32s, 1 test
[junit4:junit4]  
[junit4:junit4] Suite: org.apache.solr.TestSolrCoreProperties
[junit4:junit4] Completed on J1 in 0.44s, 1 test
[junit4:junit4]  
[junit4:junit4] Suite: org.apache.solr.core.TestConfig
[junit4:junit4] Completed on J1 in 0.82s, 7 tests
[junit4:junit4]  
[junit4:junit4] Suite: org.apache.solr.analysis.TestKStemFilterFactory
[junit4:junit4] Completed on J1 in 0.27s, 1 test
[junit4:junit4]  
[junit4:junit4] Suite: org.apache.solr.spelling.suggest.TestPhraseSuggestions
[junit4:junit4] Completed on J1 in 0.36s, 1 test
[junit4:junit4]  
[junit4:junit4] Suite: org.apache.solr.search.similarities.TestPerFieldSimilarity
[junit4:junit4] Completed on J1 in 0.47s, 7 tests
[junit4:junit4]  
[junit4:junit4] Suite: org.apache.solr.analysis.LegacyHTMLStripCharFilterTest
[junit4:junit4] IGNORED 0.00s J1 | LegacyHTMLStripCharFilterTest.testRandom
[junit4:junit4]    > Cause: Annotated @Ignore(broken offsets: see LUCENE-2208)
[junit4:junit4] Completed on J1 in 0.41s, 13 tests, 1 skipped
[junit4:junit4]  
[junit4:junit4] Suite: org.apache.solr.analysis.TestHyphenationCompoundWordTokenFilterFactory
[junit4:junit4] Completed on J1 in 0.23s, 2 tests
[junit4:junit4]  
[junit4:junit4] Suite: org.apache.solr.analysis.TestJapaneseReadingFormFilterFactory
[junit4:junit4] Completed on J1 in 0.05s, 1 test
[junit4:junit4]  
[junit4:junit4] Suite: org.apache.solr.search.similarities.TestDFRSimilarityFactory
[junit4:junit4] Completed on J1 in 0.93s, 3 tests
[junit4:junit4]  
[junit4:junit4] Suite: org.apache.solr.search.similarities.TestIBSimilarityFactory
[junit4:junit4] Completed on J1 in 0.61s, 2 tests
[junit4:junit4]  
[junit4:junit4] Suite: org.apache.solr.analysis.TestHTMLStripCharFilterFactory
[junit4:junit4] Completed on J1 in 0.28s, 6 tests
[junit4:junit4]  
[junit4:junit4] Suite: org.apache.solr.util.TimeZoneUtilsTest
[junit4:junit4] Completed on J1 in 0.38s, 5 tests
[junit4:junit4]  
[junit4:junit4] Suite: org.apache.solr.util.PrimUtilsTest
[junit4:junit4] Completed on J1 in 0.11s, 2 tests
[junit4:junit4]  
[junit4:junit4] Suite: org.apache.solr.analysis.DoubleMetaphoneFilterFactoryTest
[junit4:junit4] Completed on J1 in 0.07s, 3 tests
[junit4:junit4]  
[junit4:junit4] Suite: org.apache.solr.analysis.TestMultiWordSynonyms
[junit4:junit4] Completed on J1 in 0.04s, 1 test
[junit4:junit4]  
[junit4:junit4] Suite: org.apache.solr.schema.OpenExchangeRatesOrgProviderTest
[junit4:junit4] Completed on J1 in 0.22s, 5 tests
[junit4:junit4]  
[junit4:junit4] Suite: org.apache.solr.analysis.TestCapitalizationFilterFactory
[junit4:junit4] Completed on J1 in 0.25s, 7 tests
[junit4:junit4]  
[junit4:junit4] Suite: org.apache.solr.util.FileUtilsTest
[junit4:junit4] Completed on J1 in 0.06s, 1 test
[junit4:junit4]  
[junit4:junit4] Suite: org.apache.solr.analysis.TestPortugueseMinimalStemFilterFactory
[junit4:junit4] Completed on J1 in 0.17s, 1 test
[junit4:junit4]  
[junit4:junit4] Suite: org.apache.solr.analysis.TestDelimitedPayloadTokenFilterFactory
[junit4:junit4] Completed on J1 in 0.13s, 2 tests
[junit4:junit4]  
[junit4:junit4] Suite: org.apache.solr.schema.DateFieldTest
[junit4:junit4] IGNORED 0.00s J1 | DateFieldTest.testRoundTripNonPositiveYear
[junit4:junit4]    > Cause: Annotated @Ignore(SOLR-2773: Non-Positive years don't work)
[junit4:junit4] Completed on J1 in 0.10s, 8 tests, 1 skipped
[junit4:junit4]  
[junit4:junit4] Suite: org.apache.solr.spelling.SpellingQueryConverterTest
[junit4:junit4] Completed on J1 in 0.29s, 5 tests
[junit4:junit4]  
[junit4:junit4] Suite: org.apache.solr.analysis.TestPortugueseStemFilterFactory
[junit4:junit4] Completed on J1 in 0.15s, 1 test
[junit4:junit4]  
[junit4:junit4] Suite: org.apache.solr.spelling.TestSuggestSpellingConverter
[junit4:junit4] Completed on J1 in 0.06s, 2 tests
[junit4:junit4]  
[junit4:junit4] Suite: org.apache.solr.analysis.TestGermanLightStemFilterFactory
[junit4:junit4] Completed on J1 in 0.14s, 1 test
[junit4:junit4]  
[junit4:junit4] Suite: org.apache.solr.analysis.TestPersianNormalizationFilterFactory
[junit4:junit4] Completed on J1 in 0.07s, 1 test
[junit4:junit4]  
[junit4:junit4] Suite: org.apache.solr.internal.csv.CSVParserTest
[junit4:junit4] Completed on J1 in 0.67s, 23 tests
[junit4:junit4]  
[junit4:junit4] Suite: org.apache.solr.internal.csv.ExtendedBufferedReaderTest
[junit4:junit4] Completed on J1 in 0.32s, 8 tests
[junit4:junit4]  
[junit4:junit4] Suite: org.apache.solr.analysis.TestGalicianMinimalStemFilterFactory
[junit4:junit4] Completed on J1 in 0.08s, 1 test
[junit4:junit4]  
[junit4:junit4] Suite: org.apache.solr.analysis.TestStopFilterFactory
[junit4:junit4] Completed on J1 in 0.20s, 1 test
[junit4:junit4]  
[junit4:junit4] Suite: org.apache.solr.util.DOMUtilTest
[junit4:junit4] Completed on J1 in 0.07s, 1 test
[junit4:junit4]  
[junit4:junit4] Suite: org.apache.solr.analysis.TestElisionFilterFactory
[junit4:junit4] Completed on J1 in 0.29s, 3 tests
[junit4:junit4]  
[junit4:junit4] Suite: org.apache.solr.analysis.TestFrenchMinimalStemFilterFactory
[junit4:junit4] Completed on J1 in 0.14s, 1 test
[junit4:junit4]  
[junit4:junit4] Suite: org.apache.solr.analysis.TestIndonesianStemFilterFactory
[...truncated 186 lines...]
BUILD FAILED
/usr/home/hudson/hudson-slave/workspace/Lucene-Solr-tests-only-trunk-java7/checkout/build.xml:29:
The following error occurred while executing this line:
/usr/home/hudson/hudson-slave/workspace/Lucene-Solr-tests-only-trunk-java7/checkout/solr/build.xml:144:
The following error occurred while executing this line:
/usr/home/hudson/hudson-slave/workspace/Lucene-Solr-tests-only-trunk-java7/checkout/lucene/module-build.xml:62:
The following error occurred while executing this line:
/usr/home/hudson/hudson-slave/workspace/Lucene-Solr-tests-only-trunk-java7/checkout/lucene/common-build.xml:1094:
The following error occurred while executing this line:
/usr/home/hudson/hudson-slave/workspace/Lucene-Solr-tests-only-trunk-java7/checkout/lucene/common-build.xml:789:
There were test failures: 297 suites, 1055 tests, 1 suite-level error, 5 ignored

Total time: 31 minutes 59 seconds
Build step 'Execute shell' marked build as failure
Archiving artifacts
Recording test results
Email was triggered for: Failure
Sending email for trigger: Failure



Mime
View raw message