lucene-dev mailing list archives

Site index · List index
Message view « Date » · « Thread »
Top « Date » · « Thread »
From Policeman Jenkins Server <jenk...@sd-datasolutions.de>
Subject [JENKINS] Lucene-Solr-4.x-Linux-Java7-64 - Build # 569 - Failure!
Date Sat, 28 Jul 2012 19:46:45 GMT
Build: http://jenkins.sd-datasolutions.de/job/Lucene-Solr-4.x-Linux-Java7-64/569/

1 tests failed.
FAILED:  org.apache.lucene.analysis.util.TestFilesystemResourceLoader.testBaseDir

Error Message:
Resource not found: ./fsResourceLoaderBase7518375200tmp/template.txt

Stack Trace:
java.io.IOException: Resource not found: ./fsResourceLoaderBase7518375200tmp/template.txt
	at __randomizedtesting.SeedInfo.seed([9072A707A613233A:AA5B118DD0352D02]:0)
	at org.apache.lucene.analysis.util.ClasspathResourceLoader.openResource(ClasspathResourceLoader.java:67)
	at org.apache.lucene.analysis.util.FilesystemResourceLoader.openResource(FilesystemResourceLoader.java:86)
	at org.apache.lucene.analysis.util.TestFilesystemResourceLoader.testBaseDir(TestFilesystemResourceLoader.java:77)
	at sun.reflect.NativeMethodAccessorImpl.invoke0(Native Method)
	at sun.reflect.NativeMethodAccessorImpl.invoke(NativeMethodAccessorImpl.java:57)
	at sun.reflect.DelegatingMethodAccessorImpl.invoke(DelegatingMethodAccessorImpl.java:43)
	at java.lang.reflect.Method.invoke(Method.java:601)
	at com.carrotsearch.randomizedtesting.RandomizedRunner.invoke(RandomizedRunner.java:1995)
	at com.carrotsearch.randomizedtesting.RandomizedRunner.access$1100(RandomizedRunner.java:132)
	at com.carrotsearch.randomizedtesting.RandomizedRunner$6.evaluate(RandomizedRunner.java:818)
	at com.carrotsearch.randomizedtesting.RandomizedRunner$7.evaluate(RandomizedRunner.java:877)
	at com.carrotsearch.randomizedtesting.RandomizedRunner$8.evaluate(RandomizedRunner.java:891)
	at org.apache.lucene.util.TestRuleSetupTeardownChained$1.evaluate(TestRuleSetupTeardownChained.java:50)
	at org.apache.lucene.util.TestRuleFieldCacheSanity$1.evaluate(TestRuleFieldCacheSanity.java:32)
	at org.apache.lucene.util.AbstractBeforeAfterRule$1.evaluate(AbstractBeforeAfterRule.java:45)
	at com.carrotsearch.randomizedtesting.rules.SystemPropertiesInvariantRule$1.evaluate(SystemPropertiesInvariantRule.java:55)
	at org.apache.lucene.util.TestRuleReportUncaughtExceptions$1.evaluate(TestRuleReportUncaughtExceptions.java:68)
	at org.apache.lucene.util.TestRuleThreadAndTestName$1.evaluate(TestRuleThreadAndTestName.java:48)
	at org.apache.lucene.util.TestRuleIgnoreAfterMaxFailures$1.evaluate(TestRuleIgnoreAfterMaxFailures.java:70)
	at org.apache.lucene.util.TestRuleMarkFailure$1.evaluate(TestRuleMarkFailure.java:48)
	at com.carrotsearch.randomizedtesting.RandomizedRunner.runSingleTest(RandomizedRunner.java:825)
	at com.carrotsearch.randomizedtesting.RandomizedRunner.access$700(RandomizedRunner.java:132)
	at com.carrotsearch.randomizedtesting.RandomizedRunner$3$1.run(RandomizedRunner.java:671)
	at com.carrotsearch.randomizedtesting.RandomizedRunner$3.evaluate(RandomizedRunner.java:697)
	at com.carrotsearch.randomizedtesting.RandomizedRunner$4.evaluate(RandomizedRunner.java:736)
	at com.carrotsearch.randomizedtesting.RandomizedRunner$5.evaluate(RandomizedRunner.java:747)
	at org.apache.lucene.util.AbstractBeforeAfterRule$1.evaluate(AbstractBeforeAfterRule.java:45)
	at org.apache.lucene.util.TestRuleReportUncaughtExceptions$1.evaluate(TestRuleReportUncaughtExceptions.java:68)
	at org.apache.lucene.util.TestRuleStoreClassName$1.evaluate(TestRuleStoreClassName.java:38)
	at com.carrotsearch.randomizedtesting.rules.SystemPropertiesInvariantRule$1.evaluate(SystemPropertiesInvariantRule.java:55)
	at org.apache.lucene.util.TestRuleNoInstanceHooksOverrides$1.evaluate(TestRuleNoInstanceHooksOverrides.java:53)
	at org.apache.lucene.util.TestRuleNoStaticHooksShadowing$1.evaluate(TestRuleNoStaticHooksShadowing.java:52)
	at org.apache.lucene.util.TestRuleAssertionsRequired$1.evaluate(TestRuleAssertionsRequired.java:36)
	at org.apache.lucene.util.TestRuleMarkFailure$1.evaluate(TestRuleMarkFailure.java:48)
	at org.apache.lucene.util.TestRuleIgnoreAfterMaxFailures$1.evaluate(TestRuleIgnoreAfterMaxFailures.java:70)
	at org.apache.lucene.util.TestRuleIgnoreTestSuites$1.evaluate(TestRuleIgnoreTestSuites.java:55)
	at com.carrotsearch.randomizedtesting.RandomizedRunner.runSuite(RandomizedRunner.java:605)
	at com.carrotsearch.randomizedtesting.RandomizedRunner.access$400(RandomizedRunner.java:132)
	at com.carrotsearch.randomizedtesting.RandomizedRunner$2.run(RandomizedRunner.java:551)




Build Log:
[...truncated 4427 lines...]
[junit4:junit4] Suite: org.apache.lucene.analysis.util.TestFilesystemResourceLoader
[junit4:junit4] ERROR   0.05s J0 | TestFilesystemResourceLoader.testBaseDir
[junit4:junit4]    > Throwable #1: java.io.IOException: Resource not found: ./fsResourceLoaderBase7518375200tmp/template.txt
[junit4:junit4]    > 	at __randomizedtesting.SeedInfo.seed([9072A707A613233A:AA5B118DD0352D02]:0)
[junit4:junit4]    > 	at org.apache.lucene.analysis.util.ClasspathResourceLoader.openResource(ClasspathResourceLoader.java:67)
[junit4:junit4]    > 	at org.apache.lucene.analysis.util.FilesystemResourceLoader.openResource(FilesystemResourceLoader.java:86)
[junit4:junit4]    > 	at org.apache.lucene.analysis.util.TestFilesystemResourceLoader.testBaseDir(TestFilesystemResourceLoader.java:77)
[junit4:junit4]    > 	at sun.reflect.NativeMethodAccessorImpl.invoke0(Native Method)
[junit4:junit4]    > 	at sun.reflect.NativeMethodAccessorImpl.invoke(NativeMethodAccessorImpl.java:57)
[junit4:junit4]    > 	at sun.reflect.DelegatingMethodAccessorImpl.invoke(DelegatingMethodAccessorImpl.java:43)
[junit4:junit4]    > 	at java.lang.reflect.Method.invoke(Method.java:601)
[junit4:junit4]    > 	at com.carrotsearch.randomizedtesting.RandomizedRunner.invoke(RandomizedRunner.java:1995)
[junit4:junit4]    > 	at com.carrotsearch.randomizedtesting.RandomizedRunner.access$1100(RandomizedRunner.java:132)
[junit4:junit4]    > 	at com.carrotsearch.randomizedtesting.RandomizedRunner$6.evaluate(RandomizedRunner.java:818)
[junit4:junit4]    > 	at com.carrotsearch.randomizedtesting.RandomizedRunner$7.evaluate(RandomizedRunner.java:877)
[junit4:junit4]    > 	at com.carrotsearch.randomizedtesting.RandomizedRunner$8.evaluate(RandomizedRunner.java:891)
[junit4:junit4]    > 	at org.apache.lucene.util.TestRuleSetupTeardownChained$1.evaluate(TestRuleSetupTeardownChained.java:50)
[junit4:junit4]    > 	at org.apache.lucene.util.TestRuleFieldCacheSanity$1.evaluate(TestRuleFieldCacheSanity.java:32)
[junit4:junit4]    > 	at org.apache.lucene.util.AbstractBeforeAfterRule$1.evaluate(AbstractBeforeAfterRule.java:45)
[junit4:junit4]    > 	at com.carrotsearch.randomizedtesting.rules.SystemPropertiesInvariantRule$1.evaluate(SystemPropertiesInvariantRule.java:55)
[junit4:junit4]    > 	at org.apache.lucene.util.TestRuleReportUncaughtExceptions$1.evaluate(TestRuleReportUncaughtExceptions.java:68)
[junit4:junit4]    > 	at org.apache.lucene.util.TestRuleThreadAndTestName$1.evaluate(TestRuleThreadAndTestName.java:48)
[junit4:junit4]    > 	at org.apache.lucene.util.TestRuleIgnoreAfterMaxFailures$1.evaluate(TestRuleIgnoreAfterMaxFailures.java:70)
[junit4:junit4]    > 	at org.apache.lucene.util.TestRuleMarkFailure$1.evaluate(TestRuleMarkFailure.java:48)
[junit4:junit4]    > 	at com.carrotsearch.randomizedtesting.RandomizedRunner.runSingleTest(RandomizedRunner.java:825)
[junit4:junit4]    > 	at com.carrotsearch.randomizedtesting.RandomizedRunner.access$700(RandomizedRunner.java:132)
[junit4:junit4]    > 	at com.carrotsearch.randomizedtesting.RandomizedRunner$3$1.run(RandomizedRunner.java:671)
[junit4:junit4]    > 	at com.carrotsearch.randomizedtesting.RandomizedRunner$3.evaluate(RandomizedRunner.java:697)
[junit4:junit4]    > 	at com.carrotsearch.randomizedtesting.RandomizedRunner$4.evaluate(RandomizedRunner.java:736)
[junit4:junit4]    > 	at com.carrotsearch.randomizedtesting.RandomizedRunner$5.evaluate(RandomizedRunner.java:747)
[junit4:junit4]    > 	at org.apache.lucene.util.AbstractBeforeAfterRule$1.evaluate(AbstractBeforeAfterRule.java:45)
[junit4:junit4]    > 	at org.apache.lucene.util.TestRuleReportUncaughtExceptions$1.evaluate(TestRuleReportUncaughtExceptions.java:68)
[junit4:junit4]    > 	at org.apache.lucene.util.TestRuleStoreClassName$1.evaluate(TestRuleStoreClassName.java:38)
[junit4:junit4]    > 	at com.carrotsearch.randomizedtesting.rules.SystemPropertiesInvariantRule$1.evaluate(SystemPropertiesInvariantRule.java:55)
[junit4:junit4]    > 	at org.apache.lucene.util.TestRuleNoInstanceHooksOverrides$1.evaluate(TestRuleNoInstanceHooksOverrides.java:53)
[junit4:junit4]    > 	at org.apache.lucene.util.TestRuleNoStaticHooksShadowing$1.evaluate(TestRuleNoStaticHooksShadowing.java:52)
[junit4:junit4]    > 	at org.apache.lucene.util.TestRuleAssertionsRequired$1.evaluate(TestRuleAssertionsRequired.java:36)
[junit4:junit4]    > 	at org.apache.lucene.util.TestRuleMarkFailure$1.evaluate(TestRuleMarkFailure.java:48)
[junit4:junit4]    > 	at org.apache.lucene.util.TestRuleIgnoreAfterMaxFailures$1.evaluate(TestRuleIgnoreAfterMaxFailures.java:70)
[junit4:junit4]    > 	at org.apache.lucene.util.TestRuleIgnoreTestSuites$1.evaluate(TestRuleIgnoreTestSuites.java:55)
[junit4:junit4]    > 	at com.carrotsearch.randomizedtesting.RandomizedRunner.runSuite(RandomizedRunner.java:605)
[junit4:junit4]    > 	at com.carrotsearch.randomizedtesting.RandomizedRunner.access$400(RandomizedRunner.java:132)
[junit4:junit4]    > 	at com.carrotsearch.randomizedtesting.RandomizedRunner$2.run(RandomizedRunner.java:551)
[junit4:junit4]    > 
[junit4:junit4]   2> NOTE: reproduce with: ant test  -Dtestcase=TestFilesystemResourceLoader
-Dtests.method=testBaseDir -Dtests.seed=9072A707A613233A -Dtests.multiplier=3 -Dtests.slow=true
-Dtests.locale=ms_MY -Dtests.timezone=Canada/Mountain -Dtests.file.encoding=UTF-8
[junit4:junit4]   2>
[junit4:junit4]    > (@AfterClass output)
[junit4:junit4]   2> NOTE: test params are: codec=SimpleText, sim=RandomSimilarityProvider(queryNorm=true,coord=true):
{}, locale=ms_MY, timezone=Canada/Mountain
[junit4:junit4]   2> NOTE: Linux 3.2.0-26-generic amd64/Oracle Corporation 1.7.0_05 (64-bit)/cpus=8,threads=1,free=182323872,total=503316480
[junit4:junit4]   2> NOTE: All tests run in this JVM: [TestPortugueseMinimalStemFilterFactory,
TestReverseStringFilterFactory, TestArabicFilters, TestBrazilianStemmer, TestStandardAnalyzer,
TestCollationKeyFilter, TestIndonesianStemFilterFactory, TestHTMLStripCharFilterFactory, TestIndonesianAnalyzer,
TestDuelingAnalyzers, TestHungarianLightStemFilter, TestGalicianMinimalStemFilter, TestNorwegianAnalyzer,
TestTypeTokenFilter, TestPatternReplaceCharFilter, TestPorterStemFilter, TypeAsPayloadTokenFilterTest,
TestBulgarianStemFilterFactory, TestCapitalizationFilterFactory, TestFrenchAnalyzer, TestShingleFilterFactory,
TestWordDelimiterFilter, TestDanishAnalyzer, TestTeeSinkTokenFilter, TestEnglishAnalyzer,
TestWordnetSynonymParser, TestTurkishLowerCaseFilterFactory, TestStopFilterFactory, TestFrenchLightStemFilterFactory,
TestHungarianLightStemFilterFactory, TestPersianAnalyzer, TestPortugueseLightStemFilter, TestSwedishAnalyzer,
TestElision, TestGalicianStemFilterFactory, TestEnglishMinimalStemFilter, TestSlowSynonymFilter,
TestAllAnalyzersHaveFactories, TestBugInSomething, TestStopFilter, TestSpanishLightStemFilter,
TestGermanStemFilter, TestGreekStemFilterFactory, TestCompoundWordTokenFilter, TestChineseTokenizer,
TestPerFieldAnalyzerWrapper, TestTurkishAnalyzer, NGramTokenFilterTest, TestSwedishLightStemFilter,
TestHindiStemmer, TestRandomChains, TestCJKWidthFilterFactory, TestKeywordMarkerFilterFactory,
TestCzechStemFilterFactory, GreekAnalyzerTest, TestGalicianAnalyzer, TestSnowballVocab, EdgeNGramTokenizerTest,
TestRemoveDuplicatesTokenFilter, EdgeNGramTokenFilterTest, TestPatternTokenizer, TestTrimFilter,
TestUAX29URLEmailAnalyzer, TestReversePathHierarchyTokenizer, TestIrishAnalyzer, TestHungarianAnalyzer,
TestGermanAnalyzer, TestItalianLightStemFilter, TestGermanNormalizationFilter, TestCatalanAnalyzer,
TestASCIIFoldingFilter, TestPortugueseAnalyzer, TestNorwegianMinimalStemFilter, TestKeepWordFilter,
TestGalicianStemFilter, TestCharArrayIterator, TestArabicStemFilter, TestCharArraySet, TestCzechStemmer,
HunspellDictionaryTest, DelimitedPayloadTokenFilterTest, TestStopAnalyzer, TestPrefixAndSuffixAwareTokenFilter,
TestPrefixAwareTokenFilter, TestEmptyTokenStream, TokenTypeSinkTokenizerTest, TestBrazilianStemFilterFactory,
TestCJKBigramFilterFactory, TestCommonGramsFilterFactory, TestCommonGramsQueryFilterFactory,
TestDictionaryCompoundWordTokenFilterFactory, TestHyphenationCompoundWordTokenFilterFactory,
TestGermanMinimalStemFilterFactory, TestGermanStemFilterFactory, TestGreekLowerCaseFilterFactory,
TestEnglishMinimalStemFilterFactory, TestKStemFilterFactory, TestSpanishLightStemFilterFactory,
TestFinnishLightStemFilterFactory, TestFrenchMinimalStemFilterFactory, TestIrishLowerCaseFilterFactory,
TestGalicianMinimalStemFilterFactory, TestHindiFilters, TestHunspellStemFilterFactory, TestItalianLightStemFilterFactory,
TestLatvianStemFilterFactory, TestLengthFilterFactory, TestRemoveDuplicatesTokenFilterFactory,
TestStemmerOverrideFilterFactory, TestTrimFilterFactory, TestNGramFilters, TestNorwegianLightStemFilterFactory,
TestNorwegianMinimalStemFilterFactory, TestPatternReplaceFilterFactory, TestPatternTokenizerFactory,
TestDelimitedPayloadTokenFilterFactory, TestPortugueseStemFilterFactory, TestRussianFilters,
TestRussianLetterTokenizer, TestStandardFactories, TestSwedishLightStemFilterFactory, TestMultiWordSynonyms,
TestSynonymFilterFactory, TestSynonymMap, TestFilesystemResourceLoader]
[junit4:junit4]   2> 
[junit4:junit4] Completed on J0 in 0.06s, 2 tests, 1 error <<< FAILURES!

[...truncated 11 lines...]
BUILD FAILED
/mnt/ssd/jenkins/workspace/Lucene-Solr-4.x-Linux-Java7-64/checkout/build.xml:29: The following
error occurred while executing this line:
/mnt/ssd/jenkins/workspace/Lucene-Solr-4.x-Linux-Java7-64/checkout/lucene/build.xml:503: The
following error occurred while executing this line:
/mnt/ssd/jenkins/workspace/Lucene-Solr-4.x-Linux-Java7-64/checkout/lucene/common-build.xml:1497:
The following error occurred while executing this line:
/mnt/ssd/jenkins/workspace/Lucene-Solr-4.x-Linux-Java7-64/checkout/lucene/analysis/build.xml:101:
The following error occurred while executing this line:
/mnt/ssd/jenkins/workspace/Lucene-Solr-4.x-Linux-Java7-64/checkout/lucene/analysis/build.xml:38:
The following error occurred while executing this line:
/mnt/ssd/jenkins/workspace/Lucene-Solr-4.x-Linux-Java7-64/checkout/lucene/module-build.xml:62:
The following error occurred while executing this line:
/mnt/ssd/jenkins/workspace/Lucene-Solr-4.x-Linux-Java7-64/checkout/lucene/common-build.xml:1095:
The following error occurred while executing this line:
/mnt/ssd/jenkins/workspace/Lucene-Solr-4.x-Linux-Java7-64/checkout/lucene/common-build.xml:790:
There were test failures: 223 suites, 1148 tests, 1 error, 1 ignored

Total time: 7 minutes 49 seconds
Build step 'Execute shell' marked build as failure
Archiving artifacts
Recording test results
Email was triggered for: Failure
Sending email for trigger: Failure




Mime
View raw message