lucene-dev mailing list archives

Site index · List index
Message view « Date » · « Thread »
Top « Date » · « Thread »
From Policeman Jenkins Server <jenk...@sd-datasolutions.de>
Subject [JENKINS] Lucene-Solr-4.x-Windows-Java6-64 - Build # 340 - Failure!
Date Sun, 15 Jul 2012 09:37:53 GMT
Build: http://jenkins.sd-datasolutions.de/job/Lucene-Solr-4.x-Windows-Java6-64/340/

1 tests failed.
FAILED:  junit.framework.TestSuite.org.apache.solr.handler.TestReplicationHandler

Error Message:
ERROR: SolrIndexSearcher opens=74 closes=73

Stack Trace:
java.lang.AssertionError: ERROR: SolrIndexSearcher opens=74 closes=73
	at __randomizedtesting.SeedInfo.seed([31DAB171B5407E8B]:0)
	at org.junit.Assert.fail(Assert.java:93)
	at org.apache.solr.SolrTestCaseJ4.endTrackingSearchers(SolrTestCaseJ4.java:217)
	at org.apache.solr.SolrTestCaseJ4.afterClass(SolrTestCaseJ4.java:82)
	at sun.reflect.GeneratedMethodAccessor15.invoke(Unknown Source)
	at sun.reflect.DelegatingMethodAccessorImpl.invoke(DelegatingMethodAccessorImpl.java:25)
	at java.lang.reflect.Method.invoke(Method.java:597)
	at com.carrotsearch.randomizedtesting.RandomizedRunner.invoke(RandomizedRunner.java:1995)
	at com.carrotsearch.randomizedtesting.RandomizedRunner.access$1100(RandomizedRunner.java:132)
	at com.carrotsearch.randomizedtesting.RandomizedRunner$5.evaluate(RandomizedRunner.java:754)
	at com.carrotsearch.randomizedtesting.rules.SystemPropertiesRestoreRule$1.evaluate(SystemPropertiesRestoreRule.java:53)
	at org.apache.lucene.util.AbstractBeforeAfterRule$1.evaluate(AbstractBeforeAfterRule.java:45)
	at org.apache.lucene.util.TestRuleReportUncaughtExceptions$1.evaluate(TestRuleReportUncaughtExceptions.java:68)
	at org.apache.lucene.util.TestRuleStoreClassName$1.evaluate(TestRuleStoreClassName.java:38)
	at org.apache.lucene.util.TestRuleIcuHack$1.evaluate(TestRuleIcuHack.java:51)
	at com.carrotsearch.randomizedtesting.rules.SystemPropertiesInvariantRule$1.evaluate(SystemPropertiesInvariantRule.java:55)
	at org.apache.lucene.util.TestRuleNoInstanceHooksOverrides$1.evaluate(TestRuleNoInstanceHooksOverrides.java:53)
	at org.apache.lucene.util.TestRuleNoStaticHooksShadowing$1.evaluate(TestRuleNoStaticHooksShadowing.java:52)
	at org.apache.lucene.util.TestRuleAssertionsRequired$1.evaluate(TestRuleAssertionsRequired.java:36)
	at org.apache.lucene.util.TestRuleMarkFailure$1.evaluate(TestRuleMarkFailure.java:48)
	at org.apache.lucene.util.TestRuleIgnoreAfterMaxFailures$1.evaluate(TestRuleIgnoreAfterMaxFailures.java:70)
	at org.apache.lucene.util.TestRuleIgnoreTestSuites$1.evaluate(TestRuleIgnoreTestSuites.java:55)
	at com.carrotsearch.randomizedtesting.RandomizedRunner.runSuite(RandomizedRunner.java:605)
	at com.carrotsearch.randomizedtesting.RandomizedRunner.access$400(RandomizedRunner.java:132)
	at com.carrotsearch.randomizedtesting.RandomizedRunner$2.run(RandomizedRunner.java:551)




Build Log:
[...truncated 15286 lines...]
[junit4:junit4] Suite: org.apache.solr.handler.TestReplicationHandler
[junit4:junit4]    > (@BeforeClass output)
[junit4:junit4]   2> 4 T1217 oejs.Server.doStart jetty-8.1.2.v20120308
[junit4:junit4]   2> 9 T1217 oejs.AbstractConnector.doStart Started SocketConnector@0.0.0.0:53412
[junit4:junit4]   2> 9 T1217 oasc.SolrResourceLoader.locateSolrHome JNDI not configured for solr (NoInitialContextEx)
[junit4:junit4]   2> 10 T1217 oasc.SolrResourceLoader.locateSolrHome using system property solr.solr.home: .\org.apache.solr.handler.TestReplicationHandler$SolrInstance-1342344292739\master
[junit4:junit4]   2> 10 T1217 oasc.SolrResourceLoader.<init> new SolrResourceLoader for deduced Solr Home: '.\org.apache.solr.handler.TestReplicationHandler$SolrInstance-1342344292739\master\'
[junit4:junit4]   2> 15 T1217 oass.SolrDispatchFilter.init SolrDispatchFilter.init()
[junit4:junit4]   2> 17 T1217 oasc.SolrResourceLoader.locateSolrHome JNDI not configured for solr (NoInitialContextEx)
[junit4:junit4]   2> 17 T1217 oasc.SolrResourceLoader.locateSolrHome using system property solr.solr.home: .\org.apache.solr.handler.TestReplicationHandler$SolrInstance-1342344292739\master
[junit4:junit4]   2> 18 T1217 oasc.CoreContainer$Initializer.initialize looking for solr.xml: C:\Jenkins\workspace\Lucene-Solr-4.x-Windows-Java6-64\solr\build\solr-core\test\J0\.\org.apache.solr.handler.TestReplicationHandler$SolrInstance-1342344292739\master\solr.xml
[junit4:junit4]   2> 18 T1217 oasc.CoreContainer.<init> New CoreContainer 1833266282
[junit4:junit4]   2> 18 T1217 oasc.CoreContainer$Initializer.initialize no solr.xml file found - using default
[junit4:junit4]   2> 18 T1217 oasc.CoreContainer.load Loading CoreContainer using Solr Home: '.\org.apache.solr.handler.TestReplicationHandler$SolrInstance-1342344292739\master\'
[junit4:junit4]   2> 18 T1217 oasc.SolrResourceLoader.<init> new SolrResourceLoader for directory: '.\org.apache.solr.handler.TestReplicationHandler$SolrInstance-1342344292739\master\'
[junit4:junit4]   2> 28 T1217 oasc.CoreContainer.load Registering Log Listener
[junit4:junit4]   2> 42 T1217 oashc.HttpShardHandlerFactory.getParameter Setting socketTimeout to: 0
[junit4:junit4]   2> 43 T1217 oashc.HttpShardHandlerFactory.getParameter Setting urlScheme to: http://
[junit4:junit4]   2> 43 T1217 oashc.HttpShardHandlerFactory.getParameter Setting connTimeout to: 0
[junit4:junit4]   2> 43 T1217 oashc.HttpShardHandlerFactory.getParameter Setting maxConnectionsPerHost to: 20
[junit4:junit4]   2> 43 T1217 oashc.HttpShardHandlerFactory.getParameter Setting corePoolSize to: 0
[junit4:junit4]   2> 44 T1217 oashc.HttpShardHandlerFactory.getParameter Setting maximumPoolSize to: 2147483647
[junit4:junit4]   2> 44 T1217 oashc.HttpShardHandlerFactory.getParameter Setting maxThreadIdleTime to: 5
[junit4:junit4]   2> 44 T1217 oashc.HttpShardHandlerFactory.getParameter Setting sizeOfQueue to: -1
[junit4:junit4]   2> 44 T1217 oashc.HttpShardHandlerFactory.getParameter Setting fairnessPolicy to: false
[junit4:junit4]   2> 44 T1217 oascsi.HttpClientUtil.createClient Creating new http client, config:maxConnectionsPerHost=20&maxConnections=10000&socketTimeout=0&connTimeout=0&retry=false
[junit4:junit4]   2> 55 T1217 oasc.CoreContainer.create Creating SolrCore 'collection1' using instanceDir: .\org.apache.solr.handler.TestReplicationHandler$SolrInstance-1342344292739\master\collection1
[junit4:junit4]   2> 55 T1217 oasc.SolrResourceLoader.<init> new SolrResourceLoader for directory: '.\org.apache.solr.handler.TestReplicationHandler$SolrInstance-1342344292739\master\collection1\'
[junit4:junit4]   2> 84 T1217 oasc.SolrConfig.<init> Using Lucene MatchVersion: LUCENE_40
[junit4:junit4]   2> 166 T1217 oasc.SolrConfig.<init> Loaded SolrConfig: solrconfig.xml
[junit4:junit4]   2> 167 T1217 oass.IndexSchema.readSchema Reading Solr Schema
[junit4:junit4]   2> 170 T1217 oass.IndexSchema.readSchema Schema name=test
[junit4:junit4]   2> 188 T1217 oass.IndexSchema.readSchema unique key field: id
[junit4:junit4]   2> 191 T1217 oasc.SolrCore.<init> [collection1] Opening new SolrCore at .\org.apache.solr.handler.TestReplicationHandler$SolrInstance-1342344292739\master\collection1\, dataDir=.\org.apache.solr.handler.TestReplicationHandler$SolrInstance-1342344292739\master\collection1\data\
[junit4:junit4]   2> 191 T1217 oasc.SolrCore.<init> JMX monitoring not detected for core: collection1
[junit4:junit4]   2> 192 T1217 oasc.SolrCore.getNewIndexDir WARNING New index directory detected: old=null new=.\org.apache.solr.handler.TestReplicationHandler$SolrInstance-1342344292739\master\collection1\data\index/
[junit4:junit4]   2> 192 T1217 oasc.SolrCore.initIndex WARNING [collection1] Solr index directory '.\org.apache.solr.handler.TestReplicationHandler$SolrInstance-1342344292739\master\collection1\data\index' doesn't exist. Creating new index...
[junit4:junit4]   2> 200 T1217 oasc.SolrDeletionPolicy.onCommit SolrDeletionPolicy.onCommit: commits:num=1
[junit4:junit4]   2> 		commit{dir=NRTCachingDirectory(org.apache.lucene.store.MMapDirectory@C:\Jenkins\workspace\Lucene-Solr-4.x-Windows-Java6-64\solr\build\solr-core\test\J0\org.apache.solr.handler.TestReplicationHandler$SolrInstance-1342344292739\master\collection1\data\index lockFactory=org.apache.lucene.store.SingleInstanceLockFactory@14f5e86; maxCacheMB=48.0 maxMergeSizeMB=4.0),segFN=segments_1,generation=1,filenames=[segments_1]
[junit4:junit4]   2> 200 T1217 oasc.SolrDeletionPolicy.updateCommits newest commit = 1
[junit4:junit4]   2> 201 T1217 oasc.RequestHandlers.initHandlersFromConfig created standard: solr.StandardRequestHandler
[junit4:junit4]   2> 201 T1217 oasc.RequestHandlers.initHandlersFromConfig created /replication: solr.ReplicationHandler
[junit4:junit4]   2> 201 T1217 oasc.RequestHandlers.initHandlersFromConfig created defaults: solr.StandardRequestHandler
[junit4:junit4]   2> 201 T1217 oasc.RequestHandlers.initHandlersFromConfig adding lazy requestHandler: solr.StandardRequestHandler
[junit4:junit4]   2> 201 T1217 oasc.RequestHandlers.initHandlersFromConfig created lazy: solr.StandardRequestHandler
[junit4:junit4]   2> 202 T1217 oasc.RequestHandlers.initHandlersFromConfig created /update: solr.UpdateRequestHandler
[junit4:junit4]   2> 203 T1217 oashl.XMLLoader.init xsltCacheLifetimeSeconds=60
[junit4:junit4]   2> 207 T1217 oass.SolrIndexSearcher.<init> Opening Searcher@7b6afdea main
[junit4:junit4]   2> 208 T1217 oasu.CommitTracker.<init> Hard AutoCommit: disabled
[junit4:junit4]   2> 209 T1217 oasu.CommitTracker.<init> Soft AutoCommit: disabled
[junit4:junit4]   2> 209 T1217 oash.ReplicationHandler.inform Replication enabled for following config files: schema.xml
[junit4:junit4]   2> 209 T1217 oash.ReplicationHandler.inform Commits will be reserved for  10000
[junit4:junit4]   2> 210 T1227 oasc.SolrCore.registerSearcher [collection1] Registered new searcher Searcher@7b6afdea main{StandardDirectoryReader(segments_1:1)}
[junit4:junit4]   2> 209 T1217 oasc.CoreContainer.register registering core: collection1
[junit4:junit4]   2> 212 T1217 oass.SolrDispatchFilter.init user.dir=C:\Jenkins\workspace\Lucene-Solr-4.x-Windows-Java6-64\solr\build\solr-core\test\J0
[junit4:junit4]   2> 212 T1217 oass.SolrDispatchFilter.init SolrDispatchFilter.init() done
[junit4:junit4]   2> 212 T1217 oascsi.HttpClientUtil.createClient Creating new http client, config:maxConnections=128&maxConnectionsPerHost=32&followRedirects=false
[junit4:junit4]   2> 220 T1217 oejs.Server.doStart jetty-8.1.2.v20120308
[junit4:junit4]   2> 223 T1217 oejs.AbstractConnector.doStart Started SocketConnector@0.0.0.0:53413
[junit4:junit4]   2> 223 T1217 oasc.SolrResourceLoader.locateSolrHome JNDI not configured for solr (NoInitialContextEx)
[junit4:junit4]   2> 224 T1217 oasc.SolrResourceLoader.locateSolrHome using system property solr.solr.home: .\org.apache.solr.handler.TestReplicationHandler$SolrInstance-1342344292953\slave
[junit4:junit4]   2> 224 T1217 oasc.SolrResourceLoader.<init> new SolrResourceLoader for deduced Solr Home: '.\org.apache.solr.handler.TestReplicationHandler$SolrInstance-1342344292953\slave\'
[junit4:junit4]   2> 238 T1217 oass.SolrDispatchFilter.init SolrDispatchFilter.init()
[junit4:junit4]   2> 238 T1217 oasc.SolrResourceLoader.locateSolrHome JNDI not configured for solr (NoInitialContextEx)
[junit4:junit4]   2> 239 T1217 oasc.SolrResourceLoader.locateSolrHome using system property solr.solr.home: .\org.apache.solr.handler.TestReplicationHandler$SolrInstance-1342344292953\slave
[junit4:junit4]   2> 240 T1217 oasc.CoreContainer$Initializer.initialize looking for solr.xml: C:\Jenkins\workspace\Lucene-Solr-4.x-Windows-Java6-64\solr\build\solr-core\test\J0\.\org.apache.solr.handler.TestReplicationHandler$SolrInstance-1342344292953\slave\solr.xml
[junit4:junit4]   2> 240 T1217 oasc.CoreContainer.<init> New CoreContainer 129639869
[junit4:junit4]   2> 240 T1217 oasc.CoreContainer$Initializer.initialize no solr.xml file found - using default
[junit4:junit4]   2> 241 T1217 oasc.CoreContainer.load Loading CoreContainer using Solr Home: '.\org.apache.solr.handler.TestReplicationHandler$SolrInstance-1342344292953\slave\'
[junit4:junit4]   2> 241 T1217 oasc.SolrResourceLoader.<init> new SolrResourceLoader for directory: '.\org.apache.solr.handler.TestReplicationHandler$SolrInstance-1342344292953\slave\'
[junit4:junit4]   2> 247 T1167 oaz.ClientCnxn$SendThread.run WARNING Session 0x13889f3352b0010 for server null, unexpected error, closing socket connection and attempting reconnect java.net.ConnectException: Connection refused: no further information
[junit4:junit4]   2> 	at sun.nio.ch.SocketChannelImpl.checkConnect(Native Method)
[junit4:junit4]   2> 	at sun.nio.ch.SocketChannelImpl.finishConnect(SocketChannelImpl.java:599)
[junit4:junit4]   2> 	at org.apache.zookeeper.ClientCnxn$SendThread.run(ClientCnxn.java:1146)
[junit4:junit4]   2> 
[junit4:junit4]   2> 252 T1217 oasc.CoreContainer.load Registering Log Listener
[junit4:junit4]   2> 269 T1217 oashc.HttpShardHandlerFactory.getParameter Setting socketTimeout to: 0
[junit4:junit4]   2> 270 T1217 oashc.HttpShardHandlerFactory.getParameter Setting urlScheme to: http://
[junit4:junit4]   2> 271 T1217 oashc.HttpShardHandlerFactory.getParameter Setting connTimeout to: 0
[junit4:junit4]   2> 271 T1217 oashc.HttpShardHandlerFactory.getParameter Setting maxConnectionsPerHost to: 20
[junit4:junit4]   2> 271 T1217 oashc.HttpShardHandlerFactory.getParameter Setting corePoolSize to: 0
[junit4:junit4]   2> 272 T1217 oashc.HttpShardHandlerFactory.getParameter Setting maximumPoolSize to: 2147483647
[junit4:junit4]   2> 272 T1217 oashc.HttpShardHandlerFactory.getParameter Setting maxThreadIdleTime to: 5
[junit4:junit4]   2> 272 T1217 oashc.HttpShardHandlerFactory.getParameter Setting sizeOfQueue to: -1
[junit4:junit4]   2> 272 T1217 oashc.HttpShardHandlerFactory.getParameter Setting fairnessPolicy to: false
[junit4:junit4]   2> 273 T1217 oascsi.HttpClientUtil.createClient Creating new http client, config:maxConnectionsPerHost=20&maxConnections=10000&socketTimeout=0&connTimeout=0&retry=false
[junit4:junit4]   2> 283 T1217 oasc.CoreContainer.create Creating SolrCore 'collection1' using instanceDir: .\org.apache.solr.handler.TestReplicationHandler$SolrInstance-1342344292953\slave\collection1
[junit4:junit4]   2> 283 T1217 oasc.SolrResourceLoader.<init> new SolrResourceLoader for directory: '.\org.apache.solr.handler.TestReplicationHandler$SolrInstance-1342344292953\slave\collection1\'
[junit4:junit4]   2> 318 T1217 oasc.SolrConfig.<init> Using Lucene MatchVersion: LUCENE_40
[junit4:junit4]   2> 386 T1217 oasc.SolrConfig.<init> Loaded SolrConfig: solrconfig.xml
[junit4:junit4]   2> 386 T1217 oass.IndexSchema.readSchema Reading Solr Schema
[junit4:junit4]   2> 390 T1217 oass.IndexSchema.readSchema Schema name=test
[junit4:junit4]   2> 408 T1217 oass.IndexSchema.readSchema unique key field: id
[junit4:junit4]   2> 410 T1217 oasc.SolrCore.<init> [collection1] Opening new SolrCore at .\org.apache.solr.handler.TestReplicationHandler$SolrInstance-1342344292953\slave\collection1\, dataDir=.\org.apache.solr.handler.TestReplicationHandler$SolrInstance-1342344292953\slave\collection1\data\
[junit4:junit4]   2> 410 T1217 oasc.SolrCore.<init> JMX monitoring not detected for core: collection1
[junit4:junit4]   2> 410 T1217 oasc.SolrCore.getNewIndexDir WARNING New index directory detected: old=null new=.\org.apache.solr.handler.TestReplicationHandler$SolrInstance-1342344292953\slave\collection1\data\index/
[junit4:junit4]   2> 412 T1217 oasc.SolrCore.initIndex WARNING [collection1] Solr index directory '.\org.apache.solr.handler.TestReplicationHandler$SolrInstance-1342344292953\slave\collection1\data\index' doesn't exist. Creating new index...
[junit4:junit4]   2> 418 T1217 oasc.SolrDeletionPolicy.onCommit SolrDeletionPolicy.onCommit: commits:num=1
[junit4:junit4]   2> 		commit{dir=NRTCachingDirectory(org.apache.lucene.store.MMapDirectory@C:\Jenkins\workspace\Lucene-Solr-4.x-Windows-Java6-64\solr\build\solr-core\test\J0\org.apache.solr.handler.TestReplicationHandler$SolrInstance-1342344292953\slave\collection1\data\index lockFactory=org.apache.lucene.store.SingleInstanceLockFactory@84c5310; maxCacheMB=48.0 maxMergeSizeMB=4.0),segFN=segments_1,generation=1,filenames=[segments_1]
[junit4:junit4]   2> 419 T1217 oasc.SolrDeletionPolicy.updateCommits newest commit = 1
[junit4:junit4]   2> 420 T1217 oasc.RequestHandlers.initHandlersFromConfig created standard: solr.StandardRequestHandler
[junit4:junit4]   2> 420 T1217 oasc.RequestHandlers.initHandlersFromConfig created defaults: solr.StandardRequestHandler
[junit4:junit4]   2> 420 T1217 oasc.RequestHandlers.initHandlersFromConfig adding lazy requestHandler: solr.StandardRequestHandler
[junit4:junit4]   2> 420 T1217 oasc.RequestHandlers.initHandlersFromConfig created lazy: solr.StandardRequestHandler
[junit4:junit4]   2> 421 T1217 oasc.RequestHandlers.initHandlersFromConfig created /update: solr.UpdateRequestHandler
[junit4:junit4]   2> 421 T1217 oasc.RequestHandlers.initHandlersFromConfig created /replication: solr.ReplicationHandler
[junit4:junit4]   2> 422 T1217 oashl.XMLLoader.init xsltCacheLifetimeSeconds=60
[junit4:junit4]   2> 426 T1217 oass.SolrIndexSearcher.<init> Opening Searcher@5e42d31a main
[junit4:junit4]   2> 426 T1217 oasu.CommitTracker.<init> Hard AutoCommit: disabled
[junit4:junit4]   2> 426 T1217 oasu.CommitTracker.<init> Soft AutoCommit: disabled
[junit4:junit4]   2> 428 T1217 oash.SnapPuller.startExecutorService Poll Scheduled at an interval of 1000ms
[junit4:junit4]   2> 429 T1237 oasc.SolrCore.registerSearcher [collection1] Registered new searcher Searcher@5e42d31a main{StandardDirectoryReader(segments_1:1)}
[junit4:junit4]   2> 429 T1217 oasc.CoreContainer.register registering core: collection1
[junit4:junit4]   2> 429 T1217 oass.SolrDispatchFilter.init user.dir=C:\Jenkins\workspace\Lucene-Solr-4.x-Windows-Java6-64\solr\build\solr-core\test\J0
[junit4:junit4]   2> 429 T1217 oass.SolrDispatchFilter.init SolrDispatchFilter.init() done
[junit4:junit4]   2> 429 T1217 oascsi.HttpClientUtil.createClient Creating new http client, config:maxConnections=128&maxConnectionsPerHost=32&followRedirects=false
[junit4:junit4]   2> 
[junit4:junit4]    > (@AfterClass output)
[junit4:junit4]   2> 34621 T1217 oasc.CoreContainer.shutdown Shutting down CoreContainer instance=365656503
[junit4:junit4]   2> 34621 T1217 oasc.SolrCore.close [collection1]  CLOSING SolrCore org.apache.solr.core.SolrCore@3c6394e6
[junit4:junit4]   2> 34623 T1217 oasc.SolrCore.closeSearcher [collection1] Closing main searcher on request.
[junit4:junit4]   2> 34625 T1217 oasu.DirectUpdateHandler2.close closing DirectUpdateHandler2{commits=1,autocommits=0,soft autocommits=0,optimizes=0,rollbacks=0,expungeDeletes=0,docsPending=0,adds=0,deletesById=0,deletesByQuery=0,errors=0,cumulative_adds=493,cumulative_deletesById=0,cumulative_deletesByQuery=1,cumulative_errors=0}
[junit4:junit4]   2> 34632 T1217 oejsh.ContextHandler.doStop stopped o.e.j.s.ServletContextHandler{/solr,null}
[junit4:junit4]   2> 34685 T1217 oasc.CoreContainer.shutdown Shutting down CoreContainer instance=525182819
[junit4:junit4]   2> 34686 T1217 oasc.SolrCore.close [collection1]  CLOSING SolrCore org.apache.solr.core.SolrCore@242eb7e
[junit4:junit4]   2> 34687 T1217 oasc.SolrCore.closeSearcher [collection1] Closing main searcher on request.
[junit4:junit4]   2> 34687 T1217 oasu.DirectUpdateHandler2.close closing DirectUpdateHandler2{commits=2,autocommits=0,soft autocommits=0,optimizes=0,rollbacks=0,expungeDeletes=0,docsPending=0,adds=0,deletesById=0,deletesByQuery=0,errors=0,cumulative_adds=1,cumulative_deletesById=0,cumulative_deletesByQuery=0,cumulative_errors=0}
[junit4:junit4]   2> 34691 T1217 oejsh.ContextHandler.doStop stopped o.e.j.s.ServletContextHandler{/solr,null}
[junit4:junit4]   2> 34792 T1217 oas.SolrTestCaseJ4.deleteCore ###deleteCore
[junit4:junit4]   2> 34794 T1167 oaz.ClientCnxn$SendThread.run WARNING Session 0x13889f3352b0010 for server null, unexpected error, closing socket connection and attempting reconnect java.net.ConnectException: Connection refused: no further information
[junit4:junit4]   2> 	at sun.nio.ch.SocketChannelImpl.checkConnect(Native Method)
[junit4:junit4]   2> 	at sun.nio.ch.SocketChannelImpl.finishConnect(SocketChannelImpl.java:599)
[junit4:junit4]   2> 	at org.apache.zookeeper.ClientCnxn$SendThread.run(ClientCnxn.java:1146)
[junit4:junit4]   2> 
[junit4:junit4]   2> 35688 T1420 oash.SnapPuller.fetchLatestIndex SEVERE Master at: http://localhost:53463/solr is not available. Index fetch failed. Exception: org.apache.solr.client.solrj.SolrServerException: Server refused connection at: http://localhost:53463/solr
[junit4:junit4]   2> 35689 T1420 oash.SnapPuller.logReplicationTimeAndConfFiles WARNING Exception while updating statistics java.io.FileNotFoundException: .\org.apache.solr.handler.TestReplicationHandler$SolrInstance-1342344292953\slave\collection1\data\replication.properties (The system cannot find the path specified)
[junit4:junit4]   2> 	at java.io.FileOutputStream.open(Native Method)
[junit4:junit4]   2> 	at java.io.FileOutputStream.<init>(FileOutputStream.java:194)
[junit4:junit4]   2> 	at java.io.FileOutputStream.<init>(FileOutputStream.java:145)
[junit4:junit4]   2> 	at org.apache.solr.handler.SnapPuller.logReplicationTimeAndConfFiles(SnapPuller.java:446)
[junit4:junit4]   2> 	at org.apache.solr.handler.SnapPuller.fetchLatestIndex(SnapPuller.java:372)
[junit4:junit4]   2> 	at org.apache.solr.handler.ReplicationHandler.doFetch(ReplicationHandler.java:297)
[junit4:junit4]   2> 	at org.apache.solr.handler.SnapPuller$1.run(SnapPuller.java:172)
[junit4:junit4]   2> 	at java.util.concurrent.Executors$RunnableAdapter.call(Executors.java:441)
[junit4:junit4]   2> 	at java.util.concurrent.FutureTask$Sync.innerRunAndReset(FutureTask.java:317)
[junit4:junit4]   2> 	at java.util.concurrent.FutureTask.runAndReset(FutureTask.java:150)
[junit4:junit4]   2> 	at java.util.concurrent.ScheduledThreadPoolExecutor$ScheduledFutureTask.access$101(ScheduledThreadPoolExecutor.java:98)
[junit4:junit4]   2> 	at java.util.concurrent.ScheduledThreadPoolExecutor$ScheduledFutureTask.runPeriodic(ScheduledThreadPoolExecutor.java:180)
[junit4:junit4]   2> 	at java.util.concurrent.ScheduledThreadPoolExecutor$ScheduledFutureTask.run(ScheduledThreadPoolExecutor.java:204)
[junit4:junit4]   2> 	at java.util.concurrent.ThreadPoolExecutor$Worker.runTask(ThreadPoolExecutor.java:886)
[junit4:junit4]   2> 	at java.util.concurrent.ThreadPoolExecutor$Worker.run(ThreadPoolExecutor.java:908)
[junit4:junit4]   2> 	at java.lang.Thread.run(Thread.java:662)
[junit4:junit4]   2> 
[junit4:junit4]   2> 36147 T1167 oaz.ClientCnxn$SendThread.startConnect Opening socket connection to server 127.0.0.1/127.0.0.1:53280
[junit4:junit4]   2> 37237 T1167 oaz.ClientCnxn$SendThread.run WARNING Session 0x13889f3352b0010 for server null, unexpected error, closing socket connection and attempting reconnect java.net.ConnectException: Connection refused: no further information
[junit4:junit4]   2> 	at sun.nio.ch.SocketChannelImpl.checkConnect(Native Method)
[junit4:junit4]   2> 	at sun.nio.ch.SocketChannelImpl.finishConnect(SocketChannelImpl.java:599)
[junit4:junit4]   2> 	at org.apache.zookeeper.ClientCnxn$SendThread.run(ClientCnxn.java:1146)
[junit4:junit4]   2> 
[junit4:junit4]   2> 39006 T1167 oaz.ClientCnxn$SendThread.startConnect Opening socket connection to server 127.0.0.1/127.0.0.1:53280
[junit4:junit4]   2> 40107 T1167 oaz.ClientCnxn$SendThread.run WARNING Session 0x13889f3352b0010 for server null, unexpected error, closing socket connection and attempting reconnect java.net.ConnectException: Connection refused: no further information
[junit4:junit4]   2> 	at sun.nio.ch.SocketChannelImpl.checkConnect(Native Method)
[junit4:junit4]   2> 	at sun.nio.ch.SocketChannelImpl.finishConnect(SocketChannelImpl.java:599)
[junit4:junit4]   2> 	at org.apache.zookeeper.ClientCnxn$SendThread.run(ClientCnxn.java:1146)
[junit4:junit4]   2> 
[junit4:junit4]   2> 41656 T1167 oaz.ClientCnxn$SendThread.startConnect Opening socket connection to server 127.0.0.1/127.0.0.1:53280
[junit4:junit4]   2> 42712 T1167 oaz.ClientCnxn$SendThread.run WARNING Session 0x13889f3352b0010 for server null, unexpected error, closing socket connection and attempting reconnect java.net.ConnectException: Connection refused: no further information
[junit4:junit4]   2> 	at sun.nio.ch.SocketChannelImpl.checkConnect(Native Method)
[junit4:junit4]   2> 	at sun.nio.ch.SocketChannelImpl.finishConnect(SocketChannelImpl.java:599)
[junit4:junit4]   2> 	at org.apache.zookeeper.ClientCnxn$SendThread.run(ClientCnxn.java:1146)
[junit4:junit4]   2> 
[junit4:junit4]   2> 44709 T1167 oaz.ClientCnxn$SendThread.startConnect Opening socket connection to server 127.0.0.1/127.0.0.1:53280
[junit4:junit4]   2> 45700 T1167 oaz.ClientCnxn$SendThread.run WARNING Session 0x13889f3352b0010 for server null, unexpected error, closing socket connection and attempting reconnect java.net.ConnectException: Connection refused: no further information
[junit4:junit4]   2> 	at sun.nio.ch.SocketChannelImpl.checkConnect(Native Method)
[junit4:junit4]   2> 	at sun.nio.ch.SocketChannelImpl.finishConnect(SocketChannelImpl.java:599)
[junit4:junit4]   2> 	at org.apache.zookeeper.ClientCnxn$SendThread.run(ClientCnxn.java:1146)
[junit4:junit4]   2> 
[junit4:junit4]   2> 47379 T1167 oaz.ClientCnxn$SendThread.startConnect Opening socket connection to server 127.0.0.1/127.0.0.1:53280
[junit4:junit4]   2> 48370 T1167 oaz.ClientCnxn$SendThread.run WARNING Session 0x13889f3352b0010 for server null, unexpected error, closing socket connection and attempting reconnect java.net.ConnectException: Connection refused: no further information
[junit4:junit4]   2> 	at sun.nio.ch.SocketChannelImpl.checkConnect(Native Method)
[junit4:junit4]   2> 	at sun.nio.ch.SocketChannelImpl.finishConnect(SocketChannelImpl.java:599)
[junit4:junit4]   2> 	at org.apache.zookeeper.ClientCnxn$SendThread.run(ClientCnxn.java:1146)
[junit4:junit4]   2> 
[junit4:junit4]   2> 49545 T1167 oaz.ClientCnxn$SendThread.startConnect Opening socket connection to server 127.0.0.1/127.0.0.1:53280
[junit4:junit4]   2> 50537 T1167 oaz.ClientCnxn$SendThread.run WARNING Session 0x13889f3352b0010 for server null, unexpected error, closing socket connection and attempting reconnect java.net.ConnectException: Connection refused: no further information
[junit4:junit4]   2> 	at sun.nio.ch.SocketChannelImpl.checkConnect(Native Method)
[junit4:junit4]   2> 	at sun.nio.ch.SocketChannelImpl.finishConnect(SocketChannelImpl.java:599)
[junit4:junit4]   2> 	at org.apache.zookeeper.ClientCnxn$SendThread.run(ClientCnxn.java:1146)
[junit4:junit4]   2> 
[junit4:junit4]   2> 51993 T1167 oaz.ClientCnxn$SendThread.startConnect Opening socket connection to server 127.0.0.1/127.0.0.1:53280
[junit4:junit4]   2> 52904 T1167 oaz.ClientCnxn$SendThread.run WARNING Session 0x13889f3352b0010 for server null, unexpected error, closing socket connection and attempting reconnect java.net.ConnectException: Connection refused: no further information
[junit4:junit4]   2> 	at sun.nio.ch.SocketChannelImpl.checkConnect(Native Method)
[junit4:junit4]   2> 	at sun.nio.ch.SocketChannelImpl.finishConnect(SocketChannelImpl.java:599)
[junit4:junit4]   2> 	at org.apache.zookeeper.ClientCnxn$SendThread.run(ClientCnxn.java:1146)
[junit4:junit4]   2> 
[junit4:junit4]   2> 54114 T1167 oaz.ClientCnxn$SendThread.startConnect Opening socket connection to server 127.0.0.1/127.0.0.1:53280
[junit4:junit4]   2> 55007 T1167 oaz.ClientCnxn$SendThread.run WARNING Session 0x13889f3352b0010 for server null, unexpected error, closing socket connection and attempting reconnect java.net.ConnectException: Connection refused: no further information
[junit4:junit4]   2> 	at sun.nio.ch.SocketChannelImpl.checkConnect(Native Method)
[junit4:junit4]   2> 	at sun.nio.ch.SocketChannelImpl.finishConnect(SocketChannelImpl.java:599)
[junit4:junit4]   2> 	at org.apache.zookeeper.ClientCnxn$SendThread.run(ClientCnxn.java:1146)
[junit4:junit4]   2> 
[junit4:junit4]   2> 56571 T1167 oaz.ClientCnxn$SendThread.startConnect Opening socket connection to server 127.0.0.1/127.0.0.1:53280
[junit4:junit4]   2> 57465 T1167 oaz.ClientCnxn$SendThread.run WARNING Session 0x13889f3352b0010 for server null, unexpected error, closing socket connection and attempting reconnect java.net.ConnectException: Connection refused: no further information
[junit4:junit4]   2> 	at sun.nio.ch.SocketChannelImpl.checkConnect(Native Method)
[junit4:junit4]   2> 	at sun.nio.ch.SocketChannelImpl.finishConnect(SocketChannelImpl.java:599)
[junit4:junit4]   2> 	at org.apache.zookeeper.ClientCnxn$SendThread.run(ClientCnxn.java:1146)
[junit4:junit4]   2> 
[junit4:junit4]   2> 58969 T1167 oaz.ClientCnxn$SendThread.startConnect Opening socket connection to server 127.0.0.1/127.0.0.1:53280
[junit4:junit4]   2> 59861 T1167 oaz.ClientCnxn$SendThread.run WARNING Session 0x13889f3352b0010 for server null, unexpected error, closing socket connection and attempting reconnect java.net.ConnectException: Connection refused: no further information
[junit4:junit4]   2> 	at sun.nio.ch.SocketChannelImpl.checkConnect(Native Method)
[junit4:junit4]   2> 	at sun.nio.ch.SocketChannelImpl.finishConnect(SocketChannelImpl.java:599)
[junit4:junit4]   2> 	at org.apache.zookeeper.ClientCnxn$SendThread.run(ClientCnxn.java:1146)
[junit4:junit4]   2> 
[junit4:junit4]   2> 61292 T1167 oaz.ClientCnxn$SendThread.startConnect Opening socket connection to server 127.0.0.1/127.0.0.1:53280
[junit4:junit4]   2> 62275 T1167 oaz.ClientCnxn$SendThread.run WARNING Session 0x13889f3352b0010 for server null, unexpected error, closing socket connection and attempting reconnect java.net.ConnectException: Connection refused: no further information
[junit4:junit4]   2> 	at sun.nio.ch.SocketChannelImpl.checkConnect(Native Method)
[junit4:junit4]   2> 	at sun.nio.ch.SocketChannelImpl.finishConnect(SocketChannelImpl.java:599)
[junit4:junit4]   2> 	at org.apache.zookeeper.ClientCnxn$SendThread.run(ClientCnxn.java:1146)
[junit4:junit4]   2> 
[junit4:junit4]   2> 64221 T1167 oaz.ClientCnxn$SendThread.startConnect Opening socket connection to server 127.0.0.1/127.0.0.1:53280
[junit4:junit4]   2> 65204 T1167 oaz.ClientCnxn$SendThread.run WARNING Session 0x13889f3352b0010 for server null, unexpected error, closing socket connection and attempting reconnect java.net.ConnectException: Connection refused: no further information
[junit4:junit4]   2> 	at sun.nio.ch.SocketChannelImpl.checkConnect(Native Method)
[junit4:junit4]   2> 	at sun.nio.ch.SocketChannelImpl.finishConnect(SocketChannelImpl.java:599)
[junit4:junit4]   2> 	at org.apache.zookeeper.ClientCnxn$SendThread.run(ClientCnxn.java:1146)
[junit4:junit4]   2> 
[junit4:junit4]   2> 66824 T1167 oaz.ClientCnxn$SendThread.startConnect Opening socket connection to server 127.0.0.1/127.0.0.1:53280
[junit4:junit4]   2> 67807 T1167 oaz.ClientCnxn$SendThread.run WARNING Session 0x13889f3352b0010 for server null, unexpected error, closing socket connection and attempting reconnect java.net.ConnectException: Connection refused: no further information
[junit4:junit4]   2> 	at sun.nio.ch.SocketChannelImpl.checkConnect(Native Method)
[junit4:junit4]   2> 	at sun.nio.ch.SocketChannelImpl.finishConnect(SocketChannelImpl.java:599)
[junit4:junit4]   2> 	at org.apache.zookeeper.ClientCnxn$SendThread.run(ClientCnxn.java:1146)
[junit4:junit4]   2> 
[junit4:junit4]   2> 69761 T1167 oaz.ClientCnxn$SendThread.startConnect Opening socket connection to server 127.0.0.1/127.0.0.1:53280
[junit4:junit4]   2> 70742 T1167 oaz.ClientCnxn$SendThread.run WARNING Session 0x13889f3352b0010 for server null, unexpected error, closing socket connection and attempting reconnect java.net.ConnectException: Connection refused: no further information
[junit4:junit4]   2> 	at sun.nio.ch.SocketChannelImpl.checkConnect(Native Method)
[junit4:junit4]   2> 	at sun.nio.ch.SocketChannelImpl.finishConnect(SocketChannelImpl.java:599)
[junit4:junit4]   2> 	at org.apache.zookeeper.ClientCnxn$SendThread.run(ClientCnxn.java:1146)
[junit4:junit4]   2> 
[junit4:junit4]   2> 72594 T1167 oaz.ClientCnxn$SendThread.startConnect Opening socket connection to server 127.0.0.1/127.0.0.1:53280
[junit4:junit4]   2> 73685 T1167 oaz.ClientCnxn$SendThread.run WARNING Session 0x13889f3352b0010 for server null, unexpected error, closing socket connection and attempting reconnect java.net.ConnectException: Connection refused: no further information
[junit4:junit4]   2> 	at sun.nio.ch.SocketChannelImpl.checkConnect(Native Method)
[junit4:junit4]   2> 	at sun.nio.ch.SocketChannelImpl.finishConnect(SocketChannelImpl.java:599)
[junit4:junit4]   2> 	at org.apache.zookeeper.ClientCnxn$SendThread.run(ClientCnxn.java:1146)
[junit4:junit4]   2> 
[junit4:junit4]   2> 75520 T1167 oaz.ClientCnxn$SendThread.startConnect Opening socket connection to server 127.0.0.1/127.0.0.1:53280
[junit4:junit4]   2> 76599 T1167 oaz.ClientCnxn$SendThread.run WARNING Session 0x13889f3352b0010 for server null, unexpected error, closing socket connection and attempting reconnect java.net.ConnectException: Connection refused: no further information
[junit4:junit4]   2> 	at sun.nio.ch.SocketChannelImpl.checkConnect(Native Method)
[junit4:junit4]   2> 	at sun.nio.ch.SocketChannelImpl.finishConnect(SocketChannelImpl.java:599)
[junit4:junit4]   2> 	at org.apache.zookeeper.ClientCnxn$SendThread.run(ClientCnxn.java:1146)
[junit4:junit4]   2> 
[junit4:junit4]   2> 78782 T1167 oaz.ClientCnxn$SendThread.startConnect Opening socket connection to server 127.0.0.1/127.0.0.1:53280
[junit4:junit4]   2> 79861 T1167 oaz.ClientCnxn$SendThread.run WARNING Session 0x13889f3352b0010 for server null, unexpected error, closing socket connection and attempting reconnect java.net.ConnectException: Connection refused: no further information
[junit4:junit4]   2> 	at sun.nio.ch.SocketChannelImpl.checkConnect(Native Method)
[junit4:junit4]   2> 	at sun.nio.ch.SocketChannelImpl.finishConnect(SocketChannelImpl.java:599)
[junit4:junit4]   2> 	at org.apache.zookeeper.ClientCnxn$SendThread.run(ClientCnxn.java:1146)
[junit4:junit4]   2> 
[junit4:junit4]   2> 81612 T1167 oaz.ClientCnxn$SendThread.startConnect Opening socket connection to server 127.0.0.1/127.0.0.1:53280
[junit4:junit4]   2> 82591 T1167 oaz.ClientCnxn$SendThread.run WARNING Session 0x13889f3352b0010 for server null, unexpected error, closing socket connection and attempting reconnect java.net.ConnectException: Connection refused: no further information
[junit4:junit4]   2> 	at sun.nio.ch.SocketChannelImpl.checkConnect(Native Method)
[junit4:junit4]   2> 	at sun.nio.ch.SocketChannelImpl.finishConnect(SocketChannelImpl.java:599)
[junit4:junit4]   2> 	at org.apache.zookeeper.ClientCnxn$SendThread.run(ClientCnxn.java:1146)
[junit4:junit4]   2> 
[junit4:junit4]   2> 84480 T1167 oaz.ClientCnxn$SendThread.startConnect Opening socket connection to server 127.0.0.1/127.0.0.1:53280
[junit4:junit4]   2> 85453 T1167 oaz.ClientCnxn$SendThread.run WARNING Session 0x13889f3352b0010 for server null, unexpected error, closing socket connection and attempting reconnect java.net.ConnectException: Connection refused: no further information
[junit4:junit4]   2> 	at sun.nio.ch.SocketChannelImpl.checkConnect(Native Method)
[junit4:junit4]   2> 	at sun.nio.ch.SocketChannelImpl.finishConnect(SocketChannelImpl.java:599)
[junit4:junit4]   2> 	at org.apache.zookeeper.ClientCnxn$SendThread.run(ClientCnxn.java:1146)
[junit4:junit4]   2> 
[junit4:junit4]   2> 86874 T1167 oaz.ClientCnxn$SendThread.startConnect Opening socket connection to server 127.0.0.1/127.0.0.1:53280
[junit4:junit4]   2> 87847 T1167 oaz.ClientCnxn$SendThread.run WARNING Session 0x13889f3352b0010 for server null, unexpected error, closing socket connection and attempting reconnect java.net.ConnectException: Connection refused: no further information
[junit4:junit4]   2> 	at sun.nio.ch.SocketChannelImpl.checkConnect(Native Method)
[junit4:junit4]   2> 	at sun.nio.ch.SocketChannelImpl.finishConnect(SocketChannelImpl.java:599)
[junit4:junit4]   2> 	at org.apache.zookeeper.ClientCnxn$SendThread.run(ClientCnxn.java:1146)
[junit4:junit4]   2> 
[junit4:junit4]   2> 89823 T1167 oaz.ClientCnxn$SendThread.startConnect Opening socket connection to server 127.0.0.1/127.0.0.1:53280
[junit4:junit4]   2> 90794 T1167 oaz.ClientCnxn$SendThread.run WARNING Session 0x13889f3352b0010 for server null, unexpected error, closing socket connection and attempting reconnect java.net.ConnectException: Connection refused: no further information
[junit4:junit4]   2> 	at sun.nio.ch.SocketChannelImpl.checkConnect(Native Method)
[junit4:junit4]   2> 	at sun.nio.ch.SocketChannelImpl.finishConnect(SocketChannelImpl.java:599)
[junit4:junit4]   2> 	at org.apache.zookeeper.ClientCnxn$SendThread.run(ClientCnxn.java:1146)
[junit4:junit4]   2> 
[junit4:junit4]   2> 92273 T1167 oaz.ClientCnxn$SendThread.startConnect Opening socket connection to server 127.0.0.1/127.0.0.1:53280
[junit4:junit4]   2> 93274 T1167 oaz.ClientCnxn$SendThread.run WARNING Session 0x13889f3352b0010 for server null, unexpected error, closing socket connection and attempting reconnect java.net.ConnectException: Connection refused: no further information
[junit4:junit4]   2> 	at sun.nio.ch.SocketChannelImpl.checkConnect(Native Method)
[junit4:junit4]   2> 	at sun.nio.ch.SocketChannelImpl.finishConnect(SocketChannelImpl.java:599)
[junit4:junit4]   2> 	at org.apache.zookeeper.ClientCnxn$SendThread.run(ClientCnxn.java:1146)
[junit4:junit4]   2> 
[junit4:junit4]   2> 95226 T1167 oaz.ClientCnxn$SendThread.startConnect Opening socket connection to server 127.0.0.1/127.0.0.1:53280
[junit4:junit4]   2> 96229 T1167 oaz.ClientCnxn$SendThread.run WARNING Session 0x13889f3352b0010 for server null, unexpected error, closing socket connection and attempting reconnect java.net.ConnectException: Connection refused: no further information
[junit4:junit4]   2> 	at sun.nio.ch.SocketChannelImpl.checkConnect(Native Method)
[junit4:junit4]   2> 	at sun.nio.ch.SocketChannelImpl.finishConnect(SocketChannelImpl.java:599)
[junit4:junit4]   2> 	at org.apache.zookeeper.ClientCnxn$SendThread.run(ClientCnxn.java:1146)
[junit4:junit4]   2> 
[junit4:junit4]   2> 97413 T1167 oaz.ClientCnxn$SendThread.startConnect Opening socket connection to server 127.0.0.1/127.0.0.1:53280
[junit4:junit4]   2> 98415 T1167 oaz.ClientCnxn$SendThread.run WARNING Session 0x13889f3352b0010 for server null, unexpected error, closing socket connection and attempting reconnect java.net.ConnectException: Connection refused: no further information
[junit4:junit4]   2> 	at sun.nio.ch.SocketChannelImpl.checkConnect(Native Method)
[junit4:junit4]   2> 	at sun.nio.ch.SocketChannelImpl.finishConnect(SocketChannelImpl.java:599)
[junit4:junit4]   2> 	at org.apache.zookeeper.ClientCnxn$SendThread.run(ClientCnxn.java:1146)
[junit4:junit4]   2> 
[junit4:junit4]   2> 99997 T1167 oaz.ClientCnxn$SendThread.startConnect Opening socket connection to server 127.0.0.1/127.0.0.1:53280
[junit4:junit4]   2> 100999 T1167 oaz.ClientCnxn$SendThread.run WARNING Session 0x13889f3352b0010 for server null, unexpected error, closing socket connection and attempting reconnect java.net.ConnectException: Connection refused: no further information
[junit4:junit4]   2> 	at sun.nio.ch.SocketChannelImpl.checkConnect(Native Method)
[junit4:junit4]   2> 	at sun.nio.ch.SocketChannelImpl.finishConnect(SocketChannelImpl.java:599)
[junit4:junit4]   2> 	at org.apache.zookeeper.ClientCnxn$SendThread.run(ClientCnxn.java:1146)
[junit4:junit4]   2> 
[junit4:junit4]   2> 102520 T1167 oaz.ClientCnxn$SendThread.startConnect Opening socket connection to server 127.0.0.1/127.0.0.1:53280
[junit4:junit4]   2> 103523 T1167 oaz.ClientCnxn$SendThread.run WARNING Session 0x13889f3352b0010 for server null, unexpected error, closing socket connection and attempting reconnect java.net.ConnectException: Connection refused: no further information
[junit4:junit4]   2> 	at sun.nio.ch.SocketChannelImpl.checkConnect(Native Method)
[junit4:junit4]   2> 	at sun.nio.ch.SocketChannelImpl.finishConnect(SocketChannelImpl.java:599)
[junit4:junit4]   2> 	at org.apache.zookeeper.ClientCnxn$SendThread.run(ClientCnxn.java:1146)
[junit4:junit4]   2> 
[junit4:junit4]   2> 105240 T1167 oaz.ClientCnxn$SendThread.startConnect Opening socket connection to server 127.0.0.1/127.0.0.1:53280
[junit4:junit4]   2> 106245 T1167 oaz.ClientCnxn$SendThread.run WARNING Session 0x13889f3352b0010 for server null, unexpected error, closing socket connection and attempting reconnect java.net.ConnectException: Connection refused: no further information
[junit4:junit4]   2> 	at sun.nio.ch.SocketChannelImpl.checkConnect(Native Method)
[junit4:junit4]   2> 	at sun.nio.ch.SocketChannelImpl.finishConnect(SocketChannelImpl.java:599)
[junit4:junit4]   2> 	at org.apache.zookeeper.ClientCnxn$SendThread.run(ClientCnxn.java:1146)
[junit4:junit4]   2> 
[junit4:junit4]   2> 108324 T1167 oaz.ClientCnxn$SendThread.startConnect Opening socket connection to server 127.0.0.1/127.0.0.1:53280
[junit4:junit4]   2> 109325 T1167 oaz.ClientCnxn$SendThread.run WARNING Session 0x13889f3352b0010 for server null, unexpected error, closing socket connection and attempting reconnect java.net.ConnectException: Connection refused: no further information
[junit4:junit4]   2> 	at sun.nio.ch.SocketChannelImpl.checkConnect(Native Method)
[junit4:junit4]   2> 	at sun.nio.ch.SocketChannelImpl.finishConnect(SocketChannelImpl.java:599)
[junit4:junit4]   2> 	at org.apache.zookeeper.ClientCnxn$SendThread.run(ClientCnxn.java:1146)
[junit4:junit4]   2> 
[junit4:junit4]   2> 111190 T1167 oaz.ClientCnxn$SendThread.startConnect Opening socket connection to server 127.0.0.1/127.0.0.1:53280
[junit4:junit4]   2> 112191 T1167 oaz.ClientCnxn$SendThread.run WARNING Session 0x13889f3352b0010 for server null, unexpected error, closing socket connection and attempting reconnect java.net.ConnectException: Connection refused: no further information
[junit4:junit4]   2> 	at sun.nio.ch.SocketChannelImpl.checkConnect(Native Method)
[junit4:junit4]   2> 	at sun.nio.ch.SocketChannelImpl.finishConnect(SocketChannelImpl.java:599)
[junit4:junit4]   2> 	at org.apache.zookeeper.ClientCnxn$SendThread.run(ClientCnxn.java:1146)
[junit4:junit4]   2> 
[junit4:junit4]   2> 112516 T1173 oasc.Overseer$CloudStateUpdater.amILeader WARNING  org.apache.zookeeper.KeeperException$ConnectionLossException: KeeperErrorCode = ConnectionLoss for /overseer_elect/leader
[junit4:junit4]   2> 	at org.apache.zookeeper.KeeperException.create(KeeperException.java:90)
[junit4:junit4]   2> 	at org.apache.zookeeper.KeeperException.create(KeeperException.java:42)
[junit4:junit4]   2> 	at org.apache.zookeeper.ZooKeeper.getData(ZooKeeper.java:927)
[junit4:junit4]   2> 	at org.apache.solr.common.cloud.SolrZkClient$7.execute(SolrZkClient.java:289)
[junit4:junit4]   2> 	at org.apache.solr.common.cloud.SolrZkClient$7.execute(SolrZkClient.java:286)
[junit4:junit4]   2> 	at org.apache.solr.common.cloud.ZkCmdExecutor.retryOperation(ZkCmdExecutor.java:67)
[junit4:junit4]   2> 	at org.apache.solr.common.cloud.SolrZkClient.getData(SolrZkClient.java:286)
[junit4:junit4]   2> 	at org.apache.solr.cloud.Overseer$CloudStateUpdater.amILeader(Overseer.java:187)
[junit4:junit4]   2> 	at org.apache.solr.cloud.Overseer$CloudStateUpdater.run(Overseer.java:113)
[junit4:junit4]   2> 	at java.lang.Thread.run(Thread.java:662)
[junit4:junit4]   2> 
[junit4:junit4]   2> 112517 T1173 oasc.Overseer$CloudStateUpdater.amILeader According to ZK I (id=87971870395793424-127.0.0.1:53291_solr-n_0000000013) am no longer a leader.
[junit4:junit4]   2> 113726 T1167 oaz.ClientCnxn$SendThread.startConnect Opening socket connection to server 127.0.0.1/127.0.0.1:53280
[junit4:junit4]   2> 114728 T1167 oaz.ClientCnxn$SendThread.run WARNING Session 0x13889f3352b0010 for server null, unexpected error, closing socket connection and attempting reconnect java.net.ConnectException: Connection refused: no further information
[junit4:junit4]   2> 	at sun.nio.ch.SocketChannelImpl.checkConnect(Native Method)
[junit4:junit4]   2> 	at sun.nio.ch.SocketChannelImpl.finishConnect(SocketChannelImpl.java:599)
[junit4:junit4]   2> 	at org.apache.zookeeper.ClientCnxn$SendThread.run(ClientCnxn.java:1146)
[junit4:junit4]   2> 
[junit4:junit4]   2> 116000 T1167 oaz.ClientCnxn$SendThread.startConnect Opening socket connection to server 127.0.0.1/127.0.0.1:53280
[junit4:junit4]   2> 117001 T1167 oaz.ClientCnxn$SendThread.run WARNING Session 0x13889f3352b0010 for server null, unexpected error, closing socket connection and attempting reconnect java.net.ConnectException: Connection refused: no further information
[junit4:junit4]   2> 	at sun.nio.ch.SocketChannelImpl.checkConnect(Native Method)
[junit4:junit4]   2> 	at sun.nio.ch.SocketChannelImpl.finishConnect(SocketChannelImpl.java:599)
[junit4:junit4]   2> 	at org.apache.zookeeper.ClientCnxn$SendThread.run(ClientCnxn.java:1146)
[junit4:junit4]   2> 
[junit4:junit4]   2> 118160 T1167 oaz.ClientCnxn$SendThread.startConnect Opening socket connection to server 127.0.0.1/127.0.0.1:53280
[junit4:junit4]   2> 119162 T1167 oaz.ClientCnxn$SendThread.run WARNING Session 0x13889f3352b0010 for server null, unexpected error, closing socket connection and attempting reconnect java.net.ConnectException: Connection refused: no further information
[junit4:junit4]   2> 	at sun.nio.ch.SocketChannelImpl.checkConnect(Native Method)
[junit4:junit4]   2> 	at sun.nio.ch.SocketChannelImpl.finishConnect(SocketChannelImpl.java:599)
[junit4:junit4]   2> 	at org.apache.zookeeper.ClientCnxn$SendThread.run(ClientCnxn.java:1146)
[junit4:junit4]   2> 
[junit4:junit4]   2> 120701 T1167 oaz.ClientCnxn$SendThread.startConnect Opening socket connection to server 127.0.0.1/127.0.0.1:53280
[junit4:junit4]   2> 121746 T1167 oaz.ClientCnxn$SendThread.run WARNING Session 0x13889f3352b0010 for server null, unexpected error, closing socket connection and attempting reconnect java.net.ConnectException: Connection refused: no further information
[junit4:junit4]   2> 	at sun.nio.ch.SocketChannelImpl.checkConnect(Native Method)
[junit4:junit4]   2> 	at sun.nio.ch.SocketChannelImpl.finishConnect(SocketChannelImpl.java:599)
[junit4:junit4]   2> 	at org.apache.zookeeper.ClientCnxn$SendThread.run(ClientCnxn.java:1146)
[junit4:junit4]   2> 
[junit4:junit4]   2> 123483 T1167 oaz.ClientCnxn$SendThread.startConnect Opening socket connection to server 127.0.0.1/127.0.0.1:53280
[junit4:junit4]   2> 124584 T1167 oaz.ClientCnxn$SendThread.run WARNING Session 0x13889f3352b0010 for server null, unexpected error, closing socket connection and attempting reconnect java.net.ConnectException: Connection refused: no further information
[junit4:junit4]   2> 	at sun.nio.ch.SocketChannelImpl.checkConnect(Native Method)
[junit4:junit4]   2> 	at sun.nio.ch.SocketChannelImpl.finishConnect(SocketChannelImpl.java:599)
[junit4:junit4]   2> 	at org.apache.zookeeper.ClientCnxn$SendThread.run(ClientCnxn.java:1146)
[junit4:junit4]   2> 
[junit4:junit4]   2> 126769 T1167 oaz.ClientCnxn$SendThread.startConnect Opening socket connection to server 127.0.0.1/127.0.0.1:53280
[junit4:junit4]   2> 127873 T1167 oaz.ClientCnxn$SendThread.run WARNING Session 0x13889f3352b0010 for server null, unexpected error, closing socket connection and attempting reconnect java.net.ConnectException: Connection refused: no further information
[junit4:junit4]   2> 	at sun.nio.ch.SocketChannelImpl.checkConnect(Native Method)
[junit4:junit4]   2> 	at sun.nio.ch.SocketChannelImpl.finishConnect(SocketChannelImpl.java:599)
[junit4:junit4]   2> 	at org.apache.zookeeper.ClientCnxn$SendThread.run(ClientCnxn.java:1146)
[junit4:junit4]   2> 
[junit4:junit4]   2> 129811 T1167 oaz.ClientCnxn$SendThread.startConnect Opening socket connection to server 127.0.0.1/127.0.0.1:53280
[junit4:junit4]   2> 130913 T1167 oaz.ClientCnxn$SendThread.run WARNING Session 0x13889f3352b0010 for server null, unexpected error, closing socket connection and attempting reconnect java.net.ConnectException: Connection refused: no further information
[junit4:junit4]   2> 	at sun.nio.ch.SocketChannelImpl.checkConnect(Native Method)
[junit4:junit4]   2> 	at sun.nio.ch.SocketChannelImpl.finishConnect(SocketChannelImpl.java:599)
[junit4:junit4]   2> 	at org.apache.zookeeper.ClientCnxn$SendThread.run(ClientCnxn.java:1146)
[junit4:junit4]   2> 
[junit4:junit4]   2> 132202 T1167 oaz.ClientCnxn$SendThread.startConnect Opening socket connection to server 127.0.0.1/127.0.0.1:53280
[junit4:junit4]   2> 133211 T1167 oaz.ClientCnxn$SendThread.run WARNING Session 0x13889f3352b0010 for server null, unexpected error, closing socket connection and attempting reconnect java.net.ConnectException: Connection refused: no further information
[junit4:junit4]   2> 	at sun.nio.ch.SocketChannelImpl.checkConnect(Native Method)
[junit4:junit4]   2> 	at sun.nio.ch.SocketChannelImpl.finishConnect(SocketChannelImpl.java:599)
[junit4:junit4]   2> 	at org.apache.zookeeper.ClientCnxn$SendThread.run(ClientCnxn.java:1146)
[junit4:junit4]   2> 
[junit4:junit4]   2> 134732 T1167 oaz.ClientCnxn$SendThread.startConnect Opening socket connection to server 127.0.0.1/127.0.0.1:53280
[junit4:junit4]   2> 135723 T1167 oaz.ClientCnxn$SendThread.run WARNING Session 0x13889f3352b0010 for server null, unexpected error, closing socket connection and attempting reconnect java.net.ConnectException: Connection refused: no further information
[junit4:junit4]   2> 	at sun.nio.ch.SocketChannelImpl.checkConnect(Native Method)
[junit4:junit4]   2> 	at sun.nio.ch.SocketChannelImpl.finishConnect(SocketChannelImpl.java:599)
[junit4:junit4]   2> 	at org.apache.zookeeper.ClientCnxn$SendThread.run(ClientCnxn.java:1146)
[junit4:junit4]   2> 
[junit4:junit4]   2> 137314 T1167 oaz.ClientCnxn$SendThread.startConnect Opening socket connection to server 127.0.0.1/127.0.0.1:53280
[junit4:junit4]   2> 138305 T1167 oaz.ClientCnxn$SendThread.run WARNING Session 0x13889f3352b0010 for server null, unexpected error, closing socket connection and attempting reconnect java.net.ConnectException: Connection refused: no further information
[junit4:junit4]   2> 	at sun.nio.ch.SocketChannelImpl.checkConnect(Native Method)
[junit4:junit4]   2> 	at sun.nio.ch.SocketChannelImpl.finishConnect(SocketChannelImpl.java:599)
[junit4:junit4]   2> 	at org.apache.zookeeper.ClientCnxn$SendThread.run(ClientCnxn.java:1146)
[junit4:junit4]   2> 
[junit4:junit4]   2> 140321 T1167 oaz.ClientCnxn$SendThread.startConnect Opening socket connection to server 127.0.0.1/127.0.0.1:53280
[junit4:junit4]   2> 141314 T1167 oaz.ClientCnxn$SendThread.run WARNING Session 0x13889f3352b0010 for server null, unexpected error, closing socket connection and attempting reconnect java.net.ConnectException: Connection refused: no further information
[junit4:junit4]   2> 	at sun.nio.ch.SocketChannelImpl.checkConnect(Native Method)
[junit4:junit4]   2> 	at sun.nio.ch.SocketChannelImpl.finishConnect(SocketChannelImpl.java:599)
[junit4:junit4]   2> 	at org.apache.zookeeper.ClientCnxn$SendThread.run(ClientCnxn.java:1146)
[junit4:junit4]   2> 
[junit4:junit4]   2> 142448 T1167 oaz.ClientCnxn$SendThread.startConnect Opening socket connection to server 127.0.0.1/127.0.0.1:53280
[junit4:junit4]   2> 143342 T1167 oaz.ClientCnxn$SendThread.run WARNING Session 0x13889f3352b0010 for server null, unexpected error, closing socket connection and attempting reconnect java.net.ConnectException: Connection refused: no further information
[junit4:junit4]   2> 	at sun.nio.ch.SocketChannelImpl.checkConnect(Native Method)
[junit4:junit4]   2> 	at sun.nio.ch.SocketChannelImpl.finishConnect(SocketChannelImpl.java:599)
[junit4:junit4]   2> 	at org.apache.zookeeper.ClientCnxn$SendThread.run(ClientCnxn.java:1146)
[junit4:junit4]   2> 
[junit4:junit4]   2> 145166 T1167 oaz.ClientCnxn$SendThread.startConnect Opening socket connection to server 127.0.0.1/127.0.0.1:53280
[junit4:junit4]   2> 146059 T1167 oaz.ClientCnxn$SendThread.run WARNING Session 0x13889f3352b0010 for server null, unexpected error, closing socket connection and attempting reconnect java.net.ConnectException: Connection refused: no further information
[junit4:junit4]   2> 	at sun.nio.ch.SocketChannelImpl.checkConnect(Native Method)
[junit4:junit4]   2> 	at sun.nio.ch.SocketChannelImpl.finishConnect(SocketChannelImpl.java:599)
[junit4:junit4]   2> 	at org.apache.zookeeper.ClientCnxn$SendThread.run(ClientCnxn.java:1146)
[junit4:junit4]   2> 
[junit4:junit4]   2> 147715 T1167 oaz.ClientCnxn$SendThread.startConnect Opening socket connection to server 127.0.0.1/127.0.0.1:53280
[junit4:junit4]   2> 148607 T1167 oaz.ClientCnxn$SendThread.run WARNING Session 0x13889f3352b0010 for server null, unexpected error, closing socket connection and attempting reconnect java.net.ConnectException: Connection refused: no further information
[junit4:junit4]   2> 	at sun.nio.ch.SocketChannelImpl.checkConnect(Native Method)
[junit4:junit4]   2> 	at sun.nio.ch.SocketChannelImpl.finishConnect(SocketChannelImpl.java:599)
[junit4:junit4]   2> 	at org.apache.zookeeper.ClientCnxn$SendThread.run(ClientCnxn.java:1146)
[junit4:junit4]   2> 
[junit4:junit4]   2> 150135 T1167 oaz.ClientCnxn$SendThread.startConnect Opening socket connection to server 127.0.0.1/127.0.0.1:53280
[junit4:junit4]   2> 151030 T1167 oaz.ClientCnxn$SendThread.run WARNING Session 0x13889f3352b0010 for server null, unexpected error, closing socket connection and attempting reconnect java.net.ConnectException: Connection refused: no further information
[junit4:junit4]   2> 	at sun.nio.ch.SocketChannelImpl.checkConnect(Native Method)
[junit4:junit4]   2> 	at sun.nio.ch.SocketChannelImpl.finishConnect(SocketChannelImpl.java:599)
[junit4:junit4]   2> 	at org.apache.zookeeper.ClientCnxn$SendThread.run(ClientCnxn.java:1146)
[junit4:junit4]   2> 
[junit4:junit4]   2> 153062 T1167 oaz.ClientCnxn$SendThread.startConnect Opening socket connection to server 127.0.0.1/127.0.0.1:53280
[junit4:junit4]   2> 154036 T1167 oaz.ClientCnxn$SendThread.run WARNING Session 0x13889f3352b0010 for server null, unexpected error, closing socket connection and attempting reconnect java.net.ConnectException: Connection refused: no further information
[junit4:junit4]   2> 	at sun.nio.ch.SocketChannelImpl.checkConnect(Native Method)
[junit4:junit4]   2> 	at sun.nio.ch.SocketChannelImpl.finishConnect(SocketChannelImpl.java:599)
[junit4:junit4]   2> 	at org.apache.zookeeper.ClientCnxn$SendThread.run(ClientCnxn.java:1146)
[junit4:junit4]   2> 
[junit4:junit4]   2> 155297 T1217 oas.SolrTestCaseJ4.endTrackingSearchers SEVERE ERROR: SolrIndexSearcher opens=74 closes=73
[junit4:junit4]   2> NOTE: test params are: codec=Lucene3x, sim=RandomSimilarityProvider(queryNorm=true,coord=false): {}, locale=ar_TN, timezone=America/Santo_Domingo
[junit4:junit4]   2> NOTE: Windows 7 6.1 amd64/Sun Microsystems Inc. 1.6.0_32 (64-bit)/cpus=2,threads=1,free=45899808,total=228261888
[junit4:junit4]   2> NOTE: All tests run in this JVM: [TestWordDelimiterFilterFactory, TestFiltering, SolrCoreTest, UpdateRequestProcessorFactoryTest, TestHashPartitioner, BadComponentTest, TestOmitPositions, TestMultiWordSynonyms, TestStopFilterFactory, DOMUtilTest, TestRangeQuery, TestRTGBase, TestQueryTypes, AutoCommitTest, TestFoldingMultitermQuery, LeaderElectionTest, TestElisionFilterFactory, TestNGramFilters, LeaderElectionIntegrationTest, QueryEqualityTest, SolrIndexConfigTest, AlternateDirectoryTest, DistributedTermsComponentTest, TestDocSet, TestSolrXMLSerializer, TestDistributedSearch, OverseerTest, FieldAnalysisRequestHandlerTest, DirectSolrConnectionTest, TestGreekLowerCaseFilterFactory, TestGreekStemFilterFactory, TestKeywordMarkerFilterFactory, FastVectorHighlighterTest, PreAnalyzedFieldTest, TestBinaryField, TestSolrDeletionPolicy2, LukeRequestHandlerTest, SpellingQueryConverterTest, TestIndexingPerformance, QueryParsingTest, SpellCheckComponentTest, TestFrenchLightStemFilterFactory, TestKeepFilterFactory, PeerSyncTest, SuggesterTSTTest, TestTypeTokenFilterFactory, TestJapaneseKatakanaStemFilterFactory, TestPhoneticFilterFactory, SuggesterWFSTTest, TestLMDirichletSimilarityFactory, TestIndonesianStemFilterFactory, FullSolrCloudTest, SpellCheckCollatorTest, TestStressRecovery, SortByFunctionTest, PolyFieldTest, NumericFieldsTest, BinaryUpdateRequestHandlerTest, TestKStemFilterFactory, TestUpdate, TestPerFieldSimilarity, TestChineseTokenizerFactory, TestGermanMinimalStemFilterFactory, TestSolrJ, TestIBSimilarityFactory, TestBulgarianStemFilterFactory, TestSynonymMap, TestLFUCache, TestPatternReplaceCharFilterFactory, TestCapitalizationFilterFactory, MBeansHandlerTest, TestCSVResponseWriter, TestCJKWidthFilterFactory, WordBreakSolrSpellCheckerTest, SolrPluginUtilsTest, TestJapaneseIterationMarkCharFilterFactory, TestHyphenationCompoundWordTokenFilterFactory, TestCSVLoader, TestReplicationHandler]
[junit4:junit4]   2> NOTE: reproduce with: ant test  -Dtestcase=TestReplicationHandler -Dtests.seed=31DAB171B5407E8B -Dtests.slow=true -Dtests.locale=ar_TN -Dtests.timezone=America/Santo_Domingo -Dtests.file.encoding=Cp1252
[junit4:junit4]   2> 
[junit4:junit4] ERROR   0.00s | TestReplicationHandler (suite)
[junit4:junit4]    > Throwable #1: java.lang.AssertionError: ERROR: SolrIndexSearcher opens=74 closes=73
[junit4:junit4]    > 	at __randomizedtesting.SeedInfo.seed([31DAB171B5407E8B]:0)
[junit4:junit4]    > 	at org.junit.Assert.fail(Assert.java:93)
[junit4:junit4]    > 	at org.apache.solr.SolrTestCaseJ4.endTrackingSearchers(SolrTestCaseJ4.java:217)
[junit4:junit4]    > 	at org.apache.solr.SolrTestCaseJ4.afterClass(SolrTestCaseJ4.java:82)
[junit4:junit4]    > 	at sun.reflect.GeneratedMethodAccessor15.invoke(Unknown Source)
[junit4:junit4]    > 	at sun.reflect.DelegatingMethodAccessorImpl.invoke(DelegatingMethodAccessorImpl.java:25)
[junit4:junit4]    > 	at java.lang.reflect.Method.invoke(Method.java:597)
[junit4:junit4]    > 	at com.carrotsearch.randomizedtesting.RandomizedRunner.invoke(RandomizedRunner.java:1995)
[junit4:junit4]    > 	at com.carrotsearch.randomizedtesting.RandomizedRunner.access$1100(RandomizedRunner.java:132)
[junit4:junit4]    > 	at com.carrotsearch.randomizedtesting.RandomizedRunner$5.evaluate(RandomizedRunner.java:754)
[junit4:junit4]    > 	at com.carrotsearch.randomizedtesting.rules.SystemPropertiesRestoreRule$1.evaluate(SystemPropertiesRestoreRule.java:53)
[junit4:junit4]    > 	at org.apache.lucene.util.AbstractBeforeAfterRule$1.evaluate(AbstractBeforeAfterRule.java:45)
[junit4:junit4]    > 	at org.apache.lucene.util.TestRuleReportUncaughtExceptions$1.evaluate(TestRuleReportUncaughtExceptions.java:68)
[junit4:junit4]    > 	at org.apache.lucene.util.TestRuleStoreClassName$1.evaluate(TestRuleStoreClassName.java:38)
[junit4:junit4]    > 	at org.apache.lucene.util.TestRuleIcuHack$1.evaluate(TestRuleIcuHack.java:51)
[junit4:junit4]    > 	at com.carrotsearch.randomizedtesting.rules.SystemPropertiesInvariantRule$1.evaluate(SystemPropertiesInvariantRule.java:55)
[junit4:junit4]    > 	at org.apache.lucene.util.TestRuleNoInstanceHooksOverrides$1.evaluate(TestRuleNoInstanceHooksOverrides.java:53)
[junit4:junit4]    > 	at org.apache.lucene.util.TestRuleNoStaticHooksShadowing$1.evaluate(TestRuleNoStaticHooksShadowing.java:52)
[junit4:junit4]    > 	at org.apache.lucene.util.TestRuleAssertionsRequired$1.evaluate(TestRuleAssertionsRequired.java:36)
[junit4:junit4]    > 	at org.apache.lucene.util.TestRuleMarkFailure$1.evaluate(TestRuleMarkFailure.java:48)
[junit4:junit4]    > 	at org.apache.lucene.util.TestRuleIgnoreAfterMaxFailures$1.evaluate(TestRuleIgnoreAfterMaxFailures.java:70)
[junit4:junit4]    > 	at org.apache.lucene.util.TestRuleIgnoreTestSuites$1.evaluate(TestRuleIgnoreTestSuites.java:55)
[junit4:junit4]    > 	at com.carrotsearch.randomizedtesting.RandomizedRunner.runSuite(RandomizedRunner.java:605)
[junit4:junit4]    > 	at com.carrotsearch.randomizedtesting.RandomizedRunner.access$400(RandomizedRunner.java:132)
[junit4:junit4]    > 	at com.carrotsearch.randomizedtesting.RandomizedRunner$2.run(RandomizedRunner.java:551)
[junit4:junit4]    >
[junit4:junit4] Completed in 155.32s, 1 test, 1 failure <<< FAILURES!

[...truncated 924 lines...]
BUILD FAILED
C:\Jenkins\workspace\Lucene-Solr-4.x-Windows-Java6-64\build.xml:29: The following error occurred while executing this line:
C:\Jenkins\workspace\Lucene-Solr-4.x-Windows-Java6-64\solr\build.xml:144: The following error occurred while executing this line:
C:\Jenkins\workspace\Lucene-Solr-4.x-Windows-Java6-64\lucene\module-build.xml:62: The following error occurred while executing this line:
C:\Jenkins\workspace\Lucene-Solr-4.x-Windows-Java6-64\lucene\common-build.xml:1093: The following error occurred while executing this line:
C:\Jenkins\workspace\Lucene-Solr-4.x-Windows-Java6-64\lucene\common-build.xml:788: There were test failures: 302 suites, 1081 tests, 1 suite-level error, 10 ignored (5 assumptions)

Total time: 34 minutes 51 seconds
Build step 'Invoke Ant' marked build as failure
Recording test results
Email was triggered for: Failure
Sending email for trigger: Failure




Mime
View raw message