lucene-dev mailing list archives

Site index · List index
Message view « Date » · « Thread »
Top « Date » · « Thread »
From Policeman Jenkins Server <jenk...@sd-datasolutions.de>
Subject [JENKINS] Lucene-Solr-trunk-Windows-Java7-64 - Build # 499 - Failure!
Date Tue, 10 Jul 2012 07:12:38 GMT
Build: http://jenkins.sd-datasolutions.de/job/Lucene-Solr-trunk-Windows-Java7-64/499/

1 tests failed.
FAILED:  junit.framework.TestSuite.org.apache.solr.handler.TestReplicationHandler

Error Message:
ERROR: SolrIndexSearcher opens=74 closes=73

Stack Trace:
java.lang.AssertionError: ERROR: SolrIndexSearcher opens=74 closes=73
	at __randomizedtesting.SeedInfo.seed([4F3C223F3B4EE30E]:0)
	at org.junit.Assert.fail(Assert.java:93)
	at org.apache.solr.SolrTestCaseJ4.endTrackingSearchers(SolrTestCaseJ4.java:217)
	at org.apache.solr.SolrTestCaseJ4.afterClass(SolrTestCaseJ4.java:82)
	at sun.reflect.GeneratedMethodAccessor14.invoke(Unknown Source)
	at sun.reflect.DelegatingMethodAccessorImpl.invoke(DelegatingMethodAccessorImpl.java:43)
	at java.lang.reflect.Method.invoke(Method.java:601)
	at com.carrotsearch.randomizedtesting.RandomizedRunner.invoke(RandomizedRunner.java:1995)
	at com.carrotsearch.randomizedtesting.RandomizedRunner.access$1100(RandomizedRunner.java:132)
	at com.carrotsearch.randomizedtesting.RandomizedRunner$5.evaluate(RandomizedRunner.java:754)
	at com.carrotsearch.randomizedtesting.rules.SystemPropertiesRestoreRule$1.evaluate(SystemPropertiesRestoreRule.java:53)
	at org.apache.lucene.util.AbstractBeforeAfterRule$1.evaluate(AbstractBeforeAfterRule.java:45)
	at org.apache.lucene.util.TestRuleReportUncaughtExceptions$1.evaluate(TestRuleReportUncaughtExceptions.java:68)
	at org.apache.lucene.util.TestRuleStoreClassName$1.evaluate(TestRuleStoreClassName.java:38)
	at org.apache.lucene.util.TestRuleIcuHack$1.evaluate(TestRuleIcuHack.java:51)
	at com.carrotsearch.randomizedtesting.rules.SystemPropertiesInvariantRule$1.evaluate(SystemPropertiesInvariantRule.java:55)
	at org.apache.lucene.util.TestRuleNoInstanceHooksOverrides$1.evaluate(TestRuleNoInstanceHooksOverrides.java:53)
	at org.apache.lucene.util.TestRuleNoStaticHooksShadowing$1.evaluate(TestRuleNoStaticHooksShadowing.java:52)
	at org.apache.lucene.util.TestRuleAssertionsRequired$1.evaluate(TestRuleAssertionsRequired.java:36)
	at org.apache.lucene.util.TestRuleMarkFailure$1.evaluate(TestRuleMarkFailure.java:48)
	at org.apache.lucene.util.TestRuleIgnoreAfterMaxFailures$1.evaluate(TestRuleIgnoreAfterMaxFailures.java:70)
	at org.apache.lucene.util.TestRuleIgnoreTestSuites$1.evaluate(TestRuleIgnoreTestSuites.java:55)
	at com.carrotsearch.randomizedtesting.RandomizedRunner.runSuite(RandomizedRunner.java:605)
	at com.carrotsearch.randomizedtesting.RandomizedRunner.access$400(RandomizedRunner.java:132)
	at com.carrotsearch.randomizedtesting.RandomizedRunner$2.run(RandomizedRunner.java:551)




Build Log:
[...truncated 10680 lines...]
[junit4:junit4] Suite: org.apache.solr.handler.TestReplicationHandler
[junit4:junit4]    > (@BeforeClass output)
[junit4:junit4]   2> 5 T794 oejs.Server.doStart jetty-8.1.2.v20120308
[junit4:junit4]   2> 9 T794 oejs.AbstractConnector.doStart Started SocketConnector@0.0.0.0:60286
[junit4:junit4]   2> 10 T794 oasc.SolrResourceLoader.locateSolrHome JNDI not configured
for solr (NoInitialContextEx)
[junit4:junit4]   2> 10 T794 oasc.SolrResourceLoader.locateSolrHome using system property
solr.solr.home: .\org.apache.solr.handler.TestReplicationHandler$SolrInstance-1341903492549\master
[junit4:junit4]   2> 10 T794 oasc.SolrResourceLoader.<init> new SolrResourceLoader
for deduced Solr Home: '.\org.apache.solr.handler.TestReplicationHandler$SolrInstance-1341903492549\master\'
[junit4:junit4]   2> 15 T794 oass.SolrDispatchFilter.init SolrDispatchFilter.init()
[junit4:junit4]   2> 15 T794 oasc.SolrResourceLoader.locateSolrHome JNDI not configured
for solr (NoInitialContextEx)
[junit4:junit4]   2> 16 T794 oasc.SolrResourceLoader.locateSolrHome using system property
solr.solr.home: .\org.apache.solr.handler.TestReplicationHandler$SolrInstance-1341903492549\master
[junit4:junit4]   2> 16 T794 oasc.CoreContainer$Initializer.initialize looking for solr.xml:
C:\Jenkins\workspace\Lucene-Solr-trunk-Windows-Java7-64\solr\build\solr-core\test\J0\.\org.apache.solr.handler.TestReplicationHandler$SolrInstance-1341903492549\master\solr.xml
[junit4:junit4]   2> 16 T794 oasc.CoreContainer.<init> New CoreContainer 465429407
[junit4:junit4]   2> 16 T794 oasc.CoreContainer$Initializer.initialize no solr.xml file
found - using default
[junit4:junit4]   2> 17 T794 oasc.CoreContainer.load Loading CoreContainer using Solr Home:
'.\org.apache.solr.handler.TestReplicationHandler$SolrInstance-1341903492549\master\'
[junit4:junit4]   2> 17 T794 oasc.SolrResourceLoader.<init> new SolrResourceLoader
for directory: '.\org.apache.solr.handler.TestReplicationHandler$SolrInstance-1341903492549\master\'
[junit4:junit4]   2> 27 T794 oasc.CoreContainer.load Registering Log Listener
[junit4:junit4]   2> 41 T794 oashc.HttpShardHandlerFactory.getParameter Setting socketTimeout
to: 0
[junit4:junit4]   2> 41 T794 oashc.HttpShardHandlerFactory.getParameter Setting urlScheme
to: http://
[junit4:junit4]   2> 42 T794 oashc.HttpShardHandlerFactory.getParameter Setting connTimeout
to: 0
[junit4:junit4]   2> 42 T794 oashc.HttpShardHandlerFactory.getParameter Setting maxConnectionsPerHost
to: 20
[junit4:junit4]   2> 42 T794 oashc.HttpShardHandlerFactory.getParameter Setting corePoolSize
to: 0
[junit4:junit4]   2> 42 T794 oashc.HttpShardHandlerFactory.getParameter Setting maximumPoolSize
to: 2147483647
[junit4:junit4]   2> 42 T794 oashc.HttpShardHandlerFactory.getParameter Setting maxThreadIdleTime
to: 5
[junit4:junit4]   2> 43 T794 oashc.HttpShardHandlerFactory.getParameter Setting sizeOfQueue
to: -1
[junit4:junit4]   2> 43 T794 oashc.HttpShardHandlerFactory.getParameter Setting fairnessPolicy
to: false
[junit4:junit4]   2> 43 T794 oascsi.HttpClientUtil.createClient Creating new http client,
config:maxConnectionsPerHost=20&maxConnections=10000&socketTimeout=0&connTimeout=0&retry=false
[junit4:junit4]   2> 55 T794 oasc.CoreContainer.create Creating SolrCore 'collection1'
using instanceDir: .\org.apache.solr.handler.TestReplicationHandler$SolrInstance-1341903492549\master\collection1
[junit4:junit4]   2> 55 T794 oasc.SolrResourceLoader.<init> new SolrResourceLoader
for directory: '.\org.apache.solr.handler.TestReplicationHandler$SolrInstance-1341903492549\master\collection1\'
[junit4:junit4]   2> 85 T794 oasc.SolrConfig.<init> Using Lucene MatchVersion: LUCENE_50
[junit4:junit4]   2> 154 T794 oasc.SolrConfig.<init> Loaded SolrConfig: solrconfig.xml
[junit4:junit4]   2> 154 T794 oass.IndexSchema.readSchema Reading Solr Schema
[junit4:junit4]   2> 156 T794 oass.IndexSchema.readSchema Schema name=test
[junit4:junit4]   2> 188 T794 oass.IndexSchema.readSchema unique key field: id
[junit4:junit4]   2> 191 T794 oasc.SolrCore.<init> [collection1] Opening new SolrCore
at .\org.apache.solr.handler.TestReplicationHandler$SolrInstance-1341903492549\master\collection1\,
dataDir=.\org.apache.solr.handler.TestReplicationHandler$SolrInstance-1341903492549\master\collection1\data\
[junit4:junit4]   2> 191 T794 oasc.SolrCore.<init> JMX monitoring not detected for
core: collection1
[junit4:junit4]   2> 191 T794 oasc.SolrCore.getNewIndexDir WARNING New index directory
detected: old=null new=.\org.apache.solr.handler.TestReplicationHandler$SolrInstance-1341903492549\master\collection1\data\index/
[junit4:junit4]   2> 192 T794 oasc.SolrCore.initIndex WARNING [collection1] Solr index
directory '.\org.apache.solr.handler.TestReplicationHandler$SolrInstance-1341903492549\master\collection1\data\index'
doesn't exist. Creating new index...
[junit4:junit4]   2> 202 T794 oasc.SolrDeletionPolicy.onCommit SolrDeletionPolicy.onCommit:
commits:num=1
[junit4:junit4]   2> 		commit{dir=NRTCachingDirectory(org.apache.lucene.store.MMapDirectory@C:\Jenkins\workspace\Lucene-Solr-trunk-Windows-Java7-64\solr\build\solr-core\test\J0\org.apache.solr.handler.TestReplicationHandler$SolrInstance-1341903492549\master\collection1\data\index
lockFactory=org.apache.lucene.store.SingleInstanceLockFactory@2c420d48; maxCacheMB=48.0 maxMergeSizeMB=4.0),segFN=segments_1,generation=1,filenames=[segments_1]
[junit4:junit4]   2> 203 T794 oasc.SolrDeletionPolicy.updateCommits newest commit = 1
[junit4:junit4]   2> 203 T794 oasc.RequestHandlers.initHandlersFromConfig created standard:
solr.StandardRequestHandler
[junit4:junit4]   2> 204 T794 oasc.RequestHandlers.initHandlersFromConfig created /replication:
solr.ReplicationHandler
[junit4:junit4]   2> 204 T794 oasc.RequestHandlers.initHandlersFromConfig created defaults:
solr.StandardRequestHandler
[junit4:junit4]   2> 204 T794 oasc.RequestHandlers.initHandlersFromConfig adding lazy requestHandler:
solr.StandardRequestHandler
[junit4:junit4]   2> 204 T794 oasc.RequestHandlers.initHandlersFromConfig created lazy:
solr.StandardRequestHandler
[junit4:junit4]   2> 204 T794 oasc.RequestHandlers.initHandlersFromConfig created /update:
solr.UpdateRequestHandler
[junit4:junit4]   2> 205 T794 oashl.XMLLoader.init xsltCacheLifetimeSeconds=60
[junit4:junit4]   2> 209 T794 oass.SolrIndexSearcher.<init> Opening Searcher@42e84c9a
main
[junit4:junit4]   2> 210 T794 oasu.CommitTracker.<init> Hard AutoCommit: disabled
[junit4:junit4]   2> 210 T794 oasu.CommitTracker.<init> Soft AutoCommit: disabled
[junit4:junit4]   2> 211 T794 oash.ReplicationHandler.inform Replication enabled for following
config files: schema.xml
[junit4:junit4]   2> 211 T794 oash.ReplicationHandler.inform Commits will be reserved for
 10000
[junit4:junit4]   2> 211 T794 oasc.CoreContainer.register registering core: collection1
[junit4:junit4]   2> 211 T804 oasc.SolrCore.registerSearcher [collection1] Registered new
searcher Searcher@42e84c9a main{StandardDirectoryReader(segments_1:1)}
[junit4:junit4]   2> 211 T794 oass.SolrDispatchFilter.init user.dir=C:\Jenkins\workspace\Lucene-Solr-trunk-Windows-Java7-64\solr\build\solr-core\test\J0
[junit4:junit4]   2> 212 T794 oass.SolrDispatchFilter.init SolrDispatchFilter.init() done
[junit4:junit4]   2> 212 T794 oascsi.HttpClientUtil.createClient Creating new http client,
config:maxConnections=128&maxConnectionsPerHost=32&followRedirects=false
[junit4:junit4]   2> 220 T794 oejs.Server.doStart jetty-8.1.2.v20120308
[junit4:junit4]   2> 222 T794 oejs.AbstractConnector.doStart Started SocketConnector@0.0.0.0:60287
[junit4:junit4]   2> 225 T794 oasc.SolrResourceLoader.locateSolrHome JNDI not configured
for solr (NoInitialContextEx)
[junit4:junit4]   2> 225 T794 oasc.SolrResourceLoader.locateSolrHome using system property
solr.solr.home: .\org.apache.solr.handler.TestReplicationHandler$SolrInstance-1341903492765\slave
[junit4:junit4]   2> 225 T794 oasc.SolrResourceLoader.<init> new SolrResourceLoader
for deduced Solr Home: '.\org.apache.solr.handler.TestReplicationHandler$SolrInstance-1341903492765\slave\'
[junit4:junit4]   2> 230 T794 oass.SolrDispatchFilter.init SolrDispatchFilter.init()
[junit4:junit4]   2> 230 T794 oasc.SolrResourceLoader.locateSolrHome JNDI not configured
for solr (NoInitialContextEx)
[junit4:junit4]   2> 230 T794 oasc.SolrResourceLoader.locateSolrHome using system property
solr.solr.home: .\org.apache.solr.handler.TestReplicationHandler$SolrInstance-1341903492765\slave
[junit4:junit4]   2> 230 T794 oasc.CoreContainer$Initializer.initialize looking for solr.xml:
C:\Jenkins\workspace\Lucene-Solr-trunk-Windows-Java7-64\solr\build\solr-core\test\J0\.\org.apache.solr.handler.TestReplicationHandler$SolrInstance-1341903492765\slave\solr.xml
[junit4:junit4]   2> 230 T794 oasc.CoreContainer.<init> New CoreContainer 1589617752
[junit4:junit4]   2> 230 T794 oasc.CoreContainer$Initializer.initialize no solr.xml file
found - using default
[junit4:junit4]   2> 231 T794 oasc.CoreContainer.load Loading CoreContainer using Solr
Home: '.\org.apache.solr.handler.TestReplicationHandler$SolrInstance-1341903492765\slave\'
[junit4:junit4]   2> 231 T794 oasc.SolrResourceLoader.<init> new SolrResourceLoader
for directory: '.\org.apache.solr.handler.TestReplicationHandler$SolrInstance-1341903492765\slave\'
[junit4:junit4]   2> 239 T794 oasc.CoreContainer.load Registering Log Listener
[junit4:junit4]   2> 251 T794 oashc.HttpShardHandlerFactory.getParameter Setting socketTimeout
to: 0
[junit4:junit4]   2> 251 T794 oashc.HttpShardHandlerFactory.getParameter Setting urlScheme
to: http://
[junit4:junit4]   2> 251 T794 oashc.HttpShardHandlerFactory.getParameter Setting connTimeout
to: 0
[junit4:junit4]   2> 251 T794 oashc.HttpShardHandlerFactory.getParameter Setting maxConnectionsPerHost
to: 20
[junit4:junit4]   2> 251 T794 oashc.HttpShardHandlerFactory.getParameter Setting corePoolSize
to: 0
[junit4:junit4]   2> 251 T794 oashc.HttpShardHandlerFactory.getParameter Setting maximumPoolSize
to: 2147483647
[junit4:junit4]   2> 252 T794 oashc.HttpShardHandlerFactory.getParameter Setting maxThreadIdleTime
to: 5
[junit4:junit4]   2> 252 T794 oashc.HttpShardHandlerFactory.getParameter Setting sizeOfQueue
to: -1
[junit4:junit4]   2> 252 T794 oashc.HttpShardHandlerFactory.getParameter Setting fairnessPolicy
to: false
[junit4:junit4]   2> 253 T794 oascsi.HttpClientUtil.createClient Creating new http client,
config:maxConnectionsPerHost=20&maxConnections=10000&socketTimeout=0&connTimeout=0&retry=false
[junit4:junit4]   2> 263 T794 oasc.CoreContainer.create Creating SolrCore 'collection1'
using instanceDir: .\org.apache.solr.handler.TestReplicationHandler$SolrInstance-1341903492765\slave\collection1
[junit4:junit4]   2> 263 T794 oasc.SolrResourceLoader.<init> new SolrResourceLoader
for directory: '.\org.apache.solr.handler.TestReplicationHandler$SolrInstance-1341903492765\slave\collection1\'
[junit4:junit4]   2> 300 T794 oasc.SolrConfig.<init> Using Lucene MatchVersion: LUCENE_50
[junit4:junit4]   2> 367 T794 oasc.SolrConfig.<init> Loaded SolrConfig: solrconfig.xml
[junit4:junit4]   2> 368 T794 oass.IndexSchema.readSchema Reading Solr Schema
[junit4:junit4]   2> 372 T794 oass.IndexSchema.readSchema Schema name=test
[junit4:junit4]   2> 390 T794 oass.IndexSchema.readSchema unique key field: id
[junit4:junit4]   2> 392 T794 oasc.SolrCore.<init> [collection1] Opening new SolrCore
at .\org.apache.solr.handler.TestReplicationHandler$SolrInstance-1341903492765\slave\collection1\,
dataDir=.\org.apache.solr.handler.TestReplicationHandler$SolrInstance-1341903492765\slave\collection1\data\
[junit4:junit4]   2> 392 T794 oasc.SolrCore.<init> JMX monitoring not detected for
core: collection1
[junit4:junit4]   2> 392 T794 oasc.SolrCore.getNewIndexDir WARNING New index directory
detected: old=null new=.\org.apache.solr.handler.TestReplicationHandler$SolrInstance-1341903492765\slave\collection1\data\index/
[junit4:junit4]   2> 393 T794 oasc.SolrCore.initIndex WARNING [collection1] Solr index
directory '.\org.apache.solr.handler.TestReplicationHandler$SolrInstance-1341903492765\slave\collection1\data\index'
doesn't exist. Creating new index...
[junit4:junit4]   2> 399 T794 oasc.SolrDeletionPolicy.onCommit SolrDeletionPolicy.onCommit:
commits:num=1
[junit4:junit4]   2> 		commit{dir=NRTCachingDirectory(org.apache.lucene.store.MMapDirectory@C:\Jenkins\workspace\Lucene-Solr-trunk-Windows-Java7-64\solr\build\solr-core\test\J0\org.apache.solr.handler.TestReplicationHandler$SolrInstance-1341903492765\slave\collection1\data\index
lockFactory=org.apache.lucene.store.SingleInstanceLockFactory@6ad49a64; maxCacheMB=48.0 maxMergeSizeMB=4.0),segFN=segments_1,generation=1,filenames=[segments_1]
[junit4:junit4]   2> 399 T794 oasc.SolrDeletionPolicy.updateCommits newest commit = 1
[junit4:junit4]   2> 402 T794 oasc.RequestHandlers.initHandlersFromConfig created standard:
solr.StandardRequestHandler
[junit4:junit4]   2> 402 T794 oasc.RequestHandlers.initHandlersFromConfig created defaults:
solr.StandardRequestHandler
[junit4:junit4]   2> 402 T794 oasc.RequestHandlers.initHandlersFromConfig adding lazy requestHandler:
solr.StandardRequestHandler
[junit4:junit4]   2> 402 T794 oasc.RequestHandlers.initHandlersFromConfig created lazy:
solr.StandardRequestHandler
[junit4:junit4]   2> 402 T794 oasc.RequestHandlers.initHandlersFromConfig created /update:
solr.UpdateRequestHandler
[junit4:junit4]   2> 403 T794 oasc.RequestHandlers.initHandlersFromConfig created /replication:
solr.ReplicationHandler
[junit4:junit4]   2> 403 T794 oashl.XMLLoader.init xsltCacheLifetimeSeconds=60
[junit4:junit4]   2> 406 T794 oass.SolrIndexSearcher.<init> Opening Searcher@14b40320
main
[junit4:junit4]   2> 406 T794 oasu.CommitTracker.<init> Hard AutoCommit: disabled
[junit4:junit4]   2> 407 T794 oasu.CommitTracker.<init> Soft AutoCommit: disabled
[junit4:junit4]   2> 407 T794 oascsi.HttpClientUtil.createClient Creating new http client,
config:connTimeout=5000&socketTimeout=20000&allowCompression=false&maxConnections=10000&maxConnectionsPerHost=10000
[junit4:junit4]   2> 418 T794 oash.SnapPuller.startExecutorService Poll Scheduled at an
interval of 1000ms
[junit4:junit4]   2> 418 T794 oasc.CoreContainer.register registering core: collection1
[junit4:junit4]   2> 418 T794 oass.SolrDispatchFilter.init user.dir=C:\Jenkins\workspace\Lucene-Solr-trunk-Windows-Java7-64\solr\build\solr-core\test\J0
[junit4:junit4]   2> 418 T794 oass.SolrDispatchFilter.init SolrDispatchFilter.init() done
[junit4:junit4]   2> 418 T794 oascsi.HttpClientUtil.createClient Creating new http client,
config:maxConnections=128&maxConnectionsPerHost=32&followRedirects=false
[junit4:junit4]   2> 419 T814 oasc.SolrCore.registerSearcher [collection1] Registered new
searcher Searcher@14b40320 main{StandardDirectoryReader(segments_1:1)}
[junit4:junit4]   2> 
[junit4:junit4]    > (@AfterClass output)
[junit4:junit4]   2> 37244 T794 oasc.CoreContainer.shutdown Shutting down CoreContainer
instance=1371218801
[junit4:junit4]   2> 37244 T794 oasc.SolrCore.close [collection1]  CLOSING SolrCore org.apache.solr.core.SolrCore@17e960b5
[junit4:junit4]   2> 37245 T794 oasc.SolrCore.closeSearcher [collection1] Closing main
searcher on request.
[junit4:junit4]   2> 37246 T794 oasu.DirectUpdateHandler2.close closing DirectUpdateHandler2{commits=1,autocommits=0,soft
autocommits=0,optimizes=0,rollbacks=0,expungeDeletes=0,docsPending=0,adds=0,deletesById=0,deletesByQuery=0,errors=0,cumulative_adds=493,cumulative_deletesById=0,cumulative_deletesByQuery=1,cumulative_errors=0}
[junit4:junit4]   2> 37251 T794 oejsh.ContextHandler.doStop stopped o.e.j.s.ServletContextHandler{/solr,null}
[junit4:junit4]   2> 37305 T794 oasc.CoreContainer.shutdown Shutting down CoreContainer
instance=422087694
[junit4:junit4]   2> 37306 T794 oasc.SolrCore.close [collection1]  CLOSING SolrCore org.apache.solr.core.SolrCore@11a00755
[junit4:junit4]   2> 37307 T794 oasc.SolrCore.closeSearcher [collection1] Closing main
searcher on request.
[junit4:junit4]   2> 37307 T794 oasu.DirectUpdateHandler2.close closing DirectUpdateHandler2{commits=2,autocommits=0,soft
autocommits=0,optimizes=0,rollbacks=0,expungeDeletes=0,docsPending=0,adds=0,deletesById=0,deletesByQuery=0,errors=0,cumulative_adds=1,cumulative_deletesById=0,cumulative_deletesByQuery=0,cumulative_errors=0}
[junit4:junit4]   2> 37311 T794 oejsh.ContextHandler.doStop stopped o.e.j.s.ServletContextHandler{/solr,null}
[junit4:junit4]   2> !!!! WARNING: best effort to remove C:\Jenkins\workspace\Lucene-Solr-trunk-Windows-Java7-64\solr\build\solr-core\test\J0\.\org.apache.solr.handler.TestReplicationHandler$SolrInstance-1341903492765\slave\collection1\data\index.20120710045835011\_7_nrm.cfs
FAILED !!!!!
[junit4:junit4]   2> !!!! WARNING: best effort to remove C:\Jenkins\workspace\Lucene-Solr-trunk-Windows-Java7-64\solr\build\solr-core\test\J0\.\org.apache.solr.handler.TestReplicationHandler$SolrInstance-1341903492765\slave\collection1\data\index.20120710045835011
FAILED !!!!!
[junit4:junit4]   2> !!!! WARNING: best effort to remove C:\Jenkins\workspace\Lucene-Solr-trunk-Windows-Java7-64\solr\build\solr-core\test\J0\.\org.apache.solr.handler.TestReplicationHandler$SolrInstance-1341903492765\slave\collection1\data
FAILED !!!!!
[junit4:junit4]   2> !!!! WARNING: best effort to remove C:\Jenkins\workspace\Lucene-Solr-trunk-Windows-Java7-64\solr\build\solr-core\test\J0\.\org.apache.solr.handler.TestReplicationHandler$SolrInstance-1341903492765\slave\collection1
FAILED !!!!!
[junit4:junit4]   2> 37402 T794 oas.SolrTestCaseJ4.deleteCore ###deleteCore
[junit4:junit4]   2> 38380 T997 oash.SnapPuller.fetchLatestIndex SEVERE Master at: http://localhost:60327/solr
is not available. Index fetch failed. Exception: org.apache.solr.client.solrj.SolrServerException:
Server refused connection at: http://localhost:60327/solr
[junit4:junit4]   2> 161015 T794 oas.SolrTestCaseJ4.endTrackingSearchers SEVERE ERROR:
SolrIndexSearcher opens=74 closes=73
[junit4:junit4]   2> NOTE: test params are: codec=Lucene40: {newname=PostingsFormat(name=Lucene40WithOrds),
id=PostingsFormat(name=Lucene40WithOrds), name=PostingsFormat(name=Lucene40WithOrds)}, sim=DefaultSimilarity,
locale=hu_HU, timezone=America/Noronha
[junit4:junit4]   2> NOTE: Windows 7 6.1 amd64/Oracle Corporation 1.7.0_04 (64-bit)/cpus=2,threads=1,free=28262352,total=242810880
[junit4:junit4]   2> NOTE: All tests run in this JVM: [TestStressLucene, TestOmitPositions,
DefaultValueUpdateProcessorTest, TestStressReorder, CSVRequestHandlerTest, ShowFileRequestHandlerTest,
SpellCheckCollatorTest, TestJapaneseTokenizerFactory, BinaryUpdateRequestHandlerTest, XmlUpdateRequestHandlerTest,
TestHyphenationCompoundWordTokenFilterFactory, TestPatternReplaceCharFilterFactory, JSONWriterTest,
TestLFUCache, MoreLikeThisHandlerTest, TestSynonymFilterFactory, MultiTermTest, LukeRequestHandlerTest,
TestUAX29URLEmailTokenizerFactory, AnalysisAfterCoreReloadTest, TestFrenchMinimalStemFilterFactory,
AlternateDirectoryTest, TestWikipediaTokenizerFactory, CloudStateTest, TestSuggestSpellingConverter,
TestStopFilterFactory, TestQuerySenderNoQuery, TestArabicFilters, ZkNodePropsTest, NumericFieldsTest,
TestSolrXMLSerializer, TestGermanNormalizationFilterFactory, TestSolrQueryParser, TestFinnishLightStemFilterFactory,
TestBadConfig, TestExtendedDismaxParser, TermVectorComponentTest, TestSwedishLightStemFilterFactory,
TestStressVersions, TestEnglishMinimalStemFilterFactory, TestDocSet, TestTrimFilterFactory,
DistributedSpellCheckComponentTest, TestIrishLowerCaseFilterFactory, TestPersianNormalizationFilterFactory,
TestWriterPerf, StandardRequestHandlerTest, TestJapaneseBaseFormFilterFactory, DebugComponentTest,
NoCacheHeaderTest, TestPhraseSuggestions, TestHTMLStripCharFilterFactory, BadComponentTest,
TestMergePolicyConfig, TestSolrJ, PolyFieldTest, AutoCommitTest, SpatialFilterTest, SpellCheckComponentTest,
TestSolrDeletionPolicy1, TestCSVLoader, DoubleMetaphoneFilterFactoryTest, EchoParamsTest,
SolrCmdDistributorTest, UniqFieldsUpdateProcessorFactoryTest, TestGermanMinimalStemFilterFactory,
OverseerTest, IndexSchemaTest, TestReplicationHandler]
[junit4:junit4]   2> NOTE: reproduce with: ant test  -Dtestcase=TestReplicationHandler
-Dtests.seed=4F3C223F3B4EE30E -Dtests.slow=true -Dtests.locale=hu_HU -Dtests.timezone=America/Noronha
-Dtests.file.encoding=US-ASCII
[junit4:junit4]   2> 
[junit4:junit4] ERROR   0.00s | TestReplicationHandler (suite)
[junit4:junit4]    > Throwable #1: java.lang.AssertionError: ERROR: SolrIndexSearcher opens=74
closes=73
[junit4:junit4]    > 	at __randomizedtesting.SeedInfo.seed([4F3C223F3B4EE30E]:0)
[junit4:junit4]    > 	at org.junit.Assert.fail(Assert.java:93)
[junit4:junit4]    > 	at org.apache.solr.SolrTestCaseJ4.endTrackingSearchers(SolrTestCaseJ4.java:217)
[junit4:junit4]    > 	at org.apache.solr.SolrTestCaseJ4.afterClass(SolrTestCaseJ4.java:82)
[junit4:junit4]    > 	at sun.reflect.GeneratedMethodAccessor14.invoke(Unknown Source)
[junit4:junit4]    > 	at sun.reflect.DelegatingMethodAccessorImpl.invoke(DelegatingMethodAccessorImpl.java:43)
[junit4:junit4]    > 	at java.lang.reflect.Method.invoke(Method.java:601)
[junit4:junit4]    > 	at com.carrotsearch.randomizedtesting.RandomizedRunner.invoke(RandomizedRunner.java:1995)
[junit4:junit4]    > 	at com.carrotsearch.randomizedtesting.RandomizedRunner.access$1100(RandomizedRunner.java:132)
[junit4:junit4]    > 	at com.carrotsearch.randomizedtesting.RandomizedRunner$5.evaluate(RandomizedRunner.java:754)
[junit4:junit4]    > 	at com.carrotsearch.randomizedtesting.rules.SystemPropertiesRestoreRule$1.evaluate(SystemPropertiesRestoreRule.java:53)
[junit4:junit4]    > 	at org.apache.lucene.util.AbstractBeforeAfterRule$1.evaluate(AbstractBeforeAfterRule.java:45)
[junit4:junit4]    > 	at org.apache.lucene.util.TestRuleReportUncaughtExceptions$1.evaluate(TestRuleReportUncaughtExceptions.java:68)
[junit4:junit4]    > 	at org.apache.lucene.util.TestRuleStoreClassName$1.evaluate(TestRuleStoreClassName.java:38)
[junit4:junit4]    > 	at org.apache.lucene.util.TestRuleIcuHack$1.evaluate(TestRuleIcuHack.java:51)
[junit4:junit4]    > 	at com.carrotsearch.randomizedtesting.rules.SystemPropertiesInvariantRule$1.evaluate(SystemPropertiesInvariantRule.java:55)
[junit4:junit4]    > 	at org.apache.lucene.util.TestRuleNoInstanceHooksOverrides$1.evaluate(TestRuleNoInstanceHooksOverrides.java:53)
[junit4:junit4]    > 	at org.apache.lucene.util.TestRuleNoStaticHooksShadowing$1.evaluate(TestRuleNoStaticHooksShadowing.java:52)
[junit4:junit4]    > 	at org.apache.lucene.util.TestRuleAssertionsRequired$1.evaluate(TestRuleAssertionsRequired.java:36)
[junit4:junit4]    > 	at org.apache.lucene.util.TestRuleMarkFailure$1.evaluate(TestRuleMarkFailure.java:48)
[junit4:junit4]    > 	at org.apache.lucene.util.TestRuleIgnoreAfterMaxFailures$1.evaluate(TestRuleIgnoreAfterMaxFailures.java:70)
[junit4:junit4]    > 	at org.apache.lucene.util.TestRuleIgnoreTestSuites$1.evaluate(TestRuleIgnoreTestSuites.java:55)
[junit4:junit4]    > 	at com.carrotsearch.randomizedtesting.RandomizedRunner.runSuite(RandomizedRunner.java:605)
[junit4:junit4]    > 	at com.carrotsearch.randomizedtesting.RandomizedRunner.access$400(RandomizedRunner.java:132)
[junit4:junit4]    > 	at com.carrotsearch.randomizedtesting.RandomizedRunner$2.run(RandomizedRunner.java:551)
[junit4:junit4]    >
[junit4:junit4] Completed in 161.05s, 1 test, 1 failure <<< FAILURES!

[...truncated 925 lines...]
BUILD FAILED
C:\Jenkins\workspace\Lucene-Solr-trunk-Windows-Java7-64\build.xml:29: The following error
occurred while executing this line:
C:\Jenkins\workspace\Lucene-Solr-trunk-Windows-Java7-64\solr\build.xml:144: The following
error occurred while executing this line:
C:\Jenkins\workspace\Lucene-Solr-trunk-Windows-Java7-64\lucene\module-build.xml:62: The following
error occurred while executing this line:
C:\Jenkins\workspace\Lucene-Solr-trunk-Windows-Java7-64\lucene\common-build.xml:1096: The
following error occurred while executing this line:
C:\Jenkins\workspace\Lucene-Solr-trunk-Windows-Java7-64\lucene\common-build.xml:793: There
were test failures: 290 suites, 1027 tests, 1 suite-level error, 10 ignored (5 assumptions)

Total time: 36 minutes 33 seconds
Build step 'Invoke Ant' marked build as failure
Recording test results
Email was triggered for: Failure
Sending email for trigger: Failure




Mime
View raw message