lucene-dev mailing list archives

Site index · List index
Message view « Date » · « Thread »
Top « Date » · « Thread »
From Policeman Jenkins Server <jenk...@sd-datasolutions.de>
Subject [JENKINS] Lucene-Solr-trunk-Linux-Java8-64 - Build # 15 - Failure!
Date Fri, 13 Jul 2012 20:54:27 GMT
Build: http://jenkins.sd-datasolutions.de/job/Lucene-Solr-trunk-Linux-Java8-64/15/

1 tests failed.
REGRESSION:  org.apache.solr.handler.component.DistributedQueryElevationComponentTest.testDistribSearch

Error Message:
Index: 18, Size: 18

Stack Trace:
java.lang.IndexOutOfBoundsException: Index: 18, Size: 18
	at __randomizedtesting.SeedInfo.seed([5629B043F56D9EA8:D7CF3E5B8232FE94]:0)
	at java.util.ArrayList.rangeCheck(ArrayList.java:603)
	at java.util.ArrayList.get(ArrayList.java:381)
	at org.apache.solr.common.util.NamedList.getName(NamedList.java:127)
	at org.apache.solr.BaseDistributedSearchTestCase.compare(BaseDistributedSearchTestCase.java:466)
	at org.apache.solr.BaseDistributedSearchTestCase.compare(BaseDistributedSearchTestCase.java:612)
	at org.apache.solr.BaseDistributedSearchTestCase.compare(BaseDistributedSearchTestCase.java:500)
	at org.apache.solr.BaseDistributedSearchTestCase.compare(BaseDistributedSearchTestCase.java:612)
	at org.apache.solr.BaseDistributedSearchTestCase.compare(BaseDistributedSearchTestCase.java:500)
	at org.apache.solr.BaseDistributedSearchTestCase.compareResponses(BaseDistributedSearchTestCase.java:667)
	at org.apache.solr.BaseDistributedSearchTestCase.query(BaseDistributedSearchTestCase.java:392)
	at org.apache.solr.handler.component.DistributedQueryElevationComponentTest.doTest(DistributedQueryElevationComponentTest.java:81)
	at org.apache.solr.BaseDistributedSearchTestCase.testDistribSearch(BaseDistributedSearchTestCase.java:679)
	at sun.reflect.NativeMethodAccessorImpl.invoke0(Native Method)
	at sun.reflect.NativeMethodAccessorImpl.invoke(NativeMethodAccessorImpl.java:57)
	at sun.reflect.DelegatingMethodAccessorImpl.invoke(DelegatingMethodAccessorImpl.java:43)
	at java.lang.reflect.Method.invoke(Method.java:474)
	at com.carrotsearch.randomizedtesting.RandomizedRunner.invoke(RandomizedRunner.java:1995)
	at com.carrotsearch.randomizedtesting.RandomizedRunner.access$1100(RandomizedRunner.java:132)
	at com.carrotsearch.randomizedtesting.RandomizedRunner$6.evaluate(RandomizedRunner.java:818)
	at com.carrotsearch.randomizedtesting.RandomizedRunner$7.evaluate(RandomizedRunner.java:877)
	at com.carrotsearch.randomizedtesting.RandomizedRunner$8.evaluate(RandomizedRunner.java:891)
	at com.carrotsearch.randomizedtesting.rules.SystemPropertiesRestoreRule$1.evaluate(SystemPropertiesRestoreRule.java:53)
	at org.apache.lucene.util.TestRuleSetupTeardownChained$1.evaluate(TestRuleSetupTeardownChained.java:50)
	at org.apache.lucene.util.TestRuleFieldCacheSanity$1.evaluate(TestRuleFieldCacheSanity.java:32)
	at org.apache.lucene.util.AbstractBeforeAfterRule$1.evaluate(AbstractBeforeAfterRule.java:45)
	at com.carrotsearch.randomizedtesting.rules.SystemPropertiesInvariantRule$1.evaluate(SystemPropertiesInvariantRule.java:55)
	at org.apache.lucene.util.TestRuleReportUncaughtExceptions$1.evaluate(TestRuleReportUncaughtExceptions.java:68)
	at org.apache.lucene.util.TestRuleThreadAndTestName$1.evaluate(TestRuleThreadAndTestName.java:48)
	at org.apache.lucene.util.TestRuleIgnoreAfterMaxFailures$1.evaluate(TestRuleIgnoreAfterMaxFailures.java:70)
	at org.apache.lucene.util.TestRuleMarkFailure$1.evaluate(TestRuleMarkFailure.java:48)
	at com.carrotsearch.randomizedtesting.RandomizedRunner.runSingleTest(RandomizedRunner.java:825)
	at com.carrotsearch.randomizedtesting.RandomizedRunner.access$700(RandomizedRunner.java:132)
	at com.carrotsearch.randomizedtesting.RandomizedRunner$3$1.run(RandomizedRunner.java:671)
	at com.carrotsearch.randomizedtesting.RandomizedRunner$3.evaluate(RandomizedRunner.java:697)
	at com.carrotsearch.randomizedtesting.RandomizedRunner$4.evaluate(RandomizedRunner.java:736)
	at com.carrotsearch.randomizedtesting.RandomizedRunner$5.evaluate(RandomizedRunner.java:747)
	at com.carrotsearch.randomizedtesting.rules.SystemPropertiesRestoreRule$1.evaluate(SystemPropertiesRestoreRule.java:53)
	at org.apache.lucene.util.AbstractBeforeAfterRule$1.evaluate(AbstractBeforeAfterRule.java:45)
	at org.apache.lucene.util.TestRuleReportUncaughtExceptions$1.evaluate(TestRuleReportUncaughtExceptions.java:68)
	at org.apache.lucene.util.TestRuleStoreClassName$1.evaluate(TestRuleStoreClassName.java:38)
	at org.apache.lucene.util.TestRuleIcuHack$1.evaluate(TestRuleIcuHack.java:51)
	at com.carrotsearch.randomizedtesting.rules.SystemPropertiesInvariantRule$1.evaluate(SystemPropertiesInvariantRule.java:55)
	at org.apache.lucene.util.TestRuleNoInstanceHooksOverrides$1.evaluate(TestRuleNoInstanceHooksOverrides.java:53)
	at org.apache.lucene.util.TestRuleNoStaticHooksShadowing$1.evaluate(TestRuleNoStaticHooksShadowing.java:52)
	at org.apache.lucene.util.TestRuleAssertionsRequired$1.evaluate(TestRuleAssertionsRequired.java:36)
	at org.apache.lucene.util.TestRuleMarkFailure$1.evaluate(TestRuleMarkFailure.java:48)
	at org.apache.lucene.util.TestRuleIgnoreAfterMaxFailures$1.evaluate(TestRuleIgnoreAfterMaxFailures.java:70)
	at org.apache.lucene.util.TestRuleIgnoreTestSuites$1.evaluate(TestRuleIgnoreTestSuites.java:55)
	at com.carrotsearch.randomizedtesting.RandomizedRunner.runSuite(RandomizedRunner.java:605)
	at com.carrotsearch.randomizedtesting.RandomizedRunner.access$400(RandomizedRunner.java:132)
	at com.carrotsearch.randomizedtesting.RandomizedRunner$2.run(RandomizedRunner.java:551)




Build Log:
[...truncated 16979 lines...]
[junit4:junit4] Suite: org.apache.solr.handler.component.DistributedQueryElevationComponentTest
[junit4:junit4] ERROR   1.12s J0 | DistributedQueryElevationComponentTest.testDistribSearch
[junit4:junit4]    > Throwable #1: java.lang.IndexOutOfBoundsException: Index: 18, Size: 18
[junit4:junit4]    > 	at __randomizedtesting.SeedInfo.seed([5629B043F56D9EA8:D7CF3E5B8232FE94]:0)
[junit4:junit4]    > 	at java.util.ArrayList.rangeCheck(ArrayList.java:603)
[junit4:junit4]    > 	at java.util.ArrayList.get(ArrayList.java:381)
[junit4:junit4]    > 	at org.apache.solr.common.util.NamedList.getName(NamedList.java:127)
[junit4:junit4]    > 	at org.apache.solr.BaseDistributedSearchTestCase.compare(BaseDistributedSearchTestCase.java:466)
[junit4:junit4]    > 	at org.apache.solr.BaseDistributedSearchTestCase.compare(BaseDistributedSearchTestCase.java:612)
[junit4:junit4]    > 	at org.apache.solr.BaseDistributedSearchTestCase.compare(BaseDistributedSearchTestCase.java:500)
[junit4:junit4]    > 	at org.apache.solr.BaseDistributedSearchTestCase.compare(BaseDistributedSearchTestCase.java:612)
[junit4:junit4]    > 	at org.apache.solr.BaseDistributedSearchTestCase.compare(BaseDistributedSearchTestCase.java:500)
[junit4:junit4]    > 	at org.apache.solr.BaseDistributedSearchTestCase.compareResponses(BaseDistributedSearchTestCase.java:667)
[junit4:junit4]    > 	at org.apache.solr.BaseDistributedSearchTestCase.query(BaseDistributedSearchTestCase.java:392)
[junit4:junit4]    > 	at org.apache.solr.handler.component.DistributedQueryElevationComponentTest.doTest(DistributedQueryElevationComponentTest.java:81)
[junit4:junit4]    > 	at org.apache.solr.BaseDistributedSearchTestCase.testDistribSearch(BaseDistributedSearchTestCase.java:679)
[junit4:junit4]    > 	at sun.reflect.NativeMethodAccessorImpl.invoke0(Native Method)
[junit4:junit4]    > 	at sun.reflect.NativeMethodAccessorImpl.invoke(NativeMethodAccessorImpl.java:57)
[junit4:junit4]    > 	at sun.reflect.DelegatingMethodAccessorImpl.invoke(DelegatingMethodAccessorImpl.java:43)
[junit4:junit4]    > 	at java.lang.reflect.Method.invoke(Method.java:474)
[junit4:junit4]    > 	at com.carrotsearch.randomizedtesting.RandomizedRunner.invoke(RandomizedRunner.java:1995)
[junit4:junit4]    > 	at com.carrotsearch.randomizedtesting.RandomizedRunner.access$1100(RandomizedRunner.java:132)
[junit4:junit4]    > 	at com.carrotsearch.randomizedtesting.RandomizedRunner$6.evaluate(RandomizedRunner.java:818)
[junit4:junit4]    > 	at com.carrotsearch.randomizedtesting.RandomizedRunner$7.evaluate(RandomizedRunner.java:877)
[junit4:junit4]    > 	at com.carrotsearch.randomizedtesting.RandomizedRunner$8.evaluate(RandomizedRunner.java:891)
[junit4:junit4]    > 	at com.carrotsearch.randomizedtesting.rules.SystemPropertiesRestoreRule$1.evaluate(SystemPropertiesRestoreRule.java:53)
[junit4:junit4]    > 	at org.apache.lucene.util.TestRuleSetupTeardownChained$1.evaluate(TestRuleSetupTeardownChained.java:50)
[junit4:junit4]    > 	at org.apache.lucene.util.TestRuleFieldCacheSanity$1.evaluate(TestRuleFieldCacheSanity.java:32)
[junit4:junit4]    > 	at org.apache.lucene.util.AbstractBeforeAfterRule$1.evaluate(AbstractBeforeAfterRule.java:45)
[junit4:junit4]    > 	at com.carrotsearch.randomizedtesting.rules.SystemPropertiesInvariantRule$1.evaluate(SystemPropertiesInvariantRule.java:55)
[junit4:junit4]    > 	at org.apache.lucene.util.TestRuleReportUncaughtExceptions$1.evaluate(TestRuleReportUncaughtExceptions.java:68)
[junit4:junit4]    > 	at org.apache.lucene.util.TestRuleThreadAndTestName$1.evaluate(TestRuleThreadAndTestName.java:48)
[junit4:junit4]    > 	at org.apache.lucene.util.TestRuleIgnoreAfterMaxFailures$1.evaluate(TestRuleIgnoreAfterMaxFailures.java:70)
[junit4:junit4]    > 	at org.apache.lucene.util.TestRuleMarkFailure$1.evaluate(TestRuleMarkFailure.java:48)
[junit4:junit4]    > 	at com.carrotsearch.randomizedtesting.RandomizedRunner.runSingleTest(RandomizedRunner.java:825)
[junit4:junit4]    > 	at com.carrotsearch.randomizedtesting.RandomizedRunner.access$700(RandomizedRunner.java:132)
[junit4:junit4]    > 	at com.carrotsearch.randomizedtesting.RandomizedRunner$3$1.run(RandomizedRunner.java:671)
[junit4:junit4]    > 	at com.carrotsearch.randomizedtesting.RandomizedRunner$3.evaluate(RandomizedRunner.java:697)
[junit4:junit4]    > 	at com.carrotsearch.randomizedtesting.RandomizedRunner$4.evaluate(RandomizedRunner.java:736)
[junit4:junit4]    > 	at com.carrotsearch.randomizedtesting.RandomizedRunner$5.evaluate(RandomizedRunner.java:747)
[junit4:junit4]    > 	at com.carrotsearch.randomizedtesting.rules.SystemPropertiesRestoreRule$1.evaluate(SystemPropertiesRestoreRule.java:53)
[junit4:junit4]    > 	at org.apache.lucene.util.AbstractBeforeAfterRule$1.evaluate(AbstractBeforeAfterRule.java:45)
[junit4:junit4]    > 	at org.apache.lucene.util.TestRuleReportUncaughtExceptions$1.evaluate(TestRuleReportUncaughtExceptions.java:68)
[junit4:junit4]    > 	at org.apache.lucene.util.TestRuleStoreClassName$1.evaluate(TestRuleStoreClassName.java:38)
[junit4:junit4]    > 	at org.apache.lucene.util.TestRuleIcuHack$1.evaluate(TestRuleIcuHack.java:51)
[junit4:junit4]    > 	at com.carrotsearch.randomizedtesting.rules.SystemPropertiesInvariantRule$1.evaluate(SystemPropertiesInvariantRule.java:55)
[junit4:junit4]    > 	at org.apache.lucene.util.TestRuleNoInstanceHooksOverrides$1.evaluate(TestRuleNoInstanceHooksOverrides.java:53)
[junit4:junit4]    > 	at org.apache.lucene.util.TestRuleNoStaticHooksShadowing$1.evaluate(TestRuleNoStaticHooksShadowing.java:52)
[junit4:junit4]    > 	at org.apache.lucene.util.TestRuleAssertionsRequired$1.evaluate(TestRuleAssertionsRequired.java:36)
[junit4:junit4]    > 	at org.apache.lucene.util.TestRuleMarkFailure$1.evaluate(TestRuleMarkFailure.java:48)
[junit4:junit4]    > 	at org.apache.lucene.util.TestRuleIgnoreAfterMaxFailures$1.evaluate(TestRuleIgnoreAfterMaxFailures.java:70)
[junit4:junit4]    > 	at org.apache.lucene.util.TestRuleIgnoreTestSuites$1.evaluate(TestRuleIgnoreTestSuites.java:55)
[junit4:junit4]    > 	at com.carrotsearch.randomizedtesting.RandomizedRunner.runSuite(RandomizedRunner.java:605)
[junit4:junit4]    > 	at com.carrotsearch.randomizedtesting.RandomizedRunner.access$400(RandomizedRunner.java:132)
[junit4:junit4]    > 	at com.carrotsearch.randomizedtesting.RandomizedRunner$2.run(RandomizedRunner.java:551)
[junit4:junit4]    > 
[junit4:junit4]   2> 1 T648 oas.SolrTestCaseJ4.setUp ###Starting testDistribSearch
[junit4:junit4]   2> 2 T648 oejs.Server.doStart jetty-8.1.2.v20120308
[junit4:junit4]   2> 5 T648 oejs.AbstractConnector.doStart Started SocketConnector@0.0.0.0:49633
[junit4:junit4]   2> 5 T648 oasc.SolrResourceLoader.locateSolrHome JNDI not configured for solr (NoInitialContextEx)
[junit4:junit4]   2> 5 T648 oasc.SolrResourceLoader.locateSolrHome using system property solr.solr.home: /mnt/ssd/jenkins/workspace/Lucene-Solr-trunk-Linux-Java8-64/checkout/solr/build/solr-core/test-files/solr
[junit4:junit4]   2> 6 T648 oasc.SolrResourceLoader.<init> new SolrResourceLoader for deduced Solr Home: '/mnt/ssd/jenkins/workspace/Lucene-Solr-trunk-Linux-Java8-64/checkout/solr/build/solr-core/test-files/solr/'
[junit4:junit4]   2> 11 T648 oass.SolrDispatchFilter.init SolrDispatchFilter.init()
[junit4:junit4]   2> 12 T648 oasc.SolrResourceLoader.locateSolrHome JNDI not configured for solr (NoInitialContextEx)
[junit4:junit4]   2> 12 T648 oasc.SolrResourceLoader.locateSolrHome using system property solr.solr.home: /mnt/ssd/jenkins/workspace/Lucene-Solr-trunk-Linux-Java8-64/checkout/solr/build/solr-core/test-files/solr
[junit4:junit4]   2> 12 T648 oasc.CoreContainer$Initializer.initialize looking for solr.xml: /mnt/ssd/jenkins/workspace/Lucene-Solr-trunk-Linux-Java8-64/checkout/solr/build/solr-core/test-files/solr/solr.xml
[junit4:junit4]   2> 13 T648 oasc.CoreContainer.<init> New CoreContainer 1157268540
[junit4:junit4]   2> 13 T648 oasc.CoreContainer.load Loading CoreContainer using Solr Home: '/mnt/ssd/jenkins/workspace/Lucene-Solr-trunk-Linux-Java8-64/checkout/solr/build/solr-core/test-files/solr/'
[junit4:junit4]   2> 13 T648 oasc.SolrResourceLoader.<init> new SolrResourceLoader for directory: '/mnt/ssd/jenkins/workspace/Lucene-Solr-trunk-Linux-Java8-64/checkout/solr/build/solr-core/test-files/solr/'
[junit4:junit4]   2> 20 T648 oasc.CoreContainer.load Registering Log Listener
[junit4:junit4]   2> 29 T648 oashc.HttpShardHandlerFactory.getParameter Setting socketTimeout to: 0
[junit4:junit4]   2> 30 T648 oashc.HttpShardHandlerFactory.getParameter Setting urlScheme to: http://
[junit4:junit4]   2> 30 T648 oashc.HttpShardHandlerFactory.getParameter Setting connTimeout to: 0
[junit4:junit4]   2> 30 T648 oashc.HttpShardHandlerFactory.getParameter Setting maxConnectionsPerHost to: 20
[junit4:junit4]   2> 30 T648 oashc.HttpShardHandlerFactory.getParameter Setting corePoolSize to: 0
[junit4:junit4]   2> 31 T648 oashc.HttpShardHandlerFactory.getParameter Setting maximumPoolSize to: 2147483647
[junit4:junit4]   2> 31 T648 oashc.HttpShardHandlerFactory.getParameter Setting maxThreadIdleTime to: 5
[junit4:junit4]   2> 31 T648 oashc.HttpShardHandlerFactory.getParameter Setting sizeOfQueue to: -1
[junit4:junit4]   2> 31 T648 oashc.HttpShardHandlerFactory.getParameter Setting fairnessPolicy to: false
[junit4:junit4]   2> 32 T648 oascsi.HttpClientUtil.createClient Creating new http client, config:maxConnectionsPerHost=20&maxConnections=10000&socketTimeout=0&connTimeout=0&retry=false
[junit4:junit4]   2> 35 T648 oasc.CoreContainer.create Creating SolrCore 'collection1' using instanceDir: /mnt/ssd/jenkins/workspace/Lucene-Solr-trunk-Linux-Java8-64/checkout/solr/build/solr-core/test-files/solr/collection1
[junit4:junit4]   2> 36 T648 oasc.SolrResourceLoader.<init> new SolrResourceLoader for directory: '/mnt/ssd/jenkins/workspace/Lucene-Solr-trunk-Linux-Java8-64/checkout/solr/build/solr-core/test-files/solr/collection1/'
[junit4:junit4]   2> 36 T648 oasc.SolrResourceLoader.replaceClassLoader Adding 'file:/mnt/ssd/jenkins/workspace/Lucene-Solr-trunk-Linux-Java8-64/checkout/solr/build/solr-core/test-files/solr/collection1/lib/README' to classloader
[junit4:junit4]   2> 36 T648 oasc.SolrResourceLoader.replaceClassLoader Adding 'file:/mnt/ssd/jenkins/workspace/Lucene-Solr-trunk-Linux-Java8-64/checkout/solr/build/solr-core/test-files/solr/collection1/lib/classes/' to classloader
[junit4:junit4]   2> 52 T648 oasc.SolrConfig.<init> Using Lucene MatchVersion: LUCENE_50
[junit4:junit4]   2> 75 T648 oasc.SolrConfig.<init> Loaded SolrConfig: solrconfig-elevate.xml
[junit4:junit4]   2> 75 T648 oass.IndexSchema.readSchema Reading Solr Schema
[junit4:junit4]   2> 77 T648 oass.IndexSchema.readSchema Schema name=example
[junit4:junit4]   2> 171 T648 oass.IndexSchema.readSchema default search field in schema is text
[junit4:junit4]   2> 172 T648 oass.IndexSchema.readSchema unique key field: id
[junit4:junit4]   2> 174 T648 oasc.SolrCore.<init> [collection1] Opening new SolrCore at /mnt/ssd/jenkins/workspace/Lucene-Solr-trunk-Linux-Java8-64/checkout/solr/build/solr-core/test-files/solr/collection1/, dataDir=./org.apache.solr.handler.component.DistributedQueryElevationComponentTest-1342212695613/control/data/
[junit4:junit4]   2> 174 T648 oasc.JmxMonitoredMap.<init> JMX monitoring is enabled. Adding Solr mbeans to JMX Server: com.sun.jmx.mbeanserver.JmxMBeanServer@384ee98f
[junit4:junit4]   2> 174 T648 oasc.SolrCore.getNewIndexDir WARNING New index directory detected: old=null new=./org.apache.solr.handler.component.DistributedQueryElevationComponentTest-1342212695613/control/data/index/
[junit4:junit4]   2> 175 T648 oasc.SolrCore.initIndex WARNING [collection1] Solr index directory './org.apache.solr.handler.component.DistributedQueryElevationComponentTest-1342212695613/control/data/index' doesn't exist. Creating new index...
[junit4:junit4]   2> 176 T648 oasc.SolrDeletionPolicy.onCommit SolrDeletionPolicy.onCommit: commits:num=1
[junit4:junit4]   2> 		commit{dir=MockDirWrapper(org.apache.lucene.store.RAMDirectory@5fb50df3 lockFactory=org.apache.lucene.store.SingleInstanceLockFactory@4540047),segFN=segments_1,generation=1,filenames=[segments_1]
[junit4:junit4]   2> 176 T648 oasc.SolrDeletionPolicy.updateCommits newest commit = 1
[junit4:junit4]   2> 177 T648 oasc.RequestHandlers.initHandlersFromConfig created /update: solr.UpdateRequestHandler
[junit4:junit4]   2> 177 T648 oasc.RequestHandlers.initHandlersFromConfig created /elevate: org.apache.solr.handler.component.SearchHandler
[junit4:junit4]   2> 177 T648 oasc.RequestHandlers.initHandlersFromConfig created /dataElevate: org.apache.solr.handler.component.SearchHandler
[junit4:junit4]   2> 177 T648 oashl.XMLLoader.init xsltCacheLifetimeSeconds=60
[junit4:junit4]   2> 178 T648 oasc.RequestHandlers.initHandlersFromConfig WARNING no default request handler is registered (either '/select' or 'standard')
[junit4:junit4]   2> 178 T648 oasc.SolrCore.initDeprecatedSupport WARNING solrconfig.xml uses deprecated <admin/gettableFiles>, Please update your config to use the ShowFileRequestHandler.
[junit4:junit4]   2> 179 T648 oasc.SolrCore.initDeprecatedSupport WARNING adding ShowFileRequestHandler with hidden files: [STOPTYPES-2.TXT, BAD-SOLRCONFIG-MISSING-SCRIPTFILE.XML, BAD-SCHEMA-UNIQUEKEY-IS-COPYFIELD-DEST.XML, DA_UTF8.XML, CONDITIONAL.UPDATEPROCESSOR.JS, STOPWORDS.TXT, HUNSPELL-TEST.AFF, SCHEMA-NOT-REQUIRED-UNIQUE-KEY.XML, SOLRCONFIG-NOCACHE.XML, SOLRCONFIG-DELPOLICY2.XML, SOLRCONFIG-UPDATE-PROCESSOR-CHAINS.XML, SCHEMA-LMDIRICHLET.XML, SCHEMA-LUCENEMATCHVERSION.XML, STOPTYPES-1.TXT, SCHEMA-LMJELINEKMERCER.XML, SOLRCONFIG-MASTER1.XML, STOP-2.TXT, SCHEMA11.XML, SCHEMA-IB.XML, SOLRCONFIG-FUNCTIONQUERY.XML, SCHEMASURROUND.XML, BAD-MP-SOLRCONFIG.XML, BAD-SCHEMA-SIM-GLOBAL-VS-FT-MISMATCH.XML, SOLRCONFIG-TLOG.XML, SOLRCONFIG-QUERYSENDER.XML, SOLRCONFIG-PROPINJECT-INDEXDEFAULT.XML, KEEP-1.TXT, SOLRCONFIG-XINCLUDE.XML, SOLRCONFIG-MERGEPOLICY.XML, BAD-SCHEMA-DUP-FIELDTYPE.XML, SOLRCONFIG_CODEC.XML, SOLRCONFIG-TRANSFORMERS.XML, SOLRCONFIG-MASTER3.XML, THROW.ERROR.ON.ADD.UPDATEPROCESSOR.JS, SCHEMA-PHRASESUGGEST.XML, BAD-SOLRCONFIG-INVALID-SCRIPTFILE.XML, SOLRCONFIG-ENABLEPLUGIN.XML, SOLRCONFIG-REQHANDLER.INCL, BAD-SCHEMA-NOT-INDEXED-BUT-NORMS.XML, WDFTYPES.TXT, MISSING.FUNCTIONS.UPDATEPROCESSOR.JS, SOLRCONFIG-LAZYWRITER.XML, SOLRCONFIG-TERMINDEX.XML, SOLRCONFIG_PERF.XML, OPEN-EXCHANGE-RATES.JSON, SOLRCONFIG-SOLCOREPROPERTIES.XML, BAD-SOLRCONFIG-BOGUS-SCRIPTENGINE-NAME.XML, SCHEMA-NUMERIC.XML, BAD_SOLRCONFIG.XML, SOLRCONFIG-SOLR-749.XML, SOLRCONFIG-DELPOLICY1.XML, SOLRCONFIG-SPELLCHECKCOMPONENT.XML, BAD-SCHEMA-OMIT-TF-BUT-NOT-POS.XML, SOLRCONFIG-SPELLCHECKER.XML, BAD-SCHEMA-NOT-INDEXED-BUT-POS.XML, XSLT, SYNONYMS.TXT, SCHEMA-DFR.XML, SOLRCONFIG-SLAVE.XML, DA_COMPOUNDDICTIONARY.TXT, SCHEMA-CHARFILTERS.XML, FRENCHARTICLES.TXT, SCHEMA.XML, STOP-1.TXT, STOPWORDSWRONGENCODING.TXT, SOLRCONFIG-ELEVATE.XML, PROTWORDS.TXT, SCHEMA-BM25.XML, PHRASESUGGEST.TXT, SCHEMA-TRIE.XML, HYPHENATION.DTD, SOLRCONFIG-CACHING.XML, BAD-SCHEMA-NONTEXT-ANALYZER.XML, SOLRCONFIG-MASTER.XML, BAD-SCHEMA-EXTERNAL-FILEFIELD.XML, SOLRCONFIG-SCRIPT-UPDATEPROCESSOR.XML, TRIVIAL.UPDATEPROCESSOR0.JS, SOLRCONFIG-BASIC.XML, MAPPING-ISOLATIN1ACCENT.TXT, SOLRCONFIG-ALTDIRECTORY.XML, SOLRCONFIG-HIGHLIGHT.XML, SCHEMA-SIM.XML, SCHEMA-MINIMAL.XML, SOLRCONFIG-REPEATER.XML, SCHEMA15.XML, SOLRCONFIG-MASTER1-KEEPONEBACKUP.XML, KEEP-2.TXT, SOLRCONFIG-QUERYSENDER-NOQUERY.XML, ADDFIELDS.UPDATEPROCESSOR.JS, STOPWITHBOM.TXT, SCHEMA-STOP-KEEP.XML, MISSLEADING.EXTENSION.UPDATEPROCESSOR.JS.TXT, SCHEMA-FOLDING.XML, SCHEMA-COLLATE.XML, SOLRCONFIG-NATIVELOCK.XML, ELEVATE.XML, BAD-SCHEMA-DUP-DYNAMICFIELD.XML, SCHEMA-REPLICATION2.XML, SOLRCONFIG-SIMPLELOCK.XML, SCHEMA-BINARYFIELD.XML, SOLRCONFIG-MASTER2.XML, SCHEMA_CODEC.XML, SCHEMA-REPLICATION1.XML, STEMDICT.TXT, SOLRCONFIG-PHRASESUGGEST.XML, SOLRCONFIG-PROPINJECT.XML, TRIVIAL.UPDATEPROCESSOR1.JS, BAD-SCHEMA-DUP-FIELD.XML, CURRENCY.XML, SCHEMA12.XML, HUNSPELL-TEST.DIC, BAD-SCHEMA-UNIQUEKEY-USES-DEFAULT.XML, STOP-SNOWBALL.TXT, SCHEMA-COPYFIELD-TEST.XML, BAD-SCHEMA-CODEC-GLOBAL-VS-FT-MISMATCH.XML, SCHEMA-TFIDF.XML, SOLRCONFIG-SLAVE1.XML, COMPOUNDDICTIONARY.TXT, SCHEMA-REVERSED.XML, SCHEMA-REQUIRED-FIELDS.XML, BAD-SCHEMA-NOT-INDEXED-BUT-TF.XML, OLD_SYNONYMS.TXT, SCHEMA-SPELLCHECKER.XML]
[junit4:junit4]   2> 180 T648 oass.SolrIndexSearcher.<init> Opening Searcher@f813d3d main
[junit4:junit4]   2> 181 T648 oass.SolrIndexSearcher.getIndexDir WARNING WARNING: Directory impl does not support setting indexDir: org.apache.lucene.store.MockDirectoryWrapper
[junit4:junit4]   2> 181 T648 oasu.CommitTracker.<init> Hard AutoCommit: disabled
[junit4:junit4]   2> 181 T648 oasu.CommitTracker.<init> Soft AutoCommit: disabled
[junit4:junit4]   2> 181 T648 oashc.QueryElevationComponent.inform Loading QueryElevation from: /mnt/ssd/jenkins/workspace/Lucene-Solr-trunk-Linux-Java8-64/checkout/solr/build/solr-core/test-files/solr/collection1/conf/elevate.xml
[junit4:junit4]   2> 186 T648 oashc.QueryElevationComponent.inform Loading QueryElevation from: /mnt/ssd/jenkins/workspace/Lucene-Solr-trunk-Linux-Java8-64/checkout/solr/build/solr-core/test-files/solr/collection1/conf/elevate.xml
[junit4:junit4]   2> 191 T658 oasc.SolrCore.registerSearcher [collection1] Registered new searcher Searcher@f813d3d main{StandardDirectoryReader(segments_1:1)}
[junit4:junit4]   2> 191 T648 oasc.CoreContainer.register registering core: collection1
[junit4:junit4]   2> 192 T648 oass.SolrDispatchFilter.init user.dir=/mnt/ssd/jenkins/workspace/Lucene-Solr-trunk-Linux-Java8-64/checkout/solr/build/solr-core/test/J0
[junit4:junit4]   2> 192 T648 oass.SolrDispatchFilter.init SolrDispatchFilter.init() done
[junit4:junit4]   2> 192 T648 oascsi.HttpClientUtil.createClient Creating new http client, config:maxConnections=128&maxConnectionsPerHost=32&followRedirects=false
[junit4:junit4]   2> 194 T648 oejs.Server.doStart jetty-8.1.2.v20120308
[junit4:junit4]   2> 195 T648 oejs.AbstractConnector.doStart Started SocketConnector@0.0.0.0:50923
[junit4:junit4]   2> 196 T648 oasc.SolrResourceLoader.locateSolrHome JNDI not configured for solr (NoInitialContextEx)
[junit4:junit4]   2> 196 T648 oasc.SolrResourceLoader.locateSolrHome using system property solr.solr.home: /mnt/ssd/jenkins/workspace/Lucene-Solr-trunk-Linux-Java8-64/checkout/solr/build/solr-core/test-files/solr
[junit4:junit4]   2> 196 T648 oasc.SolrResourceLoader.<init> new SolrResourceLoader for deduced Solr Home: '/mnt/ssd/jenkins/workspace/Lucene-Solr-trunk-Linux-Java8-64/checkout/solr/build/solr-core/test-files/solr/'
[junit4:junit4]   2> 199 T648 oass.SolrDispatchFilter.init SolrDispatchFilter.init()
[junit4:junit4]   2> 199 T648 oasc.SolrResourceLoader.locateSolrHome JNDI not configured for solr (NoInitialContextEx)
[junit4:junit4]   2> 199 T648 oasc.SolrResourceLoader.locateSolrHome using system property solr.solr.home: /mnt/ssd/jenkins/workspace/Lucene-Solr-trunk-Linux-Java8-64/checkout/solr/build/solr-core/test-files/solr
[junit4:junit4]   2> 199 T648 oasc.CoreContainer$Initializer.initialize looking for solr.xml: /mnt/ssd/jenkins/workspace/Lucene-Solr-trunk-Linux-Java8-64/checkout/solr/build/solr-core/test-files/solr/solr.xml
[junit4:junit4]   2> 200 T648 oasc.CoreContainer.<init> New CoreContainer 1530813783
[junit4:junit4]   2> 200 T648 oasc.CoreContainer.load Loading CoreContainer using Solr Home: '/mnt/ssd/jenkins/workspace/Lucene-Solr-trunk-Linux-Java8-64/checkout/solr/build/solr-core/test-files/solr/'
[junit4:junit4]   2> 200 T648 oasc.SolrResourceLoader.<init> new SolrResourceLoader for directory: '/mnt/ssd/jenkins/workspace/Lucene-Solr-trunk-Linux-Java8-64/checkout/solr/build/solr-core/test-files/solr/'
[junit4:junit4]   2> 204 T648 oasc.CoreContainer.load Registering Log Listener
[junit4:junit4]   2> 210 T648 oashc.HttpShardHandlerFactory.getParameter Setting socketTimeout to: 0
[junit4:junit4]   2> 211 T648 oashc.HttpShardHandlerFactory.getParameter Setting urlScheme to: http://
[junit4:junit4]   2> 211 T648 oashc.HttpShardHandlerFactory.getParameter Setting connTimeout to: 0
[junit4:junit4]   2> 211 T648 oashc.HttpShardHandlerFactory.getParameter Setting maxConnectionsPerHost to: 20
[junit4:junit4]   2> 211 T648 oashc.HttpShardHandlerFactory.getParameter Setting corePoolSize to: 0
[junit4:junit4]   2> 211 T648 oashc.HttpShardHandlerFactory.getParameter Setting maximumPoolSize to: 2147483647
[junit4:junit4]   2> 212 T648 oashc.HttpShardHandlerFactory.getParameter Setting maxThreadIdleTime to: 5
[junit4:junit4]   2> 212 T648 oashc.HttpShardHandlerFactory.getParameter Setting sizeOfQueue to: -1
[junit4:junit4]   2> 212 T648 oashc.HttpShardHandlerFactory.getParameter Setting fairnessPolicy to: false
[junit4:junit4]   2> 212 T648 oascsi.HttpClientUtil.createClient Creating new http client, config:maxConnectionsPerHost=20&maxConnections=10000&socketTimeout=0&connTimeout=0&retry=false
[junit4:junit4]   2> 216 T648 oasc.CoreContainer.create Creating SolrCore 'collection1' using instanceDir: /mnt/ssd/jenkins/workspace/Lucene-Solr-trunk-Linux-Java8-64/checkout/solr/build/solr-core/test-files/solr/collection1
[junit4:junit4]   2> 216 T648 oasc.SolrResourceLoader.<init> new SolrResourceLoader for directory: '/mnt/ssd/jenkins/workspace/Lucene-Solr-trunk-Linux-Java8-64/checkout/solr/build/solr-core/test-files/solr/collection1/'
[junit4:junit4]   2> 216 T648 oasc.SolrResourceLoader.replaceClassLoader Adding 'file:/mnt/ssd/jenkins/workspace/Lucene-Solr-trunk-Linux-Java8-64/checkout/solr/build/solr-core/test-files/solr/collection1/lib/README' to classloader
[junit4:junit4]   2> 217 T648 oasc.SolrResourceLoader.replaceClassLoader Adding 'file:/mnt/ssd/jenkins/workspace/Lucene-Solr-trunk-Linux-Java8-64/checkout/solr/build/solr-core/test-files/solr/collection1/lib/classes/' to classloader
[junit4:junit4]   2> 239 T648 oasc.SolrConfig.<init> Using Lucene MatchVersion: LUCENE_50
[junit4:junit4]   2> 266 T648 oasc.SolrConfig.<init> Loaded SolrConfig: solrconfig-elevate.xml
[junit4:junit4]   2> 266 T648 oass.IndexSchema.readSchema Reading Solr Schema
[junit4:junit4]   2> 268 T648 oass.IndexSchema.readSchema Schema name=example
[junit4:junit4]   2> 360 T648 oass.IndexSchema.readSchema default search field in schema is text
[junit4:junit4]   2> 362 T648 oass.IndexSchema.readSchema unique key field: id
[junit4:junit4]   2> 363 T648 oasc.SolrCore.<init> [collection1] Opening new SolrCore at /mnt/ssd/jenkins/workspace/Lucene-Solr-trunk-Linux-Java8-64/checkout/solr/build/solr-core/test-files/solr/collection1/, dataDir=./org.apache.solr.handler.component.DistributedQueryElevationComponentTest-1342212695613/shard0/data/
[junit4:junit4]   2> 364 T648 oasc.JmxMonitoredMap.<init> JMX monitoring is enabled. Adding Solr mbeans to JMX Server: com.sun.jmx.mbeanserver.JmxMBeanServer@384ee98f
[junit4:junit4]   2> 364 T648 oasc.SolrCore.getNewIndexDir WARNING New index directory detected: old=null new=./org.apache.solr.handler.component.DistributedQueryElevationComponentTest-1342212695613/shard0/data/index/
[junit4:junit4]   2> 364 T648 oasc.SolrCore.initIndex WARNING [collection1] Solr index directory './org.apache.solr.handler.component.DistributedQueryElevationComponentTest-1342212695613/shard0/data/index' doesn't exist. Creating new index...
[junit4:junit4]   2> 365 T648 oasc.SolrDeletionPolicy.onCommit SolrDeletionPolicy.onCommit: commits:num=1
[junit4:junit4]   2> 		commit{dir=MockDirWrapper(org.apache.lucene.store.RAMDirectory@2fecd6bb lockFactory=org.apache.lucene.store.SingleInstanceLockFactory@7d3c54ea),segFN=segments_1,generation=1,filenames=[segments_1]
[junit4:junit4]   2> 365 T648 oasc.SolrDeletionPolicy.updateCommits newest commit = 1
[junit4:junit4]   2> 366 T648 oasc.RequestHandlers.initHandlersFromConfig created /update: solr.UpdateRequestHandler
[junit4:junit4]   2> 366 T648 oasc.RequestHandlers.initHandlersFromConfig created /elevate: org.apache.solr.handler.component.SearchHandler
[junit4:junit4]   2> 366 T648 oasc.RequestHandlers.initHandlersFromConfig created /dataElevate: org.apache.solr.handler.component.SearchHandler
[junit4:junit4]   2> 367 T648 oashl.XMLLoader.init xsltCacheLifetimeSeconds=60
[junit4:junit4]   2> 367 T648 oasc.RequestHandlers.initHandlersFromConfig WARNING no default request handler is registered (either '/select' or 'standard')
[junit4:junit4]   2> 368 T648 oasc.SolrCore.initDeprecatedSupport WARNING solrconfig.xml uses deprecated <admin/gettableFiles>, Please update your config to use the ShowFileRequestHandler.
[junit4:junit4]   2> 368 T648 oasc.SolrCore.initDeprecatedSupport WARNING adding ShowFileRequestHandler with hidden files: [STOPTYPES-2.TXT, BAD-SOLRCONFIG-MISSING-SCRIPTFILE.XML, BAD-SCHEMA-UNIQUEKEY-IS-COPYFIELD-DEST.XML, DA_UTF8.XML, CONDITIONAL.UPDATEPROCESSOR.JS, STOPWORDS.TXT, HUNSPELL-TEST.AFF, SCHEMA-NOT-REQUIRED-UNIQUE-KEY.XML, SOLRCONFIG-NOCACHE.XML, SOLRCONFIG-DELPOLICY2.XML, SOLRCONFIG-UPDATE-PROCESSOR-CHAINS.XML, SCHEMA-LMDIRICHLET.XML, SCHEMA-LUCENEMATCHVERSION.XML, STOPTYPES-1.TXT, SCHEMA-LMJELINEKMERCER.XML, SOLRCONFIG-MASTER1.XML, STOP-2.TXT, SCHEMA11.XML, SCHEMA-IB.XML, SOLRCONFIG-FUNCTIONQUERY.XML, SCHEMASURROUND.XML, BAD-MP-SOLRCONFIG.XML, BAD-SCHEMA-SIM-GLOBAL-VS-FT-MISMATCH.XML, SOLRCONFIG-TLOG.XML, SOLRCONFIG-QUERYSENDER.XML, SOLRCONFIG-PROPINJECT-INDEXDEFAULT.XML, KEEP-1.TXT, SOLRCONFIG-XINCLUDE.XML, SOLRCONFIG-MERGEPOLICY.XML, BAD-SCHEMA-DUP-FIELDTYPE.XML, SOLRCONFIG_CODEC.XML, SOLRCONFIG-TRANSFORMERS.XML, SOLRCONFIG-MASTER3.XML, THROW.ERROR.ON.ADD.UPDATEPROCESSOR.JS, SCHEMA-PHRASESUGGEST.XML, BAD-SOLRCONFIG-INVALID-SCRIPTFILE.XML, SOLRCONFIG-ENABLEPLUGIN.XML, SOLRCONFIG-REQHANDLER.INCL, BAD-SCHEMA-NOT-INDEXED-BUT-NORMS.XML, WDFTYPES.TXT, MISSING.FUNCTIONS.UPDATEPROCESSOR.JS, SOLRCONFIG-LAZYWRITER.XML, SOLRCONFIG-TERMINDEX.XML, SOLRCONFIG_PERF.XML, OPEN-EXCHANGE-RATES.JSON, SOLRCONFIG-SOLCOREPROPERTIES.XML, BAD-SOLRCONFIG-BOGUS-SCRIPTENGINE-NAME.XML, SCHEMA-NUMERIC.XML, BAD_SOLRCONFIG.XML, SOLRCONFIG-SOLR-749.XML, SOLRCONFIG-DELPOLICY1.XML, SOLRCONFIG-SPELLCHECKCOMPONENT.XML, BAD-SCHEMA-OMIT-TF-BUT-NOT-POS.XML, SOLRCONFIG-SPELLCHECKER.XML, BAD-SCHEMA-NOT-INDEXED-BUT-POS.XML, XSLT, SYNONYMS.TXT, SCHEMA-DFR.XML, SOLRCONFIG-SLAVE.XML, DA_COMPOUNDDICTIONARY.TXT, SCHEMA-CHARFILTERS.XML, FRENCHARTICLES.TXT, SCHEMA.XML, STOP-1.TXT, STOPWORDSWRONGENCODING.TXT, SOLRCONFIG-ELEVATE.XML, PROTWORDS.TXT, SCHEMA-BM25.XML, PHRASESUGGEST.TXT, SCHEMA-TRIE.XML, HYPHENATION.DTD, SOLRCONFIG-CACHING.XML, BAD-SCHEMA-NONTEXT-ANALYZER.XML, SOLRCONFIG-MASTER.XML, BAD-SCHEMA-EXTERNAL-FILEFIELD.XML, SOLRCONFIG-SCRIPT-UPDATEPROCESSOR.XML, TRIVIAL.UPDATEPROCESSOR0.JS, SOLRCONFIG-BASIC.XML, MAPPING-ISOLATIN1ACCENT.TXT, SOLRCONFIG-ALTDIRECTORY.XML, SOLRCONFIG-HIGHLIGHT.XML, SCHEMA-SIM.XML, SCHEMA-MINIMAL.XML, SOLRCONFIG-REPEATER.XML, SCHEMA15.XML, SOLRCONFIG-MASTER1-KEEPONEBACKUP.XML, KEEP-2.TXT, SOLRCONFIG-QUERYSENDER-NOQUERY.XML, ADDFIELDS.UPDATEPROCESSOR.JS, STOPWITHBOM.TXT, SCHEMA-STOP-KEEP.XML, MISSLEADING.EXTENSION.UPDATEPROCESSOR.JS.TXT, SCHEMA-FOLDING.XML, SCHEMA-COLLATE.XML, SOLRCONFIG-NATIVELOCK.XML, ELEVATE.XML, BAD-SCHEMA-DUP-DYNAMICFIELD.XML, SCHEMA-REPLICATION2.XML, SOLRCONFIG-SIMPLELOCK.XML, SCHEMA-BINARYFIELD.XML, SOLRCONFIG-MASTER2.XML, SCHEMA_CODEC.XML, SCHEMA-REPLICATION1.XML, STEMDICT.TXT, SOLRCONFIG-PHRASESUGGEST.XML, SOLRCONFIG-PROPINJECT.XML, TRIVIAL.UPDATEPROCESSOR1.JS, BAD-SCHEMA-DUP-FIELD.XML, CURRENCY.XML, SCHEMA12.XML, HUNSPELL-TEST.DIC, BAD-SCHEMA-UNIQUEKEY-USES-DEFAULT.XML, STOP-SNOWBALL.TXT, SCHEMA-COPYFIELD-TEST.XML, BAD-SCHEMA-CODEC-GLOBAL-VS-FT-MISMATCH.XML, SCHEMA-TFIDF.XML, SOLRCONFIG-SLAVE1.XML, COMPOUNDDICTIONARY.TXT, SCHEMA-REVERSED.XML, SCHEMA-REQUIRED-FIELDS.XML, BAD-SCHEMA-NOT-INDEXED-BUT-TF.XML, OLD_SYNONYMS.TXT, SCHEMA-SPELLCHECKER.XML]
[junit4:junit4]   2> 370 T648 oass.SolrIndexSearcher.<init> Opening Searcher@5ab9270a main
[junit4:junit4]   2> 370 T648 oass.SolrIndexSearcher.getIndexDir WARNING WARNING: Directory impl does not support setting indexDir: org.apache.lucene.store.MockDirectoryWrapper
[junit4:junit4]   2> 370 T648 oasu.CommitTracker.<init> Hard AutoCommit: disabled
[junit4:junit4]   2> 370 T648 oasu.CommitTracker.<init> Soft AutoCommit: disabled
[junit4:junit4]   2> 371 T648 oashc.QueryElevationComponent.inform Loading QueryElevation from: /mnt/ssd/jenkins/workspace/Lucene-Solr-trunk-Linux-Java8-64/checkout/solr/build/solr-core/test-files/solr/collection1/conf/elevate.xml
[junit4:junit4]   2> 375 T648 oashc.QueryElevationComponent.inform Loading QueryElevation from: /mnt/ssd/jenkins/workspace/Lucene-Solr-trunk-Linux-Java8-64/checkout/solr/build/solr-core/test-files/solr/collection1/conf/elevate.xml
[junit4:junit4]   2> 380 T668 oasc.SolrCore.registerSearcher [collection1] Registered new searcher Searcher@5ab9270a main{StandardDirectoryReader(segments_1:1)}
[junit4:junit4]   2> 380 T648 oasc.CoreContainer.register registering core: collection1
[junit4:junit4]   2> 381 T648 oass.SolrDispatchFilter.init user.dir=/mnt/ssd/jenkins/workspace/Lucene-Solr-trunk-Linux-Java8-64/checkout/solr/build/solr-core/test/J0
[junit4:junit4]   2> 381 T648 oass.SolrDispatchFilter.init SolrDispatchFilter.init() done
[junit4:junit4]   2> 381 T648 oascsi.HttpClientUtil.createClient Creating new http client, config:maxConnections=128&maxConnectionsPerHost=32&followRedirects=false
[junit4:junit4]   2> 383 T648 oejs.Server.doStart jetty-8.1.2.v20120308
[junit4:junit4]   2> 384 T648 oejs.AbstractConnector.doStart Started SocketConnector@0.0.0.0:41104
[junit4:junit4]   2> 385 T648 oasc.SolrResourceLoader.locateSolrHome JNDI not configured for solr (NoInitialContextEx)
[junit4:junit4]   2> 385 T648 oasc.SolrResourceLoader.locateSolrHome using system property solr.solr.home: /mnt/ssd/jenkins/workspace/Lucene-Solr-trunk-Linux-Java8-64/checkout/solr/build/solr-core/test-files/solr
[junit4:junit4]   2> 385 T648 oasc.SolrResourceLoader.<init> new SolrResourceLoader for deduced Solr Home: '/mnt/ssd/jenkins/workspace/Lucene-Solr-trunk-Linux-Java8-64/checkout/solr/build/solr-core/test-files/solr/'
[junit4:junit4]   2> 387 T648 oass.SolrDispatchFilter.init SolrDispatchFilter.init()
[junit4:junit4]   2> 387 T648 oasc.SolrResourceLoader.locateSolrHome JNDI not configured for solr (NoInitialContextEx)
[junit4:junit4]   2> 388 T648 oasc.SolrResourceLoader.locateSolrHome using system property solr.solr.home: /mnt/ssd/jenkins/workspace/Lucene-Solr-trunk-Linux-Java8-64/checkout/solr/build/solr-core/test-files/solr
[junit4:junit4]   2> 388 T648 oasc.CoreContainer$Initializer.initialize looking for solr.xml: /mnt/ssd/jenkins/workspace/Lucene-Solr-trunk-Linux-Java8-64/checkout/solr/build/solr-core/test-files/solr/solr.xml
[junit4:junit4]   2> 388 T648 oasc.CoreContainer.<init> New CoreContainer 957956409
[junit4:junit4]   2> 388 T648 oasc.CoreContainer.load Loading CoreContainer using Solr Home: '/mnt/ssd/jenkins/workspace/Lucene-Solr-trunk-Linux-Java8-64/checkout/solr/build/solr-core/test-files/solr/'
[junit4:junit4]   2> 388 T648 oasc.SolrResourceLoader.<init> new SolrResourceLoader for directory: '/mnt/ssd/jenkins/workspace/Lucene-Solr-trunk-Linux-Java8-64/checkout/solr/build/solr-core/test-files/solr/'
[junit4:junit4]   2> 389 T611 oazs.SessionTrackerImpl.run SessionTrackerImpl exited loop!
[junit4:junit4]   2> 392 T648 oasc.CoreContainer.load Registering Log Listener
[junit4:junit4]   2> 398 T648 oashc.HttpShardHandlerFactory.getParameter Setting socketTimeout to: 0
[junit4:junit4]   2> 399 T648 oashc.HttpShardHandlerFactory.getParameter Setting urlScheme to: http://
[junit4:junit4]   2> 399 T648 oashc.HttpShardHandlerFactory.getParameter Setting connTimeout to: 0
[junit4:junit4]   2> 399 T648 oashc.HttpShardHandlerFactory.getParameter Setting maxConnectionsPerHost to: 20
[junit4:junit4]   2> 399 T648 oashc.HttpShardHandlerFactory.getParameter Setting corePoolSize to: 0
[junit4:junit4]   2> 399 T648 oashc.HttpShardHandlerFactory.getParameter Setting maximumPoolSize to: 2147483647
[junit4:junit4]   2> 399 T648 oashc.HttpShardHandlerFactory.getParameter Setting maxThreadIdleTime to: 5
[junit4:junit4]   2> 399 T648 oashc.HttpShardHandlerFactory.getParameter Setting sizeOfQueue to: -1
[junit4:junit4]   2> 400 T648 oashc.HttpShardHandlerFactory.getParameter Setting fairnessPolicy to: false
[junit4:junit4]   2> 400 T648 oascsi.HttpClientUtil.createClient Creating new http client, config:maxConnectionsPerHost=20&maxConnections=10000&socketTimeout=0&connTimeout=0&retry=false
[junit4:junit4]   2> 403 T648 oasc.CoreContainer.create Creating SolrCore 'collection1' using instanceDir: /mnt/ssd/jenkins/workspace/Lucene-Solr-trunk-Linux-Java8-64/checkout/solr/build/solr-core/test-files/solr/collection1
[junit4:junit4]   2> 404 T648 oasc.SolrResourceLoader.<init> new SolrResourceLoader for directory: '/mnt/ssd/jenkins/workspace/Lucene-Solr-trunk-Linux-Java8-64/checkout/solr/build/solr-core/test-files/solr/collection1/'
[junit4:junit4]   2> 404 T648 oasc.SolrResourceLoader.replaceClassLoader Adding 'file:/mnt/ssd/jenkins/workspace/Lucene-Solr-trunk-Linux-Java8-64/checkout/solr/build/solr-core/test-files/solr/collection1/lib/README' to classloader
[junit4:junit4]   2> 404 T648 oasc.SolrResourceLoader.replaceClassLoader Adding 'file:/mnt/ssd/jenkins/workspace/Lucene-Solr-trunk-Linux-Java8-64/checkout/solr/build/solr-core/test-files/solr/collection1/lib/classes/' to classloader
[junit4:junit4]   2> 416 T648 oasc.SolrConfig.<init> Using Lucene MatchVersion: LUCENE_50
[junit4:junit4]   2> 443 T648 oasc.SolrConfig.<init> Loaded SolrConfig: solrconfig-elevate.xml
[junit4:junit4]   2> 444 T648 oass.IndexSchema.readSchema Reading Solr Schema
[junit4:junit4]   2> 446 T648 oass.IndexSchema.readSchema Schema name=example
[junit4:junit4]   2> 540 T648 oass.IndexSchema.readSchema default search field in schema is text
[junit4:junit4]   2> 541 T648 oass.IndexSchema.readSchema unique key field: id
[junit4:junit4]   2> 543 T648 oasc.SolrCore.<init> [collection1] Opening new SolrCore at /mnt/ssd/jenkins/workspace/Lucene-Solr-trunk-Linux-Java8-64/checkout/solr/build/solr-core/test-files/solr/collection1/, dataDir=./org.apache.solr.handler.component.DistributedQueryElevationComponentTest-1342212695613/shard1/data/
[junit4:junit4]   2> 543 T648 oasc.JmxMonitoredMap.<init> JMX monitoring is enabled. Adding Solr mbeans to JMX Server: com.sun.jmx.mbeanserver.JmxMBeanServer@384ee98f
[junit4:junit4]   2> 544 T648 oasc.SolrCore.getNewIndexDir WARNING New index directory detected: old=null new=./org.apache.solr.handler.component.DistributedQueryElevationComponentTest-1342212695613/shard1/data/index/
[junit4:junit4]   2> 544 T648 oasc.SolrCore.initIndex WARNING [collection1] Solr index directory './org.apache.solr.handler.component.DistributedQueryElevationComponentTest-1342212695613/shard1/data/index' doesn't exist. Creating new index...
[junit4:junit4]   2> 545 T648 oasc.SolrDeletionPolicy.onCommit SolrDeletionPolicy.onCommit: commits:num=1
[junit4:junit4]   2> 		commit{dir=MockDirWrapper(NRTCachingDirectory(org.apache.lucene.store.RAMDirectory@4e494fdb lockFactory=org.apache.lucene.store.SingleInstanceLockFactory@7f845138; maxCacheMB=0.1513671875 maxMergeSizeMB=0.880859375)),segFN=segments_1,generation=1,filenames=[segments_1]
[junit4:junit4]   2> 546 T648 oasc.SolrDeletionPolicy.updateCommits newest commit = 1
[junit4:junit4]   2> 547 T648 oasc.RequestHandlers.initHandlersFromConfig created /update: solr.UpdateRequestHandler
[junit4:junit4]   2> 547 T648 oasc.RequestHandlers.initHandlersFromConfig created /elevate: org.apache.solr.handler.component.SearchHandler
[junit4:junit4]   2> 547 T648 oasc.RequestHandlers.initHandlersFromConfig created /dataElevate: org.apache.solr.handler.component.SearchHandler
[junit4:junit4]   2> 548 T648 oashl.XMLLoader.init xsltCacheLifetimeSeconds=60
[junit4:junit4]   2> 548 T648 oasc.RequestHandlers.initHandlersFromConfig WARNING no default request handler is registered (either '/select' or 'standard')
[junit4:junit4]   2> 549 T648 oasc.SolrCore.initDeprecatedSupport WARNING solrconfig.xml uses deprecated <admin/gettableFiles>, Please update your config to use the ShowFileRequestHandler.
[junit4:junit4]   2> 549 T648 oasc.SolrCore.initDeprecatedSupport WARNING adding ShowFileRequestHandler with hidden files: [STOPTYPES-2.TXT, BAD-SOLRCONFIG-MISSING-SCRIPTFILE.XML, BAD-SCHEMA-UNIQUEKEY-IS-COPYFIELD-DEST.XML, DA_UTF8.XML, CONDITIONAL.UPDATEPROCESSOR.JS, STOPWORDS.TXT, HUNSPELL-TEST.AFF, SCHEMA-NOT-REQUIRED-UNIQUE-KEY.XML, SOLRCONFIG-NOCACHE.XML, SOLRCONFIG-DELPOLICY2.XML, SOLRCONFIG-UPDATE-PROCESSOR-CHAINS.XML, SCHEMA-LMDIRICHLET.XML, SCHEMA-LUCENEMATCHVERSION.XML, STOPTYPES-1.TXT, SCHEMA-LMJELINEKMERCER.XML, SOLRCONFIG-MASTER1.XML, STOP-2.TXT, SCHEMA11.XML, SCHEMA-IB.XML, SOLRCONFIG-FUNCTIONQUERY.XML, SCHEMASURROUND.XML, BAD-MP-SOLRCONFIG.XML, BAD-SCHEMA-SIM-GLOBAL-VS-FT-MISMATCH.XML, SOLRCONFIG-TLOG.XML, SOLRCONFIG-QUERYSENDER.XML, SOLRCONFIG-PROPINJECT-INDEXDEFAULT.XML, KEEP-1.TXT, SOLRCONFIG-XINCLUDE.XML, SOLRCONFIG-MERGEPOLICY.XML, BAD-SCHEMA-DUP-FIELDTYPE.XML, SOLRCONFIG_CODEC.XML, SOLRCONFIG-TRANSFORMERS.XML, SOLRCONFIG-MASTER3.XML, THROW.ERROR.ON.ADD.UPDATEPROCESSOR.JS, SCHEMA-PHRASESUGGEST.XML, BAD-SOLRCONFIG-INVALID-SCRIPTFILE.XML, SOLRCONFIG-ENABLEPLUGIN.XML, SOLRCONFIG-REQHANDLER.INCL, BAD-SCHEMA-NOT-INDEXED-BUT-NORMS.XML, WDFTYPES.TXT, MISSING.FUNCTIONS.UPDATEPROCESSOR.JS, SOLRCONFIG-LAZYWRITER.XML, SOLRCONFIG-TERMINDEX.XML, SOLRCONFIG_PERF.XML, OPEN-EXCHANGE-RATES.JSON, SOLRCONFIG-SOLCOREPROPERTIES.XML, BAD-SOLRCONFIG-BOGUS-SCRIPTENGINE-NAME.XML, SCHEMA-NUMERIC.XML, BAD_SOLRCONFIG.XML, SOLRCONFIG-SOLR-749.XML, SOLRCONFIG-DELPOLICY1.XML, SOLRCONFIG-SPELLCHECKCOMPONENT.XML, BAD-SCHEMA-OMIT-TF-BUT-NOT-POS.XML, SOLRCONFIG-SPELLCHECKER.XML, BAD-SCHEMA-NOT-INDEXED-BUT-POS.XML, XSLT, SYNONYMS.TXT, SCHEMA-DFR.XML, SOLRCONFIG-SLAVE.XML, DA_COMPOUNDDICTIONARY.TXT, SCHEMA-CHARFILTERS.XML, FRENCHARTICLES.TXT, SCHEMA.XML, STOP-1.TXT, STOPWORDSWRONGENCODING.TXT, SOLRCONFIG-ELEVATE.XML, PROTWORDS.TXT, SCHEMA-BM25.XML, PHRASESUGGEST.TXT, SCHEMA-TRIE.XML, HYPHENATION.DTD, SOLRCONFIG-CACHING.XML, BAD-SCHEMA-NONTEXT-ANALYZER.XML, SOLRCONFIG-MASTER.XML, BAD-SCHEMA-EXTERNAL-FILEFIELD.XML, SOLRCONFIG-SCRIPT-UPDATEPROCESSOR.XML, TRIVIAL.UPDATEPROCESSOR0.JS, SOLRCONFIG-BASIC.XML, MAPPING-ISOLATIN1ACCENT.TXT, SOLRCONFIG-ALTDIRECTORY.XML, SOLRCONFIG-HIGHLIGHT.XML, SCHEMA-SIM.XML, SCHEMA-MINIMAL.XML, SOLRCONFIG-REPEATER.XML, SCHEMA15.XML, SOLRCONFIG-MASTER1-KEEPONEBACKUP.XML, KEEP-2.TXT, SOLRCONFIG-QUERYSENDER-NOQUERY.XML, ADDFIELDS.UPDATEPROCESSOR.JS, STOPWITHBOM.TXT, SCHEMA-STOP-KEEP.XML, MISSLEADING.EXTENSION.UPDATEPROCESSOR.JS.TXT, SCHEMA-FOLDING.XML, SCHEMA-COLLATE.XML, SOLRCONFIG-NATIVELOCK.XML, ELEVATE.XML, BAD-SCHEMA-DUP-DYNAMICFIELD.XML, SCHEMA-REPLICATION2.XML, SOLRCONFIG-SIMPLELOCK.XML, SCHEMA-BINARYFIELD.XML, SOLRCONFIG-MASTER2.XML, SCHEMA_CODEC.XML, SCHEMA-REPLICATION1.XML, STEMDICT.TXT, SOLRCONFIG-PHRASESUGGEST.XML, SOLRCONFIG-PROPINJECT.XML, TRIVIAL.UPDATEPROCESSOR1.JS, BAD-SCHEMA-DUP-FIELD.XML, CURRENCY.XML, SCHEMA12.XML, HUNSPELL-TEST.DIC, BAD-SCHEMA-UNIQUEKEY-USES-DEFAULT.XML, STOP-SNOWBALL.TXT, SCHEMA-COPYFIELD-TEST.XML, BAD-SCHEMA-CODEC-GLOBAL-VS-FT-MISMATCH.XML, SCHEMA-TFIDF.XML, SOLRCONFIG-SLAVE1.XML, COMPOUNDDICTIONARY.TXT, SCHEMA-REVERSED.XML, SCHEMA-REQUIRED-FIELDS.XML, BAD-SCHEMA-NOT-INDEXED-BUT-TF.XML, OLD_SYNONYMS.TXT, SCHEMA-SPELLCHECKER.XML]
[junit4:junit4]   2> 551 T648 oass.SolrIndexSearcher.<init> Opening Searcher@49a0621c main
[junit4:junit4]   2> 551 T648 oass.SolrIndexSearcher.getIndexDir WARNING WARNING: Directory impl does not support setting indexDir: org.apache.lucene.store.MockDirectoryWrapper
[junit4:junit4]   2> 551 T648 oasu.CommitTracker.<init> Hard AutoCommit: disabled
[junit4:junit4]   2> 551 T648 oasu.CommitTracker.<init> Soft AutoCommit: disabled
[junit4:junit4]   2> 552 T648 oashc.QueryElevationComponent.inform Loading QueryElevation from: /mnt/ssd/jenkins/workspace/Lucene-Solr-trunk-Linux-Java8-64/checkout/solr/build/solr-core/test-files/solr/collection1/conf/elevate.xml
[junit4:junit4]   2> 557 T648 oashc.QueryElevationComponent.inform Loading QueryElevation from: /mnt/ssd/jenkins/workspace/Lucene-Solr-trunk-Linux-Java8-64/checkout/solr/build/solr-core/test-files/solr/collection1/conf/elevate.xml
[junit4:junit4]   2> 562 T678 oasc.SolrCore.registerSearcher [collection1] Registered new searcher Searcher@49a0621c main{StandardDirectoryReader(segments_1:1)}
[junit4:junit4]   2> 562 T648 oasc.CoreContainer.register registering core: collection1
[junit4:junit4]   2> 562 T648 oass.SolrDispatchFilter.init user.dir=/mnt/ssd/jenkins/workspace/Lucene-Solr-trunk-Linux-Java8-64/checkout/solr/build/solr-core/test/J0
[junit4:junit4]   2> 562 T648 oass.SolrDispatchFilter.init SolrDispatchFilter.init() done
[junit4:junit4]   2> 563 T648 oascsi.HttpClientUtil.createClient Creating new http client, config:maxConnections=128&maxConnectionsPerHost=32&followRedirects=false
[junit4:junit4]   2> 565 T648 oejs.Server.doStart jetty-8.1.2.v20120308
[junit4:junit4]   2> 566 T648 oejs.AbstractConnector.doStart Started SocketConnector@0.0.0.0:54921
[junit4:junit4]   2> 567 T648 oasc.SolrResourceLoader.locateSolrHome JNDI not configured for solr (NoInitialContextEx)
[junit4:junit4]   2> 567 T648 oasc.SolrResourceLoader.locateSolrHome using system property solr.solr.home: /mnt/ssd/jenkins/workspace/Lucene-Solr-trunk-Linux-Java8-64/checkout/solr/build/solr-core/test-files/solr
[junit4:junit4]   2> 567 T648 oasc.SolrResourceLoader.<init> new SolrResourceLoader for deduced Solr Home: '/mnt/ssd/jenkins/workspace/Lucene-Solr-trunk-Linux-Java8-64/checkout/solr/build/solr-core/test-files/solr/'
[junit4:junit4]   2> 569 T648 oass.SolrDispatchFilter.init SolrDispatchFilter.init()
[junit4:junit4]   2> 569 T648 oasc.SolrResourceLoader.locateSolrHome JNDI not configured for solr (NoInitialContextEx)
[junit4:junit4]   2> 570 T648 oasc.SolrResourceLoader.locateSolrHome using system property solr.solr.home: /mnt/ssd/jenkins/workspace/Lucene-Solr-trunk-Linux-Java8-64/checkout/solr/build/solr-core/test-files/solr
[junit4:junit4]   2> 570 T648 oasc.CoreContainer$Initializer.initialize looking for solr.xml: /mnt/ssd/jenkins/workspace/Lucene-Solr-trunk-Linux-Java8-64/checkout/solr/build/solr-core/test-files/solr/solr.xml
[junit4:junit4]   2> 570 T648 oasc.CoreContainer.<init> New CoreContainer 1372225898
[junit4:junit4]   2> 570 T648 oasc.CoreContainer.load Loading CoreContainer using Solr Home: '/mnt/ssd/jenkins/workspace/Lucene-Solr-trunk-Linux-Java8-64/checkout/solr/build/solr-core/test-files/solr/'
[junit4:junit4]   2> 570 T648 oasc.SolrResourceLoader.<init> new SolrResourceLoader for directory: '/mnt/ssd/jenkins/workspace/Lucene-Solr-trunk-Linux-Java8-64/checkout/solr/build/solr-core/test-files/solr/'
[junit4:junit4]   2> 574 T648 oasc.CoreContainer.load Registering Log Listener
[junit4:junit4]   2> 580 T648 oashc.HttpShardHandlerFactory.getParameter Setting socketTimeout to: 0
[junit4:junit4]   2> 581 T648 oashc.HttpShardHandlerFactory.getParameter Setting urlScheme to: http://
[junit4:junit4]   2> 581 T648 oashc.HttpShardHandlerFactory.getParameter Setting connTimeout to: 0
[junit4:junit4]   2> 581 T648 oashc.HttpShardHandlerFactory.getParameter Setting maxConnectionsPerHost to: 20
[junit4:junit4]   2> 581 T648 oashc.HttpShardHandlerFactory.getParameter Setting corePoolSize to: 0
[junit4:junit4]   2> 581 T648 oashc.HttpShardHandlerFactory.getParameter Setting maximumPoolSize to: 2147483647
[junit4:junit4]   2> 581 T648 oashc.HttpShardHandlerFactory.getParameter Setting maxThreadIdleTime to: 5
[junit4:junit4]   2> 582 T648 oashc.HttpShardHandlerFactory.getParameter Setting sizeOfQueue to: -1
[junit4:junit4]   2> 582 T648 oashc.HttpShardHandlerFactory.getParameter Setting fairnessPolicy to: false
[junit4:junit4]   2> 582 T648 oascsi.HttpClientUtil.createClient Creating new http client, config:maxConnectionsPerHost=20&maxConnections=10000&socketTimeout=0&connTimeout=0&retry=false
[junit4:junit4]   2> 586 T648 oasc.CoreContainer.create Creating SolrCore 'collection1' using instanceDir: /mnt/ssd/jenkins/workspace/Lucene-Solr-trunk-Linux-Java8-64/checkout/solr/build/solr-core/test-files/solr/collection1
[junit4:junit4]   2> 586 T648 oasc.SolrResourceLoader.<init> new SolrResourceLoader for directory: '/mnt/ssd/jenkins/workspace/Lucene-Solr-trunk-Linux-Java8-64/checkout/solr/build/solr-core/test-files/solr/collection1/'
[junit4:junit4]   2> 586 T648 oasc.SolrResourceLoader.replaceClassLoader Adding 'file:/mnt/ssd/jenkins/workspace/Lucene-Solr-trunk-Linux-Java8-64/checkout/solr/build/solr-core/test-files/solr/collection1/lib/README' to classloader
[junit4:junit4]   2> 586 T648 oasc.SolrResourceLoader.replaceClassLoader Adding 'file:/mnt/ssd/jenkins/workspace/Lucene-Solr-trunk-Linux-Java8-64/checkout/solr/build/solr-core/test-files/solr/collection1/lib/classes/' to classloader
[junit4:junit4]   2> 598 T648 oasc.SolrConfig.<init> Using Lucene MatchVersion: LUCENE_50
[junit4:junit4]   2> 624 T648 oasc.SolrConfig.<init> Loaded SolrConfig: solrconfig-elevate.xml
[junit4:junit4]   2> 625 T648 oass.IndexSchema.readSchema Reading Solr Schema
[junit4:junit4]   2> 627 T648 oass.IndexSchema.readSchema Schema name=example
[junit4:junit4]   2> 719 T648 oass.IndexSchema.readSchema default search field in schema is text
[junit4:junit4]   2> 720 T648 oass.IndexSchema.readSchema unique key field: id
[junit4:junit4]   2> 722 T648 oasc.SolrCore.<init> [collection1] Opening new SolrCore at /mnt/ssd/jenkins/workspace/Lucene-Solr-trunk-Linux-Java8-64/checkout/solr/build/solr-core/test-files/solr/collection1/, dataDir=./org.apache.solr.handler.component.DistributedQueryElevationComponentTest-1342212695613/shard2/data/
[junit4:junit4]   2> 722 T648 oasc.JmxMonitoredMap.<init> JMX monitoring is enabled. Adding Solr mbeans to JMX Server: com.sun.jmx.mbeanserver.JmxMBeanServer@384ee98f
[junit4:junit4]   2> 722 T648 oasc.SolrCore.getNewIndexDir WARNING New index directory detected: old=null new=./org.apache.solr.handler.component.DistributedQueryElevationComponentTest-1342212695613/shard2/data/index/
[junit4:junit4]   2> 723 T648 oasc.SolrCore.initIndex WARNING [collection1] Solr index directory './org.apache.solr.handler.component.DistributedQueryElevationComponentTest-1342212695613/shard2/data/index' doesn't exist. Creating new index...
[junit4:junit4]   2> 723 T648 oasc.SolrDeletionPolicy.onCommit SolrDeletionPolicy.onCommit: commits:num=1
[junit4:junit4]   2> 		commit{dir=MockDirWrapper(NRTCachingDirectory(org.apache.lucene.store.RAMDirectory@ace0c6a lockFactory=org.apache.lucene.store.SingleInstanceLockFactory@3e49a768; maxCacheMB=0.751953125 maxMergeSizeMB=0.9345703125)),segFN=segments_1,generation=1,filenames=[segments_1]
[junit4:junit4]   2> 724 T648 oasc.SolrDeletionPolicy.updateCommits newest commit = 1
[junit4:junit4]   2> 724 T648 oasc.RequestHandlers.initHandlersFromConfig created /update: solr.UpdateRequestHandler
[junit4:junit4]   2> 725 T648 oasc.RequestHandlers.initHandlersFromConfig created /elevate: org.apache.solr.handler.component.SearchHandler
[junit4:junit4]   2> 725 T648 oasc.RequestHandlers.initHandlersFromConfig created /dataElevate: org.apache.solr.handler.component.SearchHandler
[junit4:junit4]   2> 725 T648 oashl.XMLLoader.init xsltCacheLifetimeSeconds=60
[junit4:junit4]   2> 725 T648 oasc.RequestHandlers.initHandlersFromConfig WARNING no default request handler is registered (either '/select' or 'standard')
[junit4:junit4]   2> 726 T648 oasc.SolrCore.initDeprecatedSupport WARNING solrconfig.xml uses deprecated <admin/gettableFiles>, Please update your config to use the ShowFileRequestHandler.
[junit4:junit4]   2> 727 T648 oasc.SolrCore.initDeprecatedSupport WARNING adding ShowFileRequestHandler with hidden files: [STOPTYPES-2.TXT, BAD-SOLRCONFIG-MISSING-SCRIPTFILE.XML, BAD-SCHEMA-UNIQUEKEY-IS-COPYFIELD-DEST.XML, DA_UTF8.XML, CONDITIONAL.UPDATEPROCESSOR.JS, STOPWORDS.TXT, HUNSPELL-TEST.AFF, SCHEMA-NOT-REQUIRED-UNIQUE-KEY.XML, SOLRCONFIG-NOCACHE.XML, SOLRCONFIG-DELPOLICY2.XML, SOLRCONFIG-UPDATE-PROCESSOR-CHAINS.XML, SCHEMA-LMDIRICHLET.XML, SCHEMA-LUCENEMATCHVERSION.XML, STOPTYPES-1.TXT, SCHEMA-LMJELINEKMERCER.XML, SOLRCONFIG-MASTER1.XML, STOP-2.TXT, SCHEMA11.XML, SCHEMA-IB.XML, SOLRCONFIG-FUNCTIONQUERY.XML, SCHEMASURROUND.XML, BAD-MP-SOLRCONFIG.XML, BAD-SCHEMA-SIM-GLOBAL-VS-FT-MISMATCH.XML, SOLRCONFIG-TLOG.XML, SOLRCONFIG-QUERYSENDER.XML, SOLRCONFIG-PROPINJECT-INDEXDEFAULT.XML, KEEP-1.TXT, SOLRCONFIG-XINCLUDE.XML, SOLRCONFIG-MERGEPOLICY.XML, BAD-SCHEMA-DUP-FIELDTYPE.XML, SOLRCONFIG_CODEC.XML, SOLRCONFIG-TRANSFORMERS.XML, SOLRCONFIG-MASTER3.XML, THROW.ERROR.ON.ADD.UPDATEPROCESSOR.JS, SCHEMA-PHRASESUGGEST.XML, BAD-SOLRCONFIG-INVALID-SCRIPTFILE.XML, SOLRCONFIG-ENABLEPLUGIN.XML, SOLRCONFIG-REQHANDLER.INCL, BAD-SCHEMA-NOT-INDEXED-BUT-NORMS.XML, WDFTYPES.TXT, MISSING.FUNCTIONS.UPDATEPROCESSOR.JS, SOLRCONFIG-LAZYWRITER.XML, SOLRCONFIG-TERMINDEX.XML, SOLRCONFIG_PERF.XML, OPEN-EXCHANGE-RATES.JSON, SOLRCONFIG-SOLCOREPROPERTIES.XML, BAD-SOLRCONFIG-BOGUS-SCRIPTENGINE-NAME.XML, SCHEMA-NUMERIC.XML, BAD_SOLRCONFIG.XML, SOLRCONFIG-SOLR-749.XML, SOLRCONFIG-DELPOLICY1.XML, SOLRCONFIG-SPELLCHECKCOMPONENT.XML, BAD-SCHEMA-OMIT-TF-BUT-NOT-POS.XML, SOLRCONFIG-SPELLCHECKER.XML, BAD-SCHEMA-NOT-INDEXED-BUT-POS.XML, XSLT, SYNONYMS.TXT, SCHEMA-DFR.XML, SOLRCONFIG-SLAVE.XML, DA_COMPOUNDDICTIONARY.TXT, SCHEMA-CHARFILTERS.XML, FRENCHARTICLES.TXT, SCHEMA.XML, STOP-1.TXT, STOPWORDSWRONGENCODING.TXT, SOLRCONFIG-ELEVATE.XML, PROTWORDS.TXT, SCHEMA-BM25.XML, PHRASESUGGEST.TXT, SCHEMA-TRIE.XML, HYPHENATION.DTD, SOLRCONFIG-CACHING.XML, BAD-SCHEMA-NONTEXT-ANALYZER.XML, SOLRCONFIG-MASTER.XML, BAD-SCHEMA-EXTERNAL-FILEFIELD.XML, SOLRCONFIG-SCRIPT-UPDATEPROCESSOR.XML, TRIVIAL.UPDATEPROCESSOR0.JS, SOLRCONFIG-BASIC.XML, MAPPING-ISOLATIN1ACCENT.TXT, SOLRCONFIG-ALTDIRECTORY.XML, SOLRCONFIG-HIGHLIGHT.XML, SCHEMA-SIM.XML, SCHEMA-MINIMAL.XML, SOLRCONFIG-REPEATER.XML, SCHEMA15.XML, SOLRCONFIG-MASTER1-KEEPONEBACKUP.XML, KEEP-2.TXT, SOLRCONFIG-QUERYSENDER-NOQUERY.XML, ADDFIELDS.UPDATEPROCESSOR.JS, STOPWITHBOM.TXT, SCHEMA-STOP-KEEP.XML, MISSLEADING.EXTENSION.UPDATEPROCESSOR.JS.TXT, SCHEMA-FOLDING.XML, SCHEMA-COLLATE.XML, SOLRCONFIG-NATIVELOCK.XML, ELEVATE.XML, BAD-SCHEMA-DUP-DYNAMICFIELD.XML, SCHEMA-REPLICATION2.XML, SOLRCONFIG-SIMPLELOCK.XML, SCHEMA-BINARYFIELD.XML, SOLRCONFIG-MASTER2.XML, SCHEMA_CODEC.XML, SCHEMA-REPLICATION1.XML, STEMDICT.TXT, SOLRCONFIG-PHRASESUGGEST.XML, SOLRCONFIG-PROPINJECT.XML, TRIVIAL.UPDATEPROCESSOR1.JS, BAD-SCHEMA-DUP-FIELD.XML, CURRENCY.XML, SCHEMA12.XML, HUNSPELL-TEST.DIC, BAD-SCHEMA-UNIQUEKEY-USES-DEFAULT.XML, STOP-SNOWBALL.TXT, SCHEMA-COPYFIELD-TEST.XML, BAD-SCHEMA-CODEC-GLOBAL-VS-FT-MISMATCH.XML, SCHEMA-TFIDF.XML, SOLRCONFIG-SLAVE1.XML, COMPOUNDDICTIONARY.TXT, SCHEMA-REVERSED.XML, SCHEMA-REQUIRED-FIELDS.XML, BAD-SCHEMA-NOT-INDEXED-BUT-TF.XML, OLD_SYNONYMS.TXT, SCHEMA-SPELLCHECKER.XML]
[junit4:junit4]   2> 728 T648 oass.SolrIndexSearcher.<init> Opening Searcher@17cea8c9 main
[junit4:junit4]   2> 729 T648 oass.SolrIndexSearcher.getIndexDir WARNING WARNING: Directory impl does not support setting indexDir: org.apache.lucene.store.MockDirectoryWrapper
[junit4:junit4]   2> 729 T648 oasu.CommitTracker.<init> Hard AutoCommit: disabled
[junit4:junit4]   2> 729 T648 oasu.CommitTracker.<init> Soft AutoCommit: disabled
[junit4:junit4]   2> 729 T648 oashc.QueryElevationComponent.inform Loading QueryElevation from: /mnt/ssd/jenkins/workspace/Lucene-Solr-trunk-Linux-Java8-64/checkout/solr/build/solr-core/test-files/solr/collection1/conf/elevate.xml
[junit4:junit4]   2> 734 T648 oashc.QueryElevationComponent.inform Loading QueryElevation from: /mnt/ssd/jenkins/workspace/Lucene-Solr-trunk-Linux-Java8-64/checkout/solr/build/solr-core/test-files/solr/collection1/conf/elevate.xml
[junit4:junit4]   2> 739 T688 oasc.SolrCore.registerSearcher [collection1] Registered new searcher Searcher@17cea8c9 main{StandardDirectoryReader(segments_1:1)}
[junit4:junit4]   2> 739 T648 oasc.CoreContainer.register registering core: collection1
[junit4:junit4]   2> 739 T648 oass.SolrDispatchFilter.init user.dir=/mnt/ssd/jenkins/workspace/Lucene-Solr-trunk-Linux-Java8-64/checkout/solr/build/solr-core/test/J0
[junit4:junit4]   2> 740 T648 oass.SolrDispatchFilter.init SolrDispatchFilter.init() done
[junit4:junit4]   2> 740 T648 oascsi.HttpClientUtil.createClient Creating new http client, config:maxConnections=128&maxConnectionsPerHost=32&followRedirects=false
[junit4:junit4]   2> ASYNC  NEW_CORE C39 name=collection1 org.apache.solr.core.SolrCore@29239796
[junit4:junit4]   2> 757 T651 C39 oasu.DirectUpdateHandler2.deleteAll [collection1] REMOVING ALL DOCUMENTS FROM INDEX
[junit4:junit4]   2> 759 T651 C39 oasc.SolrDeletionPolicy.onInit SolrDeletionPolicy.onInit: commits:num=1
[junit4:junit4]   2> 		commit{dir=MockDirWrapper(org.apache.lucene.store.RAMDirectory@5fb50df3 lockFactory=org.apache.lucene.store.SingleInstanceLockFactory@4540047),segFN=segments_1,generation=1,filenames=[segments_1]
[junit4:junit4]   2> 759 T651 C39 oasc.SolrDeletionPolicy.updateCommits newest commit = 1
[junit4:junit4]   2> 760 T651 C39 UPDATE [collection1] webapp=/solr path=/update params={version=2&wt=javabin} {deleteByQuery=*:*} 0 3
[junit4:junit4]   2> ASYNC  NEW_CORE C40 name=collection1 org.apache.solr.core.SolrCore@7562e60a
[junit4:junit4]   2> 764 T661 C40 oasu.DirectUpdateHandler2.deleteAll [collection1] REMOVING ALL DOCUMENTS FROM INDEX
[junit4:junit4]   2> 765 T661 C40 oasc.SolrDeletionPolicy.onInit SolrDeletionPolicy.onInit: commits:num=1
[junit4:junit4]   2> 		commit{dir=MockDirWrapper(org.apache.lucene.store.RAMDirectory@2fecd6bb lockFactory=org.apache.lucene.store.SingleInstanceLockFactory@7d3c54ea),segFN=segments_1,generation=1,filenames=[segments_1]
[junit4:junit4]   2> 765 T661 C40 oasc.SolrDeletionPolicy.updateCommits newest commit = 1
[junit4:junit4]   2> 765 T661 C40 UPDATE [collection1] webapp=/solr path=/update params={version=2&wt=javabin} {deleteByQuery=*:*} 0 1
[junit4:junit4]   2> ASYNC  NEW_CORE C41 name=collection1 org.apache.solr.core.SolrCore@6d1c1393
[junit4:junit4]   2> 768 T671 C41 oasu.DirectUpdateHandler2.deleteAll [collection1] REMOVING ALL DOCUMENTS FROM INDEX
[junit4:junit4]   2> 769 T671 C41 oasc.SolrDeletionPolicy.onInit SolrDeletionPolicy.onInit: commits:num=1
[junit4:junit4]   2> 		commit{dir=MockDirWrapper(NRTCachingDirectory(org.apache.lucene.store.RAMDirectory@4e494fdb lockFactory=org.apache.lucene.store.SingleInstanceLockFactory@7f845138; maxCacheMB=0.1513671875 maxMergeSizeMB=0.880859375)),segFN=segments_1,generation=1,filenames=[segments_1]
[junit4:junit4]   2> 770 T671 C41 oasc.SolrDeletionPolicy.updateCommits newest commit = 1
[junit4:junit4]   2> 770 T671 C41 UPDATE [collection1] webapp=/solr path=/update params={version=2&wt=javabin} {deleteByQuery=*:*} 0 2
[junit4:junit4]   2> ASYNC  NEW_CORE C42 name=collection1 org.apache.solr.core.SolrCore@6435d75c
[junit4:junit4]   2> 774 T681 C42 oasu.DirectUpdateHandler2.deleteAll [collection1] REMOVING ALL DOCUMENTS FROM INDEX
[junit4:junit4]   2> 775 T681 C42 oasc.SolrDeletionPolicy.onInit SolrDeletionPolicy.onInit: commits:num=1
[junit4:junit4]   2> 		commit{dir=MockDirWrapper(NRTCachingDirectory(org.apache.lucene.store.RAMDirectory@ace0c6a lockFactory=org.apache.lucene.store.SingleInstanceLockFactory@3e49a768; maxCacheMB=0.751953125 maxMergeSizeMB=0.9345703125)),segFN=segments_1,generation=1,filenames=[segments_1]
[junit4:junit4]   2> 776 T681 C42 oasc.SolrDeletionPolicy.updateCommits newest commit = 1
[junit4:junit4]   2> 776 T681 C42 UPDATE [collection1] webapp=/solr path=/update params={version=2&wt=javabin} {deleteByQuery=*:*} 0 2
[junit4:junit4]   2> 779 T651 C39 UPDATE [collection1] webapp=/solr path=/update params={version=2&wt=javabin} {add=[1]} 0 1
[junit4:junit4]   2> 782 T661 C40 UPDATE [collection1] webapp=/solr path=/update params={version=2&wt=javabin} {add=[1]} 0 1
[junit4:junit4]   2> 784 T651 C39 UPDATE [collection1] webapp=/solr path=/update params={version=2&wt=javabin} {add=[2]} 0 0
[junit4:junit4]   2> 786 T671 C41 UPDATE [collection1] webapp=/solr path=/update params={version=2&wt=javabin} {add=[2]} 0 0
[junit4:junit4]   2> 788 T651 C39 UPDATE [collection1] webapp=/solr path=/update params={version=2&wt=javabin} {add=[3]} 0 0
[junit4:junit4]   2> 791 T681 C42 UPDATE [collection1] webapp=/solr path=/update params={version=2&wt=javabin} {add=[3]} 0 1
[junit4:junit4]   2> 793 T651 C39 UPDATE [collection1] webapp=/solr path=/update params={version=2&wt=javabin} {add=[4]} 0 0
[junit4:junit4]   2> 795 T661 C40 UPDATE [collection1] webapp=/solr path=/update params={version=2&wt=javabin} {add=[4]} 0 0
[junit4:junit4]   2> 797 T651 C39 UPDATE [collection1] webapp=/solr path=/update params={version=2&wt=javabin} {add=[5]} 0 0
[junit4:junit4]   2> 800 T671 C41 UPDATE [collection1] webapp=/solr path=/update params={version=2&wt=javabin} {add=[5]} 0 1
[junit4:junit4]   2> 802 T651 C39 UPDATE [collection1] webapp=/solr path=/update params={version=2&wt=javabin} {add=[6]} 0 0
[junit4:junit4]   2> 804 T681 C42 UPDATE [collection1] webapp=/solr path=/update params={version=2&wt=javabin} {add=[6]} 0 1
[junit4:junit4]   2> 806 T651 C39 UPDATE [collection1] webapp=/solr path=/update params={version=2&wt=javabin} {add=[7]} 0 0
[junit4:junit4]   2> 808 T681 C42 UPDATE [collection1] webapp=/solr path=/update params={version=2&wt=javabin} {add=[7]} 0 0
[junit4:junit4]   2> 810 T651 C39 oasu.DirectUpdateHandler2.commit start commit{flags=0,version=0,optimize=false,openSearcher=true,waitSearcher=true,expungeDeletes=false,softCommit=false}
[junit4:junit4]   2> 819 T651 C39 oasc.SolrDeletionPolicy.onCommit SolrDeletionPolicy.onCommit: commits:num=2
[junit4:junit4]   2> 		commit{dir=MockDirWrapper(org.apache.lucene.store.RAMDirectory@5fb50df3 lockFactory=org.apache.lucene.store.SingleInstanceLockFactory@4540047),segFN=segments_1,generation=1,filenames=[segments_1]
[junit4:junit4]   2> 		commit{dir=MockDirWrapper(org.apache.lucene.store.RAMDirectory@5fb50df3 lockFactory=org.apache.lucene.store.SingleInstanceLockFactory@4540047),segFN=segments_2,generation=2,filenames=[_0_Lucene40WithOrds_0.frq, _0_Asserting_0.frq, segments_2, _0_nrm.cfs, _0.fdt, _0.si, _0_nrm.cfe, _0_Lucene40WithOrds_0.tii, _0.fdx, _0_Asserting_0.tip, _0.fnm, _0_Asserting_0.prx, _0_Asserting_0.tim, _0_Lucene40WithOrds_0.prx, _0_Lucene40WithOrds_0.tib]
[junit4:junit4]   2> 820 T651 C39 oasc.SolrDeletionPolicy.updateCommits newest commit = 2
[junit4:junit4]   2> 820 T651 C39 oass.SolrIndexSearcher.<init> Opening Searcher@4e181df6 main
[junit4:junit4]   2> 820 T651 C39 oass.SolrIndexSearcher.getIndexDir WARNING WARNING: Directory impl does not support setting indexDir: org.apache.lucene.store.MockDirectoryWrapper
[junit4:junit4]   2> 821 T651 C39 oasu.DirectUpdateHandler2.commit end_commit_flush
[junit4:junit4]   2> 821 T658 oasc.SolrCore.registerSearcher [collection1] Registered new searcher Searcher@4e181df6 main{StandardDirectoryReader(segments_2:4 _0(5.0):C7)}
[junit4:junit4]   2> 822 T651 C39 UPDATE [collection1] webapp=/solr path=/update params={softCommit=false&waitSearcher=true&version=2&commit=true&wt=javabin} {commit=} 0 12
[junit4:junit4]   2> 824 T661 C40 oasu.DirectUpdateHandler2.commit start commit{flags=0,version=0,optimize=false,openSearcher=true,waitSearcher=true,expungeDeletes=false,softCommit=false}
[junit4:junit4]   2> 825 T661 C40 oasc.SolrDeletionPolicy.onCommit SolrDeletionPolicy.onCommit: commits:num=2
[junit4:junit4]   2> 		commit{dir=MockDirWrapper(org.apache.lucene.store.RAMDirectory@2fecd6bb lockFactory=org.apache.lucene.store.SingleInstanceLockFactory@7d3c54ea),segFN=segments_1,generation=1,filenames=[segments_1]
[junit4:junit4]   2> 		commit{dir=MockDirWrapper(org.apache.lucene.store.RAMDirectory@2fecd6bb lockFactory=org.apache.lucene.store.SingleInstanceLockFactory@7d3c54ea),segFN=segments_2,generation=2,filenames=[_0_Lucene40WithOrds_0.frq, _0_Asserting_0.frq, segments_2, _0_nrm.cfs, _0.fdt, _0.si, _0_nrm.cfe, _0_Lucene40WithOrds_0.tii, _0.fdx, _0_Asserting_0.tip, _0.fnm, _0_Asserting_0.prx, _0_Asserting_0.tim, _0_Lucene40WithOrds_0.prx, _0_Lucene40WithOrds_0.tib]
[junit4:junit4]   2> 825 T661 C40 oasc.SolrDeletionPolicy.updateCommits newest commit = 2
[junit4:junit4]   2> 825 T661 C40 oass.SolrIndexSearcher.<init> Opening Searcher@73420f0f main
[junit4:junit4]   2> 826 T661 C40 oass.SolrIndexSearcher.getIndexDir WARNING WARNING: Directory impl does not support setting indexDir: org.apache.lucene.store.MockDirectoryWrapper
[junit4:junit4]   2> 826 T661 C40 oasu.DirectUpdateHandler2.commit end_commit_flush
[junit4:junit4]   2> 826 T668 oasc.SolrCore.registerSearcher [collection1] Registered new searcher Searcher@73420f0f main{StandardDirectoryReader(segments_2:4 _0(5.0):C2)}
[junit4:junit4]   2> 826 T661 C40 UPDATE [collection1] webapp=/solr path=/update params={softCommit=false&waitSearcher=true&version=2&commit=true&wt=javabin} {commit=} 0 2
[junit4:junit4]   2> 828 T671 C41 oasu.DirectUpdateHandler2.commit start commit{flags=0,version=0,optimize=false,openSearcher=true,waitSearcher=true,expungeDeletes=false,softCommit=false}
[junit4:junit4]   2> 830 T671 C41 oasc.SolrDeletionPolicy.onCommit SolrDeletionPolicy.onCommit: commits:num=2
[junit4:junit4]   2> 		commit{dir=MockDirWrapper(NRTCachingDirectory(org.apache.lucene.store.RAMDirectory@4e494fdb lockFactory=org.apache.lucene.store.SingleInstanceLockFactory@7f845138; maxCacheMB=0.1513671875 maxMergeSizeMB=0.880859375)),segFN=segments_1,generation=1,filenames=[segments_1]
[junit4:junit4]   2> 		commit{dir=MockDirWrapper(NRTCachingDirectory(org.apache.lucene.store.RAMDirectory@4e494fdb lockFactory=org.apache.lucene.store.SingleInstanceLockFactory@7f845138; maxCacheMB=0.1513671875 maxMergeSizeMB=0.880859375)),segFN=segments_2,generation=2,filenames=[_0_Asserting_0.frq, _0_Lucene40WithOrds_0.frq, segments_2, _0_nrm.cfs, _0.fdt, _0.si, _0_nrm.cfe, _0_Lucene40WithOrds_0.tii, _0.fdx, _0_Asserting_0.tip, _0.fnm, _0_Asserting_0.prx, _0_Asserting_0.tim, _0_Lucene40WithOrds_0.prx, _0_Lucene40WithOrds_0.tib]
[junit4:junit4]   2> 830 T671 C41 oasc.SolrDeletionPolicy.updateCommits newest commit = 2
[junit4:junit4]   2> 831 T671 C41 oass.SolrIndexSearcher.<init> Opening Searcher@5a30dcdc main
[junit4:junit4]   2> 831 T671 C41 oass.SolrIndexSearcher.getIndexDir WARNING WARNING: Directory impl does not support setting indexDir: org.apache.lucene.store.MockDirectoryWrapper
[junit4:junit4]   2> 831 T671 C41 oasu.DirectUpdateHandler2.commit end_commit_flush
[junit4:junit4]   2> 831 T678 oasc.SolrCore.registerSearcher [collection1] Registered new searcher Searcher@5a30dcdc main{StandardDirectoryReader(segments_2:4 _0(5.0):C2)}
[junit4:junit4]   2> 832 T671 C41 UPDATE [collection1] webapp=/solr path=/update params={softCommit=false&waitSearcher=true&version=2&commit=true&wt=javabin} {commit=} 0 4
[junit4:junit4]   2> 834 T681 C42 oasu.DirectUpdateHandler2.commit start commit{flags=0,version=0,optimize=false,openSearcher=true,waitSearcher=true,expungeDeletes=false,softCommit=false}
[junit4:junit4]   2> 835 T681 C42 oasc.SolrDeletionPolicy.onCommit SolrDeletionPolicy.onCommit: commits:num=2
[junit4:junit4]   2> 		commit{dir=MockDirWrapper(NRTCachingDirectory(org.apache.lucene.store.RAMDirectory@ace0c6a lockFactory=org.apache.lucene.store.SingleInstanceLockFactory@3e49a768; maxCacheMB=0.751953125 maxMergeSizeMB=0.9345703125)),segFN=segments_1,generation=1,filenames=[segments_1]
[junit4:junit4]   2> 		commit{dir=MockDirWrapper(NRTCachingDirectory(org.apache.lucene.store.RAMDirectory@ace0c6a lockFactory=org.apache.lucene.store.SingleInstanceLockFactory@3e49a768; maxCacheMB=0.751953125 maxMergeSizeMB=0.9345703125)),segFN=segments_2,generation=2,filenames=[_0_Asserting_0.frq, _0_Lucene40WithOrds_0.frq, segments_2, _0_nrm.cfs, _0.fdt, _0.si, _0_nrm.cfe, _0_Lucene40WithOrds_0.tii, _0.fdx, _0_Asserting_0.tip, _0.fnm, _0_Asserting_0.prx, _0_Asserting_0.tim, _0_Lucene40WithOrds_0.prx, _0_Lucene40WithOrds_0.tib]
[junit4:junit4]   2> 836 T681 C42 oasc.SolrDeletionPolicy.updateCommits newest commit = 2
[junit4:junit4]   2> 837 T681 C42 oass.SolrIndexSearcher.<init> Opening Searcher@7733375b main
[junit4:junit4]   2> 837 T681 C42 oass.SolrIndexSearcher.getIndexDir WARNING WARNING: Directory impl does not support setting indexDir: org.apache.lucene.store.MockDirectoryWrapper
[junit4:junit4]   2> 837 T681 C42 oasu.DirectUpdateHandler2.commit end_commit_flush
[junit4:junit4]   2> 837 T688 oasc.SolrCore.registerSearcher [collection1] Registered new searcher Searcher@7733375b main{StandardDirectoryReader(segments_2:4 _0(5.0):C3)}
[junit4:junit4]   2> 838 T681 C42 UPDATE [collection1] webapp=/solr path=/update params={softCommit=false&waitSearcher=true&version=2&commit=true&wt=javabin} {commit=} 0 4
[junit4:junit4]   2> 841 T651 C39 REQ [collection1] webapp=/solr path=/elevate params={q=*:*&shards.qt=/elevate&fl=id,+score,+[elevated]&version=2&distrib=false&sort=id+desc&qt=/elevate&rows=500&wt=javabin} hits=7 status=0 QTime=1 
[junit4:junit4]   2> 846 T682 C42 REQ [collection1] webapp=/solr path=/elevate params={shard.url=localhost:54921/solr&q=*:*&NOW=1342212696454&fsv=true&fl=id,score&sort=id+desc&isShard=true&start=0&qt=/elevate&wt=javabin&shards.qt=/elevate&version=2&distrib=false&rows=500} hits=3 status=0 QTime=0 
[junit4:junit4]   2> 848 T672 C41 REQ [collection1] webapp=/solr path=/elevate params={shard.url=localhost:41104/solr|[::1]:33332/solr&q=*:*&NOW=1342212696454&fsv=true&fl=id,score&sort=id+desc&isShard=true&start=0&qt=/elevate&wt=javabin&shards.qt=/elevate&version=2&distrib=false&rows=500} hits=2 status=0 QTime=0 
[junit4:junit4]   2> 848 T662 C40 REQ [collection1] webapp=/solr path=/elevate params={shard.url=[::1]:33332/solr|localhost:50923/solr&q=*:*&NOW=1342212696454&fsv=true&fl=id,score&sort=id+desc&isShard=true&start=0&qt=/elevate&wt=javabin&shards.qt=/elevate&version=2&distrib=false&rows=500} hits=2 status=0 QTime=0 
[junit4:junit4]   2> 851 T672 C41 REQ [collection1] webapp=/solr path=/elevate params={shard.url=localhost:41104/solr|[::1]:33332/solr&q=*:*&NOW=1342212696454&fl=id,+score,+[elevated]&isShard=true&qt=/elevate&wt=javabin&shards.qt=/elevate&version=2&ids=2.0,5.0&distrib=false&rows=500} status=0 QTime=0 
[junit4:junit4]   2> 851 T682 C42 REQ [collection1] webapp=/solr path=/elevate params={shard.url=localhost:54921/solr&q=*:*&NOW=1342212696454&fl=id,+score,+[elevated]&isShard=true&qt=/elevate&wt=javabin&shards.qt=/elevate&version=2&ids=6.0,3.0,7.0&distrib=false&rows=500} status=0 QTime=0 
[junit4:junit4]   2> 852 T662 C40 REQ [collection1] webapp=/solr path=/elevate params={shard.url=[::1]:33332/solr|localhost:50923/solr&q=*:*&NOW=1342212696454&fl=id,+score,+[elevated]&isShard=true&qt=/elevate&wt=javabin&shards.qt=/elevate&version=2&ids=4.0,1.0&distrib=false&rows=500} status=0 QTime=0 
[junit4:junit4]   2> 852 T661 C40 REQ [collection1] webapp=/solr path=/elevate params={q=*:*&shards.qt=/elevate&fl=id,+score,+[elevated]&version=2&shards=[::1]:33332/solr|localhost:50923/solr,localhost:41104/solr|[::1]:33332/solr,localhost:54921/solr&sort=id+desc&qt=/elevate&rows=500&wt=javabin} status=0 QTime=9 
[junit4:junit4]   2> 853 T648 oasc.CoreContainer.shutdown Shutting down CoreContainer instance=1157268540
[junit4:junit4]   2> 854 T648 oasc.SolrCore.close [collection1]  CLOSING SolrCore org.apache.solr.core.SolrCore@29239796
[junit4:junit4]   2> 854 T648 oasc.SolrCore.closeSearcher [collection1] Closing main searcher on request.
[junit4:junit4]   2> 854 T648 oasu.DirectUpdateHandler2.close closing DirectUpdateHandler2{commits=1,autocommits=0,soft autocommits=0,optimizes=0,rollbacks=0,expungeDeletes=0,docsPending=0,adds=0,deletesById=0,deletesByQuery=0,errors=0,cumulative_adds=7,cumulative_deletesById=0,cumulative_deletesByQuery=1,cumulative_errors=0}
[junit4:junit4]   2> 857 T648 oejsh.ContextHandler.doStop stopped o.e.j.s.ServletContextHandler{/solr,null}
[junit4:junit4]   2> 908 T648 oasc.CoreContainer.shutdown Shutting down CoreContainer instance=1530813783
[junit4:junit4]   2> 909 T648 oasc.SolrCore.close [collection1]  CLOSING SolrCore org.apache.solr.core.SolrCore@7562e60a
[junit4:junit4]   2> 909 T648 oasc.SolrCore.closeSearcher [collection1] Closing main searcher on request.
[junit4:junit4]   2> 910 T648 oasu.DirectUpdateHandler2.close closing DirectUpdateHandler2{commits=1,autocommits=0,soft autocommits=0,optimizes=0,rollbacks=0,expungeDeletes=0,docsPending=0,adds=0,deletesById=0,deletesByQuery=0,errors=0,cumulative_adds=2,cumulative_deletesById=0,cumulative_deletesByQuery=1,cumulative_errors=0}
[junit4:junit4]   2> 912 T648 oejsh.ContextHandler.doStop stopped o.e.j.s.ServletContextHandler{/solr,null}
[junit4:junit4]   2> 964 T648 oasc.CoreContainer.shutdown Shutting down CoreContainer instance=957956409
[junit4:junit4]   2> 965 T648 oasc.SolrCore.close [collection1]  CLOSING SolrCore org.apache.solr.core.SolrCore@6d1c1393
[junit4:junit4]   2> 965 T648 oasc.SolrCore.closeSearcher [collection1] Closing main searcher on request.
[junit4:junit4]   2> 966 T648 oasu.DirectUpdateHandler2.close closing DirectUpdateHandler2{commits=1,autocommits=0,soft autocommits=0,optimizes=0,rollbacks=0,expungeDeletes=0,docsPending=0,adds=0,deletesById=0,deletesByQuery=0,errors=0,cumulative_adds=2,cumulative_deletesById=0,cumulative_deletesByQuery=1,cumulative_errors=0}
[junit4:junit4]   2> 968 T648 oejsh.ContextHandler.doStop stopped o.e.j.s.ServletContextHandler{/solr,null}
[junit4:junit4]   2> 1020 T648 oasc.CoreContainer.shutdown Shutting down CoreContainer instance=1372225898
[junit4:junit4]   2> 1021 T648 oasc.SolrCore.close [collection1]  CLOSING SolrCore org.apache.solr.core.SolrCore@6435d75c
[junit4:junit4]   2> 1021 T648 oasc.SolrCore.closeSearcher [collection1] Closing main searcher on request.
[junit4:junit4]   2> 1021 T648 oasu.DirectUpdateHandler2.close closing DirectUpdateHandler2{commits=1,autocommits=0,soft autocommits=0,optimizes=0,rollbacks=0,expungeDeletes=0,docsPending=0,adds=0,deletesById=0,deletesByQuery=0,errors=0,cumulative_adds=3,cumulative_deletesById=0,cumulative_deletesByQuery=1,cumulative_errors=0}
[junit4:junit4]   2> 1024 T648 oejsh.ContextHandler.doStop stopped o.e.j.s.ServletContextHandler{/solr,null}
[junit4:junit4]   2> 1076 T648 oas.SolrTestCaseJ4.tearDown ###Ending testDistribSearch
[junit4:junit4]   2> NOTE: reproduce with: ant test  -Dtestcase=DistributedQueryElevationComponentTest -Dtests.method=testDistribSearch -Dtests.seed=5629B043F56D9EA8 -Dtests.multiplier=3 -Dtests.slow=true -Dtests.locale=en_AU -Dtests.timezone=Asia/Manila -Dtests.file.encoding=UTF-8
[junit4:junit4]   2>
[junit4:junit4]    > (@AfterClass output)
[junit4:junit4]   2> 1115 T648 oas.SolrTestCaseJ4.deleteCore ###deleteCore
[junit4:junit4]   2> NOTE: test params are: codec=Lucene40: {id=PostingsFormat(name=Asserting), int_i=PostingsFormat(name=Lucene40WithOrds), text=PostingsFormat(name=Lucene40WithOrds), plow_t=PostingsFormat(name=Asserting), field_t=PostingsFormat(name=Lucene40WithOrds)}, sim=RandomSimilarityProvider(queryNorm=true,coord=false): {}, locale=en_AU, timezone=Asia/Manila
[junit4:junit4]   2> NOTE: Linux 3.2.0-26-generic amd64/Oracle Corporation 1.8.0-ea (64-bit)/cpus=8,threads=1,free=31493744,total=286654464
[junit4:junit4]   2> NOTE: All tests run in this JVM: [TestFaceting, SolrInfoMBeanTest, DOMUtilTest, SpatialFilterTest, DoubleMetaphoneFilterFactoryTest, SnowballPorterFilterFactoryTest, TestRandomFaceting, TestItalianLightStemFilterFactory, TestFiltering, TestPhraseSuggestions, TestStressLucene, TestWordDelimiterFilterFactory, TestFoldingMultitermQuery, TestSpanishLightStemFilterFactory, TestFrenchMinimalStemFilterFactory, CommonGramsQueryFilterFactoryTest, SystemInfoHandlerTest, SuggesterTest, TestJapaneseKatakanaStemFilterFactory, SOLR749Test, SimpleFacetsTest, FullSolrCloudDistribCmdsTest, SolrCoreCheckLockOnStartupTest, ConvertedLegacyTest, ShowFileRequestHandlerTest, TestQueryUtils, SolrCmdDistributorTest, TestIrishLowerCaseFilterFactory, TermsComponentTest, CopyFieldTest, TestPhoneticFilterFactory, TestFinnishLightStemFilterFactory, ScriptEngineTest, TestRTGBase, TestSearchPerf, TestHashPartitioner, TestTrimFilterFactory, TestStandardFactories, BadComponentTest, AutoCommitTest, SuggesterTSTTest, TestUpdate, TestJoin, TestSynonymFilterFactory, LukeRequestHandlerTest, UpdateRequestProcessorFactoryTest, TestNorwegianLightStemFilterFactory, TestSurroundQueryParser, TestBinaryField, BasicFunctionalityTest, TestPerFieldSimilarity, TestHTMLStripCharFilterFactory, TestDictionaryCompoundWordTokenFilterFactory, DirectUpdateHandlerTest, TestBM25SimilarityFactory, LegacyHTMLStripCharFilterTest, CacheHeaderTest, LeaderElectionIntegrationTest, OpenExchangeRatesOrgProviderTest, TestRemoveDuplicatesTokenFilterFactory, DistributedQueryElevationComponentTest]
[junit4:junit4]   2> 
[junit4:junit4] Completed on J0 in 1.12s, 1 test, 1 error <<< FAILURES!

[...truncated 479 lines...]
BUILD FAILED
/mnt/ssd/jenkins/workspace/Lucene-Solr-trunk-Linux-Java8-64/checkout/build.xml:29: The following error occurred while executing this line:
/mnt/ssd/jenkins/workspace/Lucene-Solr-trunk-Linux-Java8-64/checkout/solr/build.xml:144: The following error occurred while executing this line:
/mnt/ssd/jenkins/workspace/Lucene-Solr-trunk-Linux-Java8-64/checkout/lucene/module-build.xml:62: The following error occurred while executing this line:
/mnt/ssd/jenkins/workspace/Lucene-Solr-trunk-Linux-Java8-64/checkout/lucene/common-build.xml:1096: The following error occurred while executing this line:
/mnt/ssd/jenkins/workspace/Lucene-Solr-trunk-Linux-Java8-64/checkout/lucene/common-build.xml:793: There were test failures: 294 suites, 1050 tests, 1 error, 5 ignored

Total time: 18 minutes 44 seconds
Build step 'Execute shell' marked build as failure
Archiving artifacts
Recording test results
Email was triggered for: Failure
Sending email for trigger: Failure




Mime
View raw message