lucene-dev mailing list archives

Site index · List index
Message view « Date » · « Thread »
Top « Date » · « Thread »
From Policeman Jenkins Server <jenk...@sd-datasolutions.de>
Subject [JENKINS] Lucene-Solr-4.x-Linux (32bit/jdk1.8.0-ea-b49) - Build # 35 - Failure!
Date Tue, 31 Jul 2012 01:07:08 GMT
Build: http://jenkins.sd-datasolutions.de/job/Lucene-Solr-4.x-Linux/35/
Java: 32bit/jdk1.8.0-ea-b49 -client -XX:+UseSerialGC

1 tests failed.
REGRESSION:  org.apache.solr.handler.component.DistributedQueryElevationComponentTest.testDistribSearch

Error Message:
.responseHeader.params.size()==9,9skipped=5,4

Stack Trace:
junit.framework.AssertionFailedError: .responseHeader.params.size()==9,9skipped=5,4
	at __randomizedtesting.SeedInfo.seed([A55186A1CBEF2E4:8BB396726BE192D8]:0)
	at junit.framework.Assert.fail(Assert.java:50)
	at org.apache.solr.BaseDistributedSearchTestCase.compareResponses(BaseDistributedSearchTestCase.java:670)
	at org.apache.solr.BaseDistributedSearchTestCase.query(BaseDistributedSearchTestCase.java:392)
	at org.apache.solr.handler.component.DistributedQueryElevationComponentTest.doTest(DistributedQueryElevationComponentTest.java:81)
	at org.apache.solr.BaseDistributedSearchTestCase.testDistribSearch(BaseDistributedSearchTestCase.java:679)
	at sun.reflect.NativeMethodAccessorImpl.invoke0(Native Method)
	at sun.reflect.NativeMethodAccessorImpl.invoke(NativeMethodAccessorImpl.java:57)
	at sun.reflect.DelegatingMethodAccessorImpl.invoke(DelegatingMethodAccessorImpl.java:43)
	at java.lang.reflect.Method.invoke(Method.java:474)
	at com.carrotsearch.randomizedtesting.RandomizedRunner.invoke(RandomizedRunner.java:1995)
	at com.carrotsearch.randomizedtesting.RandomizedRunner.access$1100(RandomizedRunner.java:132)
	at com.carrotsearch.randomizedtesting.RandomizedRunner$6.evaluate(RandomizedRunner.java:818)
	at com.carrotsearch.randomizedtesting.RandomizedRunner$7.evaluate(RandomizedRunner.java:877)
	at com.carrotsearch.randomizedtesting.RandomizedRunner$8.evaluate(RandomizedRunner.java:891)
	at com.carrotsearch.randomizedtesting.rules.SystemPropertiesRestoreRule$1.evaluate(SystemPropertiesRestoreRule.java:53)
	at org.apache.lucene.util.TestRuleSetupTeardownChained$1.evaluate(TestRuleSetupTeardownChained.java:50)
	at org.apache.lucene.util.TestRuleFieldCacheSanity$1.evaluate(TestRuleFieldCacheSanity.java:32)
	at org.apache.lucene.util.AbstractBeforeAfterRule$1.evaluate(AbstractBeforeAfterRule.java:45)
	at com.carrotsearch.randomizedtesting.rules.SystemPropertiesInvariantRule$1.evaluate(SystemPropertiesInvariantRule.java:55)
	at org.apache.lucene.util.TestRuleReportUncaughtExceptions$1.evaluate(TestRuleReportUncaughtExceptions.java:68)
	at org.apache.lucene.util.TestRuleThreadAndTestName$1.evaluate(TestRuleThreadAndTestName.java:48)
	at org.apache.lucene.util.TestRuleIgnoreAfterMaxFailures$1.evaluate(TestRuleIgnoreAfterMaxFailures.java:70)
	at org.apache.lucene.util.TestRuleMarkFailure$1.evaluate(TestRuleMarkFailure.java:48)
	at com.carrotsearch.randomizedtesting.RandomizedRunner.runSingleTest(RandomizedRunner.java:825)
	at com.carrotsearch.randomizedtesting.RandomizedRunner.access$700(RandomizedRunner.java:132)
	at com.carrotsearch.randomizedtesting.RandomizedRunner$3$1.run(RandomizedRunner.java:671)
	at com.carrotsearch.randomizedtesting.RandomizedRunner$3.evaluate(RandomizedRunner.java:697)
	at com.carrotsearch.randomizedtesting.RandomizedRunner$4.evaluate(RandomizedRunner.java:736)
	at com.carrotsearch.randomizedtesting.RandomizedRunner$5.evaluate(RandomizedRunner.java:747)
	at com.carrotsearch.randomizedtesting.rules.SystemPropertiesRestoreRule$1.evaluate(SystemPropertiesRestoreRule.java:53)
	at org.apache.lucene.util.AbstractBeforeAfterRule$1.evaluate(AbstractBeforeAfterRule.java:45)
	at org.apache.lucene.util.TestRuleReportUncaughtExceptions$1.evaluate(TestRuleReportUncaughtExceptions.java:68)
	at org.apache.lucene.util.TestRuleStoreClassName$1.evaluate(TestRuleStoreClassName.java:38)
	at com.carrotsearch.randomizedtesting.rules.SystemPropertiesInvariantRule$1.evaluate(SystemPropertiesInvariantRule.java:55)
	at org.apache.lucene.util.TestRuleNoInstanceHooksOverrides$1.evaluate(TestRuleNoInstanceHooksOverrides.java:53)
	at org.apache.lucene.util.TestRuleNoStaticHooksShadowing$1.evaluate(TestRuleNoStaticHooksShadowing.java:52)
	at org.apache.lucene.util.TestRuleAssertionsRequired$1.evaluate(TestRuleAssertionsRequired.java:36)
	at org.apache.lucene.util.TestRuleMarkFailure$1.evaluate(TestRuleMarkFailure.java:48)
	at org.apache.lucene.util.TestRuleIgnoreAfterMaxFailures$1.evaluate(TestRuleIgnoreAfterMaxFailures.java:70)
	at org.apache.lucene.util.TestRuleIgnoreTestSuites$1.evaluate(TestRuleIgnoreTestSuites.java:55)
	at com.carrotsearch.randomizedtesting.RandomizedRunner.runSuite(RandomizedRunner.java:605)
	at com.carrotsearch.randomizedtesting.RandomizedRunner.access$400(RandomizedRunner.java:132)
	at com.carrotsearch.randomizedtesting.RandomizedRunner$2.run(RandomizedRunner.java:551)




Build Log:
[...truncated 7627 lines...]
[junit4:junit4] Suite: org.apache.solr.handler.component.DistributedQueryElevationComponentTest
[junit4:junit4] FAILURE 1.55s J1 | DistributedQueryElevationComponentTest.testDistribSearch
[junit4:junit4]    > Throwable #1: junit.framework.AssertionFailedError: .responseHeader.params.size()==9,9skipped=5,4
[junit4:junit4]    > 	at __randomizedtesting.SeedInfo.seed([A55186A1CBEF2E4:8BB396726BE192D8]:0)
[junit4:junit4]    > 	at junit.framework.Assert.fail(Assert.java:50)
[junit4:junit4]    > 	at org.apache.solr.BaseDistributedSearchTestCase.compareResponses(BaseDistributedSearchTestCase.java:670)
[junit4:junit4]    > 	at org.apache.solr.BaseDistributedSearchTestCase.query(BaseDistributedSearchTestCase.java:392)
[junit4:junit4]    > 	at org.apache.solr.handler.component.DistributedQueryElevationComponentTest.doTest(DistributedQueryElevationComponentTest.java:81)
[junit4:junit4]    > 	at org.apache.solr.BaseDistributedSearchTestCase.testDistribSearch(BaseDistributedSearchTestCase.java:679)
[junit4:junit4]    > 	at sun.reflect.NativeMethodAccessorImpl.invoke0(Native Method)
[junit4:junit4]    > 	at sun.reflect.NativeMethodAccessorImpl.invoke(NativeMethodAccessorImpl.java:57)
[junit4:junit4]    > 	at sun.reflect.DelegatingMethodAccessorImpl.invoke(DelegatingMethodAccessorImpl.java:43)
[junit4:junit4]    > 	at java.lang.reflect.Method.invoke(Method.java:474)
[junit4:junit4]    > 	at com.carrotsearch.randomizedtesting.RandomizedRunner.invoke(RandomizedRunner.java:1995)
[junit4:junit4]    > 	at com.carrotsearch.randomizedtesting.RandomizedRunner.access$1100(RandomizedRunner.java:132)
[junit4:junit4]    > 	at com.carrotsearch.randomizedtesting.RandomizedRunner$6.evaluate(RandomizedRunner.java:818)
[junit4:junit4]    > 	at com.carrotsearch.randomizedtesting.RandomizedRunner$7.evaluate(RandomizedRunner.java:877)
[junit4:junit4]    > 	at com.carrotsearch.randomizedtesting.RandomizedRunner$8.evaluate(RandomizedRunner.java:891)
[junit4:junit4]    > 	at com.carrotsearch.randomizedtesting.rules.SystemPropertiesRestoreRule$1.evaluate(SystemPropertiesRestoreRule.java:53)
[junit4:junit4]    > 	at org.apache.lucene.util.TestRuleSetupTeardownChained$1.evaluate(TestRuleSetupTeardownChained.java:50)
[junit4:junit4]    > 	at org.apache.lucene.util.TestRuleFieldCacheSanity$1.evaluate(TestRuleFieldCacheSanity.java:32)
[junit4:junit4]    > 	at org.apache.lucene.util.AbstractBeforeAfterRule$1.evaluate(AbstractBeforeAfterRule.java:45)
[junit4:junit4]    > 	at com.carrotsearch.randomizedtesting.rules.SystemPropertiesInvariantRule$1.evaluate(SystemPropertiesInvariantRule.java:55)
[junit4:junit4]    > 	at org.apache.lucene.util.TestRuleReportUncaughtExceptions$1.evaluate(TestRuleReportUncaughtExceptions.java:68)
[junit4:junit4]    > 	at org.apache.lucene.util.TestRuleThreadAndTestName$1.evaluate(TestRuleThreadAndTestName.java:48)
[junit4:junit4]    > 	at org.apache.lucene.util.TestRuleIgnoreAfterMaxFailures$1.evaluate(TestRuleIgnoreAfterMaxFailures.java:70)
[junit4:junit4]    > 	at org.apache.lucene.util.TestRuleMarkFailure$1.evaluate(TestRuleMarkFailure.java:48)
[junit4:junit4]    > 	at com.carrotsearch.randomizedtesting.RandomizedRunner.runSingleTest(RandomizedRunner.java:825)
[junit4:junit4]    > 	at com.carrotsearch.randomizedtesting.RandomizedRunner.access$700(RandomizedRunner.java:132)
[junit4:junit4]    > 	at com.carrotsearch.randomizedtesting.RandomizedRunner$3$1.run(RandomizedRunner.java:671)
[junit4:junit4]    > 	at com.carrotsearch.randomizedtesting.RandomizedRunner$3.evaluate(RandomizedRunner.java:697)
[junit4:junit4]    > 	at com.carrotsearch.randomizedtesting.RandomizedRunner$4.evaluate(RandomizedRunner.java:736)
[junit4:junit4]    > 	at com.carrotsearch.randomizedtesting.RandomizedRunner$5.evaluate(RandomizedRunner.java:747)
[junit4:junit4]    > 	at com.carrotsearch.randomizedtesting.rules.SystemPropertiesRestoreRule$1.evaluate(SystemPropertiesRestoreRule.java:53)
[junit4:junit4]    > 	at org.apache.lucene.util.AbstractBeforeAfterRule$1.evaluate(AbstractBeforeAfterRule.java:45)
[junit4:junit4]    > 	at org.apache.lucene.util.TestRuleReportUncaughtExceptions$1.evaluate(TestRuleReportUncaughtExceptions.java:68)
[junit4:junit4]    > 	at org.apache.lucene.util.TestRuleStoreClassName$1.evaluate(TestRuleStoreClassName.java:38)
[junit4:junit4]    > 	at com.carrotsearch.randomizedtesting.rules.SystemPropertiesInvariantRule$1.evaluate(SystemPropertiesInvariantRule.java:55)
[junit4:junit4]    > 	at org.apache.lucene.util.TestRuleNoInstanceHooksOverrides$1.evaluate(TestRuleNoInstanceHooksOverrides.java:53)
[junit4:junit4]    > 	at org.apache.lucene.util.TestRuleNoStaticHooksShadowing$1.evaluate(TestRuleNoStaticHooksShadowing.java:52)
[junit4:junit4]    > 	at org.apache.lucene.util.TestRuleAssertionsRequired$1.evaluate(TestRuleAssertionsRequired.java:36)
[junit4:junit4]    > 	at org.apache.lucene.util.TestRuleMarkFailure$1.evaluate(TestRuleMarkFailure.java:48)
[junit4:junit4]    > 	at org.apache.lucene.util.TestRuleIgnoreAfterMaxFailures$1.evaluate(TestRuleIgnoreAfterMaxFailures.java:70)
[junit4:junit4]    > 	at org.apache.lucene.util.TestRuleIgnoreTestSuites$1.evaluate(TestRuleIgnoreTestSuites.java:55)
[junit4:junit4]    > 	at com.carrotsearch.randomizedtesting.RandomizedRunner.runSuite(RandomizedRunner.java:605)
[junit4:junit4]    > 	at com.carrotsearch.randomizedtesting.RandomizedRunner.access$400(RandomizedRunner.java:132)
[junit4:junit4]    > 	at com.carrotsearch.randomizedtesting.RandomizedRunner$2.run(RandomizedRunner.java:551)
[junit4:junit4]    > 
[junit4:junit4]   2> 3 T8116 oas.SolrTestCaseJ4.setUp ###Starting testDistribSearch
[junit4:junit4]   2> 3 T8116 oejs.Server.doStart jetty-8.1.2.v20120308
[junit4:junit4]   2> 6 T8116 oejs.AbstractConnector.doStart Started SocketConnector@0.0.0.0:49834
[junit4:junit4]   2> 6 T8116 oasc.SolrResourceLoader.locateSolrHome JNDI not configured for solr (NoInitialContextEx)
[junit4:junit4]   2> 6 T8116 oasc.SolrResourceLoader.locateSolrHome using system property solr.solr.home: /mnt/ssd/jenkins/workspace/Lucene-Solr-4.x-Linux/checkout/solr/build/solr-core/test-files/solr
[junit4:junit4]   2> 6 T8116 oasc.SolrResourceLoader.<init> new SolrResourceLoader for deduced Solr Home: '/mnt/ssd/jenkins/workspace/Lucene-Solr-4.x-Linux/checkout/solr/build/solr-core/test-files/solr/'
[junit4:junit4]   2> 14 T8116 oass.SolrDispatchFilter.init SolrDispatchFilter.init()
[junit4:junit4]   2> 14 T8116 oasc.SolrResourceLoader.locateSolrHome JNDI not configured for solr (NoInitialContextEx)
[junit4:junit4]   2> 14 T8116 oasc.SolrResourceLoader.locateSolrHome using system property solr.solr.home: /mnt/ssd/jenkins/workspace/Lucene-Solr-4.x-Linux/checkout/solr/build/solr-core/test-files/solr
[junit4:junit4]   2> 15 T8116 oasc.CoreContainer$Initializer.initialize looking for solr.xml: /mnt/ssd/jenkins/workspace/Lucene-Solr-4.x-Linux/checkout/solr/build/solr-core/test-files/solr/solr.xml
[junit4:junit4]   2> 15 T8116 oasc.CoreContainer.<init> New CoreContainer 9841313
[junit4:junit4]   2> 15 T8116 oasc.CoreContainer.load Loading CoreContainer using Solr Home: '/mnt/ssd/jenkins/workspace/Lucene-Solr-4.x-Linux/checkout/solr/build/solr-core/test-files/solr/'
[junit4:junit4]   2> 15 T8116 oasc.SolrResourceLoader.<init> new SolrResourceLoader for directory: '/mnt/ssd/jenkins/workspace/Lucene-Solr-4.x-Linux/checkout/solr/build/solr-core/test-files/solr/'
[junit4:junit4]   2> 25 T8116 oasc.CoreContainer.load Registering Log Listener
[junit4:junit4]   2> 37 T8116 oasc.CoreContainer.create Creating SolrCore 'collection1' using instanceDir: /mnt/ssd/jenkins/workspace/Lucene-Solr-4.x-Linux/checkout/solr/build/solr-core/test-files/solr/collection1
[junit4:junit4]   2> 37 T8116 oasc.SolrResourceLoader.<init> new SolrResourceLoader for directory: '/mnt/ssd/jenkins/workspace/Lucene-Solr-4.x-Linux/checkout/solr/build/solr-core/test-files/solr/collection1/'
[junit4:junit4]   2> 38 T8116 oasc.SolrResourceLoader.replaceClassLoader Adding 'file:/mnt/ssd/jenkins/workspace/Lucene-Solr-4.x-Linux/checkout/solr/build/solr-core/test-files/solr/collection1/lib/README' to classloader
[junit4:junit4]   2> 38 T8116 oasc.SolrResourceLoader.replaceClassLoader Adding 'file:/mnt/ssd/jenkins/workspace/Lucene-Solr-4.x-Linux/checkout/solr/build/solr-core/test-files/solr/collection1/lib/classes/' to classloader
[junit4:junit4]   2> 60 T8116 oasc.SolrConfig.<init> Using Lucene MatchVersion: LUCENE_40
[junit4:junit4]   2> 100 T8116 oasc.SolrConfig.<init> Loaded SolrConfig: solrconfig-elevate.xml
[junit4:junit4]   2> 101 T8116 oass.IndexSchema.readSchema Reading Solr Schema
[junit4:junit4]   2> 103 T8116 oass.IndexSchema.readSchema Schema name=example
[junit4:junit4]   2> 247 T8116 oass.IndexSchema.readSchema default search field in schema is text
[junit4:junit4]   2> 249 T8116 oass.IndexSchema.readSchema unique key field: id
[junit4:junit4]   2> 251 T8116 oasc.SolrCore.<init> [collection1] Opening new SolrCore at /mnt/ssd/jenkins/workspace/Lucene-Solr-4.x-Linux/checkout/solr/build/solr-core/test-files/solr/collection1/, dataDir=./org.apache.solr.handler.component.DistributedQueryElevationComponentTest-1343696725125/control/data/
[junit4:junit4]   2> 252 T8116 oasc.JmxMonitoredMap.<init> JMX monitoring is enabled. Adding Solr mbeans to JMX Server: com.sun.jmx.mbeanserver.JmxMBeanServer@c089da
[junit4:junit4]   2> 252 T8116 oasc.SolrCore.getNewIndexDir WARNING New index directory detected: old=null new=./org.apache.solr.handler.component.DistributedQueryElevationComponentTest-1343696725125/control/data/index/
[junit4:junit4]   2> 252 T8116 oasc.SolrCore.initIndex WARNING [collection1] Solr index directory './org.apache.solr.handler.component.DistributedQueryElevationComponentTest-1343696725125/control/data/index' doesn't exist. Creating new index...
[junit4:junit4]   2> 253 T8116 oasc.SolrDeletionPolicy.onCommit SolrDeletionPolicy.onCommit: commits:num=1
[junit4:junit4]   2> 		commit{dir=MockDirWrapper(org.apache.lucene.store.RAMDirectory@1c11b74 lockFactory=org.apache.lucene.store.SingleInstanceLockFactory@14396fa),segFN=segments_1,generation=1,filenames=[segments_1]
[junit4:junit4]   2> 254 T8116 oasc.SolrDeletionPolicy.updateCommits newest commit = 1
[junit4:junit4]   2> 255 T8116 oasc.RequestHandlers.initHandlersFromConfig created /update: solr.UpdateRequestHandler
[junit4:junit4]   2> 255 T8116 oasc.RequestHandlers.initHandlersFromConfig created /elevate: org.apache.solr.handler.component.SearchHandler
[junit4:junit4]   2> 256 T8116 oasc.RequestHandlers.initHandlersFromConfig created /dataElevate: org.apache.solr.handler.component.SearchHandler
[junit4:junit4]   2> 256 T8116 oashl.XMLLoader.init xsltCacheLifetimeSeconds=60
[junit4:junit4]   2> 256 T8116 oasc.RequestHandlers.initHandlersFromConfig WARNING no default request handler is registered (either '/select' or 'standard')
[junit4:junit4]   2> 257 T8116 oasc.SolrCore.initDeprecatedSupport WARNING solrconfig.xml uses deprecated <admin/gettableFiles>, Please update your config to use the ShowFileRequestHandler.
[junit4:junit4]   2> 258 T8116 oasc.SolrCore.initDeprecatedSupport WARNING adding ShowFileRequestHandler with hidden files: [KEEP-2.TXT, STOP-SNOWBALL.TXT, SOLRCONFIG-PROPINJECT.XML, STOPTYPES-2.TXT, SOLRCONFIG-TERMINDEX.XML, OPEN-EXCHANGE-RATES.JSON, STOPWORDS.TXT, SCHEMA-DFR.XML, BAD-SOLRCONFIG-MISSING-SCRIPTFILE.XML, BAD-SCHEMA-DUP-FIELDTYPE.XML, SCHEMA-LMJELINEKMERCER.XML, SOLRCONFIG-FUNCTIONQUERY.XML, SCHEMA-STOP-KEEP.XML, BAD-SCHEMA-SIM-GLOBAL-VS-FT-MISMATCH.XML, SCHEMA-SIM.XML, BAD-SCHEMA-NOT-INDEXED-BUT-TF.XML, BAD-SCHEMA-UNIQUEKEY-MULTIVALUED.XML, SOLRCONFIG-SPELLCHECKER.XML, SOLRCONFIG-MASTER.XML, SOLRCONFIG-SCRIPT-UPDATEPROCESSOR.XML, ELEVATE.XML, TRIVIAL.UPDATEPROCESSOR0.JS, HUNSPELL-TEST.DIC, STOPWITHBOM.TXT, SOLRCONFIG-QUERYSENDER.XML, SOLRCONFIG-MASTER1-KEEPONEBACKUP.XML, SOLRCONFIG-BASIC-LUCENEVERSION31.XML, SOLRCONFIG-NATIVELOCK.XML, SOLRCONFIG-SLAVE.XML, SCHEMA-CHARFILTERS.XML, SCHEMA-REVERSED.XML, SCHEMA_CODEC.XML, SCHEMA-TRIE.XML, SCHEMA-REPLICATION2.XML, BAD-SOLRCONFIG-BOGUS-SCRIPTENGINE-NAME.XML, SOLRCONFIG-SLAVE1.XML, SCHEMA-COPYFIELD-TEST.XML, SOLRCONFIG-ELEVATE.XML, SCHEMA11.XML, STOPWORDSWRONGENCODING.TXT, SOLRCONFIG-PROPINJECT-INDEXDEFAULT.XML, SOLRCONFIG-XINCLUDE.XML, SOLRCONFIG-CACHING.XML, SCHEMA-FOLDING.XML, SYNONYMS.TXT, SCHEMA-COLLATEFILTER.XML, SOLRCONFIG-REPEATER.XML, SCHEMA-COLLATE.XML, SOLRCONFIG-PHRASESUGGEST.XML, SOLRCONFIG_CODEC.XML, ADDFIELDS.UPDATEPROCESSOR.JS, SOLRCONFIG-TRANSFORMERS.XML, SCHEMA-LUCENEMATCHVERSION.XML, SCHEMA-MINIMAL.XML, BAD-SCHEMA-NOT-INDEXED-BUT-POS.XML, BAD-SCHEMA-OMIT-TF-BUT-NOT-POS.XML, STOP-1.TXT, SOLRCONFIG-DELPOLICY2.XML, SOLRCONFIG-REQHANDLER.INCL, SOLRCONFIG-MASTER2.XML, CURRENCY.XML, SOLRCONFIG-MASTER3.XML, WDFTYPES.TXT, SCHEMA-IB.XML, BAD-SCHEMA-DUP-FIELD.XML, SOLRCONFIG-LAZYWRITER.XML, SCHEMA-LMDIRICHLET.XML, SCHEMA-SPELLCHECKER.XML, SCHEMASURROUND.XML, BAD-SCHEMA-NOT-INDEXED-BUT-NORMS.XML, SCHEMA-NUMERIC.XML, BAD-SCHEMA-EXTERNAL-FILEFIELD.XML, BAD-SOLRCONFIG-INVALID-SCRIPTFILE.XML, SOLRCONFIG-SOLCOREPROPERTIES.XML, SCHEMA-REPLICATION1.XML, COMPOUNDDICTIONARY.TXT, SOLRCONFIG-SOLR-749.XML, STOP-2.TXT, SOLRCONFIG-SPELLCHECKCOMPONENT.XML, TRIVIAL.UPDATEPROCESSOR1.JS, SCHEMA.XML, THROW.ERROR.ON.ADD.UPDATEPROCESSOR.JS, SOLRCONFIG-SIMPLELOCK.XML, BAD-SCHEMA-DUP-DYNAMICFIELD.XML, SOLRCONFIG-DELPOLICY1.XML, SOLRCONFIG-MERGEPOLICY.XML, DA_UTF8.XML, SOLRCONFIG_PERF.XML, HUNSPELL-TEST.AFF, FRENCHARTICLES.TXT, SOLRCONFIG-NOCACHE.XML, PHRASESUGGEST.TXT, SOLRCONFIG-ENABLEPLUGIN.XML, XSLT, BAD-SCHEMA-ANALYZER-CLASS-AND-NESTED.XML, STEMDICT.TXT, BAD-SCHEMA-CODEC-GLOBAL-VS-FT-MISMATCH.XML, PROTWORDS.TXT, SCHEMA12.XML, MISSLEADING.EXTENSION.UPDATEPROCESSOR.JS.TXT, SCHEMA-BINARYFIELD.XML, MISSING.FUNCTIONS.UPDATEPROCESSOR.JS, SCHEMA-PHRASESUGGEST.XML, DA_COMPOUNDDICTIONARY.TXT, BAD-SCHEMA-UNIQUEKEY-IS-COPYFIELD-DEST.XML, BAD-SCHEMA-NONTEXT-ANALYZER.XML, SCHEMA-TFIDF.XML, SOLRCONFIG-QUERYSENDER-NOQUERY.XML, OLD_SYNONYMS.TXT, SOLRCONFIG-MASTER1.XML, BAD-SCHEMA-UNIQUEKEY-USES-DEFAULT.XML, HYPHENATION.DTD, SOLRCONFIG-HIGHLIGHT.XML, CONDITIONAL.UPDATEPROCESSOR.JS, MAPPING-ISOLATIN1ACCENT.TXT, BAD_SOLRCONFIG.XML, SOLRCONFIG-TLOG.XML, SCHEMA15.XML, SCHEMA-REQUIRED-FIELDS.XML, STOPTYPES-1.TXT, SOLRCONFIG-UPDATE-PROCESSOR-CHAINS.XML, SOLRCONFIG-BASIC.XML, SCHEMA-BM25.XML, SCHEMA-NOT-REQUIRED-UNIQUE-KEY.XML, BAD-MP-SOLRCONFIG.XML, KEEP-1.TXT, SOLRCONFIG-ALTDIRECTORY.XML]
[junit4:junit4]   2> 260 T8116 oass.SolrIndexSearcher.<init> Opening Searcher@1eb16f4 main
[junit4:junit4]   2> 261 T8116 oass.SolrIndexSearcher.getIndexDir WARNING WARNING: Directory impl does not support setting indexDir: org.apache.lucene.store.MockDirectoryWrapper
[junit4:junit4]   2> 261 T8116 oasu.CommitTracker.<init> Hard AutoCommit: disabled
[junit4:junit4]   2> 261 T8116 oasu.CommitTracker.<init> Soft AutoCommit: disabled
[junit4:junit4]   2> 262 T8116 oashc.QueryElevationComponent.inform Loading QueryElevation from: /mnt/ssd/jenkins/workspace/Lucene-Solr-4.x-Linux/checkout/solr/build/solr-core/test-files/solr/collection1/conf/elevate.xml
[junit4:junit4]   2> 268 T8116 oashc.QueryElevationComponent.inform Loading QueryElevation from: /mnt/ssd/jenkins/workspace/Lucene-Solr-4.x-Linux/checkout/solr/build/solr-core/test-files/solr/collection1/conf/elevate.xml
[junit4:junit4]   2> 275 T8116 oashc.HttpShardHandlerFactory.getParameter Setting socketTimeout to: 0
[junit4:junit4]   2> 275 T8116 oashc.HttpShardHandlerFactory.getParameter Setting urlScheme to: http://
[junit4:junit4]   2> 275 T8116 oashc.HttpShardHandlerFactory.getParameter Setting connTimeout to: 0
[junit4:junit4]   2> 276 T8116 oashc.HttpShardHandlerFactory.getParameter Setting maxConnectionsPerHost to: 20
[junit4:junit4]   2> 276 T8116 oashc.HttpShardHandlerFactory.getParameter Setting corePoolSize to: 0
[junit4:junit4]   2> 276 T8116 oashc.HttpShardHandlerFactory.getParameter Setting maximumPoolSize to: 2147483647
[junit4:junit4]   2> 276 T8116 oashc.HttpShardHandlerFactory.getParameter Setting maxThreadIdleTime to: 5
[junit4:junit4]   2> 277 T8116 oashc.HttpShardHandlerFactory.getParameter Setting sizeOfQueue to: -1
[junit4:junit4]   2> 277 T8116 oashc.HttpShardHandlerFactory.getParameter Setting fairnessPolicy to: false
[junit4:junit4]   2> 277 T8116 oascsi.HttpClientUtil.createClient Creating new http client, config:maxConnectionsPerHost=20&maxConnections=10000&socketTimeout=0&connTimeout=0&retry=false
[junit4:junit4]   2> 280 T8126 oasc.SolrCore.registerSearcher [collection1] Registered new searcher Searcher@1eb16f4 main{StandardDirectoryReader(segments_1:1)}
[junit4:junit4]   2> 280 T8116 oasc.CoreContainer.register registering core: collection1
[junit4:junit4]   2> 281 T8116 oass.SolrDispatchFilter.init user.dir=/mnt/ssd/jenkins/workspace/Lucene-Solr-4.x-Linux/checkout/solr/build/solr-core/test/J1
[junit4:junit4]   2> 281 T8116 oass.SolrDispatchFilter.init SolrDispatchFilter.init() done
[junit4:junit4]   2> 281 T8116 oascsi.HttpClientUtil.createClient Creating new http client, config:maxConnections=128&maxConnectionsPerHost=32&followRedirects=false
[junit4:junit4]   2> 283 T8116 oejs.Server.doStart jetty-8.1.2.v20120308
[junit4:junit4]   2> 290 T8116 oejs.AbstractConnector.doStart Started SocketConnector@0.0.0.0:40315
[junit4:junit4]   2> 290 T8116 oasc.SolrResourceLoader.locateSolrHome JNDI not configured for solr (NoInitialContextEx)
[junit4:junit4]   2> 291 T8116 oasc.SolrResourceLoader.locateSolrHome using system property solr.solr.home: /mnt/ssd/jenkins/workspace/Lucene-Solr-4.x-Linux/checkout/solr/build/solr-core/test-files/solr
[junit4:junit4]   2> 291 T8116 oasc.SolrResourceLoader.<init> new SolrResourceLoader for deduced Solr Home: '/mnt/ssd/jenkins/workspace/Lucene-Solr-4.x-Linux/checkout/solr/build/solr-core/test-files/solr/'
[junit4:junit4]   2> 298 T8116 oass.SolrDispatchFilter.init SolrDispatchFilter.init()
[junit4:junit4]   2> 299 T8116 oasc.SolrResourceLoader.locateSolrHome JNDI not configured for solr (NoInitialContextEx)
[junit4:junit4]   2> 299 T8116 oasc.SolrResourceLoader.locateSolrHome using system property solr.solr.home: /mnt/ssd/jenkins/workspace/Lucene-Solr-4.x-Linux/checkout/solr/build/solr-core/test-files/solr
[junit4:junit4]   2> 299 T8116 oasc.CoreContainer$Initializer.initialize looking for solr.xml: /mnt/ssd/jenkins/workspace/Lucene-Solr-4.x-Linux/checkout/solr/build/solr-core/test-files/solr/solr.xml
[junit4:junit4]   2> 300 T8116 oasc.CoreContainer.<init> New CoreContainer 12439776
[junit4:junit4]   2> 300 T8116 oasc.CoreContainer.load Loading CoreContainer using Solr Home: '/mnt/ssd/jenkins/workspace/Lucene-Solr-4.x-Linux/checkout/solr/build/solr-core/test-files/solr/'
[junit4:junit4]   2> 300 T8116 oasc.SolrResourceLoader.<init> new SolrResourceLoader for directory: '/mnt/ssd/jenkins/workspace/Lucene-Solr-4.x-Linux/checkout/solr/build/solr-core/test-files/solr/'
[junit4:junit4]   2> 310 T8116 oasc.CoreContainer.load Registering Log Listener
[junit4:junit4]   2> 321 T8116 oasc.CoreContainer.create Creating SolrCore 'collection1' using instanceDir: /mnt/ssd/jenkins/workspace/Lucene-Solr-4.x-Linux/checkout/solr/build/solr-core/test-files/solr/collection1
[junit4:junit4]   2> 322 T8116 oasc.SolrResourceLoader.<init> new SolrResourceLoader for directory: '/mnt/ssd/jenkins/workspace/Lucene-Solr-4.x-Linux/checkout/solr/build/solr-core/test-files/solr/collection1/'
[junit4:junit4]   2> 322 T8116 oasc.SolrResourceLoader.replaceClassLoader Adding 'file:/mnt/ssd/jenkins/workspace/Lucene-Solr-4.x-Linux/checkout/solr/build/solr-core/test-files/solr/collection1/lib/README' to classloader
[junit4:junit4]   2> 323 T8116 oasc.SolrResourceLoader.replaceClassLoader Adding 'file:/mnt/ssd/jenkins/workspace/Lucene-Solr-4.x-Linux/checkout/solr/build/solr-core/test-files/solr/collection1/lib/classes/' to classloader
[junit4:junit4]   2> 344 T8116 oasc.SolrConfig.<init> Using Lucene MatchVersion: LUCENE_40
[junit4:junit4]   2> 377 T8116 oasc.SolrConfig.<init> Loaded SolrConfig: solrconfig-elevate.xml
[junit4:junit4]   2> 377 T8116 oass.IndexSchema.readSchema Reading Solr Schema
[junit4:junit4]   2> 380 T8116 oass.IndexSchema.readSchema Schema name=example
[junit4:junit4]   2> 535 T8116 oass.IndexSchema.readSchema default search field in schema is text
[junit4:junit4]   2> 538 T8116 oass.IndexSchema.readSchema unique key field: id
[junit4:junit4]   2> 540 T8116 oasc.SolrCore.<init> [collection1] Opening new SolrCore at /mnt/ssd/jenkins/workspace/Lucene-Solr-4.x-Linux/checkout/solr/build/solr-core/test-files/solr/collection1/, dataDir=./org.apache.solr.handler.component.DistributedQueryElevationComponentTest-1343696725125/shard0/data/
[junit4:junit4]   2> 540 T8116 oasc.JmxMonitoredMap.<init> JMX monitoring is enabled. Adding Solr mbeans to JMX Server: com.sun.jmx.mbeanserver.JmxMBeanServer@c089da
[junit4:junit4]   2> 541 T8116 oasc.SolrCore.getNewIndexDir WARNING New index directory detected: old=null new=./org.apache.solr.handler.component.DistributedQueryElevationComponentTest-1343696725125/shard0/data/index/
[junit4:junit4]   2> 541 T8116 oasc.SolrCore.initIndex WARNING [collection1] Solr index directory './org.apache.solr.handler.component.DistributedQueryElevationComponentTest-1343696725125/shard0/data/index' doesn't exist. Creating new index...
[junit4:junit4]   2> 542 T8116 oasc.SolrDeletionPolicy.onCommit SolrDeletionPolicy.onCommit: commits:num=1
[junit4:junit4]   2> 		commit{dir=MockDirWrapper(org.apache.lucene.store.RAMDirectory@1a8cc54 lockFactory=org.apache.lucene.store.SingleInstanceLockFactory@79e509),segFN=segments_1,generation=1,filenames=[segments_1]
[junit4:junit4]   2> 542 T8116 oasc.SolrDeletionPolicy.updateCommits newest commit = 1
[junit4:junit4]   2> 543 T8116 oasc.RequestHandlers.initHandlersFromConfig created /update: solr.UpdateRequestHandler
[junit4:junit4]   2> 544 T8116 oasc.RequestHandlers.initHandlersFromConfig created /elevate: org.apache.solr.handler.component.SearchHandler
[junit4:junit4]   2> 544 T8116 oasc.RequestHandlers.initHandlersFromConfig created /dataElevate: org.apache.solr.handler.component.SearchHandler
[junit4:junit4]   2> 545 T8116 oashl.XMLLoader.init xsltCacheLifetimeSeconds=60
[junit4:junit4]   2> 545 T8116 oasc.RequestHandlers.initHandlersFromConfig WARNING no default request handler is registered (either '/select' or 'standard')
[junit4:junit4]   2> 546 T8116 oasc.SolrCore.initDeprecatedSupport WARNING solrconfig.xml uses deprecated <admin/gettableFiles>, Please update your config to use the ShowFileRequestHandler.
[junit4:junit4]   2> 547 T8116 oasc.SolrCore.initDeprecatedSupport WARNING adding ShowFileRequestHandler with hidden files: [KEEP-2.TXT, STOP-SNOWBALL.TXT, SOLRCONFIG-PROPINJECT.XML, STOPTYPES-2.TXT, SOLRCONFIG-TERMINDEX.XML, OPEN-EXCHANGE-RATES.JSON, STOPWORDS.TXT, SCHEMA-DFR.XML, BAD-SOLRCONFIG-MISSING-SCRIPTFILE.XML, BAD-SCHEMA-DUP-FIELDTYPE.XML, SCHEMA-LMJELINEKMERCER.XML, SOLRCONFIG-FUNCTIONQUERY.XML, SCHEMA-STOP-KEEP.XML, BAD-SCHEMA-SIM-GLOBAL-VS-FT-MISMATCH.XML, SCHEMA-SIM.XML, BAD-SCHEMA-NOT-INDEXED-BUT-TF.XML, BAD-SCHEMA-UNIQUEKEY-MULTIVALUED.XML, SOLRCONFIG-SPELLCHECKER.XML, SOLRCONFIG-MASTER.XML, SOLRCONFIG-SCRIPT-UPDATEPROCESSOR.XML, ELEVATE.XML, TRIVIAL.UPDATEPROCESSOR0.JS, HUNSPELL-TEST.DIC, STOPWITHBOM.TXT, SOLRCONFIG-QUERYSENDER.XML, SOLRCONFIG-MASTER1-KEEPONEBACKUP.XML, SOLRCONFIG-BASIC-LUCENEVERSION31.XML, SOLRCONFIG-NATIVELOCK.XML, SOLRCONFIG-SLAVE.XML, SCHEMA-CHARFILTERS.XML, SCHEMA-REVERSED.XML, SCHEMA_CODEC.XML, SCHEMA-TRIE.XML, SCHEMA-REPLICATION2.XML, BAD-SOLRCONFIG-BOGUS-SCRIPTENGINE-NAME.XML, SOLRCONFIG-SLAVE1.XML, SCHEMA-COPYFIELD-TEST.XML, SOLRCONFIG-ELEVATE.XML, SCHEMA11.XML, STOPWORDSWRONGENCODING.TXT, SOLRCONFIG-PROPINJECT-INDEXDEFAULT.XML, SOLRCONFIG-XINCLUDE.XML, SOLRCONFIG-CACHING.XML, SCHEMA-FOLDING.XML, SYNONYMS.TXT, SCHEMA-COLLATEFILTER.XML, SOLRCONFIG-REPEATER.XML, SCHEMA-COLLATE.XML, SOLRCONFIG-PHRASESUGGEST.XML, SOLRCONFIG_CODEC.XML, ADDFIELDS.UPDATEPROCESSOR.JS, SOLRCONFIG-TRANSFORMERS.XML, SCHEMA-LUCENEMATCHVERSION.XML, SCHEMA-MINIMAL.XML, BAD-SCHEMA-NOT-INDEXED-BUT-POS.XML, BAD-SCHEMA-OMIT-TF-BUT-NOT-POS.XML, STOP-1.TXT, SOLRCONFIG-DELPOLICY2.XML, SOLRCONFIG-REQHANDLER.INCL, SOLRCONFIG-MASTER2.XML, CURRENCY.XML, SOLRCONFIG-MASTER3.XML, WDFTYPES.TXT, SCHEMA-IB.XML, BAD-SCHEMA-DUP-FIELD.XML, SOLRCONFIG-LAZYWRITER.XML, SCHEMA-LMDIRICHLET.XML, SCHEMA-SPELLCHECKER.XML, SCHEMASURROUND.XML, BAD-SCHEMA-NOT-INDEXED-BUT-NORMS.XML, SCHEMA-NUMERIC.XML, BAD-SCHEMA-EXTERNAL-FILEFIELD.XML, BAD-SOLRCONFIG-INVALID-SCRIPTFILE.XML, SOLRCONFIG-SOLCOREPROPERTIES.XML, SCHEMA-REPLICATION1.XML, COMPOUNDDICTIONARY.TXT, SOLRCONFIG-SOLR-749.XML, STOP-2.TXT, SOLRCONFIG-SPELLCHECKCOMPONENT.XML, TRIVIAL.UPDATEPROCESSOR1.JS, SCHEMA.XML, THROW.ERROR.ON.ADD.UPDATEPROCESSOR.JS, SOLRCONFIG-SIMPLELOCK.XML, BAD-SCHEMA-DUP-DYNAMICFIELD.XML, SOLRCONFIG-DELPOLICY1.XML, SOLRCONFIG-MERGEPOLICY.XML, DA_UTF8.XML, SOLRCONFIG_PERF.XML, HUNSPELL-TEST.AFF, FRENCHARTICLES.TXT, SOLRCONFIG-NOCACHE.XML, PHRASESUGGEST.TXT, SOLRCONFIG-ENABLEPLUGIN.XML, XSLT, BAD-SCHEMA-ANALYZER-CLASS-AND-NESTED.XML, STEMDICT.TXT, BAD-SCHEMA-CODEC-GLOBAL-VS-FT-MISMATCH.XML, PROTWORDS.TXT, SCHEMA12.XML, MISSLEADING.EXTENSION.UPDATEPROCESSOR.JS.TXT, SCHEMA-BINARYFIELD.XML, MISSING.FUNCTIONS.UPDATEPROCESSOR.JS, SCHEMA-PHRASESUGGEST.XML, DA_COMPOUNDDICTIONARY.TXT, BAD-SCHEMA-UNIQUEKEY-IS-COPYFIELD-DEST.XML, BAD-SCHEMA-NONTEXT-ANALYZER.XML, SCHEMA-TFIDF.XML, SOLRCONFIG-QUERYSENDER-NOQUERY.XML, OLD_SYNONYMS.TXT, SOLRCONFIG-MASTER1.XML, BAD-SCHEMA-UNIQUEKEY-USES-DEFAULT.XML, HYPHENATION.DTD, SOLRCONFIG-HIGHLIGHT.XML, CONDITIONAL.UPDATEPROCESSOR.JS, MAPPING-ISOLATIN1ACCENT.TXT, BAD_SOLRCONFIG.XML, SOLRCONFIG-TLOG.XML, SCHEMA15.XML, SCHEMA-REQUIRED-FIELDS.XML, STOPTYPES-1.TXT, SOLRCONFIG-UPDATE-PROCESSOR-CHAINS.XML, SOLRCONFIG-BASIC.XML, SCHEMA-BM25.XML, SCHEMA-NOT-REQUIRED-UNIQUE-KEY.XML, BAD-MP-SOLRCONFIG.XML, KEEP-1.TXT, SOLRCONFIG-ALTDIRECTORY.XML]
[junit4:junit4]   2> 549 T8116 oass.SolrIndexSearcher.<init> Opening Searcher@14d7210 main
[junit4:junit4]   2> 549 T8116 oass.SolrIndexSearcher.getIndexDir WARNING WARNING: Directory impl does not support setting indexDir: org.apache.lucene.store.MockDirectoryWrapper
[junit4:junit4]   2> 549 T8116 oasu.CommitTracker.<init> Hard AutoCommit: disabled
[junit4:junit4]   2> 550 T8116 oasu.CommitTracker.<init> Soft AutoCommit: disabled
[junit4:junit4]   2> 550 T8116 oashc.QueryElevationComponent.inform Loading QueryElevation from: /mnt/ssd/jenkins/workspace/Lucene-Solr-4.x-Linux/checkout/solr/build/solr-core/test-files/solr/collection1/conf/elevate.xml
[junit4:junit4]   2> 557 T8116 oashc.QueryElevationComponent.inform Loading QueryElevation from: /mnt/ssd/jenkins/workspace/Lucene-Solr-4.x-Linux/checkout/solr/build/solr-core/test-files/solr/collection1/conf/elevate.xml
[junit4:junit4]   2> 563 T8116 oashc.HttpShardHandlerFactory.getParameter Setting socketTimeout to: 0
[junit4:junit4]   2> 564 T8116 oashc.HttpShardHandlerFactory.getParameter Setting urlScheme to: http://
[junit4:junit4]   2> 564 T8116 oashc.HttpShardHandlerFactory.getParameter Setting connTimeout to: 0
[junit4:junit4]   2> 564 T8116 oashc.HttpShardHandlerFactory.getParameter Setting maxConnectionsPerHost to: 20
[junit4:junit4]   2> 565 T8116 oashc.HttpShardHandlerFactory.getParameter Setting corePoolSize to: 0
[junit4:junit4]   2> 565 T8116 oashc.HttpShardHandlerFactory.getParameter Setting maximumPoolSize to: 2147483647
[junit4:junit4]   2> 565 T8116 oashc.HttpShardHandlerFactory.getParameter Setting maxThreadIdleTime to: 5
[junit4:junit4]   2> 565 T8116 oashc.HttpShardHandlerFactory.getParameter Setting sizeOfQueue to: -1
[junit4:junit4]   2> 566 T8116 oashc.HttpShardHandlerFactory.getParameter Setting fairnessPolicy to: false
[junit4:junit4]   2> 566 T8116 oascsi.HttpClientUtil.createClient Creating new http client, config:maxConnectionsPerHost=20&maxConnections=10000&socketTimeout=0&connTimeout=0&retry=false
[junit4:junit4]   2> 568 T8136 oasc.SolrCore.registerSearcher [collection1] Registered new searcher Searcher@14d7210 main{StandardDirectoryReader(segments_1:1)}
[junit4:junit4]   2> 568 T8116 oasc.CoreContainer.register registering core: collection1
[junit4:junit4]   2> 569 T8116 oass.SolrDispatchFilter.init user.dir=/mnt/ssd/jenkins/workspace/Lucene-Solr-4.x-Linux/checkout/solr/build/solr-core/test/J1
[junit4:junit4]   2> 570 T8116 oass.SolrDispatchFilter.init SolrDispatchFilter.init() done
[junit4:junit4]   2> 570 T8116 oascsi.HttpClientUtil.createClient Creating new http client, config:maxConnections=128&maxConnectionsPerHost=32&followRedirects=false
[junit4:junit4]   2> 572 T8116 oejs.Server.doStart jetty-8.1.2.v20120308
[junit4:junit4]   2> 574 T8116 oejs.AbstractConnector.doStart Started SocketConnector@0.0.0.0:41864
[junit4:junit4]   2> 574 T8116 oasc.SolrResourceLoader.locateSolrHome JNDI not configured for solr (NoInitialContextEx)
[junit4:junit4]   2> 574 T8116 oasc.SolrResourceLoader.locateSolrHome using system property solr.solr.home: /mnt/ssd/jenkins/workspace/Lucene-Solr-4.x-Linux/checkout/solr/build/solr-core/test-files/solr
[junit4:junit4]   2> 575 T8116 oasc.SolrResourceLoader.<init> new SolrResourceLoader for deduced Solr Home: '/mnt/ssd/jenkins/workspace/Lucene-Solr-4.x-Linux/checkout/solr/build/solr-core/test-files/solr/'
[junit4:junit4]   2> 582 T8116 oass.SolrDispatchFilter.init SolrDispatchFilter.init()
[junit4:junit4]   2> 583 T8116 oasc.SolrResourceLoader.locateSolrHome JNDI not configured for solr (NoInitialContextEx)
[junit4:junit4]   2> 583 T8116 oasc.SolrResourceLoader.locateSolrHome using system property solr.solr.home: /mnt/ssd/jenkins/workspace/Lucene-Solr-4.x-Linux/checkout/solr/build/solr-core/test-files/solr
[junit4:junit4]   2> 583 T8116 oasc.CoreContainer$Initializer.initialize looking for solr.xml: /mnt/ssd/jenkins/workspace/Lucene-Solr-4.x-Linux/checkout/solr/build/solr-core/test-files/solr/solr.xml
[junit4:junit4]   2> 583 T8116 oasc.CoreContainer.<init> New CoreContainer 8484441
[junit4:junit4]   2> 584 T8116 oasc.CoreContainer.load Loading CoreContainer using Solr Home: '/mnt/ssd/jenkins/workspace/Lucene-Solr-4.x-Linux/checkout/solr/build/solr-core/test-files/solr/'
[junit4:junit4]   2> 584 T8116 oasc.SolrResourceLoader.<init> new SolrResourceLoader for directory: '/mnt/ssd/jenkins/workspace/Lucene-Solr-4.x-Linux/checkout/solr/build/solr-core/test-files/solr/'
[junit4:junit4]   2> 593 T8116 oasc.CoreContainer.load Registering Log Listener
[junit4:junit4]   2> 604 T8116 oasc.CoreContainer.create Creating SolrCore 'collection1' using instanceDir: /mnt/ssd/jenkins/workspace/Lucene-Solr-4.x-Linux/checkout/solr/build/solr-core/test-files/solr/collection1
[junit4:junit4]   2> 605 T8116 oasc.SolrResourceLoader.<init> new SolrResourceLoader for directory: '/mnt/ssd/jenkins/workspace/Lucene-Solr-4.x-Linux/checkout/solr/build/solr-core/test-files/solr/collection1/'
[junit4:junit4]   2> 605 T8116 oasc.SolrResourceLoader.replaceClassLoader Adding 'file:/mnt/ssd/jenkins/workspace/Lucene-Solr-4.x-Linux/checkout/solr/build/solr-core/test-files/solr/collection1/lib/README' to classloader
[junit4:junit4]   2> 606 T8116 oasc.SolrResourceLoader.replaceClassLoader Adding 'file:/mnt/ssd/jenkins/workspace/Lucene-Solr-4.x-Linux/checkout/solr/build/solr-core/test-files/solr/collection1/lib/classes/' to classloader
[junit4:junit4]   2> 630 T8116 oasc.SolrConfig.<init> Using Lucene MatchVersion: LUCENE_40
[junit4:junit4]   2> 673 T8116 oasc.SolrConfig.<init> Loaded SolrConfig: solrconfig-elevate.xml
[junit4:junit4]   2> 673 T8116 oass.IndexSchema.readSchema Reading Solr Schema
[junit4:junit4]   2> 676 T8116 oass.IndexSchema.readSchema Schema name=example
[junit4:junit4]   2> 848 T8116 oass.IndexSchema.readSchema default search field in schema is text
[junit4:junit4]   2> 850 T8116 oass.IndexSchema.readSchema unique key field: id
[junit4:junit4]   2> 852 T8116 oasc.SolrCore.<init> [collection1] Opening new SolrCore at /mnt/ssd/jenkins/workspace/Lucene-Solr-4.x-Linux/checkout/solr/build/solr-core/test-files/solr/collection1/, dataDir=./org.apache.solr.handler.component.DistributedQueryElevationComponentTest-1343696725125/shard1/data/
[junit4:junit4]   2> 853 T8116 oasc.JmxMonitoredMap.<init> JMX monitoring is enabled. Adding Solr mbeans to JMX Server: com.sun.jmx.mbeanserver.JmxMBeanServer@c089da
[junit4:junit4]   2> 853 T8116 oasc.SolrCore.getNewIndexDir WARNING New index directory detected: old=null new=./org.apache.solr.handler.component.DistributedQueryElevationComponentTest-1343696725125/shard1/data/index/
[junit4:junit4]   2> 853 T8116 oasc.SolrCore.initIndex WARNING [collection1] Solr index directory './org.apache.solr.handler.component.DistributedQueryElevationComponentTest-1343696725125/shard1/data/index' doesn't exist. Creating new index...
[junit4:junit4]   2> 854 T8116 oasc.SolrDeletionPolicy.onCommit SolrDeletionPolicy.onCommit: commits:num=1
[junit4:junit4]   2> 		commit{dir=MockDirWrapper(org.apache.lucene.store.RAMDirectory@1203851 lockFactory=org.apache.lucene.store.SingleInstanceLockFactory@1f347ad),segFN=segments_1,generation=1,filenames=[segments_1]
[junit4:junit4]   2> 855 T8116 oasc.SolrDeletionPolicy.updateCommits newest commit = 1
[junit4:junit4]   2> 855 T8116 oasc.RequestHandlers.initHandlersFromConfig created /update: solr.UpdateRequestHandler
[junit4:junit4]   2> 856 T8116 oasc.RequestHandlers.initHandlersFromConfig created /elevate: org.apache.solr.handler.component.SearchHandler
[junit4:junit4]   2> 856 T8116 oasc.RequestHandlers.initHandlersFromConfig created /dataElevate: org.apache.solr.handler.component.SearchHandler
[junit4:junit4]   2> 857 T8116 oashl.XMLLoader.init xsltCacheLifetimeSeconds=60
[junit4:junit4]   2> 857 T8116 oasc.RequestHandlers.initHandlersFromConfig WARNING no default request handler is registered (either '/select' or 'standard')
[junit4:junit4]   2> 858 T8116 oasc.SolrCore.initDeprecatedSupport WARNING solrconfig.xml uses deprecated <admin/gettableFiles>, Please update your config to use the ShowFileRequestHandler.
[junit4:junit4]   2> 859 T8116 oasc.SolrCore.initDeprecatedSupport WARNING adding ShowFileRequestHandler with hidden files: [KEEP-2.TXT, STOP-SNOWBALL.TXT, SOLRCONFIG-PROPINJECT.XML, STOPTYPES-2.TXT, SOLRCONFIG-TERMINDEX.XML, OPEN-EXCHANGE-RATES.JSON, STOPWORDS.TXT, SCHEMA-DFR.XML, BAD-SOLRCONFIG-MISSING-SCRIPTFILE.XML, BAD-SCHEMA-DUP-FIELDTYPE.XML, SCHEMA-LMJELINEKMERCER.XML, SOLRCONFIG-FUNCTIONQUERY.XML, SCHEMA-STOP-KEEP.XML, BAD-SCHEMA-SIM-GLOBAL-VS-FT-MISMATCH.XML, SCHEMA-SIM.XML, BAD-SCHEMA-NOT-INDEXED-BUT-TF.XML, BAD-SCHEMA-UNIQUEKEY-MULTIVALUED.XML, SOLRCONFIG-SPELLCHECKER.XML, SOLRCONFIG-MASTER.XML, SOLRCONFIG-SCRIPT-UPDATEPROCESSOR.XML, ELEVATE.XML, TRIVIAL.UPDATEPROCESSOR0.JS, HUNSPELL-TEST.DIC, STOPWITHBOM.TXT, SOLRCONFIG-QUERYSENDER.XML, SOLRCONFIG-MASTER1-KEEPONEBACKUP.XML, SOLRCONFIG-BASIC-LUCENEVERSION31.XML, SOLRCONFIG-NATIVELOCK.XML, SOLRCONFIG-SLAVE.XML, SCHEMA-CHARFILTERS.XML, SCHEMA-REVERSED.XML, SCHEMA_CODEC.XML, SCHEMA-TRIE.XML, SCHEMA-REPLICATION2.XML, BAD-SOLRCONFIG-BOGUS-SCRIPTENGINE-NAME.XML, SOLRCONFIG-SLAVE1.XML, SCHEMA-COPYFIELD-TEST.XML, SOLRCONFIG-ELEVATE.XML, SCHEMA11.XML, STOPWORDSWRONGENCODING.TXT, SOLRCONFIG-PROPINJECT-INDEXDEFAULT.XML, SOLRCONFIG-XINCLUDE.XML, SOLRCONFIG-CACHING.XML, SCHEMA-FOLDING.XML, SYNONYMS.TXT, SCHEMA-COLLATEFILTER.XML, SOLRCONFIG-REPEATER.XML, SCHEMA-COLLATE.XML, SOLRCONFIG-PHRASESUGGEST.XML, SOLRCONFIG_CODEC.XML, ADDFIELDS.UPDATEPROCESSOR.JS, SOLRCONFIG-TRANSFORMERS.XML, SCHEMA-LUCENEMATCHVERSION.XML, SCHEMA-MINIMAL.XML, BAD-SCHEMA-NOT-INDEXED-BUT-POS.XML, BAD-SCHEMA-OMIT-TF-BUT-NOT-POS.XML, STOP-1.TXT, SOLRCONFIG-DELPOLICY2.XML, SOLRCONFIG-REQHANDLER.INCL, SOLRCONFIG-MASTER2.XML, CURRENCY.XML, SOLRCONFIG-MASTER3.XML, WDFTYPES.TXT, SCHEMA-IB.XML, BAD-SCHEMA-DUP-FIELD.XML, SOLRCONFIG-LAZYWRITER.XML, SCHEMA-LMDIRICHLET.XML, SCHEMA-SPELLCHECKER.XML, SCHEMASURROUND.XML, BAD-SCHEMA-NOT-INDEXED-BUT-NORMS.XML, SCHEMA-NUMERIC.XML, BAD-SCHEMA-EXTERNAL-FILEFIELD.XML, BAD-SOLRCONFIG-INVALID-SCRIPTFILE.XML, SOLRCONFIG-SOLCOREPROPERTIES.XML, SCHEMA-REPLICATION1.XML, COMPOUNDDICTIONARY.TXT, SOLRCONFIG-SOLR-749.XML, STOP-2.TXT, SOLRCONFIG-SPELLCHECKCOMPONENT.XML, TRIVIAL.UPDATEPROCESSOR1.JS, SCHEMA.XML, THROW.ERROR.ON.ADD.UPDATEPROCESSOR.JS, SOLRCONFIG-SIMPLELOCK.XML, BAD-SCHEMA-DUP-DYNAMICFIELD.XML, SOLRCONFIG-DELPOLICY1.XML, SOLRCONFIG-MERGEPOLICY.XML, DA_UTF8.XML, SOLRCONFIG_PERF.XML, HUNSPELL-TEST.AFF, FRENCHARTICLES.TXT, SOLRCONFIG-NOCACHE.XML, PHRASESUGGEST.TXT, SOLRCONFIG-ENABLEPLUGIN.XML, XSLT, BAD-SCHEMA-ANALYZER-CLASS-AND-NESTED.XML, STEMDICT.TXT, BAD-SCHEMA-CODEC-GLOBAL-VS-FT-MISMATCH.XML, PROTWORDS.TXT, SCHEMA12.XML, MISSLEADING.EXTENSION.UPDATEPROCESSOR.JS.TXT, SCHEMA-BINARYFIELD.XML, MISSING.FUNCTIONS.UPDATEPROCESSOR.JS, SCHEMA-PHRASESUGGEST.XML, DA_COMPOUNDDICTIONARY.TXT, BAD-SCHEMA-UNIQUEKEY-IS-COPYFIELD-DEST.XML, BAD-SCHEMA-NONTEXT-ANALYZER.XML, SCHEMA-TFIDF.XML, SOLRCONFIG-QUERYSENDER-NOQUERY.XML, OLD_SYNONYMS.TXT, SOLRCONFIG-MASTER1.XML, BAD-SCHEMA-UNIQUEKEY-USES-DEFAULT.XML, HYPHENATION.DTD, SOLRCONFIG-HIGHLIGHT.XML, CONDITIONAL.UPDATEPROCESSOR.JS, MAPPING-ISOLATIN1ACCENT.TXT, BAD_SOLRCONFIG.XML, SOLRCONFIG-TLOG.XML, SCHEMA15.XML, SCHEMA-REQUIRED-FIELDS.XML, STOPTYPES-1.TXT, SOLRCONFIG-UPDATE-PROCESSOR-CHAINS.XML, SOLRCONFIG-BASIC.XML, SCHEMA-BM25.XML, SCHEMA-NOT-REQUIRED-UNIQUE-KEY.XML, BAD-MP-SOLRCONFIG.XML, KEEP-1.TXT, SOLRCONFIG-ALTDIRECTORY.XML]
[junit4:junit4]   2> 861 T8116 oass.SolrIndexSearcher.<init> Opening Searcher@1988893 main
[junit4:junit4]   2> 861 T8116 oass.SolrIndexSearcher.getIndexDir WARNING WARNING: Directory impl does not support setting indexDir: org.apache.lucene.store.MockDirectoryWrapper
[junit4:junit4]   2> 862 T8116 oasu.CommitTracker.<init> Hard AutoCommit: disabled
[junit4:junit4]   2> 862 T8116 oasu.CommitTracker.<init> Soft AutoCommit: disabled
[junit4:junit4]   2> 862 T8116 oashc.QueryElevationComponent.inform Loading QueryElevation from: /mnt/ssd/jenkins/workspace/Lucene-Solr-4.x-Linux/checkout/solr/build/solr-core/test-files/solr/collection1/conf/elevate.xml
[junit4:junit4]   2> 869 T8116 oashc.QueryElevationComponent.inform Loading QueryElevation from: /mnt/ssd/jenkins/workspace/Lucene-Solr-4.x-Linux/checkout/solr/build/solr-core/test-files/solr/collection1/conf/elevate.xml
[junit4:junit4]   2> 875 T8116 oashc.HttpShardHandlerFactory.getParameter Setting socketTimeout to: 0
[junit4:junit4]   2> 875 T8116 oashc.HttpShardHandlerFactory.getParameter Setting urlScheme to: http://
[junit4:junit4]   2> 876 T8116 oashc.HttpShardHandlerFactory.getParameter Setting connTimeout to: 0
[junit4:junit4]   2> 876 T8116 oashc.HttpShardHandlerFactory.getParameter Setting maxConnectionsPerHost to: 20
[junit4:junit4]   2> 876 T8116 oashc.HttpShardHandlerFactory.getParameter Setting corePoolSize to: 0
[junit4:junit4]   2> 876 T8116 oashc.HttpShardHandlerFactory.getParameter Setting maximumPoolSize to: 2147483647
[junit4:junit4]   2> 877 T8116 oashc.HttpShardHandlerFactory.getParameter Setting maxThreadIdleTime to: 5
[junit4:junit4]   2> 877 T8116 oashc.HttpShardHandlerFactory.getParameter Setting sizeOfQueue to: -1
[junit4:junit4]   2> 877 T8116 oashc.HttpShardHandlerFactory.getParameter Setting fairnessPolicy to: false
[junit4:junit4]   2> 877 T8116 oascsi.HttpClientUtil.createClient Creating new http client, config:maxConnectionsPerHost=20&maxConnections=10000&socketTimeout=0&connTimeout=0&retry=false
[junit4:junit4]   2> 880 T8146 oasc.SolrCore.registerSearcher [collection1] Registered new searcher Searcher@1988893 main{StandardDirectoryReader(segments_1:1)}
[junit4:junit4]   2> 880 T8116 oasc.CoreContainer.register registering core: collection1
[junit4:junit4]   2> 881 T8116 oass.SolrDispatchFilter.init user.dir=/mnt/ssd/jenkins/workspace/Lucene-Solr-4.x-Linux/checkout/solr/build/solr-core/test/J1
[junit4:junit4]   2> 881 T8116 oass.SolrDispatchFilter.init SolrDispatchFilter.init() done
[junit4:junit4]   2> 881 T8116 oascsi.HttpClientUtil.createClient Creating new http client, config:maxConnections=128&maxConnectionsPerHost=32&followRedirects=false
[junit4:junit4]   2> 883 T8116 oejs.Server.doStart jetty-8.1.2.v20120308
[junit4:junit4]   2> 885 T8116 oejs.AbstractConnector.doStart Started SocketConnector@0.0.0.0:57410
[junit4:junit4]   2> 885 T8116 oasc.SolrResourceLoader.locateSolrHome JNDI not configured for solr (NoInitialContextEx)
[junit4:junit4]   2> 885 T8116 oasc.SolrResourceLoader.locateSolrHome using system property solr.solr.home: /mnt/ssd/jenkins/workspace/Lucene-Solr-4.x-Linux/checkout/solr/build/solr-core/test-files/solr
[junit4:junit4]   2> 886 T8116 oasc.SolrResourceLoader.<init> new SolrResourceLoader for deduced Solr Home: '/mnt/ssd/jenkins/workspace/Lucene-Solr-4.x-Linux/checkout/solr/build/solr-core/test-files/solr/'
[junit4:junit4]   2> 892 T8116 oass.SolrDispatchFilter.init SolrDispatchFilter.init()
[junit4:junit4]   2> 893 T8116 oasc.SolrResourceLoader.locateSolrHome JNDI not configured for solr (NoInitialContextEx)
[junit4:junit4]   2> 893 T8116 oasc.SolrResourceLoader.locateSolrHome using system property solr.solr.home: /mnt/ssd/jenkins/workspace/Lucene-Solr-4.x-Linux/checkout/solr/build/solr-core/test-files/solr
[junit4:junit4]   2> 893 T8116 oasc.CoreContainer$Initializer.initialize looking for solr.xml: /mnt/ssd/jenkins/workspace/Lucene-Solr-4.x-Linux/checkout/solr/build/solr-core/test-files/solr/solr.xml
[junit4:junit4]   2> 894 T8116 oasc.CoreContainer.<init> New CoreContainer 23029375
[junit4:junit4]   2> 894 T8116 oasc.CoreContainer.load Loading CoreContainer using Solr Home: '/mnt/ssd/jenkins/workspace/Lucene-Solr-4.x-Linux/checkout/solr/build/solr-core/test-files/solr/'
[junit4:junit4]   2> 894 T8116 oasc.SolrResourceLoader.<init> new SolrResourceLoader for directory: '/mnt/ssd/jenkins/workspace/Lucene-Solr-4.x-Linux/checkout/solr/build/solr-core/test-files/solr/'
[junit4:junit4]   2> 903 T8116 oasc.CoreContainer.load Registering Log Listener
[junit4:junit4]   2> 929 T8116 oasc.CoreContainer.create Creating SolrCore 'collection1' using instanceDir: /mnt/ssd/jenkins/workspace/Lucene-Solr-4.x-Linux/checkout/solr/build/solr-core/test-files/solr/collection1
[junit4:junit4]   2> 929 T8116 oasc.SolrResourceLoader.<init> new SolrResourceLoader for directory: '/mnt/ssd/jenkins/workspace/Lucene-Solr-4.x-Linux/checkout/solr/build/solr-core/test-files/solr/collection1/'
[junit4:junit4]   2> 930 T8116 oasc.SolrResourceLoader.replaceClassLoader Adding 'file:/mnt/ssd/jenkins/workspace/Lucene-Solr-4.x-Linux/checkout/solr/build/solr-core/test-files/solr/collection1/lib/README' to classloader
[junit4:junit4]   2> 930 T8116 oasc.SolrResourceLoader.replaceClassLoader Adding 'file:/mnt/ssd/jenkins/workspace/Lucene-Solr-4.x-Linux/checkout/solr/build/solr-core/test-files/solr/collection1/lib/classes/' to classloader
[junit4:junit4]   2> 963 T8116 oasc.SolrConfig.<init> Using Lucene MatchVersion: LUCENE_40
[junit4:junit4]   2> 999 T8116 oasc.SolrConfig.<init> Loaded SolrConfig: solrconfig-elevate.xml
[junit4:junit4]   2> 1000 T8116 oass.IndexSchema.readSchema Reading Solr Schema
[junit4:junit4]   2> 1002 T8116 oass.IndexSchema.readSchema Schema name=example
[junit4:junit4]   2> 1160 T8116 oass.IndexSchema.readSchema default search field in schema is text
[junit4:junit4]   2> 1162 T8116 oass.IndexSchema.readSchema unique key field: id
[junit4:junit4]   2> 1164 T8116 oasc.SolrCore.<init> [collection1] Opening new SolrCore at /mnt/ssd/jenkins/workspace/Lucene-Solr-4.x-Linux/checkout/solr/build/solr-core/test-files/solr/collection1/, dataDir=./org.apache.solr.handler.component.DistributedQueryElevationComponentTest-1343696725125/shard2/data/
[junit4:junit4]   2> 1165 T8116 oasc.JmxMonitoredMap.<init> JMX monitoring is enabled. Adding Solr mbeans to JMX Server: com.sun.jmx.mbeanserver.JmxMBeanServer@c089da
[junit4:junit4]   2> 1165 T8116 oasc.SolrCore.getNewIndexDir WARNING New index directory detected: old=null new=./org.apache.solr.handler.component.DistributedQueryElevationComponentTest-1343696725125/shard2/data/index/
[junit4:junit4]   2> 1165 T8116 oasc.SolrCore.initIndex WARNING [collection1] Solr index directory './org.apache.solr.handler.component.DistributedQueryElevationComponentTest-1343696725125/shard2/data/index' doesn't exist. Creating new index...
[junit4:junit4]   2> 1166 T8116 oasc.SolrDeletionPolicy.onCommit SolrDeletionPolicy.onCommit: commits:num=1
[junit4:junit4]   2> 		commit{dir=MockDirWrapper(org.apache.lucene.store.RAMDirectory@c4ea39 lockFactory=org.apache.lucene.store.SingleInstanceLockFactory@19c077a),segFN=segments_1,generation=1,filenames=[segments_1]
[junit4:junit4]   2> 1167 T8116 oasc.SolrDeletionPolicy.updateCommits newest commit = 1
[junit4:junit4]   2> 1168 T8116 oasc.RequestHandlers.initHandlersFromConfig created /update: solr.UpdateRequestHandler
[junit4:junit4]   2> 1168 T8116 oasc.RequestHandlers.initHandlersFromConfig created /elevate: org.apache.solr.handler.component.SearchHandler
[junit4:junit4]   2> 1168 T8116 oasc.RequestHandlers.initHandlersFromConfig created /dataElevate: org.apache.solr.handler.component.SearchHandler
[junit4:junit4]   2> 1169 T8116 oashl.XMLLoader.init xsltCacheLifetimeSeconds=60
[junit4:junit4]   2> 1169 T8116 oasc.RequestHandlers.initHandlersFromConfig WARNING no default request handler is registered (either '/select' or 'standard')
[junit4:junit4]   2> 1170 T8116 oasc.SolrCore.initDeprecatedSupport WARNING solrconfig.xml uses deprecated <admin/gettableFiles>, Please update your config to use the ShowFileRequestHandler.
[junit4:junit4]   2> 1171 T8116 oasc.SolrCore.initDeprecatedSupport WARNING adding ShowFileRequestHandler with hidden files: [KEEP-2.TXT, STOP-SNOWBALL.TXT, SOLRCONFIG-PROPINJECT.XML, STOPTYPES-2.TXT, SOLRCONFIG-TERMINDEX.XML, OPEN-EXCHANGE-RATES.JSON, STOPWORDS.TXT, SCHEMA-DFR.XML, BAD-SOLRCONFIG-MISSING-SCRIPTFILE.XML, BAD-SCHEMA-DUP-FIELDTYPE.XML, SCHEMA-LMJELINEKMERCER.XML, SOLRCONFIG-FUNCTIONQUERY.XML, SCHEMA-STOP-KEEP.XML, BAD-SCHEMA-SIM-GLOBAL-VS-FT-MISMATCH.XML, SCHEMA-SIM.XML, BAD-SCHEMA-NOT-INDEXED-BUT-TF.XML, BAD-SCHEMA-UNIQUEKEY-MULTIVALUED.XML, SOLRCONFIG-SPELLCHECKER.XML, SOLRCONFIG-MASTER.XML, SOLRCONFIG-SCRIPT-UPDATEPROCESSOR.XML, ELEVATE.XML, TRIVIAL.UPDATEPROCESSOR0.JS, HUNSPELL-TEST.DIC, STOPWITHBOM.TXT, SOLRCONFIG-QUERYSENDER.XML, SOLRCONFIG-MASTER1-KEEPONEBACKUP.XML, SOLRCONFIG-BASIC-LUCENEVERSION31.XML, SOLRCONFIG-NATIVELOCK.XML, SOLRCONFIG-SLAVE.XML, SCHEMA-CHARFILTERS.XML, SCHEMA-REVERSED.XML, SCHEMA_CODEC.XML, SCHEMA-TRIE.XML, SCHEMA-REPLICATION2.XML, BAD-SOLRCONFIG-BOGUS-SCRIPTENGINE-NAME.XML, SOLRCONFIG-SLAVE1.XML, SCHEMA-COPYFIELD-TEST.XML, SOLRCONFIG-ELEVATE.XML, SCHEMA11.XML, STOPWORDSWRONGENCODING.TXT, SOLRCONFIG-PROPINJECT-INDEXDEFAULT.XML, SOLRCONFIG-XINCLUDE.XML, SOLRCONFIG-CACHING.XML, SCHEMA-FOLDING.XML, SYNONYMS.TXT, SCHEMA-COLLATEFILTER.XML, SOLRCONFIG-REPEATER.XML, SCHEMA-COLLATE.XML, SOLRCONFIG-PHRASESUGGEST.XML, SOLRCONFIG_CODEC.XML, ADDFIELDS.UPDATEPROCESSOR.JS, SOLRCONFIG-TRANSFORMERS.XML, SCHEMA-LUCENEMATCHVERSION.XML, SCHEMA-MINIMAL.XML, BAD-SCHEMA-NOT-INDEXED-BUT-POS.XML, BAD-SCHEMA-OMIT-TF-BUT-NOT-POS.XML, STOP-1.TXT, SOLRCONFIG-DELPOLICY2.XML, SOLRCONFIG-REQHANDLER.INCL, SOLRCONFIG-MASTER2.XML, CURRENCY.XML, SOLRCONFIG-MASTER3.XML, WDFTYPES.TXT, SCHEMA-IB.XML, BAD-SCHEMA-DUP-FIELD.XML, SOLRCONFIG-LAZYWRITER.XML, SCHEMA-LMDIRICHLET.XML, SCHEMA-SPELLCHECKER.XML, SCHEMASURROUND.XML, BAD-SCHEMA-NOT-INDEXED-BUT-NORMS.XML, SCHEMA-NUMERIC.XML, BAD-SCHEMA-EXTERNAL-FILEFIELD.XML, BAD-SOLRCONFIG-INVALID-SCRIPTFILE.XML, SOLRCONFIG-SOLCOREPROPERTIES.XML, SCHEMA-REPLICATION1.XML, COMPOUNDDICTIONARY.TXT, SOLRCONFIG-SOLR-749.XML, STOP-2.TXT, SOLRCONFIG-SPELLCHECKCOMPONENT.XML, TRIVIAL.UPDATEPROCESSOR1.JS, SCHEMA.XML, THROW.ERROR.ON.ADD.UPDATEPROCESSOR.JS, SOLRCONFIG-SIMPLELOCK.XML, BAD-SCHEMA-DUP-DYNAMICFIELD.XML, SOLRCONFIG-DELPOLICY1.XML, SOLRCONFIG-MERGEPOLICY.XML, DA_UTF8.XML, SOLRCONFIG_PERF.XML, HUNSPELL-TEST.AFF, FRENCHARTICLES.TXT, SOLRCONFIG-NOCACHE.XML, PHRASESUGGEST.TXT, SOLRCONFIG-ENABLEPLUGIN.XML, XSLT, BAD-SCHEMA-ANALYZER-CLASS-AND-NESTED.XML, STEMDICT.TXT, BAD-SCHEMA-CODEC-GLOBAL-VS-FT-MISMATCH.XML, PROTWORDS.TXT, SCHEMA12.XML, MISSLEADING.EXTENSION.UPDATEPROCESSOR.JS.TXT, SCHEMA-BINARYFIELD.XML, MISSING.FUNCTIONS.UPDATEPROCESSOR.JS, SCHEMA-PHRASESUGGEST.XML, DA_COMPOUNDDICTIONARY.TXT, BAD-SCHEMA-UNIQUEKEY-IS-COPYFIELD-DEST.XML, BAD-SCHEMA-NONTEXT-ANALYZER.XML, SCHEMA-TFIDF.XML, SOLRCONFIG-QUERYSENDER-NOQUERY.XML, OLD_SYNONYMS.TXT, SOLRCONFIG-MASTER1.XML, BAD-SCHEMA-UNIQUEKEY-USES-DEFAULT.XML, HYPHENATION.DTD, SOLRCONFIG-HIGHLIGHT.XML, CONDITIONAL.UPDATEPROCESSOR.JS, MAPPING-ISOLATIN1ACCENT.TXT, BAD_SOLRCONFIG.XML, SOLRCONFIG-TLOG.XML, SCHEMA15.XML, SCHEMA-REQUIRED-FIELDS.XML, STOPTYPES-1.TXT, SOLRCONFIG-UPDATE-PROCESSOR-CHAINS.XML, SOLRCONFIG-BASIC.XML, SCHEMA-BM25.XML, SCHEMA-NOT-REQUIRED-UNIQUE-KEY.XML, BAD-MP-SOLRCONFIG.XML, KEEP-1.TXT, SOLRCONFIG-ALTDIRECTORY.XML]
[junit4:junit4]   2> 1173 T8116 oass.SolrIndexSearcher.<init> Opening Searcher@178f268 main
[junit4:junit4]   2> 1174 T8116 oass.SolrIndexSearcher.getIndexDir WARNING WARNING: Directory impl does not support setting indexDir: org.apache.lucene.store.MockDirectoryWrapper
[junit4:junit4]   2> 1174 T8116 oasu.CommitTracker.<init> Hard AutoCommit: disabled
[junit4:junit4]   2> 1174 T8116 oasu.CommitTracker.<init> Soft AutoCommit: disabled
[junit4:junit4]   2> 1175 T8116 oashc.QueryElevationComponent.inform Loading QueryElevation from: /mnt/ssd/jenkins/workspace/Lucene-Solr-4.x-Linux/checkout/solr/build/solr-core/test-files/solr/collection1/conf/elevate.xml
[junit4:junit4]   2> 1181 T8116 oashc.QueryElevationComponent.inform Loading QueryElevation from: /mnt/ssd/jenkins/workspace/Lucene-Solr-4.x-Linux/checkout/solr/build/solr-core/test-files/solr/collection1/conf/elevate.xml
[junit4:junit4]   2> 1188 T8116 oashc.HttpShardHandlerFactory.getParameter Setting socketTimeout to: 0
[junit4:junit4]   2> 1188 T8116 oashc.HttpShardHandlerFactory.getParameter Setting urlScheme to: http://
[junit4:junit4]   2> 1188 T8116 oashc.HttpShardHandlerFactory.getParameter Setting connTimeout to: 0
[junit4:junit4]   2> 1189 T8116 oashc.HttpShardHandlerFactory.getParameter Setting maxConnectionsPerHost to: 20
[junit4:junit4]   2> 1189 T8116 oashc.HttpShardHandlerFactory.getParameter Setting corePoolSize to: 0
[junit4:junit4]   2> 1189 T8116 oashc.HttpShardHandlerFactory.getParameter Setting maximumPoolSize to: 2147483647
[junit4:junit4]   2> 1189 T8116 oashc.HttpShardHandlerFactory.getParameter Setting maxThreadIdleTime to: 5
[junit4:junit4]   2> 1189 T8116 oashc.HttpShardHandlerFactory.getParameter Setting sizeOfQueue to: -1
[junit4:junit4]   2> 1190 T8116 oashc.HttpShardHandlerFactory.getParameter Setting fairnessPolicy to: false
[junit4:junit4]   2> 1190 T8116 oascsi.HttpClientUtil.createClient Creating new http client, config:maxConnectionsPerHost=20&maxConnections=10000&socketTimeout=0&connTimeout=0&retry=false
[junit4:junit4]   2> 1193 T8156 oasc.SolrCore.registerSearcher [collection1] Registered new searcher Searcher@178f268 main{StandardDirectoryReader(segments_1:1)}
[junit4:junit4]   2> 1193 T8116 oasc.CoreContainer.register registering core: collection1
[junit4:junit4]   2> 1194 T8116 oass.SolrDispatchFilter.init user.dir=/mnt/ssd/jenkins/workspace/Lucene-Solr-4.x-Linux/checkout/solr/build/solr-core/test/J1
[junit4:junit4]   2> 1194 T8116 oass.SolrDispatchFilter.init SolrDispatchFilter.init() done
[junit4:junit4]   2> 1194 T8116 oascsi.HttpClientUtil.createClient Creating new http client, config:maxConnections=128&maxConnectionsPerHost=32&followRedirects=false
[junit4:junit4]   2> ASYNC  NEW_CORE C174 name=collection1 org.apache.solr.core.SolrCore@9a3ba2
[junit4:junit4]   2> 1201 T8119 C174 oasu.DirectUpdateHandler2.deleteAll [collection1] REMOVING ALL DOCUMENTS FROM INDEX
[junit4:junit4]   2> 1203 T8119 C174 oasc.SolrDeletionPolicy.onInit SolrDeletionPolicy.onInit: commits:num=1
[junit4:junit4]   2> 		commit{dir=MockDirWrapper(org.apache.lucene.store.RAMDirectory@1c11b74 lockFactory=org.apache.lucene.store.SingleInstanceLockFactory@14396fa),segFN=segments_1,generation=1,filenames=[segments_1]
[junit4:junit4]   2> 1203 T8119 C174 oasc.SolrDeletionPolicy.updateCommits newest commit = 1
[junit4:junit4]   2> 1203 T8119 C174 UPDATE [collection1] webapp=/solr path=/update params={wt=javabin&version=2} {deleteByQuery=*:*} 0 2
[junit4:junit4]   2> ASYNC  NEW_CORE C175 name=collection1 org.apache.solr.core.SolrCore@581095
[junit4:junit4]   2> 1208 T8129 C175 oasu.DirectUpdateHandler2.deleteAll [collection1] REMOVING ALL DOCUMENTS FROM INDEX
[junit4:junit4]   2> 1210 T8129 C175 oasc.SolrDeletionPolicy.onInit SolrDeletionPolicy.onInit: commits:num=1
[junit4:junit4]   2> 		commit{dir=MockDirWrapper(org.apache.lucene.store.RAMDirectory@1a8cc54 lockFactory=org.apache.lucene.store.SingleInstanceLockFactory@79e509),segFN=segments_1,generation=1,filenames=[segments_1]
[junit4:junit4]   2> 1210 T8129 C175 oasc.SolrDeletionPolicy.updateCommits newest commit = 1
[junit4:junit4]   2> 1211 T8129 C175 UPDATE [collection1] webapp=/solr path=/update params={wt=javabin&version=2} {deleteByQuery=*:*} 0 3
[junit4:junit4]   2> ASYNC  NEW_CORE C176 name=collection1 org.apache.solr.core.SolrCore@f7d673
[junit4:junit4]   2> 1214 T8139 C176 oasu.DirectUpdateHandler2.deleteAll [collection1] REMOVING ALL DOCUMENTS FROM INDEX
[junit4:junit4]   2> 1215 T8139 C176 oasc.SolrDeletionPolicy.onInit SolrDeletionPolicy.onInit: commits:num=1
[junit4:junit4]   2> 		commit{dir=MockDirWrapper(org.apache.lucene.store.RAMDirectory@1203851 lockFactory=org.apache.lucene.store.SingleInstanceLockFactory@1f347ad),segFN=segments_1,generation=1,filenames=[segments_1]
[junit4:junit4]   2> 1216 T8139 C176 oasc.SolrDeletionPolicy.updateCommits newest commit = 1
[junit4:junit4]   2> 1216 T8139 C176 UPDATE [collection1] webapp=/solr path=/update params={wt=javabin&version=2} {deleteByQuery=*:*} 0 2
[junit4:junit4]   2> ASYNC  NEW_CORE C177 name=collection1 org.apache.solr.core.SolrCore@17bc509
[junit4:junit4]   2> 1219 T8149 C177 oasu.DirectUpdateHandler2.deleteAll [collection1] REMOVING ALL DOCUMENTS FROM INDEX
[junit4:junit4]   2> 1220 T8149 C177 oasc.SolrDeletionPolicy.onInit SolrDeletionPolicy.onInit: commits:num=1
[junit4:junit4]   2> 		commit{dir=MockDirWrapper(org.apache.lucene.store.RAMDirectory@c4ea39 lockFactory=org.apache.lucene.store.SingleInstanceLockFactory@19c077a),segFN=segments_1,generation=1,filenames=[segments_1]
[junit4:junit4]   2> 1221 T8149 C177 oasc.SolrDeletionPolicy.updateCommits newest commit = 1
[junit4:junit4]   2> 1221 T8149 C177 UPDATE [collection1] webapp=/solr path=/update params={wt=javabin&version=2} {deleteByQuery=*:*} 0 2
[junit4:junit4]   2> 1223 T8119 C174 UPDATE [collection1] webapp=/solr path=/update params={wt=javabin&version=2} {add=[1]} 0 0
[junit4:junit4]   2> 1226 T8129 C175 UPDATE [collection1] webapp=/solr path=/update params={wt=javabin&version=2} {add=[1]} 0 1
[junit4:junit4]   2> 1227 T8119 C174 UPDATE [collection1] webapp=/solr path=/update params={wt=javabin&version=2} {add=[2]} 0 0
[junit4:junit4]   2> 1230 T8139 C176 UPDATE [collection1] webapp=/solr path=/update params={wt=javabin&version=2} {add=[2]} 0 1
[junit4:junit4]   2> 1231 T8119 C174 UPDATE [collection1] webapp=/solr path=/update params={wt=javabin&version=2} {add=[3]} 0 0
[junit4:junit4]   2> 1233 T8149 C177 UPDATE [collection1] webapp=/solr path=/update params={wt=javabin&version=2} {add=[3]} 0 0
[junit4:junit4]   2> 1235 T8119 C174 UPDATE [collection1] webapp=/solr path=/update params={wt=javabin&version=2} {add=[4]} 0 0
[junit4:junit4]   2> 1237 T8129 C175 UPDATE [collection1] webapp=/solr path=/update params={wt=javabin&version=2} {add=[4]} 0 0
[junit4:junit4]   2> 1239 T8119 C174 UPDATE [collection1] webapp=/solr path=/update params={wt=javabin&version=2} {add=[5]} 0 0
[junit4:junit4]   2> 1241 T8139 C176 UPDATE [collection1] webapp=/solr path=/update params={wt=javabin&version=2} {add=[5]} 0 0
[junit4:junit4]   2> 1243 T8119 C174 UPDATE [collection1] webapp=/solr path=/update params={wt=javabin&version=2} {add=[6]} 0 0
[junit4:junit4]   2> 1244 T8149 C177 UPDATE [collection1] webapp=/solr path=/update params={wt=javabin&version=2} {add=[6]} 0 0
[junit4:junit4]   2> 1246 T8119 C174 UPDATE [collection1] webapp=/solr path=/update params={wt=javabin&version=2} {add=[7]} 0 0
[junit4:junit4]   2> 1248 T8149 C177 UPDATE [collection1] webapp=/solr path=/update params={wt=javabin&version=2} {add=[7]} 0 0
[junit4:junit4]   2> 1250 T8119 C174 oasu.DirectUpdateHandler2.commit start commit{flags=0,_version_=0,optimize=false,openSearcher=true,waitSearcher=true,expungeDeletes=false,softCommit=false}
[junit4:junit4]   2> 1251 T8119 C174 oasc.SolrDeletionPolicy.onCommit SolrDeletionPolicy.onCommit: commits:num=2
[junit4:junit4]   2> 		commit{dir=MockDirWrapper(org.apache.lucene.store.RAMDirectory@1c11b74 lockFactory=org.apache.lucene.store.SingleInstanceLockFactory@14396fa),segFN=segments_1,generation=1,filenames=[segments_1]
[junit4:junit4]   2> 		commit{dir=MockDirWrapper(org.apache.lucene.store.RAMDirectory@1c11b74 lockFactory=org.apache.lucene.store.SingleInstanceLockFactory@14396fa),segFN=segments_2,generation=2,filenames=[_0_Lucene40_0.frq, _0_Lucene40_0.tip, _0.fdt, _0.fnm, _0_Direct_0.tip, _0_nrm.cfe, _0_Lucene40_0.prx, _0_Direct_0.frq, _0.fdx, _0.si, _0_nrm.cfs, _0_Direct_0.tim, _0_Direct_0.prx, _0_Lucene40_0.tim, segments_2]
[junit4:junit4]   2> 1252 T8119 C174 oasc.SolrDeletionPolicy.updateCommits newest commit = 2
[junit4:junit4]   2> 1253 T8119 C174 oass.SolrIndexSearcher.<init> Opening Searcher@1ec7dd0 main
[junit4:junit4]   2> 1253 T8119 C174 oass.SolrIndexSearcher.getIndexDir WARNING WARNING: Directory impl does not support setting indexDir: org.apache.lucene.store.MockDirectoryWrapper
[junit4:junit4]   2> 1254 T8119 C174 oasu.DirectUpdateHandler2.commit end_commit_flush
[junit4:junit4]   2> 1255 T8126 oasc.SolrCore.registerSearcher [collection1] Registered new searcher Searcher@1ec7dd0 main{StandardDirectoryReader(segments_2:4 _0(4.0.0.1):C7)}
[junit4:junit4]   2> 1255 T8119 C174 UPDATE [collection1] webapp=/solr path=/update params={version=2&wt=javabin&softCommit=false&commit=true&waitSearcher=true} {commit=} 0 5
[junit4:junit4]   2> 1257 T8129 C175 oasu.DirectUpdateHandler2.commit start commit{flags=0,_version_=0,optimize=false,openSearcher=true,waitSearcher=true,expungeDeletes=false,softCommit=false}
[junit4:junit4]   2> 1258 T8129 C175 oasc.SolrDeletionPolicy.onCommit SolrDeletionPolicy.onCommit: commits:num=2
[junit4:junit4]   2> 		commit{dir=MockDirWrapper(org.apache.lucene.store.RAMDirectory@1a8cc54 lockFactory=org.apache.lucene.store.SingleInstanceLockFactory@79e509),segFN=segments_1,generation=1,filenames=[segments_1]
[junit4:junit4]   2> 		commit{dir=MockDirWrapper(org.apache.lucene.store.RAMDirectory@1a8cc54 lockFactory=org.apache.lucene.store.SingleInstanceLockFactory@79e509),segFN=segments_2,generation=2,filenames=[_0_Lucene40_0.frq, _0_Lucene40_0.tip, _0.fdt, _0.fnm, _0_Direct_0.tip, _0_nrm.cfe, _0_Lucene40_0.prx, _0_Direct_0.frq, _0.fdx, _0.si, _0_nrm.cfs, _0_Direct_0.tim, _0_Direct_0.prx, _0_Lucene40_0.tim, segments_2]
[junit4:junit4]   2> 1259 T8129 C175 oasc.SolrDeletionPolicy.updateCommits newest commit = 2
[junit4:junit4]   2> 1260 T8129 C175 oass.SolrIndexSearcher.<init> Opening Searcher@16f0d16 main
[junit4:junit4]   2> 1260 T8129 C175 oass.SolrIndexSearcher.getIndexDir WARNING WARNING: Directory impl does not support setting indexDir: org.apache.lucene.store.MockDirectoryWrapper
[junit4:junit4]   2> 1260 T8129 C175 oasu.DirectUpdateHandler2.commit end_commit_flush
[junit4:junit4]   2> 1261 T8136 oasc.SolrCore.registerSearcher [collection1] Registered new searcher Searcher@16f0d16 main{StandardDirectoryReader(segments_2:4 _0(4.0.0.1):C2)}
[junit4:junit4]   2> 1261 T8129 C175 UPDATE [collection1] webapp=/solr path=/update params={version=2&wt=javabin&softCommit=false&commit=true&waitSearcher=true} {commit=} 0 4
[junit4:junit4]   2> 1263 T8139 C176 oasu.DirectUpdateHandler2.commit start commit{flags=0,_version_=0,optimize=false,openSearcher=true,waitSearcher=true,expungeDeletes=false,softCommit=false}
[junit4:junit4]   2> 1264 T8139 C176 oasc.SolrDeletionPolicy.onCommit SolrDeletionPolicy.onCommit: commits:num=2
[junit4:junit4]   2> 		commit{dir=MockDirWrapper(org.apache.lucene.store.RAMDirectory@1203851 lockFactory=org.apache.lucene.store.SingleInstanceLockFactory@1f347ad),segFN=segments_1,generation=1,filenames=[segments_1]
[junit4:junit4]   2> 		commit{dir=MockDirWrapper(org.apache.lucene.store.RAMDirectory@1203851 lockFactory=org.apache.lucene.store.SingleInstanceLockFactory@1f347ad),segFN=segments_2,generation=2,filenames=[_0_Lucene40_0.frq, _0_Lucene40_0.tip, _0.fdt, _0.fnm, _0_Direct_0.tip, _0_nrm.cfe, _0_Lucene40_0.prx, _0_Direct_0.frq, _0.fdx, _0.si, _0_nrm.cfs, _0_Direct_0.tim, _0_Direct_0.prx, _0_Lucene40_0.tim, segments_2]
[junit4:junit4]   2> 1264 T8139 C176 oasc.SolrDeletionPolicy.updateCommits newest commit = 2
[junit4:junit4]   2> 1265 T8139 C176 oass.SolrIndexSearcher.<init> Opening Searcher@2210ec main
[junit4:junit4]   2> 1265 T8139 C176 oass.SolrIndexSearcher.getIndexDir WARNING WARNING: Directory impl does not support setting indexDir: org.apache.lucene.store.MockDirectoryWrapper
[junit4:junit4]   2> 1265 T8139 C176 oasu.DirectUpdateHandler2.commit end_commit_flush
[junit4:junit4]   2> 1266 T8146 oasc.SolrCore.registerSearcher [collection1] Registered new searcher Searcher@2210ec main{StandardDirectoryReader(segments_2:4 _0(4.0.0.1):C2)}
[junit4:junit4]   2> 1266 T8139 C176 UPDATE [collection1] webapp=/solr path=/update params={version=2&wt=javabin&softCommit=false&commit=true&waitSearcher=true} {commit=} 0 3
[junit4:junit4]   2> 1268 T8149 C177 oasu.DirectUpdateHandler2.commit start commit{flags=0,_version_=0,optimize=false,openSearcher=true,waitSearcher=true,expungeDeletes=false,softCommit=false}
[junit4:junit4]   2> 1269 T8149 C177 oasc.SolrDeletionPolicy.onCommit SolrDeletionPolicy.onCommit: commits:num=2
[junit4:junit4]   2> 		commit{dir=MockDirWrapper(org.apache.lucene.store.RAMDirectory@c4ea39 lockFactory=org.apache.lucene.store.SingleInstanceLockFactory@19c077a),segFN=segments_1,generation=1,filenames=[segments_1]
[junit4:junit4]   2> 		commit{dir=MockDirWrapper(org.apache.lucene.store.RAMDirectory@c4ea39 lockFactory=org.apache.lucene.store.SingleInstanceLockFactory@19c077a),segFN=segments_2,generation=2,filenames=[_0_Lucene40_0.frq, _0_Lucene40_0.tip, _0.fdt, _0.fnm, _0_Direct_0.tip, _0_nrm.cfe, _0_Lucene40_0.prx, _0_Direct_0.frq, _0.fdx, _0.si, _0_nrm.cfs, _0_Direct_0.tim, _0_Direct_0.prx, _0_Lucene40_0.tim, segments_2]
[junit4:junit4]   2> 1270 T8149 C177 oasc.SolrDeletionPolicy.updateCommits newest commit = 2
[junit4:junit4]   2> 1270 T8149 C177 oass.SolrIndexSearcher.<init> Opening Searcher@185aa58 main
[junit4:junit4]   2> 1270 T8149 C177 oass.SolrIndexSearcher.getIndexDir WARNING WARNING: Directory impl does not support setting indexDir: org.apache.lucene.store.MockDirectoryWrapper
[junit4:junit4]   2> 1271 T8149 C177 oasu.DirectUpdateHandler2.commit end_commit_flush
[junit4:junit4]   2> 1271 T8156 oasc.SolrCore.registerSearcher [collection1] Registered new searcher Searcher@185aa58 main{StandardDirectoryReader(segments_2:4 _0(4.0.0.1):C3)}
[junit4:junit4]   2> 1272 T8149 C177 UPDATE [collection1] webapp=/solr path=/update params={version=2&wt=javabin&softCommit=false&commit=true&waitSearcher=true} {commit=} 0 4
[junit4:junit4]   2> 1275 T8119 C174 REQ [collection1] webapp=/solr path=/elevate params={rows=500&sort=id+desc&wt=javabin&q=*:*&qt=/elevate&shards.qt=/elevate&version=2&fl=id,+score,+[elevated]&distrib=false} hits=7 status=0 QTime=0 
[junit4:junit4]   2> 1278 T8130 C175 REQ [collection1] webapp=/solr path=/elevate params={wt=javabin&q=*:*&NOW=1343696726398&version=2&shard.url=localhost:40315/solr&distrib=false&rows=500&start=0&fsv=true&sort=id+desc&qt=/elevate&shards.qt=/elevate&isShard=true&fl=id,score} hits=2 status=0 QTime=0 
[junit4:junit4]   2> 1278 T8150 C177 REQ [collection1] webapp=/solr path=/elevate params={wt=javabin&q=*:*&NOW=1343696726398&version=2&shard.url=localhost:57410/solr&distrib=false&rows=500&start=0&fsv=true&sort=id+desc&qt=/elevate&shards.qt=/elevate&isShard=true&fl=id,score} hits=3 status=0 QTime=0 
[junit4:junit4]   2> 1278 T8140 C176 REQ [collection1] webapp=/solr path=/elevate params={wt=javabin&q=*:*&NOW=1343696726398&version=2&shard.url=localhost:41864/solr|[::1]:33332/solr&distrib=false&rows=500&start=0&fsv=true&sort=id+desc&qt=/elevate&shards.qt=/elevate&isShard=true&fl=id,score} hits=2 status=0 QTime=0 
[junit4:junit4]   2> 1281 T8150 C177 REQ [collection1] webapp=/solr path=/elevate params={wt=javabin&q=*:*&ids=7.0,6.0,3.0&NOW=1343696726398&version=2&shard.url=localhost:57410/solr&distrib=false&rows=500&qt=/elevate&shards.qt=/elevate&isShard=true&fl=id,+score,+[elevated]} status=0 QTime=1 
[junit4:junit4]   2> 1281 T8140 C176 REQ [collection1] webapp=/solr path=/elevate params={wt=javabin&q=*:*&ids=5.0,2.0&NOW=1343696726398&version=2&shard.url=localhost:41864/solr|[::1]:33332/solr&distrib=false&rows=500&qt=/elevate&shards.qt=/elevate&isShard=true&fl=id,+score,+[elevated]} status=0 QTime=1 
[junit4:junit4]   2> 1281 T8130 C175 REQ [collection1] webapp=/solr path=/elevate params={wt=javabin&q=*:*&ids=4.0,1.0&NOW=1343696726398&version=2&shard.url=localhost:40315/solr&distrib=false&rows=500&qt=/elevate&shards.qt=/elevate&isShard=true&fl=id,+score,+[elevated]} status=0 QTime=1 
[junit4:junit4]   2> 1282 T8129 C175 REQ [collection1] webapp=/solr path=/elevate params={rows=500&sort=id+desc&wt=javabin&q=*:*&qt=/elevate&shards.qt=/elevate&version=2&shards=localhost:40315/solr,localhost:41864/solr|[::1]:33332/solr,localhost:57410/solr&fl=id,+score,+[elevated]} status=0 QTime=6 
[junit4:junit4]   2> 1282 T8116 oas.BaseDistributedSearchTestCase.compareResponses SEVERE Mismatched responses:
[junit4:junit4]   2> 	{responseHeader={status=0,QTime=6,params={rows=500,sort=id desc,wt=javabin,q=*:*,qt=/elevate,shards.qt=/elevate,version=2,shards=localhost:40315/solr,localhost:41864/solr|[::1]:33332/solr,localhost:57410/solr,fl=id, score, [elevated]}},response={numFound=7,start=0,maxScore=1.0,docs=[SolrDocument{id=7.0, [elevated]=false, score=1.0}, SolrDocument{id=6.0, [elevated]=false, score=1.0}, SolrDocument{id=5.0, [elevated]=false, score=1.0}, SolrDocument{id=4.0, [elevated]=false, score=1.0}, SolrDocument{id=3.0, [elevated]=false, score=1.0}, SolrDocument{id=2.0, [elevated]=false, score=1.0}, SolrDocument{id=1.0, [elevated]=false, score=1.0}]}}
[junit4:junit4]   2> 	{responseHeader={status=0,QTime=0,params={rows=500,sort=id desc,wt=javabin,q=*:*,qt=/elevate,shards.qt=/elevate,version=2,fl=id, score, [elevated],distrib=false}},response={numFound=7,start=0,maxScore=1.0,docs=[SolrDocument{id=7.0, score=1.0, [elevated]=false}, SolrDocument{id=6.0, score=1.0, [elevated]=false}, SolrDocument{id=5.0, score=1.0, [elevated]=false}, SolrDocument{id=4.0, score=1.0, [elevated]=false}, SolrDocument{id=3.0, score=1.0, [elevated]=false}, SolrDocument{id=2.0, score=1.0, [elevated]=false}, SolrDocument{id=1.0, score=1.0, [elevated]=false}]}}
[junit4:junit4]   2> 1283 T8116 oasc.CoreContainer.shutdown Shutting down CoreContainer instance=9841313
[junit4:junit4]   2> 1284 T8116 oasc.SolrCore.close [collection1]  CLOSING SolrCore org.apache.solr.core.SolrCore@9a3ba2
[junit4:junit4]   2> 1284 T8116 oasc.SolrCore.closeSearcher [collection1] Closing main searcher on request.
[junit4:junit4]   2> 1285 T8116 oasu.DirectUpdateHandler2.close closing DirectUpdateHandler2{commits=1,autocommits=0,soft autocommits=0,optimizes=0,rollbacks=0,expungeDeletes=0,docsPending=0,adds=0,deletesById=0,deletesByQuery=0,errors=0,cumulative_adds=7,cumulative_deletesById=0,cumulative_deletesByQuery=1,cumulative_errors=0}
[junit4:junit4]   2> 1288 T8116 oejsh.ContextHandler.doStop stopped o.e.j.s.ServletContextHandler{/solr,null}
[junit4:junit4]   2> 1340 T8116 oasc.CoreContainer.shutdown Shutting down CoreContainer instance=12439776
[junit4:junit4]   2> 1340 T8116 oasc.SolrCore.close [collection1]  CLOSING SolrCore org.apache.solr.core.SolrCore@581095
[junit4:junit4]   2> 1341 T8116 oasc.SolrCore.closeSearcher [collection1] Closing main searcher on request.
[junit4:junit4]   2> 1341 T8116 oasu.DirectUpdateHandler2.close closing DirectUpdateHandler2{commits=1,autocommits=0,soft autocommits=0,optimizes=0,rollbacks=0,expungeDeletes=0,docsPending=0,adds=0,deletesById=0,deletesByQuery=0,errors=0,cumulative_adds=2,cumulative_deletesById=0,cumulative_deletesByQuery=1,cumulative_errors=0}
[junit4:junit4]   2> 1344 T8116 oejsh.ContextHandler.doStop stopped o.e.j.s.ServletContextHandler{/solr,null}
[junit4:junit4]   2> 1395 T8116 oasc.CoreContainer.shutdown Shutting down CoreContainer instance=8484441
[junit4:junit4]   2> 1396 T8116 oasc.SolrCore.close [collection1]  CLOSING SolrCore org.apache.solr.core.SolrCore@f7d673
[junit4:junit4]   2> 1397 T8116 oasc.SolrCore.closeSearcher [collection1] Closing main searcher on request.
[junit4:junit4]   2> 1397 T8116 oasu.DirectUpdateHandler2.close closing DirectUpdateHandler2{commits=1,autocommits=0,soft autocommits=0,optimizes=0,rollbacks=0,expungeDeletes=0,docsPending=0,adds=0,deletesById=0,deletesByQuery=0,errors=0,cumulative_adds=2,cumulative_deletesById=0,cumulative_deletesByQuery=1,cumulative_errors=0}
[junit4:junit4]   2> 1400 T8116 oejsh.ContextHandler.doStop stopped o.e.j.s.ServletContextHandler{/solr,null}
[junit4:junit4]   2> 1452 T8116 oasc.CoreContainer.shutdown Shutting down CoreContainer instance=23029375
[junit4:junit4]   2> 1452 T8116 oasc.SolrCore.close [collection1]  CLOSING SolrCore org.apache.solr.core.SolrCore@17bc509
[junit4:junit4]   2> 1456 T8116 oasc.SolrCore.closeSearcher [collection1] Closing main searcher on request.
[junit4:junit4]   2> 1457 T8116 oasu.DirectUpdateHandler2.close closing DirectUpdateHandler2{commits=1,autocommits=0,soft autocommits=0,optimizes=0,rollbacks=0,expungeDeletes=0,docsPending=0,adds=0,deletesById=0,deletesByQuery=0,errors=0,cumulative_adds=3,cumulative_deletesById=0,cumulative_deletesByQuery=1,cumulative_errors=0}
[junit4:junit4]   2> 1459 T8116 oejsh.ContextHandler.doStop stopped o.e.j.s.ServletContextHandler{/solr,null}
[junit4:junit4]   2> 1511 T8116 oas.SolrTestCaseJ4.tearDown ###Ending testDistribSearch
[junit4:junit4]   2> NOTE: reproduce with: ant test  -Dtestcase=DistributedQueryElevationComponentTest -Dtests.method=testDistribSearch -Dtests.seed=A55186A1CBEF2E4 -Dtests.multiplier=3 -Dtests.slow=true -Dtests.locale=be -Dtests.timezone=America/Phoenix -Dtests.file.encoding=US-ASCII
[junit4:junit4]   2>
[junit4:junit4]    > (@AfterClass output)
[junit4:junit4]   2> 1553 T8116 oas.SolrTestCaseJ4.deleteCore ###deleteCore
[junit4:junit4]   2> NOTE: test params are: codec=Lucene40: {plow_t=PostingsFormat(name=Direct), id=Lucene40(minBlockSize=93 maxBlockSize=250), int_i=PostingsFormat(name=Direct), text=PostingsFormat(name=Direct), field_t=Lucene40(minBlockSize=93 maxBlockSize=250)}, sim=RandomSimilarityProvider(queryNorm=true,coord=true): {}, locale=be, timezone=America/Phoenix
[junit4:junit4]   2> NOTE: Linux 3.2.0-27-generic i386/Oracle Corporation 1.8.0-ea (32-bit)/cpus=8,threads=1,free=137074864,total=259776512
[junit4:junit4]   2> NOTE: All tests run in this JVM: [TestTrie, TestDocSet, SuggesterWFSTTest, TestPropInjectDefaults, SyncSliceTest, FileUtilsTest, PrimUtilsTest, UpdateParamsTest, FieldMutatingUpdateProcessorTest, HighlighterTest, SuggesterTest, ZkControllerTest, TestSolrXMLSerializer, PrimitiveFieldTypeTest, TestPropInject, OutputWriterTest, TestDocumentBuilder, TestSolrDeletionPolicy2, TestQuerySenderListener, TestCSVResponseWriter, TestCodecSupport, URLClassifyProcessorTest, TestCharFilters, TestHashPartitioner, SystemInfoHandlerTest, ZkNodePropsTest, TestMergePolicyConfig, TestQueryUtils, TestBinaryField, IndexBasedSpellCheckerTest, TestReplicationHandler, TimeZoneUtilsTest, BasicFunctionalityTest, TestArbitraryIndexDir, StatsComponentTest, TestPluginEnable, BadIndexSchemaTest, LukeRequestHandlerTest, SoftAutoCommitTest, ScriptEngineTest, OpenExchangeRatesOrgProviderTest, PolyFieldTest, TestFoldingMultitermQuery, TestFiltering, SuggesterTSTTest, QueryParsingTest, TestSolrCoreProperties, TestBinaryResponseWriter, ReturnFieldsTest, DirectUpdateHandlerTest, CircularListTest, BasicZkTest, SolrPluginUtilsTest, BasicDistributedZkTest, RecoveryZkTest, TestDistributedGrouping, SpellCheckCollatorTest, TestFaceting, WordBreakSolrSpellCheckerTest, DistributedTermsComponentTest, SimpleFacetsTest, TestCoreContainer, TestGroupingSearch, ConvertedLegacyTest, PeerSyncTest, QueryElevationComponentTest, SortByFunctionTest, TestJmxIntegration, SampleTest, CoreAdminHandlerTest, TestFunctionQuery, SolrRequestParserTest, DirectSolrConnectionTest, TestRemoteStreaming, QueryEqualityTest, TestWordDelimiterFilterFactory, TestCSVLoader, MoreLikeThisHandlerTest, DocumentBuilderTest, DistributedQueryElevationComponentTest]
[junit4:junit4]   2> 
[junit4:junit4] Completed on J1 in 1.56s, 1 test, 1 failure <<< FAILURES!

[...truncated 243 lines...]
BUILD FAILED
/mnt/ssd/jenkins/workspace/Lucene-Solr-4.x-Linux/checkout/build.xml:29: The following error occurred while executing this line:
/mnt/ssd/jenkins/workspace/Lucene-Solr-4.x-Linux/checkout/solr/build.xml:144: The following error occurred while executing this line:
/mnt/ssd/jenkins/workspace/Lucene-Solr-4.x-Linux/checkout/lucene/module-build.xml:62: The following error occurred while executing this line:
/mnt/ssd/jenkins/workspace/Lucene-Solr-4.x-Linux/checkout/lucene/common-build.xml:1095: The following error occurred while executing this line:
/mnt/ssd/jenkins/workspace/Lucene-Solr-4.x-Linux/checkout/lucene/common-build.xml:790: There were test failures: 224 suites, 903 tests, 1 failure, 5 ignored

Total time: 20 minutes 14 seconds
Build step 'Execute shell' marked build as failure
Archiving artifacts
Recording test results
Email was triggered for: Failure
Sending email for trigger: Failure



Mime
View raw message