lucene-dev mailing list archives

Site index · List index
Message view « Date » · « Thread »
Top « Date » · « Thread »
From Policeman Jenkins Server <jenk...@sd-datasolutions.de>
Subject [JENKINS] Lucene-Solr-4.x-Linux-Java8-64 - Build # 10 - Still Failing!
Date Thu, 12 Jul 2012 15:52:27 GMT
Build: http://jenkins.sd-datasolutions.de/job/Lucene-Solr-4.x-Linux-Java8-64/10/

2 tests failed.
FAILED:  org.apache.solr.handler.component.SpellCheckComponentTest.testPerDictionary

Error Message:
mismatch: '0'!='2' @ spellcheck/suggestions/bar/startOffset

Stack Trace:
java.lang.RuntimeException: mismatch: '0'!='2' @ spellcheck/suggestions/bar/startOffset
	at __randomizedtesting.SeedInfo.seed([4A534EA0AA6C1E7E:8D5DBA08A2000B36]:0)
	at org.apache.solr.SolrTestCaseJ4.assertJQ(SolrTestCaseJ4.java:573)
	at org.apache.solr.SolrTestCaseJ4.assertJQ(SolrTestCaseJ4.java:521)
	at org.apache.solr.handler.component.SpellCheckComponentTest.testPerDictionary(SpellCheckComponentTest.java:102)
	at sun.reflect.NativeMethodAccessorImpl.invoke0(Native Method)
	at sun.reflect.NativeMethodAccessorImpl.invoke(NativeMethodAccessorImpl.java:57)
	at sun.reflect.DelegatingMethodAccessorImpl.invoke(DelegatingMethodAccessorImpl.java:43)
	at java.lang.reflect.Method.invoke(Method.java:474)
	at com.carrotsearch.randomizedtesting.RandomizedRunner.invoke(RandomizedRunner.java:1995)
	at com.carrotsearch.randomizedtesting.RandomizedRunner.access$1100(RandomizedRunner.java:132)
	at com.carrotsearch.randomizedtesting.RandomizedRunner$6.evaluate(RandomizedRunner.java:818)
	at com.carrotsearch.randomizedtesting.RandomizedRunner$7.evaluate(RandomizedRunner.java:877)
	at com.carrotsearch.randomizedtesting.RandomizedRunner$8.evaluate(RandomizedRunner.java:891)
	at com.carrotsearch.randomizedtesting.rules.SystemPropertiesRestoreRule$1.evaluate(SystemPropertiesRestoreRule.java:53)
	at org.apache.lucene.util.TestRuleSetupTeardownChained$1.evaluate(TestRuleSetupTeardownChained.java:50)
	at org.apache.lucene.util.TestRuleFieldCacheSanity$1.evaluate(TestRuleFieldCacheSanity.java:32)
	at org.apache.lucene.util.AbstractBeforeAfterRule$1.evaluate(AbstractBeforeAfterRule.java:45)
	at com.carrotsearch.randomizedtesting.rules.SystemPropertiesInvariantRule$1.evaluate(SystemPropertiesInvariantRule.java:55)
	at org.apache.lucene.util.TestRuleReportUncaughtExceptions$1.evaluate(TestRuleReportUncaughtExceptions.java:68)
	at org.apache.lucene.util.TestRuleThreadAndTestName$1.evaluate(TestRuleThreadAndTestName.java:48)
	at org.apache.lucene.util.TestRuleIgnoreAfterMaxFailures$1.evaluate(TestRuleIgnoreAfterMaxFailures.java:70)
	at org.apache.lucene.util.TestRuleMarkFailure$1.evaluate(TestRuleMarkFailure.java:48)
	at com.carrotsearch.randomizedtesting.RandomizedRunner.runSingleTest(RandomizedRunner.java:825)
	at com.carrotsearch.randomizedtesting.RandomizedRunner.access$700(RandomizedRunner.java:132)
	at com.carrotsearch.randomizedtesting.RandomizedRunner$3$1.run(RandomizedRunner.java:671)
	at com.carrotsearch.randomizedtesting.RandomizedRunner$3.evaluate(RandomizedRunner.java:697)
	at com.carrotsearch.randomizedtesting.RandomizedRunner$4.evaluate(RandomizedRunner.java:736)
	at com.carrotsearch.randomizedtesting.RandomizedRunner$5.evaluate(RandomizedRunner.java:747)
	at com.carrotsearch.randomizedtesting.rules.SystemPropertiesRestoreRule$1.evaluate(SystemPropertiesRestoreRule.java:53)
	at org.apache.lucene.util.AbstractBeforeAfterRule$1.evaluate(AbstractBeforeAfterRule.java:45)
	at org.apache.lucene.util.TestRuleReportUncaughtExceptions$1.evaluate(TestRuleReportUncaughtExceptions.java:68)
	at org.apache.lucene.util.TestRuleStoreClassName$1.evaluate(TestRuleStoreClassName.java:38)
	at org.apache.lucene.util.TestRuleIcuHack$1.evaluate(TestRuleIcuHack.java:51)
	at com.carrotsearch.randomizedtesting.rules.SystemPropertiesInvariantRule$1.evaluate(SystemPropertiesInvariantRule.java:55)
	at org.apache.lucene.util.TestRuleNoInstanceHooksOverrides$1.evaluate(TestRuleNoInstanceHooksOverrides.java:53)
	at org.apache.lucene.util.TestRuleNoStaticHooksShadowing$1.evaluate(TestRuleNoStaticHooksShadowing.java:52)
	at org.apache.lucene.util.TestRuleAssertionsRequired$1.evaluate(TestRuleAssertionsRequired.java:36)
	at org.apache.lucene.util.TestRuleMarkFailure$1.evaluate(TestRuleMarkFailure.java:48)
	at org.apache.lucene.util.TestRuleIgnoreAfterMaxFailures$1.evaluate(TestRuleIgnoreAfterMaxFailures.java:70)
	at org.apache.lucene.util.TestRuleIgnoreTestSuites$1.evaluate(TestRuleIgnoreTestSuites.java:55)
	at com.carrotsearch.randomizedtesting.RandomizedRunner.runSuite(RandomizedRunner.java:605)
	at com.carrotsearch.randomizedtesting.RandomizedRunner.access$400(RandomizedRunner.java:132)
	at com.carrotsearch.randomizedtesting.RandomizedRunner$2.run(RandomizedRunner.java:551)


FAILED:  org.apache.solr.handler.component.DistributedQueryElevationComponentTest.testDistribSearch

Error Message:
.responseHeader.params.size()==9,9skipped=4,5

Stack Trace:
junit.framework.AssertionFailedError: .responseHeader.params.size()==9,9skipped=4,5
	at __randomizedtesting.SeedInfo.seed([4A534EA0AA6C1E7E:CBB5C0B8DD337E42]:0)
	at junit.framework.Assert.fail(Assert.java:50)
	at org.apache.solr.BaseDistributedSearchTestCase.compareResponses(BaseDistributedSearchTestCase.java:670)
	at org.apache.solr.BaseDistributedSearchTestCase.query(BaseDistributedSearchTestCase.java:392)
	at org.apache.solr.handler.component.DistributedQueryElevationComponentTest.doTest(DistributedQueryElevationComponentTest.java:81)
	at org.apache.solr.BaseDistributedSearchTestCase.testDistribSearch(BaseDistributedSearchTestCase.java:679)
	at sun.reflect.NativeMethodAccessorImpl.invoke0(Native Method)
	at sun.reflect.NativeMethodAccessorImpl.invoke(NativeMethodAccessorImpl.java:57)
	at sun.reflect.DelegatingMethodAccessorImpl.invoke(DelegatingMethodAccessorImpl.java:43)
	at java.lang.reflect.Method.invoke(Method.java:474)
	at com.carrotsearch.randomizedtesting.RandomizedRunner.invoke(RandomizedRunner.java:1995)
	at com.carrotsearch.randomizedtesting.RandomizedRunner.access$1100(RandomizedRunner.java:132)
	at com.carrotsearch.randomizedtesting.RandomizedRunner$6.evaluate(RandomizedRunner.java:818)
	at com.carrotsearch.randomizedtesting.RandomizedRunner$7.evaluate(RandomizedRunner.java:877)
	at com.carrotsearch.randomizedtesting.RandomizedRunner$8.evaluate(RandomizedRunner.java:891)
	at com.carrotsearch.randomizedtesting.rules.SystemPropertiesRestoreRule$1.evaluate(SystemPropertiesRestoreRule.java:53)
	at org.apache.lucene.util.TestRuleSetupTeardownChained$1.evaluate(TestRuleSetupTeardownChained.java:50)
	at org.apache.lucene.util.TestRuleFieldCacheSanity$1.evaluate(TestRuleFieldCacheSanity.java:32)
	at org.apache.lucene.util.AbstractBeforeAfterRule$1.evaluate(AbstractBeforeAfterRule.java:45)
	at com.carrotsearch.randomizedtesting.rules.SystemPropertiesInvariantRule$1.evaluate(SystemPropertiesInvariantRule.java:55)
	at org.apache.lucene.util.TestRuleReportUncaughtExceptions$1.evaluate(TestRuleReportUncaughtExceptions.java:68)
	at org.apache.lucene.util.TestRuleThreadAndTestName$1.evaluate(TestRuleThreadAndTestName.java:48)
	at org.apache.lucene.util.TestRuleIgnoreAfterMaxFailures$1.evaluate(TestRuleIgnoreAfterMaxFailures.java:70)
	at org.apache.lucene.util.TestRuleMarkFailure$1.evaluate(TestRuleMarkFailure.java:48)
	at com.carrotsearch.randomizedtesting.RandomizedRunner.runSingleTest(RandomizedRunner.java:825)
	at com.carrotsearch.randomizedtesting.RandomizedRunner.access$700(RandomizedRunner.java:132)
	at com.carrotsearch.randomizedtesting.RandomizedRunner$3$1.run(RandomizedRunner.java:671)
	at com.carrotsearch.randomizedtesting.RandomizedRunner$3.evaluate(RandomizedRunner.java:697)
	at com.carrotsearch.randomizedtesting.RandomizedRunner$4.evaluate(RandomizedRunner.java:736)
	at com.carrotsearch.randomizedtesting.RandomizedRunner$5.evaluate(RandomizedRunner.java:747)
	at com.carrotsearch.randomizedtesting.rules.SystemPropertiesRestoreRule$1.evaluate(SystemPropertiesRestoreRule.java:53)
	at org.apache.lucene.util.AbstractBeforeAfterRule$1.evaluate(AbstractBeforeAfterRule.java:45)
	at org.apache.lucene.util.TestRuleReportUncaughtExceptions$1.evaluate(TestRuleReportUncaughtExceptions.java:68)
	at org.apache.lucene.util.TestRuleStoreClassName$1.evaluate(TestRuleStoreClassName.java:38)
	at org.apache.lucene.util.TestRuleIcuHack$1.evaluate(TestRuleIcuHack.java:51)
	at com.carrotsearch.randomizedtesting.rules.SystemPropertiesInvariantRule$1.evaluate(SystemPropertiesInvariantRule.java:55)
	at org.apache.lucene.util.TestRuleNoInstanceHooksOverrides$1.evaluate(TestRuleNoInstanceHooksOverrides.java:53)
	at org.apache.lucene.util.TestRuleNoStaticHooksShadowing$1.evaluate(TestRuleNoStaticHooksShadowing.java:52)
	at org.apache.lucene.util.TestRuleAssertionsRequired$1.evaluate(TestRuleAssertionsRequired.java:36)
	at org.apache.lucene.util.TestRuleMarkFailure$1.evaluate(TestRuleMarkFailure.java:48)
	at org.apache.lucene.util.TestRuleIgnoreAfterMaxFailures$1.evaluate(TestRuleIgnoreAfterMaxFailures.java:70)
	at org.apache.lucene.util.TestRuleIgnoreTestSuites$1.evaluate(TestRuleIgnoreTestSuites.java:55)
	at com.carrotsearch.randomizedtesting.RandomizedRunner.runSuite(RandomizedRunner.java:605)
	at com.carrotsearch.randomizedtesting.RandomizedRunner.access$400(RandomizedRunner.java:132)
	at com.carrotsearch.randomizedtesting.RandomizedRunner$2.run(RandomizedRunner.java:551)




Build Log:
[...truncated 16945 lines...]
[junit4:junit4] Suite: org.apache.solr.handler.component.SpellCheckComponentTest
[junit4:junit4]    > (@BeforeClass output)
[junit4:junit4]   2> 0 T269 oas.SolrTestCaseJ4.initCore ####initCore
[junit4:junit4]   2> Creating dataDir: /mnt/ssd/jenkins/workspace/Lucene-Solr-4.x-Linux-Java8-64/checkout/solr/build/solr-core/test/J1/./solrtest-SpellCheckComponentTest-1342107998345
[junit4:junit4]   2> 0 T269 oasc.SolrResourceLoader.<init> new SolrResourceLoader for directory: '/mnt/ssd/jenkins/workspace/Lucene-Solr-4.x-Linux-Java8-64/checkout/solr/build/solr-core/test-files/solr/collection1/'
[junit4:junit4]   2> 1 T269 oasc.SolrResourceLoader.replaceClassLoader Adding 'file:/mnt/ssd/jenkins/workspace/Lucene-Solr-4.x-Linux-Java8-64/checkout/solr/build/solr-core/test-files/solr/collection1/lib/README' to classloader
[junit4:junit4]   2> 1 T269 oasc.SolrResourceLoader.replaceClassLoader Adding 'file:/mnt/ssd/jenkins/workspace/Lucene-Solr-4.x-Linux-Java8-64/checkout/solr/build/solr-core/test-files/solr/collection1/lib/classes/' to classloader
[junit4:junit4]   2> 24 T269 oasc.SolrConfig.<init> Using Lucene MatchVersion: LUCENE_40
[junit4:junit4]   2> 86 T269 oasc.SolrConfig.<init> Loaded SolrConfig: solrconfig-spellcheckcomponent.xml
[junit4:junit4]   2> 86 T269 oass.IndexSchema.readSchema Reading Solr Schema
[junit4:junit4]   2> 117 T269 oass.IndexSchema.readSchema Schema name=test
[junit4:junit4]   2> 530 T269 oass.OpenExchangeRatesOrgProvider.init Initialized with rates=open-exchange-rates.json, refreshInterval=1440.
[junit4:junit4]   2> 538 T269 oass.IndexSchema.readSchema default search field in schema is text
[junit4:junit4]   2> 541 T269 oass.IndexSchema.readSchema unique key field: id
[junit4:junit4]   2> 572 T269 oass.FileExchangeRateProvider.reload Reloading exchange rates from file currency.xml
[junit4:junit4]   2> 575 T269 oass.FileExchangeRateProvider.reload Reloading exchange rates from file currency.xml
[junit4:junit4]   2> 577 T269 oass.OpenExchangeRatesOrgProvider.reload Reloading exchange rates from open-exchange-rates.json
[junit4:junit4]   2> 578 T269 oass.OpenExchangeRatesOrgProvider.reload Reloading exchange rates from open-exchange-rates.json
[junit4:junit4]   2> 579 T269 oasc.SolrResourceLoader.locateSolrHome JNDI not configured for solr (NoInitialContextEx)
[junit4:junit4]   2> 579 T269 oasc.SolrResourceLoader.locateSolrHome using system property solr.solr.home: /mnt/ssd/jenkins/workspace/Lucene-Solr-4.x-Linux-Java8-64/checkout/solr/build/solr-core/test-files/solr
[junit4:junit4]   2> 579 T269 oasc.SolrResourceLoader.<init> new SolrResourceLoader for directory: '/mnt/ssd/jenkins/workspace/Lucene-Solr-4.x-Linux-Java8-64/checkout/solr/build/solr-core/test-files/solr/'
[junit4:junit4]   2> 579 T269 oasc.CoreContainer.<init> New CoreContainer 664211070
[junit4:junit4]   2> 579 T269 oasc.SolrCore.<init> [collection1] Opening new SolrCore at /mnt/ssd/jenkins/workspace/Lucene-Solr-4.x-Linux-Java8-64/checkout/solr/build/solr-core/test-files/solr/collection1/, dataDir=/mnt/ssd/jenkins/workspace/Lucene-Solr-4.x-Linux-Java8-64/checkout/solr/build/solr-core/test/J1/./solrtest-SpellCheckComponentTest-1342107998345/
[junit4:junit4]   2> 580 T269 oasc.SolrCore.<init> JMX monitoring not detected for core: collection1
[junit4:junit4]   2> 580 T269 oasc.SolrCore.getNewIndexDir WARNING New index directory detected: old=null new=/mnt/ssd/jenkins/workspace/Lucene-Solr-4.x-Linux-Java8-64/checkout/solr/build/solr-core/test/J1/./solrtest-SpellCheckComponentTest-1342107998345/index/
[junit4:junit4]   2> 580 T269 oasc.SolrCore.initIndex WARNING [collection1] Solr index directory '/mnt/ssd/jenkins/workspace/Lucene-Solr-4.x-Linux-Java8-64/checkout/solr/build/solr-core/test/J1/./solrtest-SpellCheckComponentTest-1342107998345/index' doesn't exist. Creating new index...
[junit4:junit4]   2> 582 T269 oasc.SolrDeletionPolicy.onCommit SolrDeletionPolicy.onCommit: commits:num=1
[junit4:junit4]   2> 		commit{dir=MockDirWrapper(NRTCachingDirectory(org.apache.lucene.store.RAMDirectory@46c40b19 lockFactory=org.apache.lucene.store.NativeFSLockFactory@6fd0eb12; maxCacheMB=0.82421875 maxMergeSizeMB=0.80859375)),segFN=segments_1,generation=1,filenames=[segments_1]
[junit4:junit4]   2> 582 T269 oasc.SolrDeletionPolicy.updateCommits newest commit = 1
[junit4:junit4]   2> 583 T269 oasc.RequestHandlers.initHandlersFromConfig created standard: solr.StandardRequestHandler
[junit4:junit4]   2> 584 T269 oasc.RequestHandlers.initHandlersFromConfig created spellCheckCompRH: org.apache.solr.handler.component.SearchHandler
[junit4:junit4]   2> 584 T269 oasc.RequestHandlers.initHandlersFromConfig created spellCheckCompRH1: org.apache.solr.handler.component.SearchHandler
[junit4:junit4]   2> 584 T269 oasc.RequestHandlers.initHandlersFromConfig created spellCheckWithWordbreak: org.apache.solr.handler.component.SearchHandler
[junit4:junit4]   2> 591 T269 oass.SolrIndexSearcher.<init> Opening Searcher@d3c2282 main
[junit4:junit4]   2> 591 T269 oass.SolrIndexSearcher.getIndexDir WARNING WARNING: Directory impl does not support setting indexDir: org.apache.lucene.store.MockDirectoryWrapper
[junit4:junit4]   2> 592 T269 oasu.CommitTracker.<init> Hard AutoCommit: disabled
[junit4:junit4]   2> 592 T269 oasu.CommitTracker.<init> Soft AutoCommit: disabled
[junit4:junit4]   2> 592 T269 oashc.SpellCheckComponent.inform Initializing spell checkers
[junit4:junit4]   2> 600 T269 oashc.SpellCheckComponent.inform Registering newSearcher listener for spellchecker: default
[junit4:junit4]   2> 602 T269 oashc.SpellCheckComponent.inform Registering newSearcher listener for spellchecker: default_teststop
[junit4:junit4]   2> 602 T269 oass.DirectSolrSpellChecker.init init: {name=direct,classname=solr.DirectSolrSpellChecker,minQueryLength=3,maxQueryFrequency=100.0,field=teststop}
[junit4:junit4]   2> 602 T269 oass.DirectSolrSpellChecker.init init: {name=direct_lowerfilt,classname=solr.DirectSolrSpellChecker,minQueryLength=3,maxQueryFrequency=100.0,field=lowerfilt}
[junit4:junit4]   2> 605 T269 oashc.SpellCheckComponent.inform Registering newSearcher listener for spellchecker: threshold
[junit4:junit4]   2> 605 T269 oass.DirectSolrSpellChecker.init init: {name=threshold_direct,classname=solr.DirectSolrSpellChecker,field=lowerfilt,spellcheckIndexDir=spellcheckerThreshold,buildOnCommit=true,thresholdTokenFrequency=0.29}
[junit4:junit4]   2> 606 T269 oashc.SpellCheckComponent.inform Registering newSearcher listener for spellchecker: threshold_direct
[junit4:junit4]   2> 609 T269 oashc.SpellCheckComponent.inform Registering newSearcher listener for spellchecker: multipleFields
[junit4:junit4]   2> 620 T269 oashc.SpellCheckComponent.inform Registering newSearcher listener for spellchecker: freq
[junit4:junit4]   2> 624 T269 oashc.SpellCheckComponent.inform Registering newSearcher listener for spellchecker: fqcn
[junit4:junit4]   2> 624 T269 oashc.HttpShardHandlerFactory.getParameter Setting socketTimeout to: 0
[junit4:junit4]   2> 625 T269 oashc.HttpShardHandlerFactory.getParameter Setting urlScheme to: http://
[junit4:junit4]   2> 625 T269 oashc.HttpShardHandlerFactory.getParameter Setting connTimeout to: 0
[junit4:junit4]   2> 625 T269 oashc.HttpShardHandlerFactory.getParameter Setting maxConnectionsPerHost to: 20
[junit4:junit4]   2> 625 T269 oashc.HttpShardHandlerFactory.getParameter Setting corePoolSize to: 0
[junit4:junit4]   2> 625 T269 oashc.HttpShardHandlerFactory.getParameter Setting maximumPoolSize to: 2147483647
[junit4:junit4]   2> 625 T269 oashc.HttpShardHandlerFactory.getParameter Setting maxThreadIdleTime to: 5
[junit4:junit4]   2> 626 T269 oashc.HttpShardHandlerFactory.getParameter Setting sizeOfQueue to: -1
[junit4:junit4]   2> 626 T269 oashc.HttpShardHandlerFactory.getParameter Setting fairnessPolicy to: false
[junit4:junit4]   2> 626 T269 oascsi.HttpClientUtil.createClient Creating new http client, config:maxConnectionsPerHost=20&maxConnections=10000&socketTimeout=0&connTimeout=0&retry=false
[junit4:junit4]   2> 629 T270 oasc.SolrCore.registerSearcher [collection1] Registered new searcher Searcher@d3c2282 main{StandardDirectoryReader(segments_1:1)}
[junit4:junit4]   2> 629 T269 oasc.CoreContainer.register registering core: collection1
[junit4:junit4]   2> 630 T269 oas.SolrTestCaseJ4.initCore ####initCore end
[junit4:junit4]   2> 
[junit4:junit4] ERROR   0.58s J1 | SpellCheckComponentTest.testPerDictionary
[junit4:junit4]    > Throwable #1: java.lang.RuntimeException: mismatch: '0'!='2' @ spellcheck/suggestions/bar/startOffset
[junit4:junit4]    > 	at __randomizedtesting.SeedInfo.seed([4A534EA0AA6C1E7E:8D5DBA08A2000B36]:0)
[junit4:junit4]    > 	at org.apache.solr.SolrTestCaseJ4.assertJQ(SolrTestCaseJ4.java:573)
[junit4:junit4]    > 	at org.apache.solr.SolrTestCaseJ4.assertJQ(SolrTestCaseJ4.java:521)
[junit4:junit4]    > 	at org.apache.solr.handler.component.SpellCheckComponentTest.testPerDictionary(SpellCheckComponentTest.java:102)
[junit4:junit4]    > 	at sun.reflect.NativeMethodAccessorImpl.invoke0(Native Method)
[junit4:junit4]    > 	at sun.reflect.NativeMethodAccessorImpl.invoke(NativeMethodAccessorImpl.java:57)
[junit4:junit4]    > 	at sun.reflect.DelegatingMethodAccessorImpl.invoke(DelegatingMethodAccessorImpl.java:43)
[junit4:junit4]    > 	at java.lang.reflect.Method.invoke(Method.java:474)
[junit4:junit4]    > 	at com.carrotsearch.randomizedtesting.RandomizedRunner.invoke(RandomizedRunner.java:1995)
[junit4:junit4]    > 	at com.carrotsearch.randomizedtesting.RandomizedRunner.access$1100(RandomizedRunner.java:132)
[junit4:junit4]    > 	at com.carrotsearch.randomizedtesting.RandomizedRunner$6.evaluate(RandomizedRunner.java:818)
[junit4:junit4]    > 	at com.carrotsearch.randomizedtesting.RandomizedRunner$7.evaluate(RandomizedRunner.java:877)
[junit4:junit4]    > 	at com.carrotsearch.randomizedtesting.RandomizedRunner$8.evaluate(RandomizedRunner.java:891)
[junit4:junit4]    > 	at com.carrotsearch.randomizedtesting.rules.SystemPropertiesRestoreRule$1.evaluate(SystemPropertiesRestoreRule.java:53)
[junit4:junit4]    > 	at org.apache.lucene.util.TestRuleSetupTeardownChained$1.evaluate(TestRuleSetupTeardownChained.java:50)
[junit4:junit4]    > 	at org.apache.lucene.util.TestRuleFieldCacheSanity$1.evaluate(TestRuleFieldCacheSanity.java:32)
[junit4:junit4]    > 	at org.apache.lucene.util.AbstractBeforeAfterRule$1.evaluate(AbstractBeforeAfterRule.java:45)
[junit4:junit4]    > 	at com.carrotsearch.randomizedtesting.rules.SystemPropertiesInvariantRule$1.evaluate(SystemPropertiesInvariantRule.java:55)
[junit4:junit4]    > 	at org.apache.lucene.util.TestRuleReportUncaughtExceptions$1.evaluate(TestRuleReportUncaughtExceptions.java:68)
[junit4:junit4]    > 	at org.apache.lucene.util.TestRuleThreadAndTestName$1.evaluate(TestRuleThreadAndTestName.java:48)
[junit4:junit4]    > 	at org.apache.lucene.util.TestRuleIgnoreAfterMaxFailures$1.evaluate(TestRuleIgnoreAfterMaxFailures.java:70)
[junit4:junit4]    > 	at org.apache.lucene.util.TestRuleMarkFailure$1.evaluate(TestRuleMarkFailure.java:48)
[junit4:junit4]    > 	at com.carrotsearch.randomizedtesting.RandomizedRunner.runSingleTest(RandomizedRunner.java:825)
[junit4:junit4]    > 	at com.carrotsearch.randomizedtesting.RandomizedRunner.access$700(RandomizedRunner.java:132)
[junit4:junit4]    > 	at com.carrotsearch.randomizedtesting.RandomizedRunner$3$1.run(RandomizedRunner.java:671)
[junit4:junit4]    > 	at com.carrotsearch.randomizedtesting.RandomizedRunner$3.evaluate(RandomizedRunner.java:697)
[junit4:junit4]    > 	at com.carrotsearch.randomizedtesting.RandomizedRunner$4.evaluate(RandomizedRunner.java:736)
[junit4:junit4]    > 	at com.carrotsearch.randomizedtesting.RandomizedRunner$5.evaluate(RandomizedRunner.java:747)
[junit4:junit4]    > 	at com.carrotsearch.randomizedtesting.rules.SystemPropertiesRestoreRule$1.evaluate(SystemPropertiesRestoreRule.java:53)
[junit4:junit4]    > 	at org.apache.lucene.util.AbstractBeforeAfterRule$1.evaluate(AbstractBeforeAfterRule.java:45)
[junit4:junit4]    > 	at org.apache.lucene.util.TestRuleReportUncaughtExceptions$1.evaluate(TestRuleReportUncaughtExceptions.java:68)
[junit4:junit4]    > 	at org.apache.lucene.util.TestRuleStoreClassName$1.evaluate(TestRuleStoreClassName.java:38)
[junit4:junit4]    > 	at org.apache.lucene.util.TestRuleIcuHack$1.evaluate(TestRuleIcuHack.java:51)
[junit4:junit4]    > 	at com.carrotsearch.randomizedtesting.rules.SystemPropertiesInvariantRule$1.evaluate(SystemPropertiesInvariantRule.java:55)
[junit4:junit4]    > 	at org.apache.lucene.util.TestRuleNoInstanceHooksOverrides$1.evaluate(TestRuleNoInstanceHooksOverrides.java:53)
[junit4:junit4]    > 	at org.apache.lucene.util.TestRuleNoStaticHooksShadowing$1.evaluate(TestRuleNoStaticHooksShadowing.java:52)
[junit4:junit4]    > 	at org.apache.lucene.util.TestRuleAssertionsRequired$1.evaluate(TestRuleAssertionsRequired.java:36)
[junit4:junit4]    > 	at org.apache.lucene.util.TestRuleMarkFailure$1.evaluate(TestRuleMarkFailure.java:48)
[junit4:junit4]    > 	at org.apache.lucene.util.TestRuleIgnoreAfterMaxFailures$1.evaluate(TestRuleIgnoreAfterMaxFailures.java:70)
[junit4:junit4]    > 	at org.apache.lucene.util.TestRuleIgnoreTestSuites$1.evaluate(TestRuleIgnoreTestSuites.java:55)
[junit4:junit4]    > 	at com.carrotsearch.randomizedtesting.RandomizedRunner.runSuite(RandomizedRunner.java:605)
[junit4:junit4]    > 	at com.carrotsearch.randomizedtesting.RandomizedRunner.access$400(RandomizedRunner.java:132)
[junit4:junit4]    > 	at com.carrotsearch.randomizedtesting.RandomizedRunner$2.run(RandomizedRunner.java:551)
[junit4:junit4]    > 
[junit4:junit4]   2> 3820 T269 oas.SolrTestCaseJ4.setUp ###Starting testPerDictionary
[junit4:junit4]   2> 3825 T269 C23 UPDATE [collection1] webapp=null path=null params={} {add=[0]} 0 2
[junit4:junit4]   2> 3834 T269 C23 UPDATE [collection1] webapp=null path=null params={} {add=[1]} 0 2
[junit4:junit4]   2> 3845 T269 C23 UPDATE [collection1] webapp=null path=null params={} {add=[2]} 0 1
[junit4:junit4]   2> 3858 T269 C23 UPDATE [collection1] webapp=null path=null params={} {add=[3]} 0 2
[junit4:junit4]   2> 3865 T269 C23 UPDATE [collection1] webapp=null path=null params={} {add=[4]} 0 1
[junit4:junit4]   2> 3878 T269 C23 UPDATE [collection1] webapp=null path=null params={} {add=[5]} 0 9
[junit4:junit4]   2> 3883 T269 C23 UPDATE [collection1] webapp=null path=null params={} {add=[6]} 0 0
[junit4:junit4]   2> 3888 T269 C23 UPDATE [collection1] webapp=null path=null params={} {add=[7]} 0 0
[junit4:junit4]   2> 3899 T269 C23 UPDATE [collection1] webapp=null path=null params={} {add=[8]} 0 6
[junit4:junit4]   2> 3904 T269 C23 UPDATE [collection1] webapp=null path=null params={} {add=[9]} 0 1
[junit4:junit4]   2> 3908 T269 C23 oasu.DirectUpdateHandler2.commit start commit{flags=0,version=0,optimize=false,openSearcher=true,waitSearcher=true,expungeDeletes=false,softCommit=false}
[junit4:junit4]   2> 3919 T269 C23 oasc.SolrDeletionPolicy.onCommit SolrDeletionPolicy.onCommit: commits:num=2
[junit4:junit4]   2> 		commit{dir=MockDirWrapper(NRTCachingDirectory(org.apache.lucene.store.RAMDirectory@46c40b19 lockFactory=org.apache.lucene.store.NativeFSLockFactory@6fd0eb12; maxCacheMB=0.82421875 maxMergeSizeMB=0.80859375)),segFN=segments_c,generation=12,filenames=[segments_c]
[junit4:junit4]   2> 		commit{dir=MockDirWrapper(NRTCachingDirectory(org.apache.lucene.store.RAMDirectory@46c40b19 lockFactory=org.apache.lucene.store.NativeFSLockFactory@6fd0eb12; maxCacheMB=0.82421875 maxMergeSizeMB=0.80859375)),segFN=segments_d,generation=13,filenames=[_6_MockVariableIntBlock_0.skp, _6.fdt, segments_d, _6_Lucene40WithOrds_0.tib, _6.si, _6_MockRandom_0.prx, _6_nrm.cfs, _6_Lucene40WithOrds_0.prx, _6_NestedPulsing_0.tim, _6.fnm, _6_Lucene40WithOrds_0.tii, _6_MockRandom_0.tib, _6_MockRandom_0.frq, _6.fdx, _6_MockVariableIntBlock_0.doc, _6_NestedPulsing_0.frq, _6_Lucene40WithOrds_0.frq, _6_MockRandom_0.sd, _6_MockVariableIntBlock_0.tii, _6_MockVariableIntBlock_0.pos, _6_MockRandom_0.tiv, _6_NestedPulsing_0.prx, _6_MockVariableIntBlock_0.pyl, _6_MockVariableIntBlock_0.frq, _6_NestedPulsing_0.tip, _6_MockVariableIntBlock_0.tib, _6_nrm.cfe]
[junit4:junit4]   2> 3920 T269 C23 oasc.SolrDeletionPolicy.updateCommits newest commit = 13
[junit4:junit4]   2> 3934 T269 C23 oass.SolrIndexSearcher.<init> Opening Searcher@6f2e17a2 main
[junit4:junit4]   2> 3935 T269 C23 oass.SolrIndexSearcher.getIndexDir WARNING WARNING: Directory impl does not support setting indexDir: org.apache.lucene.store.MockDirectoryWrapper
[junit4:junit4]   2> 3935 T270 oashc.SpellCheckComponent$SpellCheckerListener.buildSpellIndex Building spell index for spell checker: default
[junit4:junit4]   2> 3941 T269 C23 oasu.DirectUpdateHandler2.commit end_commit_flush
[junit4:junit4]   2> 3989 T270 oashc.SpellCheckComponent$SpellCheckerListener.buildSpellIndex Building spell index for spell checker: default_teststop
[junit4:junit4]   2> 4008 T270 oashc.SpellCheckComponent$SpellCheckerListener.buildSpellIndex Building spell index for spell checker: threshold
[junit4:junit4]   2> 4049 T270 oashc.SpellCheckComponent$SpellCheckerListener.buildSpellIndex Building spell index for spell checker: threshold_direct
[junit4:junit4]   2> 4049 T270 oashc.SpellCheckComponent$SpellCheckerListener.buildSpellIndex Building spell index for spell checker: multipleFields
[junit4:junit4]   2> 4089 T270 oashc.SpellCheckComponent$SpellCheckerListener.buildSpellIndex Building spell index for spell checker: freq
[junit4:junit4]   2> 4129 T270 oashc.SpellCheckComponent$SpellCheckerListener.buildSpellIndex Building spell index for spell checker: fqcn
[junit4:junit4]   2> 4168 T270 oasc.SolrCore.registerSearcher [collection1] Registered new searcher Searcher@6f2e17a2 main{StandardDirectoryReader(segments_d:20 _6(4.0):C10)}
[junit4:junit4]   2> 4169 T269 C23 UPDATE [collection1] webapp=null path=null params={} {commit=} 0 261
[junit4:junit4]   2> 4173 T269 C23 REQ [collection1] webapp=null path=null params={spellcheck..perDict.foo=bar&json.nl=map&spellcheck..perDict.bar=foo&spellcheck.dictionary=perDict&spellcheck.build=true&spellcheck=true&qt=spellCheckCompRH&q=documemt} hits=0 status=0 QTime=0 
[junit4:junit4]   2> 4173 T269 oas.SolrTestCaseJ4.assertJQ SEVERE query failed JSON validation. error=mismatch: '0'!='2' @ spellcheck/suggestions/bar/startOffset
[junit4:junit4]   2> 	 expected =/spellcheck/suggestions/bar=={"numFound":1, "startOffset":0, "endOffset":1, "suggestion":["foo"]}
[junit4:junit4]   2> 	 response = {
[junit4:junit4]   2> 	  "responseHeader":{
[junit4:junit4]   2> 	    "status":0,
[junit4:junit4]   2> 	    "QTime":0},
[junit4:junit4]   2> 	  "command":"build",
[junit4:junit4]   2> 	  "response":{"numFound":0,"start":0,"docs":[]
[junit4:junit4]   2> 	  },
[junit4:junit4]   2> 	  "spellcheck":{
[junit4:junit4]   2> 	    "suggestions":{
[junit4:junit4]   2> 	      "foo":{
[junit4:junit4]   2> 	        "numFound":1,
[junit4:junit4]   2> 	        "startOffset":0,
[junit4:junit4]   2> 	        "endOffset":1,
[junit4:junit4]   2> 	        "suggestion":["bar"]},
[junit4:junit4]   2> 	      "bar":{
[junit4:junit4]   2> 	        "numFound":1,
[junit4:junit4]   2> 	        "startOffset":2,
[junit4:junit4]   2> 	        "endOffset":3,
[junit4:junit4]   2> 	        "suggestion":["foo"]}}}}
[junit4:junit4]   2> 	
[junit4:junit4]   2> 	 request = spellcheck..perDict.foo=bar&json.nl=map&spellcheck..perDict.bar=foo&spellcheck.dictionary=perDict&spellcheck.build=true&spellcheck=true&qt=spellCheckCompRH&q=documemt
[junit4:junit4]   2> 4174 T269 oas.SolrTestCaseJ4.tearDown ###Ending testPerDictionary
[junit4:junit4]   2> 4178 T269 C23 oasu.DirectUpdateHandler2.deleteAll [collection1] REMOVING ALL DOCUMENTS FROM INDEX
[junit4:junit4]   2> 4178 T269 C23 UPDATE [collection1] webapp=null path=null params={} {deleteByQuery=*:*} 0 1
[junit4:junit4]   2> 4183 T269 C23 oasu.DirectUpdateHandler2.commit start commit{flags=0,version=0,optimize=false,openSearcher=true,waitSearcher=true,expungeDeletes=false,softCommit=false}
[junit4:junit4]   2> 4184 T269 C23 oasc.SolrDeletionPolicy.onCommit SolrDeletionPolicy.onCommit: commits:num=2
[junit4:junit4]   2> 		commit{dir=MockDirWrapper(NRTCachingDirectory(org.apache.lucene.store.RAMDirectory@46c40b19 lockFactory=org.apache.lucene.store.NativeFSLockFactory@6fd0eb12; maxCacheMB=0.82421875 maxMergeSizeMB=0.80859375)),segFN=segments_d,generation=13,filenames=[_6_MockVariableIntBlock_0.skp, _6.fdt, segments_d, _6_Lucene40WithOrds_0.tib, _6.si, _6_MockRandom_0.prx, _6_nrm.cfs, _6_Lucene40WithOrds_0.prx, _6_NestedPulsing_0.tim, _6.fnm, _6_Lucene40WithOrds_0.tii, _6_MockRandom_0.tib, _6_MockRandom_0.frq, _6.fdx, _6_MockVariableIntBlock_0.doc, _6_NestedPulsing_0.frq, _6_Lucene40WithOrds_0.frq, _6_MockRandom_0.sd, _6_MockVariableIntBlock_0.tii, _6_MockVariableIntBlock_0.pos, _6_MockRandom_0.tiv, _6_NestedPulsing_0.prx, _6_MockVariableIntBlock_0.pyl, _6_MockVariableIntBlock_0.frq, _6_NestedPulsing_0.tip, _6_MockVariableIntBlock_0.tib, _6_nrm.cfe]
[junit4:junit4]   2> 		commit{dir=MockDirWrapper(NRTCachingDirectory(org.apache.lucene.store.RAMDirectory@46c40b19 lockFactory=org.apache.lucene.store.NativeFSLockFactory@6fd0eb12; maxCacheMB=0.82421875 maxMergeSizeMB=0.80859375)),segFN=segments_e,generation=14,filenames=[segments_e]
[junit4:junit4]   2> 4185 T269 C23 oasc.SolrDeletionPolicy.updateCommits newest commit = 14
[junit4:junit4]   2> 4186 T269 C23 oass.SolrIndexSearcher.<init> Opening Searcher@174b1f9b main
[junit4:junit4]   2> 4186 T269 C23 oass.SolrIndexSearcher.getIndexDir WARNING WARNING: Directory impl does not support setting indexDir: org.apache.lucene.store.MockDirectoryWrapper
[junit4:junit4]   2> 4187 T270 oashc.SpellCheckComponent$SpellCheckerListener.buildSpellIndex Building spell index for spell checker: default
[junit4:junit4]   2> 4187 T269 C23 oasu.DirectUpdateHandler2.commit end_commit_flush
[junit4:junit4]   2> 4209 T270 oashc.SpellCheckComponent$SpellCheckerListener.buildSpellIndex Building spell index for spell checker: default_teststop
[junit4:junit4]   2> 4228 T270 oashc.SpellCheckComponent$SpellCheckerListener.buildSpellIndex Building spell index for spell checker: threshold
[junit4:junit4]   2> 4249 T270 oashc.SpellCheckComponent$SpellCheckerListener.buildSpellIndex Building spell index for spell checker: threshold_direct
[junit4:junit4]   2> 4249 T270 oashc.SpellCheckComponent$SpellCheckerListener.buildSpellIndex Building spell index for spell checker: multipleFields
[junit4:junit4]   2> 4290 T270 oashc.SpellCheckComponent$SpellCheckerListener.buildSpellIndex Building spell index for spell checker: freq
[junit4:junit4]   2> 4318 T270 oashc.SpellCheckComponent$SpellCheckerListener.buildSpellIndex Building spell index for spell checker: fqcn
[junit4:junit4]   2> 4338 T270 oasc.SolrCore.registerSearcher [collection1] Registered new searcher Searcher@174b1f9b main{StandardDirectoryReader(segments_e:21)}
[junit4:junit4]   2> 4339 T269 C23 UPDATE [collection1] webapp=null path=null params={} {commit=} 0 156
[junit4:junit4]   2> NOTE: reproduce with: ant test  -Dtestcase=SpellCheckComponentTest -Dtests.method=testPerDictionary -Dtests.seed=4A534EA0AA6C1E7E -Dtests.multiplier=3 -Dtests.slow=true -Dtests.locale=no_NO_NY -Dtests.timezone=Africa/Kinshasa -Dtests.file.encoding=UTF-8
[junit4:junit4]   2>
[junit4:junit4]    > (@AfterClass output)
[junit4:junit4]   2> 6467 T269 oas.SolrTestCaseJ4.deleteCore ###deleteCore
[junit4:junit4]   2> 6467 T269 oasc.CoreContainer.shutdown Shutting down CoreContainer instance=664211070
[junit4:junit4]   2> 6467 T269 oasc.SolrCore.close [collection1]  CLOSING SolrCore org.apache.solr.core.SolrCore@7ac7853b
[junit4:junit4]   2> 6467 T269 oasc.SolrCore.closeSearcher [collection1] Closing main searcher on request.
[junit4:junit4]   2> 6467 T269 oasu.DirectUpdateHandler2.close closing DirectUpdateHandler2{commits=20,autocommits=0,soft autocommits=0,optimizes=0,rollbacks=0,expungeDeletes=0,docsPending=0,adds=0,deletesById=0,deletesByQuery=0,errors=0,cumulative_adds=92,cumulative_deletesById=0,cumulative_deletesByQuery=9,cumulative_errors=0}
[junit4:junit4]   2> NOTE: test params are: codec=Lucene40: {gram4=MockVariableIntBlock(baseBlockSize=64), lowerfilt1and2=PostingsFormat(name=MockRandom), range_facet_sl=MockVariableIntBlock(baseBlockSize=64), start4=PostingsFormat(name=Lucene40WithOrds), id=PostingsFormat(name=NestedPulsing), word=PostingsFormat(name=Lucene40WithOrds), end1=PostingsFormat(name=Lucene40WithOrds), end2=PostingsFormat(name=NestedPulsing), intDefault=PostingsFormat(name=Lucene40WithOrds), gram1=PostingsFormat(name=Lucene40WithOrds), range_facet_l=PostingsFormat(name=Lucene40WithOrds), range_facet_si=PostingsFormat(name=MockRandom), start2=PostingsFormat(name=MockRandom), gram2=PostingsFormat(name=NestedPulsing), multiDefault=PostingsFormat(name=MockRandom), lowerfilt=PostingsFormat(name=MockRandom), end4=MockVariableIntBlock(baseBlockSize=64), gram3=PostingsFormat(name=MockRandom), start3=PostingsFormat(name=NestedPulsing), timestamp=PostingsFormat(name=Lucene40WithOrds), start1=MockVariableIntBlock(baseBlockSize=64), end3=PostingsFormat(name=MockRandom)}, sim=DefaultSimilarity, locale=no_NO_NY, timezone=Africa/Kinshasa
[junit4:junit4]   2> NOTE: Linux 3.2.0-26-generic amd64/Oracle Corporation 1.8.0-ea (64-bit)/cpus=8,threads=1,free=137788704,total=220790784
[junit4:junit4]   2> NOTE: All tests run in this JVM: [TestWikipediaTokenizerFactory, TestJapaneseTokenizerFactory, SpellingQueryConverterTest, RAMDirectoryFactoryTest, TestReplicationHandler, TestKeepFilterFactory, TestHungarianLightStemFilterFactory, SpellCheckCollatorTest, TestPatternReplaceFilterFactory, TestEnglishMinimalStemFilterFactory, TestLMJelinekMercerSimilarityFactory, TestLuceneMatchVersion, UUIDFieldTest, CloudStateTest, ResourceLoaderTest, TestShingleFilterFactory, TestElisionFilterFactory, TestNGramFilters, DirectSolrConnectionTest, QueryEqualityTest, TestJapaneseIterationMarkCharFilterFactory, IndexReaderFactoryTest, TestLRUCache, UpdateParamsTest, DistanceFunctionTest, AlternateDirectoryTest, TestHunspellStemFilterFactory, QueryParsingTest, SpellCheckComponentTest]
[junit4:junit4]   2> 
[junit4:junit4] Completed on J1 in 6.57s, 9 tests, 1 error <<< FAILURES!

[...truncated 412 lines...]
[junit4:junit4] Suite: org.apache.solr.handler.component.DistributedQueryElevationComponentTest
[junit4:junit4] FAILURE 1.51s J1 | DistributedQueryElevationComponentTest.testDistribSearch
[junit4:junit4]    > Throwable #1: junit.framework.AssertionFailedError: .responseHeader.params.size()==9,9skipped=4,5
[junit4:junit4]    > 	at __randomizedtesting.SeedInfo.seed([4A534EA0AA6C1E7E:CBB5C0B8DD337E42]:0)
[junit4:junit4]    > 	at junit.framework.Assert.fail(Assert.java:50)
[junit4:junit4]    > 	at org.apache.solr.BaseDistributedSearchTestCase.compareResponses(BaseDistributedSearchTestCase.java:670)
[junit4:junit4]    > 	at org.apache.solr.BaseDistributedSearchTestCase.query(BaseDistributedSearchTestCase.java:392)
[junit4:junit4]    > 	at org.apache.solr.handler.component.DistributedQueryElevationComponentTest.doTest(DistributedQueryElevationComponentTest.java:81)
[junit4:junit4]    > 	at org.apache.solr.BaseDistributedSearchTestCase.testDistribSearch(BaseDistributedSearchTestCase.java:679)
[junit4:junit4]    > 	at sun.reflect.NativeMethodAccessorImpl.invoke0(Native Method)
[junit4:junit4]    > 	at sun.reflect.NativeMethodAccessorImpl.invoke(NativeMethodAccessorImpl.java:57)
[junit4:junit4]    > 	at sun.reflect.DelegatingMethodAccessorImpl.invoke(DelegatingMethodAccessorImpl.java:43)
[junit4:junit4]    > 	at java.lang.reflect.Method.invoke(Method.java:474)
[junit4:junit4]    > 	at com.carrotsearch.randomizedtesting.RandomizedRunner.invoke(RandomizedRunner.java:1995)
[junit4:junit4]    > 	at com.carrotsearch.randomizedtesting.RandomizedRunner.access$1100(RandomizedRunner.java:132)
[junit4:junit4]    > 	at com.carrotsearch.randomizedtesting.RandomizedRunner$6.evaluate(RandomizedRunner.java:818)
[junit4:junit4]    > 	at com.carrotsearch.randomizedtesting.RandomizedRunner$7.evaluate(RandomizedRunner.java:877)
[junit4:junit4]    > 	at com.carrotsearch.randomizedtesting.RandomizedRunner$8.evaluate(RandomizedRunner.java:891)
[junit4:junit4]    > 	at com.carrotsearch.randomizedtesting.rules.SystemPropertiesRestoreRule$1.evaluate(SystemPropertiesRestoreRule.java:53)
[junit4:junit4]    > 	at org.apache.lucene.util.TestRuleSetupTeardownChained$1.evaluate(TestRuleSetupTeardownChained.java:50)
[junit4:junit4]    > 	at org.apache.lucene.util.TestRuleFieldCacheSanity$1.evaluate(TestRuleFieldCacheSanity.java:32)
[junit4:junit4]    > 	at org.apache.lucene.util.AbstractBeforeAfterRule$1.evaluate(AbstractBeforeAfterRule.java:45)
[junit4:junit4]    > 	at com.carrotsearch.randomizedtesting.rules.SystemPropertiesInvariantRule$1.evaluate(SystemPropertiesInvariantRule.java:55)
[junit4:junit4]    > 	at org.apache.lucene.util.TestRuleReportUncaughtExceptions$1.evaluate(TestRuleReportUncaughtExceptions.java:68)
[junit4:junit4]    > 	at org.apache.lucene.util.TestRuleThreadAndTestName$1.evaluate(TestRuleThreadAndTestName.java:48)
[junit4:junit4]    > 	at org.apache.lucene.util.TestRuleIgnoreAfterMaxFailures$1.evaluate(TestRuleIgnoreAfterMaxFailures.java:70)
[junit4:junit4]    > 	at org.apache.lucene.util.TestRuleMarkFailure$1.evaluate(TestRuleMarkFailure.java:48)
[junit4:junit4]    > 	at com.carrotsearch.randomizedtesting.RandomizedRunner.runSingleTest(RandomizedRunner.java:825)
[junit4:junit4]    > 	at com.carrotsearch.randomizedtesting.RandomizedRunner.access$700(RandomizedRunner.java:132)
[junit4:junit4]    > 	at com.carrotsearch.randomizedtesting.RandomizedRunner$3$1.run(RandomizedRunner.java:671)
[junit4:junit4]    > 	at com.carrotsearch.randomizedtesting.RandomizedRunner$3.evaluate(RandomizedRunner.java:697)
[junit4:junit4]    > 	at com.carrotsearch.randomizedtesting.RandomizedRunner$4.evaluate(RandomizedRunner.java:736)
[junit4:junit4]    > 	at com.carrotsearch.randomizedtesting.RandomizedRunner$5.evaluate(RandomizedRunner.java:747)
[junit4:junit4]    > 	at com.carrotsearch.randomizedtesting.rules.SystemPropertiesRestoreRule$1.evaluate(SystemPropertiesRestoreRule.java:53)
[junit4:junit4]    > 	at org.apache.lucene.util.AbstractBeforeAfterRule$1.evaluate(AbstractBeforeAfterRule.java:45)
[junit4:junit4]    > 	at org.apache.lucene.util.TestRuleReportUncaughtExceptions$1.evaluate(TestRuleReportUncaughtExceptions.java:68)
[junit4:junit4]    > 	at org.apache.lucene.util.TestRuleStoreClassName$1.evaluate(TestRuleStoreClassName.java:38)
[junit4:junit4]    > 	at org.apache.lucene.util.TestRuleIcuHack$1.evaluate(TestRuleIcuHack.java:51)
[junit4:junit4]    > 	at com.carrotsearch.randomizedtesting.rules.SystemPropertiesInvariantRule$1.evaluate(SystemPropertiesInvariantRule.java:55)
[junit4:junit4]    > 	at org.apache.lucene.util.TestRuleNoInstanceHooksOverrides$1.evaluate(TestRuleNoInstanceHooksOverrides.java:53)
[junit4:junit4]    > 	at org.apache.lucene.util.TestRuleNoStaticHooksShadowing$1.evaluate(TestRuleNoStaticHooksShadowing.java:52)
[junit4:junit4]    > 	at org.apache.lucene.util.TestRuleAssertionsRequired$1.evaluate(TestRuleAssertionsRequired.java:36)
[junit4:junit4]    > 	at org.apache.lucene.util.TestRuleMarkFailure$1.evaluate(TestRuleMarkFailure.java:48)
[junit4:junit4]    > 	at org.apache.lucene.util.TestRuleIgnoreAfterMaxFailures$1.evaluate(TestRuleIgnoreAfterMaxFailures.java:70)
[junit4:junit4]    > 	at org.apache.lucene.util.TestRuleIgnoreTestSuites$1.evaluate(TestRuleIgnoreTestSuites.java:55)
[junit4:junit4]    > 	at com.carrotsearch.randomizedtesting.RandomizedRunner.runSuite(RandomizedRunner.java:605)
[junit4:junit4]    > 	at com.carrotsearch.randomizedtesting.RandomizedRunner.access$400(RandomizedRunner.java:132)
[junit4:junit4]    > 	at com.carrotsearch.randomizedtesting.RandomizedRunner$2.run(RandomizedRunner.java:551)
[junit4:junit4]    > 
[junit4:junit4]   2> 2 T1544 oas.SolrTestCaseJ4.setUp ###Starting testDistribSearch
[junit4:junit4]   2> 3 T1544 oejs.Server.doStart jetty-8.1.2.v20120308
[junit4:junit4]   2> 37 T1544 oejs.AbstractConnector.doStart Started SocketConnector@0.0.0.0:56909
[junit4:junit4]   2> 38 T1544 oasc.SolrResourceLoader.locateSolrHome JNDI not configured for solr (NoInitialContextEx)
[junit4:junit4]   2> 38 T1544 oasc.SolrResourceLoader.locateSolrHome using system property solr.solr.home: /mnt/ssd/jenkins/workspace/Lucene-Solr-4.x-Linux-Java8-64/checkout/solr/build/solr-core/test-files/solr
[junit4:junit4]   2> 38 T1544 oasc.SolrResourceLoader.<init> new SolrResourceLoader for deduced Solr Home: '/mnt/ssd/jenkins/workspace/Lucene-Solr-4.x-Linux-Java8-64/checkout/solr/build/solr-core/test-files/solr/'
[junit4:junit4]   2> 42 T1544 oass.SolrDispatchFilter.init SolrDispatchFilter.init()
[junit4:junit4]   2> 43 T1544 oasc.SolrResourceLoader.locateSolrHome JNDI not configured for solr (NoInitialContextEx)
[junit4:junit4]   2> 43 T1544 oasc.SolrResourceLoader.locateSolrHome using system property solr.solr.home: /mnt/ssd/jenkins/workspace/Lucene-Solr-4.x-Linux-Java8-64/checkout/solr/build/solr-core/test-files/solr
[junit4:junit4]   2> 43 T1544 oasc.CoreContainer$Initializer.initialize looking for solr.xml: /mnt/ssd/jenkins/workspace/Lucene-Solr-4.x-Linux-Java8-64/checkout/solr/build/solr-core/test-files/solr/solr.xml
[junit4:junit4]   2> 44 T1544 oasc.CoreContainer.<init> New CoreContainer 1045014376
[junit4:junit4]   2> 44 T1544 oasc.CoreContainer.load Loading CoreContainer using Solr Home: '/mnt/ssd/jenkins/workspace/Lucene-Solr-4.x-Linux-Java8-64/checkout/solr/build/solr-core/test-files/solr/'
[junit4:junit4]   2> 44 T1544 oasc.SolrResourceLoader.<init> new SolrResourceLoader for directory: '/mnt/ssd/jenkins/workspace/Lucene-Solr-4.x-Linux-Java8-64/checkout/solr/build/solr-core/test-files/solr/'
[junit4:junit4]   2> 50 T1544 oasc.CoreContainer.load Registering Log Listener
[junit4:junit4]   2> 60 T1544 oashc.HttpShardHandlerFactory.getParameter Setting socketTimeout to: 0
[junit4:junit4]   2> 60 T1544 oashc.HttpShardHandlerFactory.getParameter Setting urlScheme to: http://
[junit4:junit4]   2> 60 T1544 oashc.HttpShardHandlerFactory.getParameter Setting connTimeout to: 0
[junit4:junit4]   2> 61 T1544 oashc.HttpShardHandlerFactory.getParameter Setting maxConnectionsPerHost to: 20
[junit4:junit4]   2> 61 T1544 oashc.HttpShardHandlerFactory.getParameter Setting corePoolSize to: 0
[junit4:junit4]   2> 61 T1544 oashc.HttpShardHandlerFactory.getParameter Setting maximumPoolSize to: 2147483647
[junit4:junit4]   2> 61 T1544 oashc.HttpShardHandlerFactory.getParameter Setting maxThreadIdleTime to: 5
[junit4:junit4]   2> 62 T1544 oashc.HttpShardHandlerFactory.getParameter Setting sizeOfQueue to: -1
[junit4:junit4]   2> 62 T1544 oashc.HttpShardHandlerFactory.getParameter Setting fairnessPolicy to: false
[junit4:junit4]   2> 62 T1544 oascsi.HttpClientUtil.createClient Creating new http client, config:maxConnectionsPerHost=20&maxConnections=10000&socketTimeout=0&connTimeout=0&retry=false
[junit4:junit4]   2> 68 T1544 oasc.CoreContainer.create Creating SolrCore 'collection1' using instanceDir: /mnt/ssd/jenkins/workspace/Lucene-Solr-4.x-Linux-Java8-64/checkout/solr/build/solr-core/test-files/solr/collection1
[junit4:junit4]   2> 68 T1544 oasc.SolrResourceLoader.<init> new SolrResourceLoader for directory: '/mnt/ssd/jenkins/workspace/Lucene-Solr-4.x-Linux-Java8-64/checkout/solr/build/solr-core/test-files/solr/collection1/'
[junit4:junit4]   2> 69 T1544 oasc.SolrResourceLoader.replaceClassLoader Adding 'file:/mnt/ssd/jenkins/workspace/Lucene-Solr-4.x-Linux-Java8-64/checkout/solr/build/solr-core/test-files/solr/collection1/lib/README' to classloader
[junit4:junit4]   2> 69 T1544 oasc.SolrResourceLoader.replaceClassLoader Adding 'file:/mnt/ssd/jenkins/workspace/Lucene-Solr-4.x-Linux-Java8-64/checkout/solr/build/solr-core/test-files/solr/collection1/lib/classes/' to classloader
[junit4:junit4]   2> 87 T1544 oasc.SolrConfig.<init> Using Lucene MatchVersion: LUCENE_40
[junit4:junit4]   2> 124 T1544 oasc.SolrConfig.<init> Loaded SolrConfig: solrconfig-elevate.xml
[junit4:junit4]   2> 125 T1544 oass.IndexSchema.readSchema Reading Solr Schema
[junit4:junit4]   2> 128 T1544 oass.IndexSchema.readSchema Schema name=example
[junit4:junit4]   2> 287 T1544 oass.IndexSchema.readSchema default search field in schema is text
[junit4:junit4]   2> 289 T1544 oass.IndexSchema.readSchema unique key field: id
[junit4:junit4]   2> 292 T1544 oasc.SolrCore.<init> [collection1] Opening new SolrCore at /mnt/ssd/jenkins/workspace/Lucene-Solr-4.x-Linux-Java8-64/checkout/solr/build/solr-core/test-files/solr/collection1/, dataDir=./org.apache.solr.handler.component.DistributedQueryElevationComponentTest-1342108303565/control/data/
[junit4:junit4]   2> 293 T1544 oasc.JmxMonitoredMap.<init> JMX monitoring is enabled. Adding Solr mbeans to JMX Server: com.sun.jmx.mbeanserver.JmxMBeanServer@7512951d
[junit4:junit4]   2> 293 T1544 oasc.SolrCore.getNewIndexDir WARNING New index directory detected: old=null new=./org.apache.solr.handler.component.DistributedQueryElevationComponentTest-1342108303565/control/data/index/
[junit4:junit4]   2> 294 T1544 oasc.SolrCore.initIndex WARNING [collection1] Solr index directory './org.apache.solr.handler.component.DistributedQueryElevationComponentTest-1342108303565/control/data/index' doesn't exist. Creating new index...
[junit4:junit4]   2> 295 T1544 oasc.SolrDeletionPolicy.onCommit SolrDeletionPolicy.onCommit: commits:num=1
[junit4:junit4]   2> 		commit{dir=MockDirWrapper(org.apache.lucene.store.RAMDirectory@3c2ccbc9 lockFactory=org.apache.lucene.store.SingleInstanceLockFactory@3e47b24c),segFN=segments_1,generation=1,filenames=[segments_1]
[junit4:junit4]   2> 295 T1544 oasc.SolrDeletionPolicy.updateCommits newest commit = 1
[junit4:junit4]   2> 299 T1544 oasc.RequestHandlers.initHandlersFromConfig created /update: solr.UpdateRequestHandler
[junit4:junit4]   2> 300 T1544 oasc.RequestHandlers.initHandlersFromConfig created /elevate: org.apache.solr.handler.component.SearchHandler
[junit4:junit4]   2> 300 T1544 oasc.RequestHandlers.initHandlersFromConfig created /dataElevate: org.apache.solr.handler.component.SearchHandler
[junit4:junit4]   2> 300 T1544 oashl.XMLLoader.init xsltCacheLifetimeSeconds=60
[junit4:junit4]   2> 301 T1544 oasc.RequestHandlers.initHandlersFromConfig WARNING no default request handler is registered (either '/select' or 'standard')
[junit4:junit4]   2> 302 T1544 oasc.SolrCore.initDeprecatedSupport WARNING solrconfig.xml uses deprecated <admin/gettableFiles>, Please update your config to use the ShowFileRequestHandler.
[junit4:junit4]   2> 303 T1544 oasc.SolrCore.initDeprecatedSupport WARNING adding ShowFileRequestHandler with hidden files: [SCHEMA-LMJELINEKMERCER.XML, MAPPING-ISOLATIN1ACCENT.TXT, SOLRCONFIG-MASTER3.XML, SOLRCONFIG-SIMPLELOCK.XML, SOLRCONFIG-ELEVATE.XML, BAD-SCHEMA-OMIT-TF-BUT-NOT-POS.XML, BAD-SCHEMA-SIM-GLOBAL-VS-FT-MISMATCH.XML, BAD-SCHEMA-NOT-INDEXED-BUT-NORMS.XML, FRENCHARTICLES.TXT, DA_COMPOUNDDICTIONARY.TXT, SOLRCONFIG-HIGHLIGHT.XML, SCHEMA11.XML, BAD-SCHEMA-NOT-INDEXED-BUT-POS.XML, BAD-SCHEMA-DUP-FIELDTYPE.XML, STOPWORDSWRONGENCODING.TXT, SOLRCONFIG_CODEC.XML, BAD-SCHEMA-DUP-FIELD.XML, STOPTYPES-2.TXT, BAD-SCHEMA-NONTEXT-ANALYZER.XML, SCHEMA-TFIDF.XML, SOLRCONFIG-MERGEPOLICY.XML, PROTWORDS.TXT, SYNONYMS.TXT, SCHEMA-COLLATEFILTER.XML, SOLRCONFIG-MASTER1-KEEPONEBACKUP.XML, SOLRCONFIG-SOLR-749.XML, SOLRCONFIG-ALTDIRECTORY.XML, SOLRCONFIG-TRANSFORMERS.XML, SCHEMA-STOP-KEEP.XML, SOLRCONFIG-MASTER.XML, SOLRCONFIG-SPELLCHECKER.XML, CURRENCY.XML, BAD-MP-SOLRCONFIG.XML, SOLRCONFIG-TERMINDEX.XML, SOLRCONFIG-BASIC.XML, SCHEMA-SIM.XML, SCHEMA-SPELLCHECKER.XML, SOLRCONFIG-FUNCTIONQUERY.XML, HUNSPELL-TEST.DIC, SCHEMA-PHRASESUGGEST.XML, SOLRCONFIG-TLOG.XML, SCHEMASURROUND.XML, SCHEMA-TRIE.XML, SOLRCONFIG_PERF.XML, DA_UTF8.XML, SCHEMA15.XML, STOP-SNOWBALL.TXT, WDFTYPES.TXT, SOLRCONFIG-SLAVE.XML, SCHEMA-BINARYFIELD.XML, STOPWITHBOM.TXT, SOLRCONFIG-BASIC-LUCENEVERSION31.XML, SOLRCONFIG-QUERYSENDER.XML, SCHEMA-BM25.XML, SCHEMA-LUCENEMATCHVERSION.XML, SOLRCONFIG-ENABLEPLUGIN.XML, COMPOUNDDICTIONARY.TXT, SOLRCONFIG-SLAVE1.XML, SOLRCONFIG-XINCLUDE.XML, HYPHENATION.DTD, KEEP-1.TXT, ELEVATE.XML, STOP-2.TXT, SOLRCONFIG-SPELLCHECKCOMPONENT.XML, SOLRCONFIG-REQHANDLER.INCL, SOLRCONFIG-PROPINJECT-INDEXDEFAULT.XML, SCHEMA-FOLDING.XML, SCHEMA-DFR.XML, SOLRCONFIG-DELPOLICY2.XML, SOLRCONFIG-PHRASESUGGEST.XML, BAD-SCHEMA-DUP-DYNAMICFIELD.XML, SCHEMA-REPLICATION1.XML, SOLRCONFIG-DELPOLICY1.XML, OPEN-EXCHANGE-RATES.JSON, SCHEMA-REQUIRED-FIELDS.XML, SOLRCONFIG-MASTER2.XML, SOLRCONFIG-MASTER1.XML, SOLRCONFIG-LAZYWRITER.XML, STOPWORDS.TXT, SCHEMA12.XML, SOLRCONFIG-PROPINJECT.XML, SCHEMA-NUMERIC.XML, PHRASESUGGEST.TXT, BAD-SCHEMA-CODEC-GLOBAL-VS-FT-MISMATCH.XML, SOLRCONFIG-QUERYSENDER-NOQUERY.XML, BAD_SOLRCONFIG.XML, STOPTYPES-1.TXT, SOLRCONFIG-UPDATE-PROCESSOR-CHAINS.XML, SCHEMA-COLLATE.XML, SCHEMA-LMDIRICHLET.XML, SCHEMA-CHARFILTERS.XML, KEEP-2.TXT, XSLT, BAD-SCHEMA-EXTERNAL-FILEFIELD.XML, HUNSPELL-TEST.AFF, SCHEMA-MINIMAL.XML, SCHEMA-REPLICATION2.XML, SOLRCONFIG-NATIVELOCK.XML, SCHEMA.XML, BAD-SCHEMA-UNIQUEKEY-IS-COPYFIELD-DEST.XML, OLD_SYNONYMS.TXT, STOP-1.TXT, SCHEMA-REVERSED.XML, SCHEMA-COPYFIELD-TEST.XML, SCHEMA-NOT-REQUIRED-UNIQUE-KEY.XML, SOLRCONFIG-REPEATER.XML, SOLRCONFIG-SOLCOREPROPERTIES.XML, STEMDICT.TXT, SCHEMA-IB.XML, BAD-SCHEMA-NOT-INDEXED-BUT-TF.XML, SOLRCONFIG-CACHING.XML, BAD-SCHEMA-UNIQUEKEY-USES-DEFAULT.XML, SOLRCONFIG-NOCACHE.XML, SCHEMA_CODEC.XML]
[junit4:junit4]   2> 305 T1544 oass.SolrIndexSearcher.<init> Opening Searcher@5402f759 main
[junit4:junit4]   2> 306 T1544 oass.SolrIndexSearcher.getIndexDir WARNING WARNING: Directory impl does not support setting indexDir: org.apache.lucene.store.MockDirectoryWrapper
[junit4:junit4]   2> 306 T1544 oasu.CommitTracker.<init> Hard AutoCommit: disabled
[junit4:junit4]   2> 306 T1544 oasu.CommitTracker.<init> Soft AutoCommit: disabled
[junit4:junit4]   2> 308 T1544 oashc.QueryElevationComponent.inform Loading QueryElevation from: /mnt/ssd/jenkins/workspace/Lucene-Solr-4.x-Linux-Java8-64/checkout/solr/build/solr-core/test-files/solr/collection1/conf/elevate.xml
[junit4:junit4]   2> 317 T1544 oashc.QueryElevationComponent.inform Loading QueryElevation from: /mnt/ssd/jenkins/workspace/Lucene-Solr-4.x-Linux-Java8-64/checkout/solr/build/solr-core/test-files/solr/collection1/conf/elevate.xml
[junit4:junit4]   2> 323 T1554 oasc.SolrCore.registerSearcher [collection1] Registered new searcher Searcher@5402f759 main{StandardDirectoryReader(segments_1:1)}
[junit4:junit4]   2> 323 T1544 oasc.CoreContainer.register registering core: collection1
[junit4:junit4]   2> 324 T1544 oass.SolrDispatchFilter.init user.dir=/mnt/ssd/jenkins/workspace/Lucene-Solr-4.x-Linux-Java8-64/checkout/solr/build/solr-core/test/J1
[junit4:junit4]   2> 324 T1544 oass.SolrDispatchFilter.init SolrDispatchFilter.init() done
[junit4:junit4]   2> 324 T1544 oascsi.HttpClientUtil.createClient Creating new http client, config:maxConnections=128&maxConnectionsPerHost=32&followRedirects=false
[junit4:junit4]   2> 326 T1544 oejs.Server.doStart jetty-8.1.2.v20120308
[junit4:junit4]   2> 327 T1544 oejs.AbstractConnector.doStart Started SocketConnector@0.0.0.0:51824
[junit4:junit4]   2> 328 T1544 oasc.SolrResourceLoader.locateSolrHome JNDI not configured for solr (NoInitialContextEx)
[junit4:junit4]   2> 328 T1544 oasc.SolrResourceLoader.locateSolrHome using system property solr.solr.home: /mnt/ssd/jenkins/workspace/Lucene-Solr-4.x-Linux-Java8-64/checkout/solr/build/solr-core/test-files/solr
[junit4:junit4]   2> 328 T1544 oasc.SolrResourceLoader.<init> new SolrResourceLoader for deduced Solr Home: '/mnt/ssd/jenkins/workspace/Lucene-Solr-4.x-Linux-Java8-64/checkout/solr/build/solr-core/test-files/solr/'
[junit4:junit4]   2> 331 T1544 oass.SolrDispatchFilter.init SolrDispatchFilter.init()
[junit4:junit4]   2> 331 T1544 oasc.SolrResourceLoader.locateSolrHome JNDI not configured for solr (NoInitialContextEx)
[junit4:junit4]   2> 331 T1544 oasc.SolrResourceLoader.locateSolrHome using system property solr.solr.home: /mnt/ssd/jenkins/workspace/Lucene-Solr-4.x-Linux-Java8-64/checkout/solr/build/solr-core/test-files/solr
[junit4:junit4]   2> 332 T1544 oasc.CoreContainer$Initializer.initialize looking for solr.xml: /mnt/ssd/jenkins/workspace/Lucene-Solr-4.x-Linux-Java8-64/checkout/solr/build/solr-core/test-files/solr/solr.xml
[junit4:junit4]   2> 332 T1544 oasc.CoreContainer.<init> New CoreContainer 660509730
[junit4:junit4]   2> 332 T1544 oasc.CoreContainer.load Loading CoreContainer using Solr Home: '/mnt/ssd/jenkins/workspace/Lucene-Solr-4.x-Linux-Java8-64/checkout/solr/build/solr-core/test-files/solr/'
[junit4:junit4]   2> 332 T1544 oasc.SolrResourceLoader.<init> new SolrResourceLoader for directory: '/mnt/ssd/jenkins/workspace/Lucene-Solr-4.x-Linux-Java8-64/checkout/solr/build/solr-core/test-files/solr/'
[junit4:junit4]   2> 337 T1544 oasc.CoreContainer.load Registering Log Listener
[junit4:junit4]   2> 344 T1544 oashc.HttpShardHandlerFactory.getParameter Setting socketTimeout to: 0
[junit4:junit4]   2> 344 T1544 oashc.HttpShardHandlerFactory.getParameter Setting urlScheme to: http://
[junit4:junit4]   2> 344 T1544 oashc.HttpShardHandlerFactory.getParameter Setting connTimeout to: 0
[junit4:junit4]   2> 344 T1544 oashc.HttpShardHandlerFactory.getParameter Setting maxConnectionsPerHost to: 20
[junit4:junit4]   2> 345 T1544 oashc.HttpShardHandlerFactory.getParameter Setting corePoolSize to: 0
[junit4:junit4]   2> 345 T1544 oashc.HttpShardHandlerFactory.getParameter Setting maximumPoolSize to: 2147483647
[junit4:junit4]   2> 345 T1544 oashc.HttpShardHandlerFactory.getParameter Setting maxThreadIdleTime to: 5
[junit4:junit4]   2> 345 T1544 oashc.HttpShardHandlerFactory.getParameter Setting sizeOfQueue to: -1
[junit4:junit4]   2> 345 T1544 oashc.HttpShardHandlerFactory.getParameter Setting fairnessPolicy to: false
[junit4:junit4]   2> 346 T1544 oascsi.HttpClientUtil.createClient Creating new http client, config:maxConnectionsPerHost=20&maxConnections=10000&socketTimeout=0&connTimeout=0&retry=false
[junit4:junit4]   2> 352 T1544 oasc.CoreContainer.create Creating SolrCore 'collection1' using instanceDir: /mnt/ssd/jenkins/workspace/Lucene-Solr-4.x-Linux-Java8-64/checkout/solr/build/solr-core/test-files/solr/collection1
[junit4:junit4]   2> 352 T1544 oasc.SolrResourceLoader.<init> new SolrResourceLoader for directory: '/mnt/ssd/jenkins/workspace/Lucene-Solr-4.x-Linux-Java8-64/checkout/solr/build/solr-core/test-files/solr/collection1/'
[junit4:junit4]   2> 353 T1544 oasc.SolrResourceLoader.replaceClassLoader Adding 'file:/mnt/ssd/jenkins/workspace/Lucene-Solr-4.x-Linux-Java8-64/checkout/solr/build/solr-core/test-files/solr/collection1/lib/README' to classloader
[junit4:junit4]   2> 353 T1544 oasc.SolrResourceLoader.replaceClassLoader Adding 'file:/mnt/ssd/jenkins/workspace/Lucene-Solr-4.x-Linux-Java8-64/checkout/solr/build/solr-core/test-files/solr/collection1/lib/classes/' to classloader
[junit4:junit4]   2> 366 T1544 oasc.SolrConfig.<init> Using Lucene MatchVersion: LUCENE_40
[junit4:junit4]   2> 395 T1544 oasc.SolrConfig.<init> Loaded SolrConfig: solrconfig-elevate.xml
[junit4:junit4]   2> 396 T1544 oass.IndexSchema.readSchema Reading Solr Schema
[junit4:junit4]   2> 399 T1544 oass.IndexSchema.readSchema Schema name=example
[junit4:junit4]   2> 525 T1544 oass.IndexSchema.readSchema default search field in schema is text
[junit4:junit4]   2> 527 T1544 oass.IndexSchema.readSchema unique key field: id
[junit4:junit4]   2> 529 T1544 oasc.SolrCore.<init> [collection1] Opening new SolrCore at /mnt/ssd/jenkins/workspace/Lucene-Solr-4.x-Linux-Java8-64/checkout/solr/build/solr-core/test-files/solr/collection1/, dataDir=./org.apache.solr.handler.component.DistributedQueryElevationComponentTest-1342108303565/shard0/data/
[junit4:junit4]   2> 529 T1544 oasc.JmxMonitoredMap.<init> JMX monitoring is enabled. Adding Solr mbeans to JMX Server: com.sun.jmx.mbeanserver.JmxMBeanServer@7512951d
[junit4:junit4]   2> 530 T1544 oasc.SolrCore.getNewIndexDir WARNING New index directory detected: old=null new=./org.apache.solr.handler.component.DistributedQueryElevationComponentTest-1342108303565/shard0/data/index/
[junit4:junit4]   2> 530 T1544 oasc.SolrCore.initIndex WARNING [collection1] Solr index directory './org.apache.solr.handler.component.DistributedQueryElevationComponentTest-1342108303565/shard0/data/index' doesn't exist. Creating new index...
[junit4:junit4]   2> 531 T1544 oasc.SolrDeletionPolicy.onCommit SolrDeletionPolicy.onCommit: commits:num=1
[junit4:junit4]   2> 		commit{dir=MockDirWrapper(org.apache.lucene.store.RAMDirectory@4df75a83 lockFactory=org.apache.lucene.store.SingleInstanceLockFactory@54214c15),segFN=segments_1,generation=1,filenames=[segments_1]
[junit4:junit4]   2> 531 T1544 oasc.SolrDeletionPolicy.updateCommits newest commit = 1
[junit4:junit4]   2> 532 T1544 oasc.RequestHandlers.initHandlersFromConfig created /update: solr.UpdateRequestHandler
[junit4:junit4]   2> 533 T1544 oasc.RequestHandlers.initHandlersFromConfig created /elevate: org.apache.solr.handler.component.SearchHandler
[junit4:junit4]   2> 533 T1544 oasc.RequestHandlers.initHandlersFromConfig created /dataElevate: org.apache.solr.handler.component.SearchHandler
[junit4:junit4]   2> 534 T1544 oashl.XMLLoader.init xsltCacheLifetimeSeconds=60
[junit4:junit4]   2> 534 T1544 oasc.RequestHandlers.initHandlersFromConfig WARNING no default request handler is registered (either '/select' or 'standard')
[junit4:junit4]   2> 535 T1544 oasc.SolrCore.initDeprecatedSupport WARNING solrconfig.xml uses deprecated <admin/gettableFiles>, Please update your config to use the ShowFileRequestHandler.
[junit4:junit4]   2> 536 T1544 oasc.SolrCore.initDeprecatedSupport WARNING adding ShowFileRequestHandler with hidden files: [SCHEMA-LMJELINEKMERCER.XML, MAPPING-ISOLATIN1ACCENT.TXT, SOLRCONFIG-MASTER3.XML, SOLRCONFIG-SIMPLELOCK.XML, SOLRCONFIG-ELEVATE.XML, BAD-SCHEMA-OMIT-TF-BUT-NOT-POS.XML, BAD-SCHEMA-SIM-GLOBAL-VS-FT-MISMATCH.XML, BAD-SCHEMA-NOT-INDEXED-BUT-NORMS.XML, FRENCHARTICLES.TXT, DA_COMPOUNDDICTIONARY.TXT, SOLRCONFIG-HIGHLIGHT.XML, SCHEMA11.XML, BAD-SCHEMA-NOT-INDEXED-BUT-POS.XML, BAD-SCHEMA-DUP-FIELDTYPE.XML, STOPWORDSWRONGENCODING.TXT, SOLRCONFIG_CODEC.XML, BAD-SCHEMA-DUP-FIELD.XML, STOPTYPES-2.TXT, BAD-SCHEMA-NONTEXT-ANALYZER.XML, SCHEMA-TFIDF.XML, SOLRCONFIG-MERGEPOLICY.XML, PROTWORDS.TXT, SYNONYMS.TXT, SCHEMA-COLLATEFILTER.XML, SOLRCONFIG-MASTER1-KEEPONEBACKUP.XML, SOLRCONFIG-SOLR-749.XML, SOLRCONFIG-ALTDIRECTORY.XML, SOLRCONFIG-TRANSFORMERS.XML, SCHEMA-STOP-KEEP.XML, SOLRCONFIG-MASTER.XML, SOLRCONFIG-SPELLCHECKER.XML, CURRENCY.XML, BAD-MP-SOLRCONFIG.XML, SOLRCONFIG-TERMINDEX.XML, SOLRCONFIG-BASIC.XML, SCHEMA-SIM.XML, SCHEMA-SPELLCHECKER.XML, SOLRCONFIG-FUNCTIONQUERY.XML, HUNSPELL-TEST.DIC, SCHEMA-PHRASESUGGEST.XML, SOLRCONFIG-TLOG.XML, SCHEMASURROUND.XML, SCHEMA-TRIE.XML, SOLRCONFIG_PERF.XML, DA_UTF8.XML, SCHEMA15.XML, STOP-SNOWBALL.TXT, WDFTYPES.TXT, SOLRCONFIG-SLAVE.XML, SCHEMA-BINARYFIELD.XML, STOPWITHBOM.TXT, SOLRCONFIG-BASIC-LUCENEVERSION31.XML, SOLRCONFIG-QUERYSENDER.XML, SCHEMA-BM25.XML, SCHEMA-LUCENEMATCHVERSION.XML, SOLRCONFIG-ENABLEPLUGIN.XML, COMPOUNDDICTIONARY.TXT, SOLRCONFIG-SLAVE1.XML, SOLRCONFIG-XINCLUDE.XML, HYPHENATION.DTD, KEEP-1.TXT, ELEVATE.XML, STOP-2.TXT, SOLRCONFIG-SPELLCHECKCOMPONENT.XML, SOLRCONFIG-REQHANDLER.INCL, SOLRCONFIG-PROPINJECT-INDEXDEFAULT.XML, SCHEMA-FOLDING.XML, SCHEMA-DFR.XML, SOLRCONFIG-DELPOLICY2.XML, SOLRCONFIG-PHRASESUGGEST.XML, BAD-SCHEMA-DUP-DYNAMICFIELD.XML, SCHEMA-REPLICATION1.XML, SOLRCONFIG-DELPOLICY1.XML, OPEN-EXCHANGE-RATES.JSON, SCHEMA-REQUIRED-FIELDS.XML, SOLRCONFIG-MASTER2.XML, SOLRCONFIG-MASTER1.XML, SOLRCONFIG-LAZYWRITER.XML, STOPWORDS.TXT, SCHEMA12.XML, SOLRCONFIG-PROPINJECT.XML, SCHEMA-NUMERIC.XML, PHRASESUGGEST.TXT, BAD-SCHEMA-CODEC-GLOBAL-VS-FT-MISMATCH.XML, SOLRCONFIG-QUERYSENDER-NOQUERY.XML, BAD_SOLRCONFIG.XML, STOPTYPES-1.TXT, SOLRCONFIG-UPDATE-PROCESSOR-CHAINS.XML, SCHEMA-COLLATE.XML, SCHEMA-LMDIRICHLET.XML, SCHEMA-CHARFILTERS.XML, KEEP-2.TXT, XSLT, BAD-SCHEMA-EXTERNAL-FILEFIELD.XML, HUNSPELL-TEST.AFF, SCHEMA-MINIMAL.XML, SCHEMA-REPLICATION2.XML, SOLRCONFIG-NATIVELOCK.XML, SCHEMA.XML, BAD-SCHEMA-UNIQUEKEY-IS-COPYFIELD-DEST.XML, OLD_SYNONYMS.TXT, STOP-1.TXT, SCHEMA-REVERSED.XML, SCHEMA-COPYFIELD-TEST.XML, SCHEMA-NOT-REQUIRED-UNIQUE-KEY.XML, SOLRCONFIG-REPEATER.XML, SOLRCONFIG-SOLCOREPROPERTIES.XML, STEMDICT.TXT, SCHEMA-IB.XML, BAD-SCHEMA-NOT-INDEXED-BUT-TF.XML, SOLRCONFIG-CACHING.XML, BAD-SCHEMA-UNIQUEKEY-USES-DEFAULT.XML, SOLRCONFIG-NOCACHE.XML, SCHEMA_CODEC.XML]
[junit4:junit4]   2> 537 T1544 oass.SolrIndexSearcher.<init> Opening Searcher@4e6c01fa main
[junit4:junit4]   2> 538 T1544 oass.SolrIndexSearcher.getIndexDir WARNING WARNING: Directory impl does not support setting indexDir: org.apache.lucene.store.MockDirectoryWrapper
[junit4:junit4]   2> 538 T1544 oasu.CommitTracker.<init> Hard AutoCommit: disabled
[junit4:junit4]   2> 538 T1544 oasu.CommitTracker.<init> Soft AutoCommit: disabled
[junit4:junit4]   2> 538 T1544 oashc.QueryElevationComponent.inform Loading QueryElevation from: /mnt/ssd/jenkins/workspace/Lucene-Solr-4.x-Linux-Java8-64/checkout/solr/build/solr-core/test-files/solr/collection1/conf/elevate.xml
[junit4:junit4]   2> 544 T1544 oashc.QueryElevationComponent.inform Loading QueryElevation from: /mnt/ssd/jenkins/workspace/Lucene-Solr-4.x-Linux-Java8-64/checkout/solr/build/solr-core/test-files/solr/collection1/conf/elevate.xml
[junit4:junit4]   2> 549 T1564 oasc.SolrCore.registerSearcher [collection1] Registered new searcher Searcher@4e6c01fa main{StandardDirectoryReader(segments_1:1)}
[junit4:junit4]   2> 549 T1544 oasc.CoreContainer.register registering core: collection1
[junit4:junit4]   2> 550 T1544 oass.SolrDispatchFilter.init user.dir=/mnt/ssd/jenkins/workspace/Lucene-Solr-4.x-Linux-Java8-64/checkout/solr/build/solr-core/test/J1
[junit4:junit4]   2> 550 T1544 oass.SolrDispatchFilter.init SolrDispatchFilter.init() done
[junit4:junit4]   2> 550 T1544 oascsi.HttpClientUtil.createClient Creating new http client, config:maxConnections=128&maxConnectionsPerHost=32&followRedirects=false
[junit4:junit4]   2> 552 T1544 oejs.Server.doStart jetty-8.1.2.v20120308
[junit4:junit4]   2> 554 T1544 oejs.AbstractConnector.doStart Started SocketConnector@0.0.0.0:33211
[junit4:junit4]   2> 554 T1544 oasc.SolrResourceLoader.locateSolrHome JNDI not configured for solr (NoInitialContextEx)
[junit4:junit4]   2> 555 T1544 oasc.SolrResourceLoader.locateSolrHome using system property solr.solr.home: /mnt/ssd/jenkins/workspace/Lucene-Solr-4.x-Linux-Java8-64/checkout/solr/build/solr-core/test-files/solr
[junit4:junit4]   2> 555 T1544 oasc.SolrResourceLoader.<init> new SolrResourceLoader for deduced Solr Home: '/mnt/ssd/jenkins/workspace/Lucene-Solr-4.x-Linux-Java8-64/checkout/solr/build/solr-core/test-files/solr/'
[junit4:junit4]   2> 557 T1544 oass.SolrDispatchFilter.init SolrDispatchFilter.init()
[junit4:junit4]   2> 558 T1544 oasc.SolrResourceLoader.locateSolrHome JNDI not configured for solr (NoInitialContextEx)
[junit4:junit4]   2> 558 T1544 oasc.SolrResourceLoader.locateSolrHome using system property solr.solr.home: /mnt/ssd/jenkins/workspace/Lucene-Solr-4.x-Linux-Java8-64/checkout/solr/build/solr-core/test-files/solr
[junit4:junit4]   2> 558 T1544 oasc.CoreContainer$Initializer.initialize looking for solr.xml: /mnt/ssd/jenkins/workspace/Lucene-Solr-4.x-Linux-Java8-64/checkout/solr/build/solr-core/test-files/solr/solr.xml
[junit4:junit4]   2> 558 T1544 oasc.CoreContainer.<init> New CoreContainer 248389777
[junit4:junit4]   2> 558 T1544 oasc.CoreContainer.load Loading CoreContainer using Solr Home: '/mnt/ssd/jenkins/workspace/Lucene-Solr-4.x-Linux-Java8-64/checkout/solr/build/solr-core/test-files/solr/'
[junit4:junit4]   2> 559 T1544 oasc.SolrResourceLoader.<init> new SolrResourceLoader for directory: '/mnt/ssd/jenkins/workspace/Lucene-Solr-4.x-Linux-Java8-64/checkout/solr/build/solr-core/test-files/solr/'
[junit4:junit4]   2> 563 T1544 oasc.CoreContainer.load Registering Log Listener
[junit4:junit4]   2> 569 T1544 oashc.HttpShardHandlerFactory.getParameter Setting socketTimeout to: 0
[junit4:junit4]   2> 570 T1544 oashc.HttpShardHandlerFactory.getParameter Setting urlScheme to: http://
[junit4:junit4]   2> 570 T1544 oashc.HttpShardHandlerFactory.getParameter Setting connTimeout to: 0
[junit4:junit4]   2> 570 T1544 oashc.HttpShardHandlerFactory.getParameter Setting maxConnectionsPerHost to: 20
[junit4:junit4]   2> 570 T1544 oashc.HttpShardHandlerFactory.getParameter Setting corePoolSize to: 0
[junit4:junit4]   2> 570 T1544 oashc.HttpShardHandlerFactory.getParameter Setting maximumPoolSize to: 2147483647
[junit4:junit4]   2> 571 T1544 oashc.HttpShardHandlerFactory.getParameter Setting maxThreadIdleTime to: 5
[junit4:junit4]   2> 571 T1544 oashc.HttpShardHandlerFactory.getParameter Setting sizeOfQueue to: -1
[junit4:junit4]   2> 571 T1544 oashc.HttpShardHandlerFactory.getParameter Setting fairnessPolicy to: false
[junit4:junit4]   2> 571 T1544 oascsi.HttpClientUtil.createClient Creating new http client, config:maxConnectionsPerHost=20&maxConnections=10000&socketTimeout=0&connTimeout=0&retry=false
[junit4:junit4]   2> 575 T1544 oasc.CoreContainer.create Creating SolrCore 'collection1' using instanceDir: /mnt/ssd/jenkins/workspace/Lucene-Solr-4.x-Linux-Java8-64/checkout/solr/build/solr-core/test-files/solr/collection1
[junit4:junit4]   2> 575 T1544 oasc.SolrResourceLoader.<init> new SolrResourceLoader for directory: '/mnt/ssd/jenkins/workspace/Lucene-Solr-4.x-Linux-Java8-64/checkout/solr/build/solr-core/test-files/solr/collection1/'
[junit4:junit4]   2> 576 T1544 oasc.SolrResourceLoader.replaceClassLoader Adding 'file:/mnt/ssd/jenkins/workspace/Lucene-Solr-4.x-Linux-Java8-64/checkout/solr/build/solr-core/test-files/solr/collection1/lib/README' to classloader
[junit4:junit4]   2> 576 T1544 oasc.SolrResourceLoader.replaceClassLoader Adding 'file:/mnt/ssd/jenkins/workspace/Lucene-Solr-4.x-Linux-Java8-64/checkout/solr/build/solr-core/test-files/solr/collection1/lib/classes/' to classloader
[junit4:junit4]   2> 595 T1544 oasc.SolrConfig.<init> Using Lucene MatchVersion: LUCENE_40
[junit4:junit4]   2> 631 T1544 oasc.SolrConfig.<init> Loaded SolrConfig: solrconfig-elevate.xml
[junit4:junit4]   2> 631 T1544 oass.IndexSchema.readSchema Reading Solr Schema
[junit4:junit4]   2> 634 T1544 oass.IndexSchema.readSchema Schema name=example
[junit4:junit4]   2> 806 T1544 oass.IndexSchema.readSchema default search field in schema is text
[junit4:junit4]   2> 808 T1544 oass.IndexSchema.readSchema unique key field: id
[junit4:junit4]   2> 811 T1544 oasc.SolrCore.<init> [collection1] Opening new SolrCore at /mnt/ssd/jenkins/workspace/Lucene-Solr-4.x-Linux-Java8-64/checkout/solr/build/solr-core/test-files/solr/collection1/, dataDir=./org.apache.solr.handler.component.DistributedQueryElevationComponentTest-1342108303565/shard1/data/
[junit4:junit4]   2> 811 T1544 oasc.JmxMonitoredMap.<init> JMX monitoring is enabled. Adding Solr mbeans to JMX Server: com.sun.jmx.mbeanserver.JmxMBeanServer@7512951d
[junit4:junit4]   2> 812 T1544 oasc.SolrCore.getNewIndexDir WARNING New index directory detected: old=null new=./org.apache.solr.handler.component.DistributedQueryElevationComponentTest-1342108303565/shard1/data/index/
[junit4:junit4]   2> 812 T1544 oasc.SolrCore.initIndex WARNING [collection1] Solr index directory './org.apache.solr.handler.component.DistributedQueryElevationComponentTest-1342108303565/shard1/data/index' doesn't exist. Creating new index...
[junit4:junit4]   2> 813 T1544 oasc.SolrDeletionPolicy.onCommit SolrDeletionPolicy.onCommit: commits:num=1
[junit4:junit4]   2> 		commit{dir=MockDirWrapper(NRTCachingDirectory(org.apache.lucene.store.RAMDirectory@3b68cd5f lockFactory=org.apache.lucene.store.SingleInstanceLockFactory@7e3caa7c; maxCacheMB=0.9599609375 maxMergeSizeMB=0.0244140625)),segFN=segments_1,generation=1,filenames=[segments_1]
[junit4:junit4]   2> 814 T1544 oasc.SolrDeletionPolicy.updateCommits newest commit = 1
[junit4:junit4]   2> 815 T1544 oasc.RequestHandlers.initHandlersFromConfig created /update: solr.UpdateRequestHandler
[junit4:junit4]   2> 815 T1544 oasc.RequestHandlers.initHandlersFromConfig created /elevate: org.apache.solr.handler.component.SearchHandler
[junit4:junit4]   2> 815 T1544 oasc.RequestHandlers.initHandlersFromConfig created /dataElevate: org.apache.solr.handler.component.SearchHandler
[junit4:junit4]   2> 816 T1544 oashl.XMLLoader.init xsltCacheLifetimeSeconds=60
[junit4:junit4]   2> 816 T1544 oasc.RequestHandlers.initHandlersFromConfig WARNING no default request handler is registered (either '/select' or 'standard')
[junit4:junit4]   2> 817 T1544 oasc.SolrCore.initDeprecatedSupport WARNING solrconfig.xml uses deprecated <admin/gettableFiles>, Please update your config to use the ShowFileRequestHandler.
[junit4:junit4]   2> 818 T1544 oasc.SolrCore.initDeprecatedSupport WARNING adding ShowFileRequestHandler with hidden files: [SCHEMA-LMJELINEKMERCER.XML, MAPPING-ISOLATIN1ACCENT.TXT, SOLRCONFIG-MASTER3.XML, SOLRCONFIG-SIMPLELOCK.XML, SOLRCONFIG-ELEVATE.XML, BAD-SCHEMA-OMIT-TF-BUT-NOT-POS.XML, BAD-SCHEMA-SIM-GLOBAL-VS-FT-MISMATCH.XML, BAD-SCHEMA-NOT-INDEXED-BUT-NORMS.XML, FRENCHARTICLES.TXT, DA_COMPOUNDDICTIONARY.TXT, SOLRCONFIG-HIGHLIGHT.XML, SCHEMA11.XML, BAD-SCHEMA-NOT-INDEXED-BUT-POS.XML, BAD-SCHEMA-DUP-FIELDTYPE.XML, STOPWORDSWRONGENCODING.TXT, SOLRCONFIG_CODEC.XML, BAD-SCHEMA-DUP-FIELD.XML, STOPTYPES-2.TXT, BAD-SCHEMA-NONTEXT-ANALYZER.XML, SCHEMA-TFIDF.XML, SOLRCONFIG-MERGEPOLICY.XML, PROTWORDS.TXT, SYNONYMS.TXT, SCHEMA-COLLATEFILTER.XML, SOLRCONFIG-MASTER1-KEEPONEBACKUP.XML, SOLRCONFIG-SOLR-749.XML, SOLRCONFIG-ALTDIRECTORY.XML, SOLRCONFIG-TRANSFORMERS.XML, SCHEMA-STOP-KEEP.XML, SOLRCONFIG-MASTER.XML, SOLRCONFIG-SPELLCHECKER.XML, CURRENCY.XML, BAD-MP-SOLRCONFIG.XML, SOLRCONFIG-TERMINDEX.XML, SOLRCONFIG-BASIC.XML, SCHEMA-SIM.XML, SCHEMA-SPELLCHECKER.XML, SOLRCONFIG-FUNCTIONQUERY.XML, HUNSPELL-TEST.DIC, SCHEMA-PHRASESUGGEST.XML, SOLRCONFIG-TLOG.XML, SCHEMASURROUND.XML, SCHEMA-TRIE.XML, SOLRCONFIG_PERF.XML, DA_UTF8.XML, SCHEMA15.XML, STOP-SNOWBALL.TXT, WDFTYPES.TXT, SOLRCONFIG-SLAVE.XML, SCHEMA-BINARYFIELD.XML, STOPWITHBOM.TXT, SOLRCONFIG-BASIC-LUCENEVERSION31.XML, SOLRCONFIG-QUERYSENDER.XML, SCHEMA-BM25.XML, SCHEMA-LUCENEMATCHVERSION.XML, SOLRCONFIG-ENABLEPLUGIN.XML, COMPOUNDDICTIONARY.TXT, SOLRCONFIG-SLAVE1.XML, SOLRCONFIG-XINCLUDE.XML, HYPHENATION.DTD, KEEP-1.TXT, ELEVATE.XML, STOP-2.TXT, SOLRCONFIG-SPELLCHECKCOMPONENT.XML, SOLRCONFIG-REQHANDLER.INCL, SOLRCONFIG-PROPINJECT-INDEXDEFAULT.XML, SCHEMA-FOLDING.XML, SCHEMA-DFR.XML, SOLRCONFIG-DELPOLICY2.XML, SOLRCONFIG-PHRASESUGGEST.XML, BAD-SCHEMA-DUP-DYNAMICFIELD.XML, SCHEMA-REPLICATION1.XML, SOLRCONFIG-DELPOLICY1.XML, OPEN-EXCHANGE-RATES.JSON, SCHEMA-REQUIRED-FIELDS.XML, SOLRCONFIG-MASTER2.XML, SOLRCONFIG-MASTER1.XML, SOLRCONFIG-LAZYWRITER.XML, STOPWORDS.TXT, SCHEMA12.XML, SOLRCONFIG-PROPINJECT.XML, SCHEMA-NUMERIC.XML, PHRASESUGGEST.TXT, BAD-SCHEMA-CODEC-GLOBAL-VS-FT-MISMATCH.XML, SOLRCONFIG-QUERYSENDER-NOQUERY.XML, BAD_SOLRCONFIG.XML, STOPTYPES-1.TXT, SOLRCONFIG-UPDATE-PROCESSOR-CHAINS.XML, SCHEMA-COLLATE.XML, SCHEMA-LMDIRICHLET.XML, SCHEMA-CHARFILTERS.XML, KEEP-2.TXT, XSLT, BAD-SCHEMA-EXTERNAL-FILEFIELD.XML, HUNSPELL-TEST.AFF, SCHEMA-MINIMAL.XML, SCHEMA-REPLICATION2.XML, SOLRCONFIG-NATIVELOCK.XML, SCHEMA.XML, BAD-SCHEMA-UNIQUEKEY-IS-COPYFIELD-DEST.XML, OLD_SYNONYMS.TXT, STOP-1.TXT, SCHEMA-REVERSED.XML, SCHEMA-COPYFIELD-TEST.XML, SCHEMA-NOT-REQUIRED-UNIQUE-KEY.XML, SOLRCONFIG-REPEATER.XML, SOLRCONFIG-SOLCOREPROPERTIES.XML, STEMDICT.TXT, SCHEMA-IB.XML, BAD-SCHEMA-NOT-INDEXED-BUT-TF.XML, SOLRCONFIG-CACHING.XML, BAD-SCHEMA-UNIQUEKEY-USES-DEFAULT.XML, SOLRCONFIG-NOCACHE.XML, SCHEMA_CODEC.XML]
[junit4:junit4]   2> 820 T1544 oass.SolrIndexSearcher.<init> Opening Searcher@1e7d985d main
[junit4:junit4]   2> 820 T1544 oass.SolrIndexSearcher.getIndexDir WARNING WARNING: Directory impl does not support setting indexDir: org.apache.lucene.store.MockDirectoryWrapper
[junit4:junit4]   2> 822 T1544 oasu.CommitTracker.<init> Hard AutoCommit: disabled
[junit4:junit4]   2> 822 T1544 oasu.CommitTracker.<init> Soft AutoCommit: disabled
[junit4:junit4]   2> 823 T1544 oashc.QueryElevationComponent.inform Loading QueryElevation from: /mnt/ssd/jenkins/workspace/Lucene-Solr-4.x-Linux-Java8-64/checkout/solr/build/solr-core/test-files/solr/collection1/conf/elevate.xml
[junit4:junit4]   2> 828 T1544 oashc.QueryElevationComponent.inform Loading QueryElevation from: /mnt/ssd/jenkins/workspace/Lucene-Solr-4.x-Linux-Java8-64/checkout/solr/build/solr-core/test-files/solr/collection1/conf/elevate.xml
[junit4:junit4]   2> 834 T1544 oasc.CoreContainer.register registering core: collection1
[junit4:junit4]   2> 834 T1544 oass.SolrDispatchFilter.init user.dir=/mnt/ssd/jenkins/workspace/Lucene-Solr-4.x-Linux-Java8-64/checkout/solr/build/solr-core/test/J1
[junit4:junit4]   2> 834 T1544 oass.SolrDispatchFilter.init SolrDispatchFilter.init() done
[junit4:junit4]   2> 835 T1544 oascsi.HttpClientUtil.createClient Creating new http client, config:maxConnections=128&maxConnectionsPerHost=32&followRedirects=false
[junit4:junit4]   2> 837 T1574 oasc.SolrCore.registerSearcher [collection1] Registered new searcher Searcher@1e7d985d main{StandardDirectoryReader(segments_1:1)}
[junit4:junit4]   2> 837 T1544 oejs.Server.doStart jetty-8.1.2.v20120308
[junit4:junit4]   2> 858 T1544 oejs.AbstractConnector.doStart Started SocketConnector@0.0.0.0:44371
[junit4:junit4]   2> 858 T1544 oasc.SolrResourceLoader.locateSolrHome JNDI not configured for solr (NoInitialContextEx)
[junit4:junit4]   2> 859 T1544 oasc.SolrResourceLoader.locateSolrHome using system property solr.solr.home: /mnt/ssd/jenkins/workspace/Lucene-Solr-4.x-Linux-Java8-64/checkout/solr/build/solr-core/test-files/solr
[junit4:junit4]   2> 859 T1544 oasc.SolrResourceLoader.<init> new SolrResourceLoader for deduced Solr Home: '/mnt/ssd/jenkins/workspace/Lucene-Solr-4.x-Linux-Java8-64/checkout/solr/build/solr-core/test-files/solr/'
[junit4:junit4]   2> 861 T1544 oass.SolrDispatchFilter.init SolrDispatchFilter.init()
[junit4:junit4]   2> 861 T1544 oasc.SolrResourceLoader.locateSolrHome JNDI not configured for solr (NoInitialContextEx)
[junit4:junit4]   2> 862 T1544 oasc.SolrResourceLoader.locateSolrHome using system property solr.solr.home: /mnt/ssd/jenkins/workspace/Lucene-Solr-4.x-Linux-Java8-64/checkout/solr/build/solr-core/test-files/solr
[junit4:junit4]   2> 862 T1544 oasc.CoreContainer$Initializer.initialize looking for solr.xml: /mnt/ssd/jenkins/workspace/Lucene-Solr-4.x-Linux-Java8-64/checkout/solr/build/solr-core/test-files/solr/solr.xml
[junit4:junit4]   2> 862 T1544 oasc.CoreContainer.<init> New CoreContainer 2036522275
[junit4:junit4]   2> 862 T1544 oasc.CoreContainer.load Loading CoreContainer using Solr Home: '/mnt/ssd/jenkins/workspace/Lucene-Solr-4.x-Linux-Java8-64/checkout/solr/build/solr-core/test-files/solr/'
[junit4:junit4]   2> 862 T1544 oasc.SolrResourceLoader.<init> new SolrResourceLoader for directory: '/mnt/ssd/jenkins/workspace/Lucene-Solr-4.x-Linux-Java8-64/checkout/solr/build/solr-core/test-files/solr/'
[junit4:junit4]   2> 867 T1544 oasc.CoreContainer.load Registering Log Listener
[junit4:junit4]   2> 873 T1544 oashc.HttpShardHandlerFactory.getParameter Setting socketTimeout to: 0
[junit4:junit4]   2> 873 T1544 oashc.HttpShardHandlerFactory.getParameter Setting urlScheme to: http://
[junit4:junit4]   2> 873 T1544 oashc.HttpShardHandlerFactory.getParameter Setting connTimeout to: 0
[junit4:junit4]   2> 873 T1544 oashc.HttpShardHandlerFactory.getParameter Setting maxConnectionsPerHost to: 20
[junit4:junit4]   2> 874 T1544 oashc.HttpShardHandlerFactory.getParameter Setting corePoolSize to: 0
[junit4:junit4]   2> 874 T1544 oashc.HttpShardHandlerFactory.getParameter Setting maximumPoolSize to: 2147483647
[junit4:junit4]   2> 874 T1544 oashc.HttpShardHandlerFactory.getParameter Setting maxThreadIdleTime to: 5
[junit4:junit4]   2> 874 T1544 oashc.HttpShardHandlerFactory.getParameter Setting sizeOfQueue to: -1
[junit4:junit4]   2> 874 T1544 oashc.HttpShardHandlerFactory.getParameter Setting fairnessPolicy to: false
[junit4:junit4]   2> 875 T1544 oascsi.HttpClientUtil.createClient Creating new http client, config:maxConnectionsPerHost=20&maxConnections=10000&socketTimeout=0&connTimeout=0&retry=false
[junit4:junit4]   2> 880 T1544 oasc.CoreContainer.create Creating SolrCore 'collection1' using instanceDir: /mnt/ssd/jenkins/workspace/Lucene-Solr-4.x-Linux-Java8-64/checkout/solr/build/solr-core/test-files/solr/collection1
[junit4:junit4]   2> 880 T1544 oasc.SolrResourceLoader.<init> new SolrResourceLoader for directory: '/mnt/ssd/jenkins/workspace/Lucene-Solr-4.x-Linux-Java8-64/checkout/solr/build/solr-core/test-files/solr/collection1/'
[junit4:junit4]   2> 881 T1544 oasc.SolrResourceLoader.replaceClassLoader Adding 'file:/mnt/ssd/jenkins/workspace/Lucene-Solr-4.x-Linux-Java8-64/checkout/solr/build/solr-core/test-files/solr/collection1/lib/README' to classloader
[junit4:junit4]   2> 881 T1544 oasc.SolrResourceLoader.replaceClassLoader Adding 'file:/mnt/ssd/jenkins/workspace/Lucene-Solr-4.x-Linux-Java8-64/checkout/solr/build/solr-core/test-files/solr/collection1/lib/classes/' to classloader
[junit4:junit4]   2> 897 T1544 oasc.SolrConfig.<init> Using Lucene MatchVersion: LUCENE_40
[junit4:junit4]   2> 921 T1544 oasc.SolrConfig.<init> Loaded SolrConfig: solrconfig-elevate.xml
[junit4:junit4]   2> 922 T1544 oass.IndexSchema.readSchema Reading Solr Schema
[junit4:junit4]   2> 924 T1544 oass.IndexSchema.readSchema Schema name=example
[junit4:junit4]   2> 1034 T1544 oass.IndexSchema.readSchema default search field in schema is text
[junit4:junit4]   2> 1036 T1544 oass.IndexSchema.readSchema unique key field: id
[junit4:junit4]   2> 1038 T1544 oasc.SolrCore.<init> [collection1] Opening new SolrCore at /mnt/ssd/jenkins/workspace/Lucene-Solr-4.x-Linux-Java8-64/checkout/solr/build/solr-core/test-files/solr/collection1/, dataDir=./org.apache.solr.handler.component.DistributedQueryElevationComponentTest-1342108303565/shard2/data/
[junit4:junit4]   2> 1038 T1544 oasc.JmxMonitoredMap.<init> JMX monitoring is enabled. Adding Solr mbeans to JMX Server: com.sun.jmx.mbeanserver.JmxMBeanServer@7512951d
[junit4:junit4]   2> 1038 T1544 oasc.SolrCore.getNewIndexDir WARNING New index directory detected: old=null new=./org.apache.solr.handler.component.DistributedQueryElevationComponentTest-1342108303565/shard2/data/index/
[junit4:junit4]   2> 1039 T1544 oasc.SolrCore.initIndex WARNING [collection1] Solr index directory './org.apache.solr.handler.component.DistributedQueryElevationComponentTest-1342108303565/shard2/data/index' doesn't exist. Creating new index...
[junit4:junit4]   2> 1040 T1544 oasc.SolrDeletionPolicy.onCommit SolrDeletionPolicy.onCommit: commits:num=1
[junit4:junit4]   2> 		commit{dir=MockDirWrapper(org.apache.lucene.store.RAMDirectory@22f2b1d4 lockFactory=org.apache.lucene.store.SingleInstanceLockFactory@4e9444a7),segFN=segments_1,generation=1,filenames=[segments_1]
[junit4:junit4]   2> 1040 T1544 oasc.SolrDeletionPolicy.updateCommits newest commit = 1
[junit4:junit4]   2> 1041 T1544 oasc.RequestHandlers.initHandlersFromConfig created /update: solr.UpdateRequestHandler
[junit4:junit4]   2> 1041 T1544 oasc.RequestHandlers.initHandlersFromConfig created /elevate: org.apache.solr.handler.component.SearchHandler
[junit4:junit4]   2> 1041 T1544 oasc.RequestHandlers.initHandlersFromConfig created /dataElevate: org.apache.solr.handler.component.SearchHandler
[junit4:junit4]   2> 1041 T1544 oashl.XMLLoader.init xsltCacheLifetimeSeconds=60
[junit4:junit4]   2> 1042 T1544 oasc.RequestHandlers.initHandlersFromConfig WARNING no default request handler is registered (either '/select' or 'standard')
[junit4:junit4]   2> 1042 T1544 oasc.SolrCore.initDeprecatedSupport WARNING solrconfig.xml uses deprecated <admin/gettableFiles>, Please update your config to use the ShowFileRequestHandler.
[junit4:junit4]   2> 1043 T1544 oasc.SolrCore.initDeprecatedSupport WARNING adding ShowFileRequestHandler with hidden files: [SCHEMA-LMJELINEKMERCER.XML, MAPPING-ISOLATIN1ACCENT.TXT, SOLRCONFIG-MASTER3.XML, SOLRCONFIG-SIMPLELOCK.XML, SOLRCONFIG-ELEVATE.XML, BAD-SCHEMA-OMIT-TF-BUT-NOT-POS.XML, BAD-SCHEMA-SIM-GLOBAL-VS-FT-MISMATCH.XML, BAD-SCHEMA-NOT-INDEXED-BUT-NORMS.XML, FRENCHARTICLES.TXT, DA_COMPOUNDDICTIONARY.TXT, SOLRCONFIG-HIGHLIGHT.XML, SCHEMA11.XML, BAD-SCHEMA-NOT-INDEXED-BUT-POS.XML, BAD-SCHEMA-DUP-FIELDTYPE.XML, STOPWORDSWRONGENCODING.TXT, SOLRCONFIG_CODEC.XML, BAD-SCHEMA-DUP-FIELD.XML, STOPTYPES-2.TXT, BAD-SCHEMA-NONTEXT-ANALYZER.XML, SCHEMA-TFIDF.XML, SOLRCONFIG-MERGEPOLICY.XML, PROTWORDS.TXT, SYNONYMS.TXT, SCHEMA-COLLATEFILTER.XML, SOLRCONFIG-MASTER1-KEEPONEBACKUP.XML, SOLRCONFIG-SOLR-749.XML, SOLRCONFIG-ALTDIRECTORY.XML, SOLRCONFIG-TRANSFORMERS.XML, SCHEMA-STOP-KEEP.XML, SOLRCONFIG-MASTER.XML, SOLRCONFIG-SPELLCHECKER.XML, CURRENCY.XML, BAD-MP-SOLRCONFIG.XML, SOLRCONFIG-TERMINDEX.XML, SOLRCONFIG-BASIC.XML, SCHEMA-SIM.XML, SCHEMA-SPELLCHECKER.XML, SOLRCONFIG-FUNCTIONQUERY.XML, HUNSPELL-TEST.DIC, SCHEMA-PHRASESUGGEST.XML, SOLRCONFIG-TLOG.XML, SCHEMASURROUND.XML, SCHEMA-TRIE.XML, SOLRCONFIG_PERF.XML, DA_UTF8.XML, SCHEMA15.XML, STOP-SNOWBALL.TXT, WDFTYPES.TXT, SOLRCONFIG-SLAVE.XML, SCHEMA-BINARYFIELD.XML, STOPWITHBOM.TXT, SOLRCONFIG-BASIC-LUCENEVERSION31.XML, SOLRCONFIG-QUERYSENDER.XML, SCHEMA-BM25.XML, SCHEMA-LUCENEMATCHVERSION.XML, SOLRCONFIG-ENABLEPLUGIN.XML, COMPOUNDDICTIONARY.TXT, SOLRCONFIG-SLAVE1.XML, SOLRCONFIG-XINCLUDE.XML, HYPHENATION.DTD, KEEP-1.TXT, ELEVATE.XML, STOP-2.TXT, SOLRCONFIG-SPELLCHECKCOMPONENT.XML, SOLRCONFIG-REQHANDLER.INCL, SOLRCONFIG-PROPINJECT-INDEXDEFAULT.XML, SCHEMA-FOLDING.XML, SCHEMA-DFR.XML, SOLRCONFIG-DELPOLICY2.XML, SOLRCONFIG-PHRASESUGGEST.XML, BAD-SCHEMA-DUP-DYNAMICFIELD.XML, SCHEMA-REPLICATION1.XML, SOLRCONFIG-DELPOLICY1.XML, OPEN-EXCHANGE-RATES.JSON, SCHEMA-REQUIRED-FIELDS.XML, SOLRCONFIG-MASTER2.XML, SOLRCONFIG-MASTER1.XML, SOLRCONFIG-LAZYWRITER.XML, STOPWORDS.TXT, SCHEMA12.XML, SOLRCONFIG-PROPINJECT.XML, SCHEMA-NUMERIC.XML, PHRASESUGGEST.TXT, BAD-SCHEMA-CODEC-GLOBAL-VS-FT-MISMATCH.XML, SOLRCONFIG-QUERYSENDER-NOQUERY.XML, BAD_SOLRCONFIG.XML, STOPTYPES-1.TXT, SOLRCONFIG-UPDATE-PROCESSOR-CHAINS.XML, SCHEMA-COLLATE.XML, SCHEMA-LMDIRICHLET.XML, SCHEMA-CHARFILTERS.XML, KEEP-2.TXT, XSLT, BAD-SCHEMA-EXTERNAL-FILEFIELD.XML, HUNSPELL-TEST.AFF, SCHEMA-MINIMAL.XML, SCHEMA-REPLICATION2.XML, SOLRCONFIG-NATIVELOCK.XML, SCHEMA.XML, BAD-SCHEMA-UNIQUEKEY-IS-COPYFIELD-DEST.XML, OLD_SYNONYMS.TXT, STOP-1.TXT, SCHEMA-REVERSED.XML, SCHEMA-COPYFIELD-TEST.XML, SCHEMA-NOT-REQUIRED-UNIQUE-KEY.XML, SOLRCONFIG-REPEATER.XML, SOLRCONFIG-SOLCOREPROPERTIES.XML, STEMDICT.TXT, SCHEMA-IB.XML, BAD-SCHEMA-NOT-INDEXED-BUT-TF.XML, SOLRCONFIG-CACHING.XML, BAD-SCHEMA-UNIQUEKEY-USES-DEFAULT.XML, SOLRCONFIG-NOCACHE.XML, SCHEMA_CODEC.XML]
[junit4:junit4]   2> 1045 T1544 oass.SolrIndexSearcher.<init> Opening Searcher@50fabf9b main
[junit4:junit4]   2> 1046 T1544 oass.SolrIndexSearcher.getIndexDir WARNING WARNING: Directory impl does not support setting indexDir: org.apache.lucene.store.MockDirectoryWrapper
[junit4:junit4]   2> 1046 T1544 oasu.CommitTracker.<init> Hard AutoCommit: disabled
[junit4:junit4]   2> 1046 T1544 oasu.CommitTracker.<init> Soft AutoCommit: disabled
[junit4:junit4]   2> 1047 T1544 oashc.QueryElevationComponent.inform Loading QueryElevation from: /mnt/ssd/jenkins/workspace/Lucene-Solr-4.x-Linux-Java8-64/checkout/solr/build/solr-core/test-files/solr/collection1/conf/elevate.xml
[junit4:junit4]   2> 1054 T1544 oashc.QueryElevationComponent.inform Loading QueryElevation from: /mnt/ssd/jenkins/workspace/Lucene-Solr-4.x-Linux-Java8-64/checkout/solr/build/solr-core/test-files/solr/collection1/conf/elevate.xml
[junit4:junit4]   2> 1066 T1584 oasc.SolrCore.registerSearcher [collection1] Registered new searcher Searcher@50fabf9b main{StandardDirectoryReader(segments_1:1)}
[junit4:junit4]   2> 1066 T1544 oasc.CoreContainer.register registering core: collection1
[junit4:junit4]   2> 1067 T1544 oass.SolrDispatchFilter.init user.dir=/mnt/ssd/jenkins/workspace/Lucene-Solr-4.x-Linux-Java8-64/checkout/solr/build/solr-core/test/J1
[junit4:junit4]   2> 1067 T1544 oass.SolrDispatchFilter.init SolrDispatchFilter.init() done
[junit4:junit4]   2> 1067 T1544 oascsi.HttpClientUtil.createClient Creating new http client, config:maxConnections=128&maxConnectionsPerHost=32&followRedirects=false
[junit4:junit4]   2> ASYNC  NEW_CORE C100 name=collection1 org.apache.solr.core.SolrCore@1429ad3e
[junit4:junit4]   2> 1110 T1548 C100 oasu.DirectUpdateHandler2.deleteAll [collection1] REMOVING ALL DOCUMENTS FROM INDEX
[junit4:junit4]   2> 1111 T1548 C100 oasc.SolrDeletionPolicy.onInit SolrDeletionPolicy.onInit: commits:num=1
[junit4:junit4]   2> 		commit{dir=MockDirWrapper(org.apache.lucene.store.RAMDirectory@3c2ccbc9 lockFactory=org.apache.lucene.store.SingleInstanceLockFactory@3e47b24c),segFN=segments_1,generation=1,filenames=[segments_1]
[junit4:junit4]   2> 1112 T1548 C100 oasc.SolrDeletionPolicy.updateCommits newest commit = 1
[junit4:junit4]   2> 1112 T1548 C100 UPDATE [collection1] webapp=/solr path=/update params={wt=javabin&version=2} {deleteByQuery=*:*} 0 7
[junit4:junit4]   2> ASYNC  NEW_CORE C101 name=collection1 org.apache.solr.core.SolrCore@6c30298a
[junit4:junit4]   2> 1115 T1557 C101 oasu.DirectUpdateHandler2.deleteAll [collection1] REMOVING ALL DOCUMENTS FROM INDEX
[junit4:junit4]   2> 1116 T1557 C101 oasc.SolrDeletionPolicy.onInit SolrDeletionPolicy.onInit: commits:num=1
[junit4:junit4]   2> 		commit{dir=MockDirWrapper(org.apache.lucene.store.RAMDirectory@4df75a83 lockFactory=org.apache.lucene.store.SingleInstanceLockFactory@54214c15),segFN=segments_1,generation=1,filenames=[segments_1]
[junit4:junit4]   2> 1117 T1557 C101 oasc.SolrDeletionPolicy.updateCommits newest commit = 1
[junit4:junit4]   2> 1117 T1557 C101 UPDATE [collection1] webapp=/solr path=/update params={wt=javabin&version=2} {deleteByQuery=*:*} 0 2
[junit4:junit4]   2> ASYNC  NEW_CORE C102 name=collection1 org.apache.solr.core.SolrCore@25987211
[junit4:junit4]   2> 1122 T1567 C102 oasu.DirectUpdateHandler2.deleteAll [collection1] REMOVING ALL DOCUMENTS FROM INDEX
[junit4:junit4]   2> 1123 T1567 C102 oasc.SolrDeletionPolicy.onInit SolrDeletionPolicy.onInit: commits:num=1
[junit4:junit4]   2> 		commit{dir=MockDirWrapper(NRTCachingDirectory(org.apache.lucene.store.RAMDirectory@3b68cd5f lockFactory=org.apache.lucene.store.SingleInstanceLockFactory@7e3caa7c; maxCacheMB=0.9599609375 maxMergeSizeMB=0.0244140625)),segFN=segments_1,generation=1,filenames=[segments_1]
[junit4:junit4]   2> 1123 T1567 C102 oasc.SolrDeletionPolicy.updateCommits newest commit = 1
[junit4:junit4]   2> 1123 T1567 C102 UPDATE [collection1] webapp=/solr path=/update params={wt=javabin&version=2} {deleteByQuery=*:*} 0 2
[junit4:junit4]   2> ASYNC  NEW_CORE C103 name=collection1 org.apache.solr.core.SolrCore@30a6fc20
[junit4:junit4]   2> 1128 T1577 C103 oasu.DirectUpdateHandler2.deleteAll [collection1] REMOVING ALL DOCUMENTS FROM INDEX
[junit4:junit4]   2> 1129 T1577 C103 oasc.SolrDeletionPolicy.onInit SolrDeletionPolicy.onInit: commits:num=1
[junit4:junit4]   2> 		commit{dir=MockDirWrapper(org.apache.lucene.store.RAMDirectory@22f2b1d4 lockFactory=org.apache.lucene.store.SingleInstanceLockFactory@4e9444a7),segFN=segments_1,generation=1,filenames=[segments_1]
[junit4:junit4]   2> 1129 T1577 C103 oasc.SolrDeletionPolicy.updateCommits newest commit = 1
[junit4:junit4]   2> 1129 T1577 C103 UPDATE [collection1] webapp=/solr path=/update params={wt=javabin&version=2} {deleteByQuery=*:*} 0 2
[junit4:junit4]   2> 1132 T1548 C100 UPDATE [collection1] webapp=/solr path=/update params={wt=javabin&version=2} {add=[1]} 0 1
[junit4:junit4]   2> 1134 T1557 C101 UPDATE [collection1] webapp=/solr path=/update params={wt=javabin&version=2} {add=[1]} 0 1
[junit4:junit4]   2> 1136 T1548 C100 UPDATE [collection1] webapp=/solr path=/update params={wt=javabin&version=2} {add=[2]} 0 1
[junit4:junit4]   2> 1138 T1567 C102 UPDATE [collection1] webapp=/solr path=/update params={wt=javabin&version=2} {add=[2]} 0 1
[junit4:junit4]   2> 1140 T1548 C100 UPDATE [collection1] webapp=/solr path=/update params={wt=javabin&version=2} {add=[3]} 0 0
[junit4:junit4]   2> 1142 T1577 C103 UPDATE [collection1] webapp=/solr path=/update params={wt=javabin&version=2} {add=[3]} 0 1
[junit4:junit4]   2> 1144 T1548 C100 UPDATE [collection1] webapp=/solr path=/update params={wt=javabin&version=2} {add=[4]} 0 0
[junit4:junit4]   2> 1146 T1557 C101 UPDATE [collection1] webapp=/solr path=/update params={wt=javabin&version=2} {add=[4]} 0 0
[junit4:junit4]   2> 1148 T1548 C100 UPDATE [collection1] webapp=/solr path=/update params={wt=javabin&version=2} {add=[5]} 0 0
[junit4:junit4]   2> 1150 T1567 C102 UPDATE [collection1] webapp=/solr path=/update params={wt=javabin&version=2} {add=[5]} 0 0
[junit4:junit4]   2> 1152 T1548 C100 UPDATE [collection1] webapp=/solr path=/update params={wt=javabin&version=2} {add=[6]} 0 0
[junit4:junit4]   2> 1154 T1577 C103 UPDATE [collection1] webapp=/solr path=/update params={wt=javabin&version=2} {add=[6]} 0 0
[junit4:junit4]   2> 1156 T1548 C100 UPDATE [collection1] webapp=/solr path=/update params={wt=javabin&version=2} {add=[7]} 0 0
[junit4:junit4]   2> 1159 T1577 C103 UPDATE [collection1] webapp=/solr path=/update params={wt=javabin&version=2} {add=[7]} 0 1
[junit4:junit4]   2> 1161 T1548 C100 oasu.DirectUpdateHandler2.commit start commit{flags=0,version=0,optimize=false,openSearcher=true,waitSearcher=true,expungeDeletes=false,softCommit=false}
[junit4:junit4]   2> 1162 T1548 C100 oasc.SolrDeletionPolicy.onCommit SolrDeletionPolicy.onCommit: commits:num=2
[junit4:junit4]   2> 		commit{dir=MockDirWrapper(org.apache.lucene.store.RAMDirectory@3c2ccbc9 lockFactory=org.apache.lucene.store.SingleInstanceLockFactory@3e47b24c),segFN=segments_1,generation=1,filenames=[segments_1]
[junit4:junit4]   2> 		commit{dir=MockDirWrapper(org.apache.lucene.store.RAMDirectory@3c2ccbc9 lockFactory=org.apache.lucene.store.SingleInstanceLockFactory@3e47b24c),segFN=segments_2,generation=2,filenames=[_0.fdt, _0.tii, _0.fnm, _0.tis, _0.nrm, _0.frq, _0.si, _0.fdx, segments_2, _0.prx]
[junit4:junit4]   2> 1162 T1548 C100 oasc.SolrDeletionPolicy.updateCommits newest commit = 2
[junit4:junit4]   2> 1163 T1548 C100 oass.SolrIndexSearcher.<init> Opening Searcher@3356d511 main
[junit4:junit4]   2> 1163 T1548 C100 oass.SolrIndexSearcher.getIndexDir WARNING WARNING: Directory impl does not support setting indexDir: org.apache.lucene.store.MockDirectoryWrapper
[junit4:junit4]   2> 1163 T1548 C100 oasu.DirectUpdateHandler2.commit end_commit_flush
[junit4:junit4]   2> 1164 T1554 oasc.SolrCore.registerSearcher [collection1] Registered new searcher Searcher@3356d511 main{StandardDirectoryReader(segments_2:4 _0(4.0):C7)}
[junit4:junit4]   2> 1164 T1548 C100 UPDATE [collection1] webapp=/solr path=/update params={waitSearcher=true&version=2&commit=true&softCommit=false&wt=javabin} {commit=} 0 4
[junit4:junit4]   2> 1166 T1557 C101 oasu.DirectUpdateHandler2.commit start commit{flags=0,version=0,optimize=false,openSearcher=true,waitSearcher=true,expungeDeletes=false,softCommit=false}
[junit4:junit4]   2> 1167 T1557 C101 oasc.SolrDeletionPolicy.onCommit SolrDeletionPolicy.onCommit: commits:num=2
[junit4:junit4]   2> 		commit{dir=MockDirWrapper(org.apache.lucene.store.RAMDirectory@4df75a83 lockFactory=org.apache.lucene.store.SingleInstanceLockFactory@54214c15),segFN=segments_1,generation=1,filenames=[segments_1]
[junit4:junit4]   2> 		commit{dir=MockDirWrapper(org.apache.lucene.store.RAMDirectory@4df75a83 lockFactory=org.apache.lucene.store.SingleInstanceLockFactory@54214c15),segFN=segments_2,generation=2,filenames=[_0.fdt, _0.tii, _0.fnm, _0.tis, _0.nrm, _0.frq, _0.si, _0.fdx, segments_2, _0.prx]
[junit4:junit4]   2> 1167 T1557 C101 oasc.SolrDeletionPolicy.updateCommits newest commit = 2
[junit4:junit4]   2> 1168 T1557 C101 oass.SolrIndexSearcher.<init> Opening Searcher@71f5e897 main
[junit4:junit4]   2> 1168 T1557 C101 oass.SolrIndexSearcher.getIndexDir WARNING WARNING: Directory impl does not support setting indexDir: org.apache.lucene.store.MockDirectoryWrapper
[junit4:junit4]   2> 1168 T1557 C101 oasu.DirectUpdateHandler2.commit end_commit_flush
[junit4:junit4]   2> 1168 T1564 oasc.SolrCore.registerSearcher [collection1] Registered new searcher Searcher@71f5e897 main{StandardDirectoryReader(segments_2:4 _0(4.0):C2)}
[junit4:junit4]   2> 1169 T1557 C101 UPDATE [collection1] webapp=/solr path=/update params={waitSearcher=true&version=2&commit=true&softCommit=false&wt=javabin} {commit=} 0 4
[junit4:junit4]   2> 1171 T1567 C102 oasu.DirectUpdateHandler2.commit start commit{flags=0,version=0,optimize=false,openSearcher=true,waitSearcher=true,expungeDeletes=false,softCommit=false}
[junit4:junit4]   2> 1172 T1567 C102 oasc.SolrDeletionPolicy.onCommit SolrDeletionPolicy.onCommit: commits:num=2
[junit4:junit4]   2> 		commit{dir=MockDirWrapper(NRTCachingDirectory(org.apache.lucene.store.RAMDirectory@3b68cd5f lockFactory=org.apache.lucene.store.SingleInstanceLockFactory@7e3caa7c; maxCacheMB=0.9599609375 maxMergeSizeMB=0.0244140625)),segFN=segments_1,generation=1,filenames=[segments_1]
[junit4:junit4]   2> 		commit{dir=MockDirWrapper(NRTCachingDirectory(org.apache.lucene.store.RAMDirectory@3b68cd5f lockFactory=org.apache.lucene.store.SingleInstanceLockFactory@7e3caa7c; maxCacheMB=0.9599609375 maxMergeSizeMB=0.0244140625)),segFN=segments_2,generation=2,filenames=[_0.fdt, _0.tii, _0.fnm, _0.tis, _0.nrm, _0.frq, _0.si, _0.fdx, segments_2, _0.prx]
[junit4:junit4]   2> 1172 T1567 C102 oasc.SolrDeletionPolicy.updateCommits newest commit = 2
[junit4:junit4]   2> 1173 T1567 C102 oass.SolrIndexSearcher.<init> Opening Searcher@5ffe1dde main
[junit4:junit4]   2> 1173 T1567 C102 oass.SolrIndexSearcher.getIndexDir WARNING WARNING: Directory impl does not support setting indexDir: org.apache.lucene.store.MockDirectoryWrapper
[junit4:junit4]   2> 1173 T1567 C102 oasu.DirectUpdateHandler2.commit end_commit_flush
[junit4:junit4]   2> 1174 T1574 oasc.SolrCore.registerSearcher [collection1] Registered new searcher Searcher@5ffe1dde main{StandardDirectoryReader(segments_2:4 _0(4.0):C2)}
[junit4:junit4]   2> 1174 T1567 C102 UPDATE [collection1] webapp=/solr path=/update params={waitSearcher=true&version=2&commit=true&softCommit=false&wt=javabin} {commit=} 0 4
[junit4:junit4]   2> 1175 T1577 C103 oasu.DirectUpdateHandler2.commit start commit{flags=0,version=0,optimize=false,openSearcher=true,waitSearcher=true,expungeDeletes=false,softCommit=false}
[junit4:junit4]   2> 1176 T1577 C103 oasc.SolrDeletionPolicy.onCommit SolrDeletionPolicy.onCommit: commits:num=2
[junit4:junit4]   2> 		commit{dir=MockDirWrapper(org.apache.lucene.store.RAMDirectory@22f2b1d4 lockFactory=org.apache.lucene.store.SingleInstanceLockFactory@4e9444a7),segFN=segments_1,generation=1,filenames=[segments_1]
[junit4:junit4]   2> 		commit{dir=MockDirWrapper(org.apache.lucene.store.RAMDirectory@22f2b1d4 lockFactory=org.apache.lucene.store.SingleInstanceLockFactory@4e9444a7),segFN=segments_2,generation=2,filenames=[_0.fdt, _0.tii, _0.fnm, _0.tis, _0.nrm, _0.frq, _0.si, _0.fdx, segments_2, _0.prx]
[junit4:junit4]   2> 1177 T1577 C103 oasc.SolrDeletionPolicy.updateCommits newest commit = 2
[junit4:junit4]   2> 1178 T1577 C103 oass.SolrIndexSearcher.<init> Opening Searcher@1642e63c main
[junit4:junit4]   2> 1178 T1577 C103 oass.SolrIndexSearcher.getIndexDir WARNING WARNING: Directory impl does not support setting indexDir: org.apache.lucene.store.MockDirectoryWrapper
[junit4:junit4]   2> 1178 T1577 C103 oasu.DirectUpdateHandler2.commit end_commit_flush
[junit4:junit4]   2> 1178 T1584 oasc.SolrCore.registerSearcher [collection1] Registered new searcher Searcher@1642e63c main{StandardDirectoryReader(segments_2:4 _0(4.0):C3)}
[junit4:junit4]   2> 1178 T1577 C103 UPDATE [collection1] webapp=/solr path=/update params={waitSearcher=true&version=2&commit=true&softCommit=false&wt=javabin} {commit=} 0 3
[junit4:junit4]   2> 1182 T1548 C100 REQ [collection1] webapp=/solr path=/elevate params={wt=javabin&fl=id,+score,+[elevated]&shards.qt=/elevate&sort=id+desc&qt=/elevate&distrib=false&q=*:*&version=2&rows=500} hits=7 status=0 QTime=2 
[junit4:junit4]   2> 1195 T1558 C101 REQ [collection1] webapp=/solr path=/elevate params={wt=javabin&fl=id,score&sort=id+desc&shard.url=[::1]:33332/solr|localhost:51824/solr&distrib=false&qt=/elevate&q=*:*&version=2&NOW=1342108304749&isShard=true&shards.qt=/elevate&fsv=true&start=0&rows=500} hits=2 status=0 QTime=1 
[junit4:junit4]   2> 1196 T1578 C103 REQ [collection1] webapp=/solr path=/elevate params={wt=javabin&fl=id,score&sort=id+desc&shard.url=localhost:44371/solr&distrib=false&qt=/elevate&q=*:*&version=2&NOW=1342108304749&isShard=true&shards.qt=/elevate&fsv=true&start=0&rows=500} hits=3 status=0 QTime=0 
[junit4:junit4]   2> 1197 T1568 C102 REQ [collection1] webapp=/solr path=/elevate params={wt=javabin&fl=id,score&sort=id+desc&shard.url=localhost:33211/solr&distrib=false&qt=/elevate&q=*:*&version=2&NOW=1342108304749&isShard=true&shards.qt=/elevate&fsv=true&start=0&rows=500} hits=2 status=0 QTime=1 
[junit4:junit4]   2> 1205 T1568 C102 REQ [collection1] webapp=/solr path=/elevate params={wt=javabin&fl=id,+score,+[elevated]&shard.url=localhost:33211/solr&qt=/elevate&ids=2.0,5.0&distrib=false&q=*:*&version=2&NOW=1342108304749&shards.qt=/elevate&isShard=true&rows=500} status=0 QTime=6 
[junit4:junit4]   2> 1206 T1578 C103 REQ [collection1] webapp=/solr path=/elevate params={wt=javabin&fl=id,+score,+[elevated]&shard.url=localhost:44371/solr&qt=/elevate&ids=6.0,3.0,7.0&distrib=false&q=*:*&version=2&NOW=1342108304749&shards.qt=/elevate&isShard=true&rows=500} status=0 QTime=3 
[junit4:junit4]   2> 1209 T1558 C101 REQ [collection1] webapp=/solr path=/elevate params={wt=javabin&fl=id,+score,+[elevated]&shard.url=[::1]:33332/solr|localhost:51824/solr&qt=/elevate&ids=4.0,1.0&distrib=false&q=*:*&version=2&NOW=1342108304749&shards.qt=/elevate&isShard=true&rows=500} status=0 QTime=1 
[junit4:junit4]   2> 1210 T1567 C102 REQ [collection1] webapp=/solr path=/elevate params={wt=javabin&fl=id,+score,+[elevated]&shards.qt=/elevate&sort=id+desc&qt=/elevate&q=*:*&version=2&rows=500&shards=[::1]:33332/solr|localhost:51824/solr,localhost:33211/solr,localhost:44371/solr} status=0 QTime=24 
[junit4:junit4]   2> 1211 T1544 oas.BaseDistributedSearchTestCase.compareResponses SEVERE Mismatched responses:
[junit4:junit4]   2> 	{responseHeader={status=0,QTime=24,params={wt=javabin,fl=id, score, [elevated],shards.qt=/elevate,sort=id desc,qt=/elevate,q=*:*,version=2,rows=500,shards=[::1]:33332/solr|localhost:51824/solr,localhost:33211/solr,localhost:44371/solr}},response={numFound=7,start=0,maxScore=1.0,docs=[SolrDocument{id=7.0, [elevated]=false, score=1.0}, SolrDocument{id=6.0, [elevated]=false, score=1.0}, SolrDocument{id=5.0, [elevated]=false, score=1.0}, SolrDocument{id=4.0, [elevated]=false, score=1.0}, SolrDocument{id=3.0, [elevated]=false, score=1.0}, SolrDocument{id=2.0, [elevated]=false, score=1.0}, SolrDocument{id=1.0, [elevated]=false, score=1.0}]}}
[junit4:junit4]   2> 	{responseHeader={status=0,QTime=2,params={wt=javabin,fl=id, score, [elevated],shards.qt=/elevate,sort=id desc,qt=/elevate,distrib=false,q=*:*,version=2,rows=500}},response={numFound=7,start=0,maxScore=1.0,docs=[SolrDocument{id=7.0, score=1.0, [elevated]=false}, SolrDocument{id=6.0, score=1.0, [elevated]=false}, SolrDocument{id=5.0, score=1.0, [elevated]=false}, SolrDocument{id=4.0, score=1.0, [elevated]=false}, SolrDocument{id=3.0, score=1.0, [elevated]=false}, SolrDocument{id=2.0, score=1.0, [elevated]=false}, SolrDocument{id=1.0, score=1.0, [elevated]=false}]}}
[junit4:junit4]   2> 1212 T1544 oasc.CoreContainer.shutdown Shutting down CoreContainer instance=1045014376
[junit4:junit4]   2> 1212 T1544 oasc.SolrCore.close [collection1]  CLOSING SolrCore org.apache.solr.core.SolrCore@1429ad3e
[junit4:junit4]   2> 1213 T1544 oasc.SolrCore.closeSearcher [collection1] Closing main searcher on request.
[junit4:junit4]   2> 1213 T1544 oasu.DirectUpdateHandler2.close closing DirectUpdateHandler2{commits=1,autocommits=0,soft autocommits=0,optimizes=0,rollbacks=0,expungeDeletes=0,docsPending=0,adds=0,deletesById=0,deletesByQuery=0,errors=0,cumulative_adds=7,cumulative_deletesById=0,cumulative_deletesByQuery=1,cumulative_errors=0}
[junit4:junit4]   2> 1218 T1544 oejsh.ContextHandler.doStop stopped o.e.j.s.ServletContextHandler{/solr,null}
[junit4:junit4]   2> 1272 T1544 oasc.CoreContainer.shutdown Shutting down CoreContainer instance=660509730
[junit4:junit4]   2> 1273 T1544 oasc.SolrCore.close [collection1]  CLOSING SolrCore org.apache.solr.core.SolrCore@6c30298a
[junit4:junit4]   2> 1273 T1544 oasc.SolrCore.closeSearcher [collection1] Closing main searcher on request.
[junit4:junit4]   2> 1274 T1544 oasu.DirectUpdateHandler2.close closing DirectUpdateHandler2{commits=1,autocommits=0,soft autocommits=0,optimizes=0,rollbacks=0,expungeDeletes=0,docsPending=0,adds=0,deletesById=0,deletesByQuery=0,errors=0,cumulative_adds=2,cumulative_deletesById=0,cumulative_deletesByQuery=1,cumulative_errors=0}
[junit4:junit4]   2> 1277 T1544 oejsh.ContextHandler.doStop stopped o.e.j.s.ServletContextHandler{/solr,null}
[junit4:junit4]   2> 1329 T1544 oasc.CoreContainer.shutdown Shutting down CoreContainer instance=248389777
[junit4:junit4]   2> 1330 T1544 oasc.SolrCore.close [collection1]  CLOSING SolrCore org.apache.solr.core.SolrCore@25987211
[junit4:junit4]   2> 1331 T1544 oasc.SolrCore.closeSearcher [collection1] Closing main searcher on request.
[junit4:junit4]   2> 1331 T1544 oasu.DirectUpdateHandler2.close closing DirectUpdateHandler2{commits=1,autocommits=0,soft autocommits=0,optimizes=0,rollbacks=0,expungeDeletes=0,docsPending=0,adds=0,deletesById=0,deletesByQuery=0,errors=0,cumulative_adds=2,cumulative_deletesById=0,cumulative_deletesByQuery=1,cumulative_errors=0}
[junit4:junit4]   2> 1337 T1544 oejsh.ContextHandler.doStop stopped o.e.j.s.ServletContextHandler{/solr,null}
[junit4:junit4]   2> 1352 T1031 oaz.ClientCnxn$SendThread.startConnect Opening socket connection to server localhost.localdomain/127.0.0.1:46909
[junit4:junit4]   2> 1353 T1031 oaz.ClientCnxn$SendThread.run WARNING Session 0x1387be0e1f40010 for server null, unexpected error, closing socket connection and attempting reconnect java.net.ConnectException: Connection refused
[junit4:junit4]   2> 	at sun.nio.ch.SocketChannelImpl.checkConnect(Native Method)
[junit4:junit4]   2> 	at sun.nio.ch.SocketChannelImpl.finishConnect(SocketChannelImpl.java:692)
[junit4:junit4]   2> 	at org.apache.zookeeper.ClientCnxn$SendThread.run(ClientCnxn.java:1146)
[junit4:junit4]   2> 
[junit4:junit4]   2> 1389 T1544 oasc.CoreContainer.shutdown Shutting down CoreContainer instance=2036522275
[junit4:junit4]   2> 1389 T1544 oasc.SolrCore.close [collection1]  CLOSING SolrCore org.apache.solr.core.SolrCore@30a6fc20
[junit4:junit4]   2> 1390 T1544 oasc.SolrCore.closeSearcher [collection1] Closing main searcher on request.
[junit4:junit4]   2> 1390 T1544 oasu.DirectUpdateHandler2.close closing DirectUpdateHandler2{commits=1,autocommits=0,soft autocommits=0,optimizes=0,rollbacks=0,expungeDeletes=0,docsPending=0,adds=0,deletesById=0,deletesByQuery=0,errors=0,cumulative_adds=3,cumulative_deletesById=0,cumulative_deletesByQuery=1,cumulative_errors=0}
[junit4:junit4]   2> 1393 T1544 oejsh.ContextHandler.doStop stopped o.e.j.s.ServletContextHandler{/solr,null}
[junit4:junit4]   2> 1452 T1544 oas.SolrTestCaseJ4.tearDown ###Ending testDistribSearch
[junit4:junit4]   2> NOTE: reproduce with: ant test  -Dtestcase=DistributedQueryElevationComponentTest -Dtests.method=testDistribSearch -Dtests.seed=4A534EA0AA6C1E7E -Dtests.multiplier=3 -Dtests.slow=true -Dtests.locale=be_BY -Dtests.timezone=Atlantic/Madeira -Dtests.file.encoding=UTF-8
[junit4:junit4]   2>
[junit4:junit4]    > (@AfterClass output)
[junit4:junit4]   2> 1512 T1544 oas.SolrTestCaseJ4.deleteCore ###deleteCore
[junit4:junit4]   2> NOTE: test params are: codec=Lucene3x, sim=DefaultSimilarity, locale=be_BY, timezone=Atlantic/Madeira
[junit4:junit4]   2> NOTE: Linux 3.2.0-26-generic amd64/Oracle Corporation 1.8.0-ea (64-bit)/cpus=8,threads=1,free=129547976,total=297402368
[junit4:junit4]   2> NOTE: All tests run in this JVM: [TestWikipediaTokenizerFactory, TestJapaneseTokenizerFactory, SpellingQueryConverterTest, RAMDirectoryFactoryTest, TestReplicationHandler, TestKeepFilterFactory, TestHungarianLightStemFilterFactory, SpellCheckCollatorTest, TestPatternReplaceFilterFactory, TestEnglishMinimalStemFilterFactory, TestLMJelinekMercerSimilarityFactory, TestLuceneMatchVersion, UUIDFieldTest, CloudStateTest, ResourceLoaderTest, TestShingleFilterFactory, TestElisionFilterFactory, TestNGramFilters, DirectSolrConnectionTest, QueryEqualityTest, TestJapaneseIterationMarkCharFilterFactory, IndexReaderFactoryTest, TestLRUCache, UpdateParamsTest, DistanceFunctionTest, AlternateDirectoryTest, TestHunspellStemFilterFactory, QueryParsingTest, SpellCheckComponentTest, PeerSyncTest, TestQueryTypes, TestQuerySenderNoQuery, TestPropInjectDefaults, LengthFilterTest, TestKeywordMarkerFilterFactory, DistributedTermsComponentTest, TestRemoteStreaming, FileBasedSpellCheckerTest, TestStopFilterFactory, TestNorwegianMinimalStemFilterFactory, TestJapaneseReadingFormFilterFactory, TestCollationKeyFilterFactory, TestSolrJ, PolyFieldTest, UniqFieldsUpdateProcessorFactoryTest, XsltUpdateRequestHandlerTest, TestWriterPerf, TestHindiFilters, TestBinaryResponseWriter, TestPersianNormalizationFilterFactory, SuggesterFSTTest, SolrCoreTest, NotRequiredUniqueKeyTest, TestJmxMonitoredMap, BadIndexSchemaTest, TestSolrXMLSerializer, TestXIncludeConfig, NoCacheHeaderTest, FieldAnalysisRequestHandlerTest, TestSort, TimeZoneUtilsTest, DocumentBuilderTest, TestNumberUtils, TestCzechStemFilterFactory, TestTrie, TestStressRecovery, TestCJKBigramFilterFactory, TestPortugueseLightStemFilterFactory, TestGermanNormalizationFilterFactory, FieldMutatingUpdateProcessorTest, BasicDistributedZkTest, FullSolrCloudTest, LeaderElectionTest, ZkControllerTest, CloudStateUpdateTest, TestDistributedSearch, BasicZkTest, TestFaceting, WordBreakSolrSpellCheckerTest, TestJoin, ConvertedLegacyTest, SortByFunctionTest, SignatureUpdateProcessorFactoryTest, SampleTest, HighlighterTest, TestIndexSearcher, CoreAdminHandlerTest, SolrRequestParserTest, TestCSVLoader, MBeansHandlerTest, DistributedQueryElevationComponentTest]
[junit4:junit4]   2> 
[junit4:junit4] Completed on J1 in 1.52s, 1 test, 1 failure <<< FAILURES!

[...truncated 334 lines...]
BUILD FAILED
/mnt/ssd/jenkins/workspace/Lucene-Solr-4.x-Linux-Java8-64/checkout/build.xml:29: The following error occurred while executing this line:
/mnt/ssd/jenkins/workspace/Lucene-Solr-4.x-Linux-Java8-64/checkout/solr/build.xml:144: The following error occurred while executing this line:
/mnt/ssd/jenkins/workspace/Lucene-Solr-4.x-Linux-Java8-64/checkout/lucene/module-build.xml:62: The following error occurred while executing this line:
/mnt/ssd/jenkins/workspace/Lucene-Solr-4.x-Linux-Java8-64/checkout/lucene/common-build.xml:1095: The following error occurred while executing this line:
/mnt/ssd/jenkins/workspace/Lucene-Solr-4.x-Linux-Java8-64/checkout/lucene/common-build.xml:792: There were test failures: 300 suites, 1066 tests, 1 error, 1 failure, 5 ignored

Total time: 21 minutes 24 seconds
Build step 'Execute shell' marked build as failure
Archiving artifacts
Recording test results
Email was triggered for: Failure
Sending email for trigger: Failure




Mime
View raw message