lucene-dev mailing list archives

Site index · List index
Message view « Date » · « Thread »
Top « Date » · « Thread »
From Policeman Jenkins Server <jenk...@sd-datasolutions.de>
Subject [JENKINS] Lucene-Solr-4.x-Linux-Java8-64 - Build # 20 - Failure!
Date Sat, 21 Jul 2012 15:55:50 GMT
Build: http://jenkins.sd-datasolutions.de/job/Lucene-Solr-4.x-Linux-Java8-64/20/

1 tests failed.
REGRESSION:  org.apache.solr.handler.component.DistributedQueryElevationComponentTest.testDistribSearch

Error Message:
.responseHeader.params.size()==9,9skipped=5,4

Stack Trace:
junit.framework.AssertionFailedError: .responseHeader.params.size()==9,9skipped=5,4
	at __randomizedtesting.SeedInfo.seed([83EB1ADAA015C622:20D94C2D74AA61E]:0)
	at junit.framework.Assert.fail(Assert.java:50)
	at org.apache.solr.BaseDistributedSearchTestCase.compareResponses(BaseDistributedSearchTestCase.java:670)
	at org.apache.solr.BaseDistributedSearchTestCase.query(BaseDistributedSearchTestCase.java:392)
	at org.apache.solr.handler.component.DistributedQueryElevationComponentTest.doTest(DistributedQueryElevationComponentTest.java:81)
	at org.apache.solr.BaseDistributedSearchTestCase.testDistribSearch(BaseDistributedSearchTestCase.java:679)
	at sun.reflect.NativeMethodAccessorImpl.invoke0(Native Method)
	at sun.reflect.NativeMethodAccessorImpl.invoke(NativeMethodAccessorImpl.java:57)
	at sun.reflect.DelegatingMethodAccessorImpl.invoke(DelegatingMethodAccessorImpl.java:43)
	at java.lang.reflect.Method.invoke(Method.java:474)
	at com.carrotsearch.randomizedtesting.RandomizedRunner.invoke(RandomizedRunner.java:1995)
	at com.carrotsearch.randomizedtesting.RandomizedRunner.access$1100(RandomizedRunner.java:132)
	at com.carrotsearch.randomizedtesting.RandomizedRunner$6.evaluate(RandomizedRunner.java:818)
	at com.carrotsearch.randomizedtesting.RandomizedRunner$7.evaluate(RandomizedRunner.java:877)
	at com.carrotsearch.randomizedtesting.RandomizedRunner$8.evaluate(RandomizedRunner.java:891)
	at com.carrotsearch.randomizedtesting.rules.SystemPropertiesRestoreRule$1.evaluate(SystemPropertiesRestoreRule.java:53)
	at org.apache.lucene.util.TestRuleSetupTeardownChained$1.evaluate(TestRuleSetupTeardownChained.java:50)
	at org.apache.lucene.util.TestRuleFieldCacheSanity$1.evaluate(TestRuleFieldCacheSanity.java:32)
	at org.apache.lucene.util.AbstractBeforeAfterRule$1.evaluate(AbstractBeforeAfterRule.java:45)
	at com.carrotsearch.randomizedtesting.rules.SystemPropertiesInvariantRule$1.evaluate(SystemPropertiesInvariantRule.java:55)
	at org.apache.lucene.util.TestRuleReportUncaughtExceptions$1.evaluate(TestRuleReportUncaughtExceptions.java:68)
	at org.apache.lucene.util.TestRuleThreadAndTestName$1.evaluate(TestRuleThreadAndTestName.java:48)
	at org.apache.lucene.util.TestRuleIgnoreAfterMaxFailures$1.evaluate(TestRuleIgnoreAfterMaxFailures.java:70)
	at org.apache.lucene.util.TestRuleMarkFailure$1.evaluate(TestRuleMarkFailure.java:48)
	at com.carrotsearch.randomizedtesting.RandomizedRunner.runSingleTest(RandomizedRunner.java:825)
	at com.carrotsearch.randomizedtesting.RandomizedRunner.access$700(RandomizedRunner.java:132)
	at com.carrotsearch.randomizedtesting.RandomizedRunner$3$1.run(RandomizedRunner.java:671)
	at com.carrotsearch.randomizedtesting.RandomizedRunner$3.evaluate(RandomizedRunner.java:697)
	at com.carrotsearch.randomizedtesting.RandomizedRunner$4.evaluate(RandomizedRunner.java:736)
	at com.carrotsearch.randomizedtesting.RandomizedRunner$5.evaluate(RandomizedRunner.java:747)
	at com.carrotsearch.randomizedtesting.rules.SystemPropertiesRestoreRule$1.evaluate(SystemPropertiesRestoreRule.java:53)
	at org.apache.lucene.util.AbstractBeforeAfterRule$1.evaluate(AbstractBeforeAfterRule.java:45)
	at org.apache.lucene.util.TestRuleReportUncaughtExceptions$1.evaluate(TestRuleReportUncaughtExceptions.java:68)
	at org.apache.lucene.util.TestRuleStoreClassName$1.evaluate(TestRuleStoreClassName.java:38)
	at org.apache.lucene.util.TestRuleIcuHack$1.evaluate(TestRuleIcuHack.java:51)
	at com.carrotsearch.randomizedtesting.rules.SystemPropertiesInvariantRule$1.evaluate(SystemPropertiesInvariantRule.java:55)
	at org.apache.lucene.util.TestRuleNoInstanceHooksOverrides$1.evaluate(TestRuleNoInstanceHooksOverrides.java:53)
	at org.apache.lucene.util.TestRuleNoStaticHooksShadowing$1.evaluate(TestRuleNoStaticHooksShadowing.java:52)
	at org.apache.lucene.util.TestRuleAssertionsRequired$1.evaluate(TestRuleAssertionsRequired.java:36)
	at org.apache.lucene.util.TestRuleMarkFailure$1.evaluate(TestRuleMarkFailure.java:48)
	at org.apache.lucene.util.TestRuleIgnoreAfterMaxFailures$1.evaluate(TestRuleIgnoreAfterMaxFailures.java:70)
	at org.apache.lucene.util.TestRuleIgnoreTestSuites$1.evaluate(TestRuleIgnoreTestSuites.java:55)
	at com.carrotsearch.randomizedtesting.RandomizedRunner.runSuite(RandomizedRunner.java:605)
	at com.carrotsearch.randomizedtesting.RandomizedRunner.access$400(RandomizedRunner.java:132)
	at com.carrotsearch.randomizedtesting.RandomizedRunner$2.run(RandomizedRunner.java:551)




Build Log:
[...truncated 7526 lines...]
[junit4:junit4] Suite: org.apache.solr.handler.component.DistributedQueryElevationComponentTest
[junit4:junit4] FAILURE 1.23s J1 | DistributedQueryElevationComponentTest.testDistribSearch
[junit4:junit4]    > Throwable #1: junit.framework.AssertionFailedError: .responseHeader.params.size()==9,9skipped=5,4
[junit4:junit4]    > 	at __randomizedtesting.SeedInfo.seed([83EB1ADAA015C622:20D94C2D74AA61E]:0)
[junit4:junit4]    > 	at junit.framework.Assert.fail(Assert.java:50)
[junit4:junit4]    > 	at org.apache.solr.BaseDistributedSearchTestCase.compareResponses(BaseDistributedSearchTestCase.java:670)
[junit4:junit4]    > 	at org.apache.solr.BaseDistributedSearchTestCase.query(BaseDistributedSearchTestCase.java:392)
[junit4:junit4]    > 	at org.apache.solr.handler.component.DistributedQueryElevationComponentTest.doTest(DistributedQueryElevationComponentTest.java:81)
[junit4:junit4]    > 	at org.apache.solr.BaseDistributedSearchTestCase.testDistribSearch(BaseDistributedSearchTestCase.java:679)
[junit4:junit4]    > 	at sun.reflect.NativeMethodAccessorImpl.invoke0(Native Method)
[junit4:junit4]    > 	at sun.reflect.NativeMethodAccessorImpl.invoke(NativeMethodAccessorImpl.java:57)
[junit4:junit4]    > 	at sun.reflect.DelegatingMethodAccessorImpl.invoke(DelegatingMethodAccessorImpl.java:43)
[junit4:junit4]    > 	at java.lang.reflect.Method.invoke(Method.java:474)
[junit4:junit4]    > 	at com.carrotsearch.randomizedtesting.RandomizedRunner.invoke(RandomizedRunner.java:1995)
[junit4:junit4]    > 	at com.carrotsearch.randomizedtesting.RandomizedRunner.access$1100(RandomizedRunner.java:132)
[junit4:junit4]    > 	at com.carrotsearch.randomizedtesting.RandomizedRunner$6.evaluate(RandomizedRunner.java:818)
[junit4:junit4]    > 	at com.carrotsearch.randomizedtesting.RandomizedRunner$7.evaluate(RandomizedRunner.java:877)
[junit4:junit4]    > 	at com.carrotsearch.randomizedtesting.RandomizedRunner$8.evaluate(RandomizedRunner.java:891)
[junit4:junit4]    > 	at com.carrotsearch.randomizedtesting.rules.SystemPropertiesRestoreRule$1.evaluate(SystemPropertiesRestoreRule.java:53)
[junit4:junit4]    > 	at org.apache.lucene.util.TestRuleSetupTeardownChained$1.evaluate(TestRuleSetupTeardownChained.java:50)
[junit4:junit4]    > 	at org.apache.lucene.util.TestRuleFieldCacheSanity$1.evaluate(TestRuleFieldCacheSanity.java:32)
[junit4:junit4]    > 	at org.apache.lucene.util.AbstractBeforeAfterRule$1.evaluate(AbstractBeforeAfterRule.java:45)
[junit4:junit4]    > 	at com.carrotsearch.randomizedtesting.rules.SystemPropertiesInvariantRule$1.evaluate(SystemPropertiesInvariantRule.java:55)
[junit4:junit4]    > 	at org.apache.lucene.util.TestRuleReportUncaughtExceptions$1.evaluate(TestRuleReportUncaughtExceptions.java:68)
[junit4:junit4]    > 	at org.apache.lucene.util.TestRuleThreadAndTestName$1.evaluate(TestRuleThreadAndTestName.java:48)
[junit4:junit4]    > 	at org.apache.lucene.util.TestRuleIgnoreAfterMaxFailures$1.evaluate(TestRuleIgnoreAfterMaxFailures.java:70)
[junit4:junit4]    > 	at org.apache.lucene.util.TestRuleMarkFailure$1.evaluate(TestRuleMarkFailure.java:48)
[junit4:junit4]    > 	at com.carrotsearch.randomizedtesting.RandomizedRunner.runSingleTest(RandomizedRunner.java:825)
[junit4:junit4]    > 	at com.carrotsearch.randomizedtesting.RandomizedRunner.access$700(RandomizedRunner.java:132)
[junit4:junit4]    > 	at com.carrotsearch.randomizedtesting.RandomizedRunner$3$1.run(RandomizedRunner.java:671)
[junit4:junit4]    > 	at com.carrotsearch.randomizedtesting.RandomizedRunner$3.evaluate(RandomizedRunner.java:697)
[junit4:junit4]    > 	at com.carrotsearch.randomizedtesting.RandomizedRunner$4.evaluate(RandomizedRunner.java:736)
[junit4:junit4]    > 	at com.carrotsearch.randomizedtesting.RandomizedRunner$5.evaluate(RandomizedRunner.java:747)
[junit4:junit4]    > 	at com.carrotsearch.randomizedtesting.rules.SystemPropertiesRestoreRule$1.evaluate(SystemPropertiesRestoreRule.java:53)
[junit4:junit4]    > 	at org.apache.lucene.util.AbstractBeforeAfterRule$1.evaluate(AbstractBeforeAfterRule.java:45)
[junit4:junit4]    > 	at org.apache.lucene.util.TestRuleReportUncaughtExceptions$1.evaluate(TestRuleReportUncaughtExceptions.java:68)
[junit4:junit4]    > 	at org.apache.lucene.util.TestRuleStoreClassName$1.evaluate(TestRuleStoreClassName.java:38)
[junit4:junit4]    > 	at org.apache.lucene.util.TestRuleIcuHack$1.evaluate(TestRuleIcuHack.java:51)
[junit4:junit4]    > 	at com.carrotsearch.randomizedtesting.rules.SystemPropertiesInvariantRule$1.evaluate(SystemPropertiesInvariantRule.java:55)
[junit4:junit4]    > 	at org.apache.lucene.util.TestRuleNoInstanceHooksOverrides$1.evaluate(TestRuleNoInstanceHooksOverrides.java:53)
[junit4:junit4]    > 	at org.apache.lucene.util.TestRuleNoStaticHooksShadowing$1.evaluate(TestRuleNoStaticHooksShadowing.java:52)
[junit4:junit4]    > 	at org.apache.lucene.util.TestRuleAssertionsRequired$1.evaluate(TestRuleAssertionsRequired.java:36)
[junit4:junit4]    > 	at org.apache.lucene.util.TestRuleMarkFailure$1.evaluate(TestRuleMarkFailure.java:48)
[junit4:junit4]    > 	at org.apache.lucene.util.TestRuleIgnoreAfterMaxFailures$1.evaluate(TestRuleIgnoreAfterMaxFailures.java:70)
[junit4:junit4]    > 	at org.apache.lucene.util.TestRuleIgnoreTestSuites$1.evaluate(TestRuleIgnoreTestSuites.java:55)
[junit4:junit4]    > 	at com.carrotsearch.randomizedtesting.RandomizedRunner.runSuite(RandomizedRunner.java:605)
[junit4:junit4]    > 	at com.carrotsearch.randomizedtesting.RandomizedRunner.access$400(RandomizedRunner.java:132)
[junit4:junit4]    > 	at com.carrotsearch.randomizedtesting.RandomizedRunner$2.run(RandomizedRunner.java:551)
[junit4:junit4]    > 
[junit4:junit4]   2> 1 T1853 oas.SolrTestCaseJ4.setUp ###Starting testDistribSearch
[junit4:junit4]   2> 2 T1853 oejs.Server.doStart jetty-8.1.2.v20120308
[junit4:junit4]   2> 6 T1853 oejs.AbstractConnector.doStart Started SocketConnector@0.0.0.0:37882
[junit4:junit4]   2> 9 T1853 oasc.SolrResourceLoader.locateSolrHome JNDI not configured for solr (NoInitialContextEx)
[junit4:junit4]   2> 9 T1853 oasc.SolrResourceLoader.locateSolrHome using system property solr.solr.home: /mnt/ssd/jenkins/workspace/Lucene-Solr-4.x-Linux-Java8-64/checkout/solr/build/solr-core/test-files/solr
[junit4:junit4]   2> 10 T1853 oasc.SolrResourceLoader.<init> new SolrResourceLoader for deduced Solr Home: '/mnt/ssd/jenkins/workspace/Lucene-Solr-4.x-Linux-Java8-64/checkout/solr/build/solr-core/test-files/solr/'
[junit4:junit4]   2> 13 T1853 oass.SolrDispatchFilter.init SolrDispatchFilter.init()
[junit4:junit4]   2> 14 T1853 oasc.SolrResourceLoader.locateSolrHome JNDI not configured for solr (NoInitialContextEx)
[junit4:junit4]   2> 14 T1853 oasc.SolrResourceLoader.locateSolrHome using system property solr.solr.home: /mnt/ssd/jenkins/workspace/Lucene-Solr-4.x-Linux-Java8-64/checkout/solr/build/solr-core/test-files/solr
[junit4:junit4]   2> 14 T1853 oasc.CoreContainer$Initializer.initialize looking for solr.xml: /mnt/ssd/jenkins/workspace/Lucene-Solr-4.x-Linux-Java8-64/checkout/solr/build/solr-core/test-files/solr/solr.xml
[junit4:junit4]   2> 14 T1853 oasc.CoreContainer.<init> New CoreContainer 975416451
[junit4:junit4]   2> 15 T1853 oasc.CoreContainer.load Loading CoreContainer using Solr Home: '/mnt/ssd/jenkins/workspace/Lucene-Solr-4.x-Linux-Java8-64/checkout/solr/build/solr-core/test-files/solr/'
[junit4:junit4]   2> 15 T1853 oasc.SolrResourceLoader.<init> new SolrResourceLoader for directory: '/mnt/ssd/jenkins/workspace/Lucene-Solr-4.x-Linux-Java8-64/checkout/solr/build/solr-core/test-files/solr/'
[junit4:junit4]   2> 21 T1853 oasc.CoreContainer.load Registering Log Listener
[junit4:junit4]   2> 30 T1853 oashc.HttpShardHandlerFactory.getParameter Setting socketTimeout to: 0
[junit4:junit4]   2> 30 T1853 oashc.HttpShardHandlerFactory.getParameter Setting urlScheme to: http://
[junit4:junit4]   2> 31 T1853 oashc.HttpShardHandlerFactory.getParameter Setting connTimeout to: 0
[junit4:junit4]   2> 31 T1853 oashc.HttpShardHandlerFactory.getParameter Setting maxConnectionsPerHost to: 20
[junit4:junit4]   2> 31 T1853 oashc.HttpShardHandlerFactory.getParameter Setting corePoolSize to: 0
[junit4:junit4]   2> 31 T1853 oashc.HttpShardHandlerFactory.getParameter Setting maximumPoolSize to: 2147483647
[junit4:junit4]   2> 32 T1853 oashc.HttpShardHandlerFactory.getParameter Setting maxThreadIdleTime to: 5
[junit4:junit4]   2> 32 T1853 oashc.HttpShardHandlerFactory.getParameter Setting sizeOfQueue to: -1
[junit4:junit4]   2> 32 T1853 oashc.HttpShardHandlerFactory.getParameter Setting fairnessPolicy to: false
[junit4:junit4]   2> 32 T1853 oascsi.HttpClientUtil.createClient Creating new http client, config:maxConnectionsPerHost=20&maxConnections=10000&socketTimeout=0&connTimeout=0&retry=false
[junit4:junit4]   2> 38 T1853 oasc.CoreContainer.create Creating SolrCore 'collection1' using instanceDir: /mnt/ssd/jenkins/workspace/Lucene-Solr-4.x-Linux-Java8-64/checkout/solr/build/solr-core/test-files/solr/collection1
[junit4:junit4]   2> 39 T1853 oasc.SolrResourceLoader.<init> new SolrResourceLoader for directory: '/mnt/ssd/jenkins/workspace/Lucene-Solr-4.x-Linux-Java8-64/checkout/solr/build/solr-core/test-files/solr/collection1/'
[junit4:junit4]   2> 39 T1853 oasc.SolrResourceLoader.replaceClassLoader Adding 'file:/mnt/ssd/jenkins/workspace/Lucene-Solr-4.x-Linux-Java8-64/checkout/solr/build/solr-core/test-files/solr/collection1/lib/README' to classloader
[junit4:junit4]   2> 40 T1853 oasc.SolrResourceLoader.replaceClassLoader Adding 'file:/mnt/ssd/jenkins/workspace/Lucene-Solr-4.x-Linux-Java8-64/checkout/solr/build/solr-core/test-files/solr/collection1/lib/classes/' to classloader
[junit4:junit4]   2> 57 T1853 oasc.SolrConfig.<init> Using Lucene MatchVersion: LUCENE_40
[junit4:junit4]   2> 93 T1853 oasc.SolrConfig.<init> Loaded SolrConfig: solrconfig-elevate.xml
[junit4:junit4]   2> 94 T1853 oass.IndexSchema.readSchema Reading Solr Schema
[junit4:junit4]   2> 97 T1853 oass.IndexSchema.readSchema Schema name=example
[junit4:junit4]   2> 204 T1853 oass.IndexSchema.readSchema default search field in schema is text
[junit4:junit4]   2> 206 T1853 oass.IndexSchema.readSchema unique key field: id
[junit4:junit4]   2> 208 T1853 oasc.SolrCore.<init> [collection1] Opening new SolrCore at /mnt/ssd/jenkins/workspace/Lucene-Solr-4.x-Linux-Java8-64/checkout/solr/build/solr-core/test-files/solr/collection1/, dataDir=./org.apache.solr.handler.component.DistributedQueryElevationComponentTest-1342886111874/control/data/
[junit4:junit4]   2> 208 T1853 oasc.JmxMonitoredMap.<init> JMX monitoring is enabled. Adding Solr mbeans to JMX Server: com.sun.jmx.mbeanserver.JmxMBeanServer@4ea2b99f
[junit4:junit4]   2> 208 T1853 oasc.SolrCore.getNewIndexDir WARNING New index directory detected: old=null new=./org.apache.solr.handler.component.DistributedQueryElevationComponentTest-1342886111874/control/data/index/
[junit4:junit4]   2> 208 T1853 oasc.SolrCore.initIndex WARNING [collection1] Solr index directory './org.apache.solr.handler.component.DistributedQueryElevationComponentTest-1342886111874/control/data/index' doesn't exist. Creating new index...
[junit4:junit4]   2> 209 T1853 oasc.SolrDeletionPolicy.onCommit SolrDeletionPolicy.onCommit: commits:num=1
[junit4:junit4]   2> 		commit{dir=MockDirWrapper(org.apache.lucene.store.RAMDirectory@28eed037 lockFactory=org.apache.lucene.store.SingleInstanceLockFactory@275ad5eb),segFN=segments_1,generation=1,filenames=[segments_1]
[junit4:junit4]   2> 209 T1853 oasc.SolrDeletionPolicy.updateCommits newest commit = 1
[junit4:junit4]   2> 210 T1853 oasc.RequestHandlers.initHandlersFromConfig created /update: solr.UpdateRequestHandler
[junit4:junit4]   2> 210 T1853 oasc.RequestHandlers.initHandlersFromConfig created /elevate: org.apache.solr.handler.component.SearchHandler
[junit4:junit4]   2> 211 T1853 oasc.RequestHandlers.initHandlersFromConfig created /dataElevate: org.apache.solr.handler.component.SearchHandler
[junit4:junit4]   2> 211 T1853 oashl.XMLLoader.init xsltCacheLifetimeSeconds=60
[junit4:junit4]   2> 211 T1853 oasc.RequestHandlers.initHandlersFromConfig WARNING no default request handler is registered (either '/select' or 'standard')
[junit4:junit4]   2> 212 T1853 oasc.SolrCore.initDeprecatedSupport WARNING solrconfig.xml uses deprecated <admin/gettableFiles>, Please update your config to use the ShowFileRequestHandler.
[junit4:junit4]   2> 213 T1853 oasc.SolrCore.initDeprecatedSupport WARNING adding ShowFileRequestHandler with hidden files: [SOLRCONFIG-SCRIPT-UPDATEPROCESSOR.XML, SOLRCONFIG-HIGHLIGHT.XML, SCHEMA-LUCENEMATCHVERSION.XML, THROW.ERROR.ON.ADD.UPDATEPROCESSOR.JS, STOP-2.TXT, STEMDICT.TXT, SCHEMA-SPELLCHECKER.XML, MISSLEADING.EXTENSION.UPDATEPROCESSOR.JS.TXT, XSLT, SOLRCONFIG-MASTER1.XML, SCHEMA.XML, SOLRCONFIG-TLOG.XML, SCHEMA-REQUIRED-FIELDS.XML, SCHEMA-COPYFIELD-TEST.XML, BAD-MP-SOLRCONFIG.XML, BAD-SCHEMA-SIM-GLOBAL-VS-FT-MISMATCH.XML, WDFTYPES.TXT, BAD-SCHEMA-OMIT-TF-BUT-NOT-POS.XML, BAD-SCHEMA-DUP-FIELD.XML, SCHEMA-PHRASESUGGEST.XML, DA_UTF8.XML, SOLRCONFIG-ENABLEPLUGIN.XML, SCHEMA-BM25.XML, SCHEMA-BINARYFIELD.XML, SOLRCONFIG_PERF.XML, SOLRCONFIG-SLAVE.XML, PROTWORDS.TXT, BAD-SCHEMA-CODEC-GLOBAL-VS-FT-MISMATCH.XML, KEEP-2.TXT, SOLRCONFIG_CODEC.XML, OPEN-EXCHANGE-RATES.JSON, SCHEMA-IB.XML, BAD-SCHEMA-UNIQUEKEY-IS-COPYFIELD-DEST.XML, SOLRCONFIG-SOLR-749.XML, SOLRCONFIG-SLAVE1.XML, SCHEMA-CHARFILTERS.XML, SOLRCONFIG-SPELLCHECKER.XML, SOLRCONFIG-PHRASESUGGEST.XML, HUNSPELL-TEST.AFF, STOPWORDSWRONGENCODING.TXT, BAD_SOLRCONFIG.XML, SOLRCONFIG-BASIC.XML, BAD-SCHEMA-NOT-INDEXED-BUT-POS.XML, FRENCHARTICLES.TXT, SOLRCONFIG-QUERYSENDER.XML, BAD-SOLRCONFIG-BOGUS-SCRIPTENGINE-NAME.XML, SOLRCONFIG-NATIVELOCK.XML, MISSING.FUNCTIONS.UPDATEPROCESSOR.JS, STOP-SNOWBALL.TXT, STOPTYPES-2.TXT, BAD-SCHEMA-NOT-INDEXED-BUT-NORMS.XML, CURRENCY.XML, SCHEMA15.XML, SCHEMA11.XML, SCHEMA-LMDIRICHLET.XML, SCHEMA-COLLATE.XML, SOLRCONFIG-SPELLCHECKCOMPONENT.XML, SOLRCONFIG-ALTDIRECTORY.XML, BAD-SCHEMA-EXTERNAL-FILEFIELD.XML, OLD_SYNONYMS.TXT, SOLRCONFIG-MASTER.XML, STOPWORDS.TXT, SOLRCONFIG-TRANSFORMERS.XML, BAD-SCHEMA-DUP-DYNAMICFIELD.XML, SOLRCONFIG-DELPOLICY2.XML, SOLRCONFIG-BASIC-LUCENEVERSION31.XML, BAD-SCHEMA-NONTEXT-ANALYZER.XML, SOLRCONFIG-REPEATER.XML, SOLRCONFIG-REQHANDLER.INCL, SOLRCONFIG-MASTER3.XML, BAD-SOLRCONFIG-INVALID-SCRIPTFILE.XML, BAD-SCHEMA-UNIQUEKEY-USES-DEFAULT.XML, STOPWITHBOM.TXT, SCHEMA-NOT-REQUIRED-UNIQUE-KEY.XML, STOP-1.TXT, SOLRCONFIG-MERGEPOLICY.XML, HUNSPELL-TEST.DIC, CONDITIONAL.UPDATEPROCESSOR.JS, SOLRCONFIG-ELEVATE.XML, SCHEMA-SIM.XML, KEEP-1.TXT, SCHEMASURROUND.XML, SCHEMA-REPLICATION1.XML, STOPTYPES-1.TXT, SOLRCONFIG-PROPINJECT-INDEXDEFAULT.XML, SCHEMA-TRIE.XML, SCHEMA-REVERSED.XML, SOLRCONFIG-PROPINJECT.XML, SOLRCONFIG-CACHING.XML, SYNONYMS.TXT, TRIVIAL.UPDATEPROCESSOR0.JS, SOLRCONFIG-UPDATE-PROCESSOR-CHAINS.XML, SCHEMA-DFR.XML, PHRASESUGGEST.TXT, SCHEMA-NUMERIC.XML, SOLRCONFIG-TERMINDEX.XML, SOLRCONFIG-FUNCTIONQUERY.XML, SOLRCONFIG-NOCACHE.XML, SCHEMA_CODEC.XML, COMPOUNDDICTIONARY.TXT, SOLRCONFIG-XINCLUDE.XML, SCHEMA-TFIDF.XML, ADDFIELDS.UPDATEPROCESSOR.JS, MAPPING-ISOLATIN1ACCENT.TXT, SCHEMA-STOP-KEEP.XML, SCHEMA-COLLATEFILTER.XML, SOLRCONFIG-QUERYSENDER-NOQUERY.XML, SCHEMA-LMJELINEKMERCER.XML, HYPHENATION.DTD, SOLRCONFIG-SIMPLELOCK.XML, SCHEMA-FOLDING.XML, SOLRCONFIG-MASTER2.XML, SCHEMA-REPLICATION2.XML, SCHEMA-MINIMAL.XML, BAD-SOLRCONFIG-MISSING-SCRIPTFILE.XML, SOLRCONFIG-DELPOLICY1.XML, SOLRCONFIG-LAZYWRITER.XML, DA_COMPOUNDDICTIONARY.TXT, BAD-SCHEMA-NOT-INDEXED-BUT-TF.XML, SOLRCONFIG-SOLCOREPROPERTIES.XML, SOLRCONFIG-MASTER1-KEEPONEBACKUP.XML, TRIVIAL.UPDATEPROCESSOR1.JS, BAD-SCHEMA-DUP-FIELDTYPE.XML, SCHEMA12.XML, ELEVATE.XML]
[junit4:junit4]   2> 214 T1853 oass.SolrIndexSearcher.<init> Opening Searcher@412c435c main
[junit4:junit4]   2> 214 T1853 oass.SolrIndexSearcher.getIndexDir WARNING WARNING: Directory impl does not support setting indexDir: org.apache.lucene.store.MockDirectoryWrapper
[junit4:junit4]   2> 214 T1853 oasu.CommitTracker.<init> Hard AutoCommit: disabled
[junit4:junit4]   2> 215 T1853 oasu.CommitTracker.<init> Soft AutoCommit: disabled
[junit4:junit4]   2> 215 T1853 oashc.QueryElevationComponent.inform Loading QueryElevation from: /mnt/ssd/jenkins/workspace/Lucene-Solr-4.x-Linux-Java8-64/checkout/solr/build/solr-core/test-files/solr/collection1/conf/elevate.xml
[junit4:junit4]   2> 220 T1853 oashc.QueryElevationComponent.inform Loading QueryElevation from: /mnt/ssd/jenkins/workspace/Lucene-Solr-4.x-Linux-Java8-64/checkout/solr/build/solr-core/test-files/solr/collection1/conf/elevate.xml
[junit4:junit4]   2> 225 T1863 oasc.SolrCore.registerSearcher [collection1] Registered new searcher Searcher@412c435c main{StandardDirectoryReader(segments_1:1)}
[junit4:junit4]   2> 225 T1853 oasc.CoreContainer.register registering core: collection1
[junit4:junit4]   2> 225 T1853 oass.SolrDispatchFilter.init user.dir=/mnt/ssd/jenkins/workspace/Lucene-Solr-4.x-Linux-Java8-64/checkout/solr/build/solr-core/test/J1
[junit4:junit4]   2> 225 T1853 oass.SolrDispatchFilter.init SolrDispatchFilter.init() done
[junit4:junit4]   2> 226 T1853 oascsi.HttpClientUtil.createClient Creating new http client, config:maxConnections=128&maxConnectionsPerHost=32&followRedirects=false
[junit4:junit4]   2> 227 T1853 oejs.Server.doStart jetty-8.1.2.v20120308
[junit4:junit4]   2> 229 T1853 oejs.AbstractConnector.doStart Started SocketConnector@0.0.0.0:52603
[junit4:junit4]   2> 229 T1853 oasc.SolrResourceLoader.locateSolrHome JNDI not configured for solr (NoInitialContextEx)
[junit4:junit4]   2> 229 T1853 oasc.SolrResourceLoader.locateSolrHome using system property solr.solr.home: /mnt/ssd/jenkins/workspace/Lucene-Solr-4.x-Linux-Java8-64/checkout/solr/build/solr-core/test-files/solr
[junit4:junit4]   2> 229 T1853 oasc.SolrResourceLoader.<init> new SolrResourceLoader for deduced Solr Home: '/mnt/ssd/jenkins/workspace/Lucene-Solr-4.x-Linux-Java8-64/checkout/solr/build/solr-core/test-files/solr/'
[junit4:junit4]   2> 232 T1853 oass.SolrDispatchFilter.init SolrDispatchFilter.init()
[junit4:junit4]   2> 232 T1853 oasc.SolrResourceLoader.locateSolrHome JNDI not configured for solr (NoInitialContextEx)
[junit4:junit4]   2> 232 T1853 oasc.SolrResourceLoader.locateSolrHome using system property solr.solr.home: /mnt/ssd/jenkins/workspace/Lucene-Solr-4.x-Linux-Java8-64/checkout/solr/build/solr-core/test-files/solr
[junit4:junit4]   2> 232 T1853 oasc.CoreContainer$Initializer.initialize looking for solr.xml: /mnt/ssd/jenkins/workspace/Lucene-Solr-4.x-Linux-Java8-64/checkout/solr/build/solr-core/test-files/solr/solr.xml
[junit4:junit4]   2> 232 T1853 oasc.CoreContainer.<init> New CoreContainer 1530650946
[junit4:junit4]   2> 233 T1853 oasc.CoreContainer.load Loading CoreContainer using Solr Home: '/mnt/ssd/jenkins/workspace/Lucene-Solr-4.x-Linux-Java8-64/checkout/solr/build/solr-core/test-files/solr/'
[junit4:junit4]   2> 233 T1853 oasc.SolrResourceLoader.<init> new SolrResourceLoader for directory: '/mnt/ssd/jenkins/workspace/Lucene-Solr-4.x-Linux-Java8-64/checkout/solr/build/solr-core/test-files/solr/'
[junit4:junit4]   2> 237 T1853 oasc.CoreContainer.load Registering Log Listener
[junit4:junit4]   2> 242 T1853 oashc.HttpShardHandlerFactory.getParameter Setting socketTimeout to: 0
[junit4:junit4]   2> 242 T1853 oashc.HttpShardHandlerFactory.getParameter Setting urlScheme to: http://
[junit4:junit4]   2> 243 T1853 oashc.HttpShardHandlerFactory.getParameter Setting connTimeout to: 0
[junit4:junit4]   2> 243 T1853 oashc.HttpShardHandlerFactory.getParameter Setting maxConnectionsPerHost to: 20
[junit4:junit4]   2> 243 T1853 oashc.HttpShardHandlerFactory.getParameter Setting corePoolSize to: 0
[junit4:junit4]   2> 243 T1853 oashc.HttpShardHandlerFactory.getParameter Setting maximumPoolSize to: 2147483647
[junit4:junit4]   2> 243 T1853 oashc.HttpShardHandlerFactory.getParameter Setting maxThreadIdleTime to: 5
[junit4:junit4]   2> 243 T1853 oashc.HttpShardHandlerFactory.getParameter Setting sizeOfQueue to: -1
[junit4:junit4]   2> 244 T1853 oashc.HttpShardHandlerFactory.getParameter Setting fairnessPolicy to: false
[junit4:junit4]   2> 244 T1853 oascsi.HttpClientUtil.createClient Creating new http client, config:maxConnectionsPerHost=20&maxConnections=10000&socketTimeout=0&connTimeout=0&retry=false
[junit4:junit4]   2> 248 T1853 oasc.CoreContainer.create Creating SolrCore 'collection1' using instanceDir: /mnt/ssd/jenkins/workspace/Lucene-Solr-4.x-Linux-Java8-64/checkout/solr/build/solr-core/test-files/solr/collection1
[junit4:junit4]   2> 248 T1853 oasc.SolrResourceLoader.<init> new SolrResourceLoader for directory: '/mnt/ssd/jenkins/workspace/Lucene-Solr-4.x-Linux-Java8-64/checkout/solr/build/solr-core/test-files/solr/collection1/'
[junit4:junit4]   2> 249 T1853 oasc.SolrResourceLoader.replaceClassLoader Adding 'file:/mnt/ssd/jenkins/workspace/Lucene-Solr-4.x-Linux-Java8-64/checkout/solr/build/solr-core/test-files/solr/collection1/lib/README' to classloader
[junit4:junit4]   2> 249 T1853 oasc.SolrResourceLoader.replaceClassLoader Adding 'file:/mnt/ssd/jenkins/workspace/Lucene-Solr-4.x-Linux-Java8-64/checkout/solr/build/solr-core/test-files/solr/collection1/lib/classes/' to classloader
[junit4:junit4]   2> 267 T1853 oasc.SolrConfig.<init> Using Lucene MatchVersion: LUCENE_40
[junit4:junit4]   2> 290 T1853 oasc.SolrConfig.<init> Loaded SolrConfig: solrconfig-elevate.xml
[junit4:junit4]   2> 290 T1853 oass.IndexSchema.readSchema Reading Solr Schema
[junit4:junit4]   2> 292 T1853 oass.IndexSchema.readSchema Schema name=example
[junit4:junit4]   2> 388 T1853 oass.IndexSchema.readSchema default search field in schema is text
[junit4:junit4]   2> 391 T1853 oass.IndexSchema.readSchema unique key field: id
[junit4:junit4]   2> 393 T1853 oasc.SolrCore.<init> [collection1] Opening new SolrCore at /mnt/ssd/jenkins/workspace/Lucene-Solr-4.x-Linux-Java8-64/checkout/solr/build/solr-core/test-files/solr/collection1/, dataDir=./org.apache.solr.handler.component.DistributedQueryElevationComponentTest-1342886111874/shard0/data/
[junit4:junit4]   2> 393 T1853 oasc.JmxMonitoredMap.<init> JMX monitoring is enabled. Adding Solr mbeans to JMX Server: com.sun.jmx.mbeanserver.JmxMBeanServer@4ea2b99f
[junit4:junit4]   2> 393 T1853 oasc.SolrCore.getNewIndexDir WARNING New index directory detected: old=null new=./org.apache.solr.handler.component.DistributedQueryElevationComponentTest-1342886111874/shard0/data/index/
[junit4:junit4]   2> 393 T1853 oasc.SolrCore.initIndex WARNING [collection1] Solr index directory './org.apache.solr.handler.component.DistributedQueryElevationComponentTest-1342886111874/shard0/data/index' doesn't exist. Creating new index...
[junit4:junit4]   2> 394 T1853 oasc.SolrDeletionPolicy.onCommit SolrDeletionPolicy.onCommit: commits:num=1
[junit4:junit4]   2> 		commit{dir=MockDirWrapper(org.apache.lucene.store.RAMDirectory@58202b95 lockFactory=org.apache.lucene.store.SingleInstanceLockFactory@a4e4d15),segFN=segments_1,generation=1,filenames=[segments_1]
[junit4:junit4]   2> 394 T1853 oasc.SolrDeletionPolicy.updateCommits newest commit = 1
[junit4:junit4]   2> 395 T1853 oasc.RequestHandlers.initHandlersFromConfig created /update: solr.UpdateRequestHandler
[junit4:junit4]   2> 395 T1853 oasc.RequestHandlers.initHandlersFromConfig created /elevate: org.apache.solr.handler.component.SearchHandler
[junit4:junit4]   2> 395 T1853 oasc.RequestHandlers.initHandlersFromConfig created /dataElevate: org.apache.solr.handler.component.SearchHandler
[junit4:junit4]   2> 396 T1853 oashl.XMLLoader.init xsltCacheLifetimeSeconds=60
[junit4:junit4]   2> 396 T1853 oasc.RequestHandlers.initHandlersFromConfig WARNING no default request handler is registered (either '/select' or 'standard')
[junit4:junit4]   2> 397 T1853 oasc.SolrCore.initDeprecatedSupport WARNING solrconfig.xml uses deprecated <admin/gettableFiles>, Please update your config to use the ShowFileRequestHandler.
[junit4:junit4]   2> 397 T1853 oasc.SolrCore.initDeprecatedSupport WARNING adding ShowFileRequestHandler with hidden files: [SOLRCONFIG-SCRIPT-UPDATEPROCESSOR.XML, SOLRCONFIG-HIGHLIGHT.XML, SCHEMA-LUCENEMATCHVERSION.XML, THROW.ERROR.ON.ADD.UPDATEPROCESSOR.JS, STOP-2.TXT, STEMDICT.TXT, SCHEMA-SPELLCHECKER.XML, MISSLEADING.EXTENSION.UPDATEPROCESSOR.JS.TXT, XSLT, SOLRCONFIG-MASTER1.XML, SCHEMA.XML, SOLRCONFIG-TLOG.XML, SCHEMA-REQUIRED-FIELDS.XML, SCHEMA-COPYFIELD-TEST.XML, BAD-MP-SOLRCONFIG.XML, BAD-SCHEMA-SIM-GLOBAL-VS-FT-MISMATCH.XML, WDFTYPES.TXT, BAD-SCHEMA-OMIT-TF-BUT-NOT-POS.XML, BAD-SCHEMA-DUP-FIELD.XML, SCHEMA-PHRASESUGGEST.XML, DA_UTF8.XML, SOLRCONFIG-ENABLEPLUGIN.XML, SCHEMA-BM25.XML, SCHEMA-BINARYFIELD.XML, SOLRCONFIG_PERF.XML, SOLRCONFIG-SLAVE.XML, PROTWORDS.TXT, BAD-SCHEMA-CODEC-GLOBAL-VS-FT-MISMATCH.XML, KEEP-2.TXT, SOLRCONFIG_CODEC.XML, OPEN-EXCHANGE-RATES.JSON, SCHEMA-IB.XML, BAD-SCHEMA-UNIQUEKEY-IS-COPYFIELD-DEST.XML, SOLRCONFIG-SOLR-749.XML, SOLRCONFIG-SLAVE1.XML, SCHEMA-CHARFILTERS.XML, SOLRCONFIG-SPELLCHECKER.XML, SOLRCONFIG-PHRASESUGGEST.XML, HUNSPELL-TEST.AFF, STOPWORDSWRONGENCODING.TXT, BAD_SOLRCONFIG.XML, SOLRCONFIG-BASIC.XML, BAD-SCHEMA-NOT-INDEXED-BUT-POS.XML, FRENCHARTICLES.TXT, SOLRCONFIG-QUERYSENDER.XML, BAD-SOLRCONFIG-BOGUS-SCRIPTENGINE-NAME.XML, SOLRCONFIG-NATIVELOCK.XML, MISSING.FUNCTIONS.UPDATEPROCESSOR.JS, STOP-SNOWBALL.TXT, STOPTYPES-2.TXT, BAD-SCHEMA-NOT-INDEXED-BUT-NORMS.XML, CURRENCY.XML, SCHEMA15.XML, SCHEMA11.XML, SCHEMA-LMDIRICHLET.XML, SCHEMA-COLLATE.XML, SOLRCONFIG-SPELLCHECKCOMPONENT.XML, SOLRCONFIG-ALTDIRECTORY.XML, BAD-SCHEMA-EXTERNAL-FILEFIELD.XML, OLD_SYNONYMS.TXT, SOLRCONFIG-MASTER.XML, STOPWORDS.TXT, SOLRCONFIG-TRANSFORMERS.XML, BAD-SCHEMA-DUP-DYNAMICFIELD.XML, SOLRCONFIG-DELPOLICY2.XML, SOLRCONFIG-BASIC-LUCENEVERSION31.XML, BAD-SCHEMA-NONTEXT-ANALYZER.XML, SOLRCONFIG-REPEATER.XML, SOLRCONFIG-REQHANDLER.INCL, SOLRCONFIG-MASTER3.XML, BAD-SOLRCONFIG-INVALID-SCRIPTFILE.XML, BAD-SCHEMA-UNIQUEKEY-USES-DEFAULT.XML, STOPWITHBOM.TXT, SCHEMA-NOT-REQUIRED-UNIQUE-KEY.XML, STOP-1.TXT, SOLRCONFIG-MERGEPOLICY.XML, HUNSPELL-TEST.DIC, CONDITIONAL.UPDATEPROCESSOR.JS, SOLRCONFIG-ELEVATE.XML, SCHEMA-SIM.XML, KEEP-1.TXT, SCHEMASURROUND.XML, SCHEMA-REPLICATION1.XML, STOPTYPES-1.TXT, SOLRCONFIG-PROPINJECT-INDEXDEFAULT.XML, SCHEMA-TRIE.XML, SCHEMA-REVERSED.XML, SOLRCONFIG-PROPINJECT.XML, SOLRCONFIG-CACHING.XML, SYNONYMS.TXT, TRIVIAL.UPDATEPROCESSOR0.JS, SOLRCONFIG-UPDATE-PROCESSOR-CHAINS.XML, SCHEMA-DFR.XML, PHRASESUGGEST.TXT, SCHEMA-NUMERIC.XML, SOLRCONFIG-TERMINDEX.XML, SOLRCONFIG-FUNCTIONQUERY.XML, SOLRCONFIG-NOCACHE.XML, SCHEMA_CODEC.XML, COMPOUNDDICTIONARY.TXT, SOLRCONFIG-XINCLUDE.XML, SCHEMA-TFIDF.XML, ADDFIELDS.UPDATEPROCESSOR.JS, MAPPING-ISOLATIN1ACCENT.TXT, SCHEMA-STOP-KEEP.XML, SCHEMA-COLLATEFILTER.XML, SOLRCONFIG-QUERYSENDER-NOQUERY.XML, SCHEMA-LMJELINEKMERCER.XML, HYPHENATION.DTD, SOLRCONFIG-SIMPLELOCK.XML, SCHEMA-FOLDING.XML, SOLRCONFIG-MASTER2.XML, SCHEMA-REPLICATION2.XML, SCHEMA-MINIMAL.XML, BAD-SOLRCONFIG-MISSING-SCRIPTFILE.XML, SOLRCONFIG-DELPOLICY1.XML, SOLRCONFIG-LAZYWRITER.XML, DA_COMPOUNDDICTIONARY.TXT, BAD-SCHEMA-NOT-INDEXED-BUT-TF.XML, SOLRCONFIG-SOLCOREPROPERTIES.XML, SOLRCONFIG-MASTER1-KEEPONEBACKUP.XML, TRIVIAL.UPDATEPROCESSOR1.JS, BAD-SCHEMA-DUP-FIELDTYPE.XML, SCHEMA12.XML, ELEVATE.XML]
[junit4:junit4]   2> 399 T1853 oass.SolrIndexSearcher.<init> Opening Searcher@47c555f1 main
[junit4:junit4]   2> 399 T1853 oass.SolrIndexSearcher.getIndexDir WARNING WARNING: Directory impl does not support setting indexDir: org.apache.lucene.store.MockDirectoryWrapper
[junit4:junit4]   2> 399 T1853 oasu.CommitTracker.<init> Hard AutoCommit: disabled
[junit4:junit4]   2> 399 T1853 oasu.CommitTracker.<init> Soft AutoCommit: disabled
[junit4:junit4]   2> 400 T1853 oashc.QueryElevationComponent.inform Loading QueryElevation from: /mnt/ssd/jenkins/workspace/Lucene-Solr-4.x-Linux-Java8-64/checkout/solr/build/solr-core/test-files/solr/collection1/conf/elevate.xml
[junit4:junit4]   2> 404 T1853 oashc.QueryElevationComponent.inform Loading QueryElevation from: /mnt/ssd/jenkins/workspace/Lucene-Solr-4.x-Linux-Java8-64/checkout/solr/build/solr-core/test-files/solr/collection1/conf/elevate.xml
[junit4:junit4]   2> 410 T1853 oasc.CoreContainer.register registering core: collection1
[junit4:junit4]   2> 410 T1853 oass.SolrDispatchFilter.init user.dir=/mnt/ssd/jenkins/workspace/Lucene-Solr-4.x-Linux-Java8-64/checkout/solr/build/solr-core/test/J1
[junit4:junit4]   2> 410 T1853 oass.SolrDispatchFilter.init SolrDispatchFilter.init() done
[junit4:junit4]   2> 410 T1853 oascsi.HttpClientUtil.createClient Creating new http client, config:maxConnections=128&maxConnectionsPerHost=32&followRedirects=false
[junit4:junit4]   2> 413 T1853 oejs.Server.doStart jetty-8.1.2.v20120308
[junit4:junit4]   2> 415 T1873 oasc.SolrCore.registerSearcher [collection1] Registered new searcher Searcher@47c555f1 main{StandardDirectoryReader(segments_1:1)}
[junit4:junit4]   2> 419 T1853 oejs.AbstractConnector.doStart Started SocketConnector@0.0.0.0:57923
[junit4:junit4]   2> 420 T1853 oasc.SolrResourceLoader.locateSolrHome JNDI not configured for solr (NoInitialContextEx)
[junit4:junit4]   2> 420 T1853 oasc.SolrResourceLoader.locateSolrHome using system property solr.solr.home: /mnt/ssd/jenkins/workspace/Lucene-Solr-4.x-Linux-Java8-64/checkout/solr/build/solr-core/test-files/solr
[junit4:junit4]   2> 420 T1853 oasc.SolrResourceLoader.<init> new SolrResourceLoader for deduced Solr Home: '/mnt/ssd/jenkins/workspace/Lucene-Solr-4.x-Linux-Java8-64/checkout/solr/build/solr-core/test-files/solr/'
[junit4:junit4]   2> 424 T1853 oass.SolrDispatchFilter.init SolrDispatchFilter.init()
[junit4:junit4]   2> 424 T1853 oasc.SolrResourceLoader.locateSolrHome JNDI not configured for solr (NoInitialContextEx)
[junit4:junit4]   2> 424 T1853 oasc.SolrResourceLoader.locateSolrHome using system property solr.solr.home: /mnt/ssd/jenkins/workspace/Lucene-Solr-4.x-Linux-Java8-64/checkout/solr/build/solr-core/test-files/solr
[junit4:junit4]   2> 425 T1853 oasc.CoreContainer$Initializer.initialize looking for solr.xml: /mnt/ssd/jenkins/workspace/Lucene-Solr-4.x-Linux-Java8-64/checkout/solr/build/solr-core/test-files/solr/solr.xml
[junit4:junit4]   2> 425 T1853 oasc.CoreContainer.<init> New CoreContainer 1943539812
[junit4:junit4]   2> 425 T1853 oasc.CoreContainer.load Loading CoreContainer using Solr Home: '/mnt/ssd/jenkins/workspace/Lucene-Solr-4.x-Linux-Java8-64/checkout/solr/build/solr-core/test-files/solr/'
[junit4:junit4]   2> 425 T1853 oasc.SolrResourceLoader.<init> new SolrResourceLoader for directory: '/mnt/ssd/jenkins/workspace/Lucene-Solr-4.x-Linux-Java8-64/checkout/solr/build/solr-core/test-files/solr/'
[junit4:junit4]   2> 426 T207 oaz.ClientCnxn$SendThread.startConnect Opening socket connection to server localhost.localdomain/127.0.0.1:59377
[junit4:junit4]   2> 426 T207 oaz.ClientCnxn$SendThread.run WARNING Session 0x138aa39ba440010 for server null, unexpected error, closing socket connection and attempting reconnect java.net.ConnectException: Connection refused
[junit4:junit4]   2> 	at sun.nio.ch.SocketChannelImpl.checkConnect(Native Method)
[junit4:junit4]   2> 	at sun.nio.ch.SocketChannelImpl.finishConnect(SocketChannelImpl.java:692)
[junit4:junit4]   2> 	at org.apache.zookeeper.ClientCnxn$SendThread.run(ClientCnxn.java:1143)
[junit4:junit4]   2> 
[junit4:junit4]   2> 430 T1853 oasc.CoreContainer.load Registering Log Listener
[junit4:junit4]   2> 437 T1853 oashc.HttpShardHandlerFactory.getParameter Setting socketTimeout to: 0
[junit4:junit4]   2> 437 T1853 oashc.HttpShardHandlerFactory.getParameter Setting urlScheme to: http://
[junit4:junit4]   2> 437 T1853 oashc.HttpShardHandlerFactory.getParameter Setting connTimeout to: 0
[junit4:junit4]   2> 437 T1853 oashc.HttpShardHandlerFactory.getParameter Setting maxConnectionsPerHost to: 20
[junit4:junit4]   2> 438 T1853 oashc.HttpShardHandlerFactory.getParameter Setting corePoolSize to: 0
[junit4:junit4]   2> 438 T1853 oashc.HttpShardHandlerFactory.getParameter Setting maximumPoolSize to: 2147483647
[junit4:junit4]   2> 438 T1853 oashc.HttpShardHandlerFactory.getParameter Setting maxThreadIdleTime to: 5
[junit4:junit4]   2> 438 T1853 oashc.HttpShardHandlerFactory.getParameter Setting sizeOfQueue to: -1
[junit4:junit4]   2> 438 T1853 oashc.HttpShardHandlerFactory.getParameter Setting fairnessPolicy to: false
[junit4:junit4]   2> 438 T1853 oascsi.HttpClientUtil.createClient Creating new http client, config:maxConnectionsPerHost=20&maxConnections=10000&socketTimeout=0&connTimeout=0&retry=false
[junit4:junit4]   2> 442 T1853 oasc.CoreContainer.create Creating SolrCore 'collection1' using instanceDir: /mnt/ssd/jenkins/workspace/Lucene-Solr-4.x-Linux-Java8-64/checkout/solr/build/solr-core/test-files/solr/collection1
[junit4:junit4]   2> 442 T1853 oasc.SolrResourceLoader.<init> new SolrResourceLoader for directory: '/mnt/ssd/jenkins/workspace/Lucene-Solr-4.x-Linux-Java8-64/checkout/solr/build/solr-core/test-files/solr/collection1/'
[junit4:junit4]   2> 443 T1853 oasc.SolrResourceLoader.replaceClassLoader Adding 'file:/mnt/ssd/jenkins/workspace/Lucene-Solr-4.x-Linux-Java8-64/checkout/solr/build/solr-core/test-files/solr/collection1/lib/README' to classloader
[junit4:junit4]   2> 443 T1853 oasc.SolrResourceLoader.replaceClassLoader Adding 'file:/mnt/ssd/jenkins/workspace/Lucene-Solr-4.x-Linux-Java8-64/checkout/solr/build/solr-core/test-files/solr/collection1/lib/classes/' to classloader
[junit4:junit4]   2> 454 T1853 oasc.SolrConfig.<init> Using Lucene MatchVersion: LUCENE_40
[junit4:junit4]   2> 478 T1853 oasc.SolrConfig.<init> Loaded SolrConfig: solrconfig-elevate.xml
[junit4:junit4]   2> 479 T1853 oass.IndexSchema.readSchema Reading Solr Schema
[junit4:junit4]   2> 480 T1853 oass.IndexSchema.readSchema Schema name=example
[junit4:junit4]   2> 607 T1853 oass.IndexSchema.readSchema default search field in schema is text
[junit4:junit4]   2> 609 T1853 oass.IndexSchema.readSchema unique key field: id
[junit4:junit4]   2> 612 T1853 oasc.SolrCore.<init> [collection1] Opening new SolrCore at /mnt/ssd/jenkins/workspace/Lucene-Solr-4.x-Linux-Java8-64/checkout/solr/build/solr-core/test-files/solr/collection1/, dataDir=./org.apache.solr.handler.component.DistributedQueryElevationComponentTest-1342886111874/shard1/data/
[junit4:junit4]   2> 612 T1853 oasc.JmxMonitoredMap.<init> JMX monitoring is enabled. Adding Solr mbeans to JMX Server: com.sun.jmx.mbeanserver.JmxMBeanServer@4ea2b99f
[junit4:junit4]   2> 613 T1853 oasc.SolrCore.getNewIndexDir WARNING New index directory detected: old=null new=./org.apache.solr.handler.component.DistributedQueryElevationComponentTest-1342886111874/shard1/data/index/
[junit4:junit4]   2> 613 T1853 oasc.SolrCore.initIndex WARNING [collection1] Solr index directory './org.apache.solr.handler.component.DistributedQueryElevationComponentTest-1342886111874/shard1/data/index' doesn't exist. Creating new index...
[junit4:junit4]   2> 614 T1853 oasc.SolrDeletionPolicy.onCommit SolrDeletionPolicy.onCommit: commits:num=1
[junit4:junit4]   2> 		commit{dir=MockDirWrapper(org.apache.lucene.store.RAMDirectory@606f6327 lockFactory=org.apache.lucene.store.SingleInstanceLockFactory@649c80bd),segFN=segments_1,generation=1,filenames=[segments_1]
[junit4:junit4]   2> 614 T1853 oasc.SolrDeletionPolicy.updateCommits newest commit = 1
[junit4:junit4]   2> 615 T1853 oasc.RequestHandlers.initHandlersFromConfig created /update: solr.UpdateRequestHandler
[junit4:junit4]   2> 616 T1853 oasc.RequestHandlers.initHandlersFromConfig created /elevate: org.apache.solr.handler.component.SearchHandler
[junit4:junit4]   2> 616 T1853 oasc.RequestHandlers.initHandlersFromConfig created /dataElevate: org.apache.solr.handler.component.SearchHandler
[junit4:junit4]   2> 616 T1853 oashl.XMLLoader.init xsltCacheLifetimeSeconds=60
[junit4:junit4]   2> 616 T1853 oasc.RequestHandlers.initHandlersFromConfig WARNING no default request handler is registered (either '/select' or 'standard')
[junit4:junit4]   2> 618 T1853 oasc.SolrCore.initDeprecatedSupport WARNING solrconfig.xml uses deprecated <admin/gettableFiles>, Please update your config to use the ShowFileRequestHandler.
[junit4:junit4]   2> 619 T1853 oasc.SolrCore.initDeprecatedSupport WARNING adding ShowFileRequestHandler with hidden files: [SOLRCONFIG-SCRIPT-UPDATEPROCESSOR.XML, SOLRCONFIG-HIGHLIGHT.XML, SCHEMA-LUCENEMATCHVERSION.XML, THROW.ERROR.ON.ADD.UPDATEPROCESSOR.JS, STOP-2.TXT, STEMDICT.TXT, SCHEMA-SPELLCHECKER.XML, MISSLEADING.EXTENSION.UPDATEPROCESSOR.JS.TXT, XSLT, SOLRCONFIG-MASTER1.XML, SCHEMA.XML, SOLRCONFIG-TLOG.XML, SCHEMA-REQUIRED-FIELDS.XML, SCHEMA-COPYFIELD-TEST.XML, BAD-MP-SOLRCONFIG.XML, BAD-SCHEMA-SIM-GLOBAL-VS-FT-MISMATCH.XML, WDFTYPES.TXT, BAD-SCHEMA-OMIT-TF-BUT-NOT-POS.XML, BAD-SCHEMA-DUP-FIELD.XML, SCHEMA-PHRASESUGGEST.XML, DA_UTF8.XML, SOLRCONFIG-ENABLEPLUGIN.XML, SCHEMA-BM25.XML, SCHEMA-BINARYFIELD.XML, SOLRCONFIG_PERF.XML, SOLRCONFIG-SLAVE.XML, PROTWORDS.TXT, BAD-SCHEMA-CODEC-GLOBAL-VS-FT-MISMATCH.XML, KEEP-2.TXT, SOLRCONFIG_CODEC.XML, OPEN-EXCHANGE-RATES.JSON, SCHEMA-IB.XML, BAD-SCHEMA-UNIQUEKEY-IS-COPYFIELD-DEST.XML, SOLRCONFIG-SOLR-749.XML, SOLRCONFIG-SLAVE1.XML, SCHEMA-CHARFILTERS.XML, SOLRCONFIG-SPELLCHECKER.XML, SOLRCONFIG-PHRASESUGGEST.XML, HUNSPELL-TEST.AFF, STOPWORDSWRONGENCODING.TXT, BAD_SOLRCONFIG.XML, SOLRCONFIG-BASIC.XML, BAD-SCHEMA-NOT-INDEXED-BUT-POS.XML, FRENCHARTICLES.TXT, SOLRCONFIG-QUERYSENDER.XML, BAD-SOLRCONFIG-BOGUS-SCRIPTENGINE-NAME.XML, SOLRCONFIG-NATIVELOCK.XML, MISSING.FUNCTIONS.UPDATEPROCESSOR.JS, STOP-SNOWBALL.TXT, STOPTYPES-2.TXT, BAD-SCHEMA-NOT-INDEXED-BUT-NORMS.XML, CURRENCY.XML, SCHEMA15.XML, SCHEMA11.XML, SCHEMA-LMDIRICHLET.XML, SCHEMA-COLLATE.XML, SOLRCONFIG-SPELLCHECKCOMPONENT.XML, SOLRCONFIG-ALTDIRECTORY.XML, BAD-SCHEMA-EXTERNAL-FILEFIELD.XML, OLD_SYNONYMS.TXT, SOLRCONFIG-MASTER.XML, STOPWORDS.TXT, SOLRCONFIG-TRANSFORMERS.XML, BAD-SCHEMA-DUP-DYNAMICFIELD.XML, SOLRCONFIG-DELPOLICY2.XML, SOLRCONFIG-BASIC-LUCENEVERSION31.XML, BAD-SCHEMA-NONTEXT-ANALYZER.XML, SOLRCONFIG-REPEATER.XML, SOLRCONFIG-REQHANDLER.INCL, SOLRCONFIG-MASTER3.XML, BAD-SOLRCONFIG-INVALID-SCRIPTFILE.XML, BAD-SCHEMA-UNIQUEKEY-USES-DEFAULT.XML, STOPWITHBOM.TXT, SCHEMA-NOT-REQUIRED-UNIQUE-KEY.XML, STOP-1.TXT, SOLRCONFIG-MERGEPOLICY.XML, HUNSPELL-TEST.DIC, CONDITIONAL.UPDATEPROCESSOR.JS, SOLRCONFIG-ELEVATE.XML, SCHEMA-SIM.XML, KEEP-1.TXT, SCHEMASURROUND.XML, SCHEMA-REPLICATION1.XML, STOPTYPES-1.TXT, SOLRCONFIG-PROPINJECT-INDEXDEFAULT.XML, SCHEMA-TRIE.XML, SCHEMA-REVERSED.XML, SOLRCONFIG-PROPINJECT.XML, SOLRCONFIG-CACHING.XML, SYNONYMS.TXT, TRIVIAL.UPDATEPROCESSOR0.JS, SOLRCONFIG-UPDATE-PROCESSOR-CHAINS.XML, SCHEMA-DFR.XML, PHRASESUGGEST.TXT, SCHEMA-NUMERIC.XML, SOLRCONFIG-TERMINDEX.XML, SOLRCONFIG-FUNCTIONQUERY.XML, SOLRCONFIG-NOCACHE.XML, SCHEMA_CODEC.XML, COMPOUNDDICTIONARY.TXT, SOLRCONFIG-XINCLUDE.XML, SCHEMA-TFIDF.XML, ADDFIELDS.UPDATEPROCESSOR.JS, MAPPING-ISOLATIN1ACCENT.TXT, SCHEMA-STOP-KEEP.XML, SCHEMA-COLLATEFILTER.XML, SOLRCONFIG-QUERYSENDER-NOQUERY.XML, SCHEMA-LMJELINEKMERCER.XML, HYPHENATION.DTD, SOLRCONFIG-SIMPLELOCK.XML, SCHEMA-FOLDING.XML, SOLRCONFIG-MASTER2.XML, SCHEMA-REPLICATION2.XML, SCHEMA-MINIMAL.XML, BAD-SOLRCONFIG-MISSING-SCRIPTFILE.XML, SOLRCONFIG-DELPOLICY1.XML, SOLRCONFIG-LAZYWRITER.XML, DA_COMPOUNDDICTIONARY.TXT, BAD-SCHEMA-NOT-INDEXED-BUT-TF.XML, SOLRCONFIG-SOLCOREPROPERTIES.XML, SOLRCONFIG-MASTER1-KEEPONEBACKUP.XML, TRIVIAL.UPDATEPROCESSOR1.JS, BAD-SCHEMA-DUP-FIELDTYPE.XML, SCHEMA12.XML, ELEVATE.XML]
[junit4:junit4]   2> 621 T1853 oass.SolrIndexSearcher.<init> Opening Searcher@6268440 main
[junit4:junit4]   2> 621 T1853 oass.SolrIndexSearcher.getIndexDir WARNING WARNING: Directory impl does not support setting indexDir: org.apache.lucene.store.MockDirectoryWrapper
[junit4:junit4]   2> 621 T1853 oasu.CommitTracker.<init> Hard AutoCommit: disabled
[junit4:junit4]   2> 622 T1853 oasu.CommitTracker.<init> Soft AutoCommit: disabled
[junit4:junit4]   2> 622 T1853 oashc.QueryElevationComponent.inform Loading QueryElevation from: /mnt/ssd/jenkins/workspace/Lucene-Solr-4.x-Linux-Java8-64/checkout/solr/build/solr-core/test-files/solr/collection1/conf/elevate.xml
[junit4:junit4]   2> 629 T1853 oashc.QueryElevationComponent.inform Loading QueryElevation from: /mnt/ssd/jenkins/workspace/Lucene-Solr-4.x-Linux-Java8-64/checkout/solr/build/solr-core/test-files/solr/collection1/conf/elevate.xml
[junit4:junit4]   2> 636 T1883 oasc.SolrCore.registerSearcher [collection1] Registered new searcher Searcher@6268440 main{StandardDirectoryReader(segments_1:1)}
[junit4:junit4]   2> 636 T1853 oasc.CoreContainer.register registering core: collection1
[junit4:junit4]   2> 637 T1853 oass.SolrDispatchFilter.init user.dir=/mnt/ssd/jenkins/workspace/Lucene-Solr-4.x-Linux-Java8-64/checkout/solr/build/solr-core/test/J1
[junit4:junit4]   2> 637 T1853 oass.SolrDispatchFilter.init SolrDispatchFilter.init() done
[junit4:junit4]   2> 637 T1853 oascsi.HttpClientUtil.createClient Creating new http client, config:maxConnections=128&maxConnectionsPerHost=32&followRedirects=false
[junit4:junit4]   2> 640 T1853 oejs.Server.doStart jetty-8.1.2.v20120308
[junit4:junit4]   2> 642 T1853 oejs.AbstractConnector.doStart Started SocketConnector@0.0.0.0:51782
[junit4:junit4]   2> 643 T1853 oasc.SolrResourceLoader.locateSolrHome JNDI not configured for solr (NoInitialContextEx)
[junit4:junit4]   2> 643 T1853 oasc.SolrResourceLoader.locateSolrHome using system property solr.solr.home: /mnt/ssd/jenkins/workspace/Lucene-Solr-4.x-Linux-Java8-64/checkout/solr/build/solr-core/test-files/solr
[junit4:junit4]   2> 643 T1853 oasc.SolrResourceLoader.<init> new SolrResourceLoader for deduced Solr Home: '/mnt/ssd/jenkins/workspace/Lucene-Solr-4.x-Linux-Java8-64/checkout/solr/build/solr-core/test-files/solr/'
[junit4:junit4]   2> 646 T1853 oass.SolrDispatchFilter.init SolrDispatchFilter.init()
[junit4:junit4]   2> 647 T1853 oasc.SolrResourceLoader.locateSolrHome JNDI not configured for solr (NoInitialContextEx)
[junit4:junit4]   2> 647 T1853 oasc.SolrResourceLoader.locateSolrHome using system property solr.solr.home: /mnt/ssd/jenkins/workspace/Lucene-Solr-4.x-Linux-Java8-64/checkout/solr/build/solr-core/test-files/solr
[junit4:junit4]   2> 647 T1853 oasc.CoreContainer$Initializer.initialize looking for solr.xml: /mnt/ssd/jenkins/workspace/Lucene-Solr-4.x-Linux-Java8-64/checkout/solr/build/solr-core/test-files/solr/solr.xml
[junit4:junit4]   2> 648 T1853 oasc.CoreContainer.<init> New CoreContainer 9327517
[junit4:junit4]   2> 648 T1853 oasc.CoreContainer.load Loading CoreContainer using Solr Home: '/mnt/ssd/jenkins/workspace/Lucene-Solr-4.x-Linux-Java8-64/checkout/solr/build/solr-core/test-files/solr/'
[junit4:junit4]   2> 648 T1853 oasc.SolrResourceLoader.<init> new SolrResourceLoader for directory: '/mnt/ssd/jenkins/workspace/Lucene-Solr-4.x-Linux-Java8-64/checkout/solr/build/solr-core/test-files/solr/'
[junit4:junit4]   2> 654 T1853 oasc.CoreContainer.load Registering Log Listener
[junit4:junit4]   2> 663 T1853 oashc.HttpShardHandlerFactory.getParameter Setting socketTimeout to: 0
[junit4:junit4]   2> 663 T1853 oashc.HttpShardHandlerFactory.getParameter Setting urlScheme to: http://
[junit4:junit4]   2> 663 T1853 oashc.HttpShardHandlerFactory.getParameter Setting connTimeout to: 0
[junit4:junit4]   2> 663 T1853 oashc.HttpShardHandlerFactory.getParameter Setting maxConnectionsPerHost to: 20
[junit4:junit4]   2> 664 T1853 oashc.HttpShardHandlerFactory.getParameter Setting corePoolSize to: 0
[junit4:junit4]   2> 664 T1853 oashc.HttpShardHandlerFactory.getParameter Setting maximumPoolSize to: 2147483647
[junit4:junit4]   2> 664 T1853 oashc.HttpShardHandlerFactory.getParameter Setting maxThreadIdleTime to: 5
[junit4:junit4]   2> 664 T1853 oashc.HttpShardHandlerFactory.getParameter Setting sizeOfQueue to: -1
[junit4:junit4]   2> 665 T1853 oashc.HttpShardHandlerFactory.getParameter Setting fairnessPolicy to: false
[junit4:junit4]   2> 665 T1853 oascsi.HttpClientUtil.createClient Creating new http client, config:maxConnectionsPerHost=20&maxConnections=10000&socketTimeout=0&connTimeout=0&retry=false
[junit4:junit4]   2> 670 T1853 oasc.CoreContainer.create Creating SolrCore 'collection1' using instanceDir: /mnt/ssd/jenkins/workspace/Lucene-Solr-4.x-Linux-Java8-64/checkout/solr/build/solr-core/test-files/solr/collection1
[junit4:junit4]   2> 670 T1853 oasc.SolrResourceLoader.<init> new SolrResourceLoader for directory: '/mnt/ssd/jenkins/workspace/Lucene-Solr-4.x-Linux-Java8-64/checkout/solr/build/solr-core/test-files/solr/collection1/'
[junit4:junit4]   2> 671 T1853 oasc.SolrResourceLoader.replaceClassLoader Adding 'file:/mnt/ssd/jenkins/workspace/Lucene-Solr-4.x-Linux-Java8-64/checkout/solr/build/solr-core/test-files/solr/collection1/lib/README' to classloader
[junit4:junit4]   2> 671 T1853 oasc.SolrResourceLoader.replaceClassLoader Adding 'file:/mnt/ssd/jenkins/workspace/Lucene-Solr-4.x-Linux-Java8-64/checkout/solr/build/solr-core/test-files/solr/collection1/lib/classes/' to classloader
[junit4:junit4]   2> 689 T1853 oasc.SolrConfig.<init> Using Lucene MatchVersion: LUCENE_40
[junit4:junit4]   2> 724 T1853 oasc.SolrConfig.<init> Loaded SolrConfig: solrconfig-elevate.xml
[junit4:junit4]   2> 724 T1853 oass.IndexSchema.readSchema Reading Solr Schema
[junit4:junit4]   2> 727 T1853 oass.IndexSchema.readSchema Schema name=example
[junit4:junit4]   2> 859 T1853 oass.IndexSchema.readSchema default search field in schema is text
[junit4:junit4]   2> 861 T1853 oass.IndexSchema.readSchema unique key field: id
[junit4:junit4]   2> 862 T1853 oasc.SolrCore.<init> [collection1] Opening new SolrCore at /mnt/ssd/jenkins/workspace/Lucene-Solr-4.x-Linux-Java8-64/checkout/solr/build/solr-core/test-files/solr/collection1/, dataDir=./org.apache.solr.handler.component.DistributedQueryElevationComponentTest-1342886111874/shard2/data/
[junit4:junit4]   2> 862 T1853 oasc.JmxMonitoredMap.<init> JMX monitoring is enabled. Adding Solr mbeans to JMX Server: com.sun.jmx.mbeanserver.JmxMBeanServer@4ea2b99f
[junit4:junit4]   2> 863 T1853 oasc.SolrCore.getNewIndexDir WARNING New index directory detected: old=null new=./org.apache.solr.handler.component.DistributedQueryElevationComponentTest-1342886111874/shard2/data/index/
[junit4:junit4]   2> 863 T1853 oasc.SolrCore.initIndex WARNING [collection1] Solr index directory './org.apache.solr.handler.component.DistributedQueryElevationComponentTest-1342886111874/shard2/data/index' doesn't exist. Creating new index...
[junit4:junit4]   2> 864 T1853 oasc.SolrDeletionPolicy.onCommit SolrDeletionPolicy.onCommit: commits:num=1
[junit4:junit4]   2> 		commit{dir=MockDirWrapper(org.apache.lucene.store.RAMDirectory@3a8f5491 lockFactory=org.apache.lucene.store.SingleInstanceLockFactory@630163ab),segFN=segments_1,generation=1,filenames=[segments_1]
[junit4:junit4]   2> 864 T1853 oasc.SolrDeletionPolicy.updateCommits newest commit = 1
[junit4:junit4]   2> 865 T1853 oasc.RequestHandlers.initHandlersFromConfig created /update: solr.UpdateRequestHandler
[junit4:junit4]   2> 865 T1853 oasc.RequestHandlers.initHandlersFromConfig created /elevate: org.apache.solr.handler.component.SearchHandler
[junit4:junit4]   2> 865 T1853 oasc.RequestHandlers.initHandlersFromConfig created /dataElevate: org.apache.solr.handler.component.SearchHandler
[junit4:junit4]   2> 865 T1853 oashl.XMLLoader.init xsltCacheLifetimeSeconds=60
[junit4:junit4]   2> 866 T1853 oasc.RequestHandlers.initHandlersFromConfig WARNING no default request handler is registered (either '/select' or 'standard')
[junit4:junit4]   2> 866 T1853 oasc.SolrCore.initDeprecatedSupport WARNING solrconfig.xml uses deprecated <admin/gettableFiles>, Please update your config to use the ShowFileRequestHandler.
[junit4:junit4]   2> 867 T1853 oasc.SolrCore.initDeprecatedSupport WARNING adding ShowFileRequestHandler with hidden files: [SOLRCONFIG-SCRIPT-UPDATEPROCESSOR.XML, SOLRCONFIG-HIGHLIGHT.XML, SCHEMA-LUCENEMATCHVERSION.XML, THROW.ERROR.ON.ADD.UPDATEPROCESSOR.JS, STOP-2.TXT, STEMDICT.TXT, SCHEMA-SPELLCHECKER.XML, MISSLEADING.EXTENSION.UPDATEPROCESSOR.JS.TXT, XSLT, SOLRCONFIG-MASTER1.XML, SCHEMA.XML, SOLRCONFIG-TLOG.XML, SCHEMA-REQUIRED-FIELDS.XML, SCHEMA-COPYFIELD-TEST.XML, BAD-MP-SOLRCONFIG.XML, BAD-SCHEMA-SIM-GLOBAL-VS-FT-MISMATCH.XML, WDFTYPES.TXT, BAD-SCHEMA-OMIT-TF-BUT-NOT-POS.XML, BAD-SCHEMA-DUP-FIELD.XML, SCHEMA-PHRASESUGGEST.XML, DA_UTF8.XML, SOLRCONFIG-ENABLEPLUGIN.XML, SCHEMA-BM25.XML, SCHEMA-BINARYFIELD.XML, SOLRCONFIG_PERF.XML, SOLRCONFIG-SLAVE.XML, PROTWORDS.TXT, BAD-SCHEMA-CODEC-GLOBAL-VS-FT-MISMATCH.XML, KEEP-2.TXT, SOLRCONFIG_CODEC.XML, OPEN-EXCHANGE-RATES.JSON, SCHEMA-IB.XML, BAD-SCHEMA-UNIQUEKEY-IS-COPYFIELD-DEST.XML, SOLRCONFIG-SOLR-749.XML, SOLRCONFIG-SLAVE1.XML, SCHEMA-CHARFILTERS.XML, SOLRCONFIG-SPELLCHECKER.XML, SOLRCONFIG-PHRASESUGGEST.XML, HUNSPELL-TEST.AFF, STOPWORDSWRONGENCODING.TXT, BAD_SOLRCONFIG.XML, SOLRCONFIG-BASIC.XML, BAD-SCHEMA-NOT-INDEXED-BUT-POS.XML, FRENCHARTICLES.TXT, SOLRCONFIG-QUERYSENDER.XML, BAD-SOLRCONFIG-BOGUS-SCRIPTENGINE-NAME.XML, SOLRCONFIG-NATIVELOCK.XML, MISSING.FUNCTIONS.UPDATEPROCESSOR.JS, STOP-SNOWBALL.TXT, STOPTYPES-2.TXT, BAD-SCHEMA-NOT-INDEXED-BUT-NORMS.XML, CURRENCY.XML, SCHEMA15.XML, SCHEMA11.XML, SCHEMA-LMDIRICHLET.XML, SCHEMA-COLLATE.XML, SOLRCONFIG-SPELLCHECKCOMPONENT.XML, SOLRCONFIG-ALTDIRECTORY.XML, BAD-SCHEMA-EXTERNAL-FILEFIELD.XML, OLD_SYNONYMS.TXT, SOLRCONFIG-MASTER.XML, STOPWORDS.TXT, SOLRCONFIG-TRANSFORMERS.XML, BAD-SCHEMA-DUP-DYNAMICFIELD.XML, SOLRCONFIG-DELPOLICY2.XML, SOLRCONFIG-BASIC-LUCENEVERSION31.XML, BAD-SCHEMA-NONTEXT-ANALYZER.XML, SOLRCONFIG-REPEATER.XML, SOLRCONFIG-REQHANDLER.INCL, SOLRCONFIG-MASTER3.XML, BAD-SOLRCONFIG-INVALID-SCRIPTFILE.XML, BAD-SCHEMA-UNIQUEKEY-USES-DEFAULT.XML, STOPWITHBOM.TXT, SCHEMA-NOT-REQUIRED-UNIQUE-KEY.XML, STOP-1.TXT, SOLRCONFIG-MERGEPOLICY.XML, HUNSPELL-TEST.DIC, CONDITIONAL.UPDATEPROCESSOR.JS, SOLRCONFIG-ELEVATE.XML, SCHEMA-SIM.XML, KEEP-1.TXT, SCHEMASURROUND.XML, SCHEMA-REPLICATION1.XML, STOPTYPES-1.TXT, SOLRCONFIG-PROPINJECT-INDEXDEFAULT.XML, SCHEMA-TRIE.XML, SCHEMA-REVERSED.XML, SOLRCONFIG-PROPINJECT.XML, SOLRCONFIG-CACHING.XML, SYNONYMS.TXT, TRIVIAL.UPDATEPROCESSOR0.JS, SOLRCONFIG-UPDATE-PROCESSOR-CHAINS.XML, SCHEMA-DFR.XML, PHRASESUGGEST.TXT, SCHEMA-NUMERIC.XML, SOLRCONFIG-TERMINDEX.XML, SOLRCONFIG-FUNCTIONQUERY.XML, SOLRCONFIG-NOCACHE.XML, SCHEMA_CODEC.XML, COMPOUNDDICTIONARY.TXT, SOLRCONFIG-XINCLUDE.XML, SCHEMA-TFIDF.XML, ADDFIELDS.UPDATEPROCESSOR.JS, MAPPING-ISOLATIN1ACCENT.TXT, SCHEMA-STOP-KEEP.XML, SCHEMA-COLLATEFILTER.XML, SOLRCONFIG-QUERYSENDER-NOQUERY.XML, SCHEMA-LMJELINEKMERCER.XML, HYPHENATION.DTD, SOLRCONFIG-SIMPLELOCK.XML, SCHEMA-FOLDING.XML, SOLRCONFIG-MASTER2.XML, SCHEMA-REPLICATION2.XML, SCHEMA-MINIMAL.XML, BAD-SOLRCONFIG-MISSING-SCRIPTFILE.XML, SOLRCONFIG-DELPOLICY1.XML, SOLRCONFIG-LAZYWRITER.XML, DA_COMPOUNDDICTIONARY.TXT, BAD-SCHEMA-NOT-INDEXED-BUT-TF.XML, SOLRCONFIG-SOLCOREPROPERTIES.XML, SOLRCONFIG-MASTER1-KEEPONEBACKUP.XML, TRIVIAL.UPDATEPROCESSOR1.JS, BAD-SCHEMA-DUP-FIELDTYPE.XML, SCHEMA12.XML, ELEVATE.XML]
[junit4:junit4]   2> 868 T1853 oass.SolrIndexSearcher.<init> Opening Searcher@1c6a4e17 main
[junit4:junit4]   2> 869 T1853 oass.SolrIndexSearcher.getIndexDir WARNING WARNING: Directory impl does not support setting indexDir: org.apache.lucene.store.MockDirectoryWrapper
[junit4:junit4]   2> 869 T1853 oasu.CommitTracker.<init> Hard AutoCommit: disabled
[junit4:junit4]   2> 869 T1853 oasu.CommitTracker.<init> Soft AutoCommit: disabled
[junit4:junit4]   2> 869 T1853 oashc.QueryElevationComponent.inform Loading QueryElevation from: /mnt/ssd/jenkins/workspace/Lucene-Solr-4.x-Linux-Java8-64/checkout/solr/build/solr-core/test-files/solr/collection1/conf/elevate.xml
[junit4:junit4]   2> 874 T1853 oashc.QueryElevationComponent.inform Loading QueryElevation from: /mnt/ssd/jenkins/workspace/Lucene-Solr-4.x-Linux-Java8-64/checkout/solr/build/solr-core/test-files/solr/collection1/conf/elevate.xml
[junit4:junit4]   2> 879 T1893 oasc.SolrCore.registerSearcher [collection1] Registered new searcher Searcher@1c6a4e17 main{StandardDirectoryReader(segments_1:1)}
[junit4:junit4]   2> 879 T1853 oasc.CoreContainer.register registering core: collection1
[junit4:junit4]   2> 879 T1853 oass.SolrDispatchFilter.init user.dir=/mnt/ssd/jenkins/workspace/Lucene-Solr-4.x-Linux-Java8-64/checkout/solr/build/solr-core/test/J1
[junit4:junit4]   2> 880 T1853 oass.SolrDispatchFilter.init SolrDispatchFilter.init() done
[junit4:junit4]   2> 880 T1853 oascsi.HttpClientUtil.createClient Creating new http client, config:maxConnections=128&maxConnectionsPerHost=32&followRedirects=false
[junit4:junit4]   2> ASYNC  NEW_CORE C82 name=collection1 org.apache.solr.core.SolrCore@2d58ec03
[junit4:junit4]   2> 887 T1857 C82 oasu.DirectUpdateHandler2.deleteAll [collection1] REMOVING ALL DOCUMENTS FROM INDEX
[junit4:junit4]   2> 888 T1857 C82 oasc.SolrDeletionPolicy.onInit SolrDeletionPolicy.onInit: commits:num=1
[junit4:junit4]   2> 		commit{dir=MockDirWrapper(org.apache.lucene.store.RAMDirectory@28eed037 lockFactory=org.apache.lucene.store.SingleInstanceLockFactory@275ad5eb),segFN=segments_1,generation=1,filenames=[segments_1]
[junit4:junit4]   2> 889 T1857 C82 oasc.SolrDeletionPolicy.updateCommits newest commit = 1
[junit4:junit4]   2> 889 T1857 C82 UPDATE [collection1] webapp=/solr path=/update params={wt=javabin&version=2} {deleteByQuery=*:*} 0 3
[junit4:junit4]   2> ASYNC  NEW_CORE C83 name=collection1 org.apache.solr.core.SolrCore@78abd0e7
[junit4:junit4]   2> 894 T1866 C83 oasu.DirectUpdateHandler2.deleteAll [collection1] REMOVING ALL DOCUMENTS FROM INDEX
[junit4:junit4]   2> 895 T1866 C83 oasc.SolrDeletionPolicy.onInit SolrDeletionPolicy.onInit: commits:num=1
[junit4:junit4]   2> 		commit{dir=MockDirWrapper(org.apache.lucene.store.RAMDirectory@58202b95 lockFactory=org.apache.lucene.store.SingleInstanceLockFactory@a4e4d15),segFN=segments_1,generation=1,filenames=[segments_1]
[junit4:junit4]   2> 895 T1866 C83 oasc.SolrDeletionPolicy.updateCommits newest commit = 1
[junit4:junit4]   2> 896 T1866 C83 UPDATE [collection1] webapp=/solr path=/update params={wt=javabin&version=2} {deleteByQuery=*:*} 0 2
[junit4:junit4]   2> ASYNC  NEW_CORE C84 name=collection1 org.apache.solr.core.SolrCore@15e2da62
[junit4:junit4]   2> 899 T1876 C84 oasu.DirectUpdateHandler2.deleteAll [collection1] REMOVING ALL DOCUMENTS FROM INDEX
[junit4:junit4]   2> 899 T1876 C84 oasc.SolrDeletionPolicy.onInit SolrDeletionPolicy.onInit: commits:num=1
[junit4:junit4]   2> 		commit{dir=MockDirWrapper(org.apache.lucene.store.RAMDirectory@606f6327 lockFactory=org.apache.lucene.store.SingleInstanceLockFactory@649c80bd),segFN=segments_1,generation=1,filenames=[segments_1]
[junit4:junit4]   2> 900 T1876 C84 oasc.SolrDeletionPolicy.updateCommits newest commit = 1
[junit4:junit4]   2> 900 T1876 C84 UPDATE [collection1] webapp=/solr path=/update params={wt=javabin&version=2} {deleteByQuery=*:*} 0 2
[junit4:junit4]   2> ASYNC  NEW_CORE C85 name=collection1 org.apache.solr.core.SolrCore@44322e91
[junit4:junit4]   2> 904 T1886 C85 oasu.DirectUpdateHandler2.deleteAll [collection1] REMOVING ALL DOCUMENTS FROM INDEX
[junit4:junit4]   2> 904 T1886 C85 oasc.SolrDeletionPolicy.onInit SolrDeletionPolicy.onInit: commits:num=1
[junit4:junit4]   2> 		commit{dir=MockDirWrapper(org.apache.lucene.store.RAMDirectory@3a8f5491 lockFactory=org.apache.lucene.store.SingleInstanceLockFactory@630163ab),segFN=segments_1,generation=1,filenames=[segments_1]
[junit4:junit4]   2> 905 T1886 C85 oasc.SolrDeletionPolicy.updateCommits newest commit = 1
[junit4:junit4]   2> 905 T1886 C85 UPDATE [collection1] webapp=/solr path=/update params={wt=javabin&version=2} {deleteByQuery=*:*} 0 1
[junit4:junit4]   2> 910 T1857 C82 UPDATE [collection1] webapp=/solr path=/update params={wt=javabin&version=2} {add=[1]} 0 3
[junit4:junit4]   2> 912 T1866 C83 UPDATE [collection1] webapp=/solr path=/update params={wt=javabin&version=2} {add=[1]} 0 1
[junit4:junit4]   2> 913 T1857 C82 UPDATE [collection1] webapp=/solr path=/update params={wt=javabin&version=2} {add=[2]} 0 0
[junit4:junit4]   2> 915 T1876 C84 UPDATE [collection1] webapp=/solr path=/update params={wt=javabin&version=2} {add=[2]} 0 0
[junit4:junit4]   2> 917 T1857 C82 UPDATE [collection1] webapp=/solr path=/update params={wt=javabin&version=2} {add=[3]} 0 0
[junit4:junit4]   2> 919 T1886 C85 UPDATE [collection1] webapp=/solr path=/update params={wt=javabin&version=2} {add=[3]} 0 1
[junit4:junit4]   2> 920 T1857 C82 UPDATE [collection1] webapp=/solr path=/update params={wt=javabin&version=2} {add=[4]} 0 0
[junit4:junit4]   2> 922 T1866 C83 UPDATE [collection1] webapp=/solr path=/update params={wt=javabin&version=2} {add=[4]} 0 0
[junit4:junit4]   2> 923 T1857 C82 UPDATE [collection1] webapp=/solr path=/update params={wt=javabin&version=2} {add=[5]} 0 0
[junit4:junit4]   2> 925 T1876 C84 UPDATE [collection1] webapp=/solr path=/update params={wt=javabin&version=2} {add=[5]} 0 0
[junit4:junit4]   2> 927 T1857 C82 UPDATE [collection1] webapp=/solr path=/update params={wt=javabin&version=2} {add=[6]} 0 1
[junit4:junit4]   2> 928 T1886 C85 UPDATE [collection1] webapp=/solr path=/update params={wt=javabin&version=2} {add=[6]} 0 0
[junit4:junit4]   2> 930 T1857 C82 UPDATE [collection1] webapp=/solr path=/update params={wt=javabin&version=2} {add=[7]} 0 0
[junit4:junit4]   2> 932 T1886 C85 UPDATE [collection1] webapp=/solr path=/update params={wt=javabin&version=2} {add=[7]} 0 1
[junit4:junit4]   2> 933 T1857 C82 oasu.DirectUpdateHandler2.commit start commit{flags=0,version=0,optimize=false,openSearcher=true,waitSearcher=true,expungeDeletes=false,softCommit=false}
[junit4:junit4]   2> 936 T1857 C82 oasc.SolrDeletionPolicy.onCommit SolrDeletionPolicy.onCommit: commits:num=2
[junit4:junit4]   2> 		commit{dir=MockDirWrapper(org.apache.lucene.store.RAMDirectory@28eed037 lockFactory=org.apache.lucene.store.SingleInstanceLockFactory@275ad5eb),segFN=segments_1,generation=1,filenames=[segments_1]
[junit4:junit4]   2> 		commit{dir=MockDirWrapper(org.apache.lucene.store.RAMDirectory@28eed037 lockFactory=org.apache.lucene.store.SingleInstanceLockFactory@275ad5eb),segFN=segments_2,generation=2,filenames=[_0_MockRandom_0.doc, _0_MockRandom_0.pyl, _0_Lucene40_0.tip, _0_Lucene40_0.frq, _0_nrm.cfs, _0_Lucene40_0.tim, _0_Lucene40_0.prx, _0_MockRandom_0.sd, _0_nrm.cfe, _0_MockRandom_0.pos, _0.fdt, segments_2, _0_MockRandom_0.tib, _0.fdx, _0_MockRandom_0.skp, _0.si, _0_MockRandom_0.frq, _0.fnm, _0_MockRandom_0.tii]
[junit4:junit4]   2> 937 T1857 C82 oasc.SolrDeletionPolicy.updateCommits newest commit = 2
[junit4:junit4]   2> 942 T1857 C82 oass.SolrIndexSearcher.<init> Opening Searcher@245489c0 main
[junit4:junit4]   2> 942 T1857 C82 oass.SolrIndexSearcher.getIndexDir WARNING WARNING: Directory impl does not support setting indexDir: org.apache.lucene.store.MockDirectoryWrapper
[junit4:junit4]   2> 942 T1857 C82 oasu.DirectUpdateHandler2.commit end_commit_flush
[junit4:junit4]   2> 942 T1863 oasc.SolrCore.registerSearcher [collection1] Registered new searcher Searcher@245489c0 main{StandardDirectoryReader(segments_2:4 _0(4.0.0.1):C7)}
[junit4:junit4]   2> 943 T1857 C82 UPDATE [collection1] webapp=/solr path=/update params={commit=true&softCommit=false&wt=javabin&version=2&waitSearcher=true} {commit=} 0 10
[junit4:junit4]   2> 945 T1866 C83 oasu.DirectUpdateHandler2.commit start commit{flags=0,version=0,optimize=false,openSearcher=true,waitSearcher=true,expungeDeletes=false,softCommit=false}
[junit4:junit4]   2> 946 T1866 C83 oasc.SolrDeletionPolicy.onCommit SolrDeletionPolicy.onCommit: commits:num=2
[junit4:junit4]   2> 		commit{dir=MockDirWrapper(org.apache.lucene.store.RAMDirectory@58202b95 lockFactory=org.apache.lucene.store.SingleInstanceLockFactory@a4e4d15),segFN=segments_1,generation=1,filenames=[segments_1]
[junit4:junit4]   2> 		commit{dir=MockDirWrapper(org.apache.lucene.store.RAMDirectory@58202b95 lockFactory=org.apache.lucene.store.SingleInstanceLockFactory@a4e4d15),segFN=segments_2,generation=2,filenames=[_0_Lucene40_0.tip, _0_Lucene40_0.frq, _0_Lucene40_0.tim, _0_nrm.cfs, _0_Lucene40_0.prx, _0_MockRandom_0.sd, _0_nrm.cfe, _0_MockRandom_0.prx, segments_2, _0.fdt, _0_MockRandom_0.tib, _0.fdx, _0.si, _0_MockRandom_0.frq, _0.fnm, _0_MockRandom_0.tii]
[junit4:junit4]   2> 946 T1866 C83 oasc.SolrDeletionPolicy.updateCommits newest commit = 2
[junit4:junit4]   2> 947 T1866 C83 oass.SolrIndexSearcher.<init> Opening Searcher@7d809357 main
[junit4:junit4]   2> 948 T1866 C83 oass.SolrIndexSearcher.getIndexDir WARNING WARNING: Directory impl does not support setting indexDir: org.apache.lucene.store.MockDirectoryWrapper
[junit4:junit4]   2> 948 T1866 C83 oasu.DirectUpdateHandler2.commit end_commit_flush
[junit4:junit4]   2> 948 T1873 oasc.SolrCore.registerSearcher [collection1] Registered new searcher Searcher@7d809357 main{StandardDirectoryReader(segments_2:4 _0(4.0.0.1):C2)}
[junit4:junit4]   2> 949 T1866 C83 UPDATE [collection1] webapp=/solr path=/update params={commit=true&softCommit=false&wt=javabin&version=2&waitSearcher=true} {commit=} 0 4
[junit4:junit4]   2> 950 T1876 C84 oasu.DirectUpdateHandler2.commit start commit{flags=0,version=0,optimize=false,openSearcher=true,waitSearcher=true,expungeDeletes=false,softCommit=false}
[junit4:junit4]   2> 951 T1876 C84 oasc.SolrDeletionPolicy.onCommit SolrDeletionPolicy.onCommit: commits:num=2
[junit4:junit4]   2> 		commit{dir=MockDirWrapper(org.apache.lucene.store.RAMDirectory@606f6327 lockFactory=org.apache.lucene.store.SingleInstanceLockFactory@649c80bd),segFN=segments_1,generation=1,filenames=[segments_1]
[junit4:junit4]   2> 		commit{dir=MockDirWrapper(org.apache.lucene.store.RAMDirectory@606f6327 lockFactory=org.apache.lucene.store.SingleInstanceLockFactory@649c80bd),segFN=segments_2,generation=2,filenames=[_0_MockRandom_0.doc, _0_MockRandom_0.tip, _0_MockRandom_0.pyl, _0_Lucene40_0.tip, _0_Lucene40_0.frq, _0_nrm.cfs, _0_Lucene40_0.tim, _0_Lucene40_0.prx, _0_MockRandom_0.sd, _0_MockRandom_0.tim, _0_nrm.cfe, _0_MockRandom_0.pos, _0.fdt, segments_2, _0.fdx, _0_MockRandom_0.skp, _0.si, _0_MockRandom_0.frq, _0.fnm]
[junit4:junit4]   2> 951 T1876 C84 oasc.SolrDeletionPolicy.updateCommits newest commit = 2
[junit4:junit4]   2> 952 T1876 C84 oass.SolrIndexSearcher.<init> Opening Searcher@9e781d6 main
[junit4:junit4]   2> 952 T1876 C84 oass.SolrIndexSearcher.getIndexDir WARNING WARNING: Directory impl does not support setting indexDir: org.apache.lucene.store.MockDirectoryWrapper
[junit4:junit4]   2> 952 T1876 C84 oasu.DirectUpdateHandler2.commit end_commit_flush
[junit4:junit4]   2> 952 T1883 oasc.SolrCore.registerSearcher [collection1] Registered new searcher Searcher@9e781d6 main{StandardDirectoryReader(segments_2:4 _0(4.0.0.1):C2)}
[junit4:junit4]   2> 953 T1876 C84 UPDATE [collection1] webapp=/solr path=/update params={commit=true&softCommit=false&wt=javabin&version=2&waitSearcher=true} {commit=} 0 3
[junit4:junit4]   2> 955 T1886 C85 oasu.DirectUpdateHandler2.commit start commit{flags=0,version=0,optimize=false,openSearcher=true,waitSearcher=true,expungeDeletes=false,softCommit=false}
[junit4:junit4]   2> 955 T1886 C85 oasc.SolrDeletionPolicy.onCommit SolrDeletionPolicy.onCommit: commits:num=2
[junit4:junit4]   2> 		commit{dir=MockDirWrapper(org.apache.lucene.store.RAMDirectory@3a8f5491 lockFactory=org.apache.lucene.store.SingleInstanceLockFactory@630163ab),segFN=segments_1,generation=1,filenames=[segments_1]
[junit4:junit4]   2> 		commit{dir=MockDirWrapper(org.apache.lucene.store.RAMDirectory@3a8f5491 lockFactory=org.apache.lucene.store.SingleInstanceLockFactory@630163ab),segFN=segments_2,generation=2,filenames=[_0_MockRandom_0.tip, _0_Lucene40_0.tip, _0_Lucene40_0.frq, _0_Lucene40_0.tim, _0_nrm.cfs, _0_Lucene40_0.prx, _0_MockRandom_0.sd, _0_MockRandom_0.tim, _0_nrm.cfe, _0_MockRandom_0.prx, segments_2, _0.fdt, _0.fdx, _0.si, _0_MockRandom_0.frq, _0.fnm]
[junit4:junit4]   2> 956 T1886 C85 oasc.SolrDeletionPolicy.updateCommits newest commit = 2
[junit4:junit4]   2> 956 T1886 C85 oass.SolrIndexSearcher.<init> Opening Searcher@784089b4 main
[junit4:junit4]   2> 956 T1886 C85 oass.SolrIndexSearcher.getIndexDir WARNING WARNING: Directory impl does not support setting indexDir: org.apache.lucene.store.MockDirectoryWrapper
[junit4:junit4]   2> 956 T1886 C85 oasu.DirectUpdateHandler2.commit end_commit_flush
[junit4:junit4]   2> 957 T1893 oasc.SolrCore.registerSearcher [collection1] Registered new searcher Searcher@784089b4 main{StandardDirectoryReader(segments_2:4 _0(4.0.0.1):C3)}
[junit4:junit4]   2> 957 T1886 C85 UPDATE [collection1] webapp=/solr path=/update params={commit=true&softCommit=false&wt=javabin&version=2&waitSearcher=true} {commit=} 0 2
[junit4:junit4]   2> 960 T1857 C82 REQ [collection1] webapp=/solr path=/elevate params={qt=/elevate&q=*:*&shards.qt=/elevate&rows=500&fl=id,+score,+[elevated]&wt=javabin&version=2&sort=id+desc&distrib=false} hits=7 status=0 QTime=1 
[junit4:junit4]   2> 965 T1877 C84 REQ [collection1] webapp=/solr path=/elevate params={isShard=true&rows=500&wt=javabin&shard.url=[::1]:33332/solr|localhost:57923/solr&fsv=true&NOW=1342886112835&qt=/elevate&q=*:*&shards.qt=/elevate&fl=id,score&start=0&version=2&sort=id+desc&distrib=false} hits=2 status=0 QTime=0 
[junit4:junit4]   2> 965 T1887 C85 REQ [collection1] webapp=/solr path=/elevate params={isShard=true&rows=500&wt=javabin&shard.url=localhost:51782/solr&fsv=true&NOW=1342886112835&qt=/elevate&q=*:*&shards.qt=/elevate&fl=id,score&start=0&version=2&sort=id+desc&distrib=false} hits=3 status=0 QTime=0 
[junit4:junit4]   2> 965 T1867 C83 REQ [collection1] webapp=/solr path=/elevate params={isShard=true&rows=500&wt=javabin&shard.url=localhost:52603/solr&fsv=true&NOW=1342886112835&qt=/elevate&q=*:*&shards.qt=/elevate&fl=id,score&start=0&version=2&sort=id+desc&distrib=false} hits=2 status=0 QTime=1 
[junit4:junit4]   2> 967 T1887 C85 REQ [collection1] webapp=/solr path=/elevate params={isShard=true&rows=500&wt=javabin&shard.url=localhost:51782/solr&NOW=1342886112835&qt=/elevate&q=*:*&ids=6.0,7.0,3.0&shards.qt=/elevate&fl=id,+score,+[elevated]&version=2&distrib=false} status=0 QTime=0 
[junit4:junit4]   2> 967 T1877 C84 REQ [collection1] webapp=/solr path=/elevate params={isShard=true&rows=500&wt=javabin&shard.url=[::1]:33332/solr|localhost:57923/solr&NOW=1342886112835&qt=/elevate&q=*:*&ids=5.0,2.0&shards.qt=/elevate&fl=id,+score,+[elevated]&version=2&distrib=false} status=0 QTime=0 
[junit4:junit4]   2> 968 T1867 C83 REQ [collection1] webapp=/solr path=/elevate params={isShard=true&rows=500&wt=javabin&shard.url=localhost:52603/solr&NOW=1342886112835&qt=/elevate&q=*:*&ids=4.0,1.0&shards.qt=/elevate&fl=id,+score,+[elevated]&version=2&distrib=false} status=0 QTime=1 
[junit4:junit4]   2> 968 T1866 C83 REQ [collection1] webapp=/solr path=/elevate params={qt=/elevate&q=*:*&shards.qt=/elevate&rows=500&fl=id,+score,+[elevated]&shards=localhost:52603/solr,[::1]:33332/solr|localhost:57923/solr,localhost:51782/solr&wt=javabin&version=2&sort=id+desc} status=0 QTime=6 
[junit4:junit4]   2> 968 T1853 oas.BaseDistributedSearchTestCase.compareResponses SEVERE Mismatched responses:
[junit4:junit4]   2> 	{responseHeader={status=0,QTime=6,params={qt=/elevate,q=*:*,shards.qt=/elevate,rows=500,fl=id, score, [elevated],shards=localhost:52603/solr,[::1]:33332/solr|localhost:57923/solr,localhost:51782/solr,wt=javabin,version=2,sort=id desc}},response={numFound=7,start=0,maxScore=1.0,docs=[SolrDocument{id=7.0, [elevated]=false, score=1.0}, SolrDocument{id=6.0, [elevated]=false, score=1.0}, SolrDocument{id=5.0, [elevated]=false, score=1.0}, SolrDocument{id=4.0, [elevated]=false, score=1.0}, SolrDocument{id=3.0, [elevated]=false, score=1.0}, SolrDocument{id=2.0, [elevated]=false, score=1.0}, SolrDocument{id=1.0, [elevated]=false, score=1.0}]}}
[junit4:junit4]   2> 	{responseHeader={status=0,QTime=1,params={qt=/elevate,q=*:*,shards.qt=/elevate,rows=500,fl=id, score, [elevated],wt=javabin,version=2,sort=id desc,distrib=false}},response={numFound=7,start=0,maxScore=1.0,docs=[SolrDocument{id=7.0, score=1.0, [elevated]=false}, SolrDocument{id=6.0, score=1.0, [elevated]=false}, SolrDocument{id=5.0, score=1.0, [elevated]=false}, SolrDocument{id=4.0, score=1.0, [elevated]=false}, SolrDocument{id=3.0, score=1.0, [elevated]=false}, SolrDocument{id=2.0, score=1.0, [elevated]=false}, SolrDocument{id=1.0, score=1.0, [elevated]=false}]}}
[junit4:junit4]   2> 969 T1853 oasc.CoreContainer.shutdown Shutting down CoreContainer instance=975416451
[junit4:junit4]   2> 969 T1853 oasc.SolrCore.close [collection1]  CLOSING SolrCore org.apache.solr.core.SolrCore@2d58ec03
[junit4:junit4]   2> 970 T1853 oasc.SolrCore.closeSearcher [collection1] Closing main searcher on request.
[junit4:junit4]   2> 970 T1853 oasu.DirectUpdateHandler2.close closing DirectUpdateHandler2{commits=1,autocommits=0,soft autocommits=0,optimizes=0,rollbacks=0,expungeDeletes=0,docsPending=0,adds=0,deletesById=0,deletesByQuery=0,errors=0,cumulative_adds=7,cumulative_deletesById=0,cumulative_deletesByQuery=1,cumulative_errors=0}
[junit4:junit4]   2> 973 T1853 oejsh.ContextHandler.doStop stopped o.e.j.s.ServletContextHandler{/solr,null}
[junit4:junit4]   2> 1025 T1853 oasc.CoreContainer.shutdown Shutting down CoreContainer instance=1530650946
[junit4:junit4]   2> 1025 T1853 oasc.SolrCore.close [collection1]  CLOSING SolrCore org.apache.solr.core.SolrCore@78abd0e7
[junit4:junit4]   2> 1026 T1853 oasc.SolrCore.closeSearcher [collection1] Closing main searcher on request.
[junit4:junit4]   2> 1026 T1853 oasu.DirectUpdateHandler2.close closing DirectUpdateHandler2{commits=1,autocommits=0,soft autocommits=0,optimizes=0,rollbacks=0,expungeDeletes=0,docsPending=0,adds=0,deletesById=0,deletesByQuery=0,errors=0,cumulative_adds=2,cumulative_deletesById=0,cumulative_deletesByQuery=1,cumulative_errors=0}
[junit4:junit4]   2> 1029 T1853 oejsh.ContextHandler.doStop stopped o.e.j.s.ServletContextHandler{/solr,null}
[junit4:junit4]   2> 1081 T1853 oasc.CoreContainer.shutdown Shutting down CoreContainer instance=1943539812
[junit4:junit4]   2> 1082 T1853 oasc.SolrCore.close [collection1]  CLOSING SolrCore org.apache.solr.core.SolrCore@15e2da62
[junit4:junit4]   2> 1082 T1853 oasc.SolrCore.closeSearcher [collection1] Closing main searcher on request.
[junit4:junit4]   2> 1082 T1853 oasu.DirectUpdateHandler2.close closing DirectUpdateHandler2{commits=1,autocommits=0,soft autocommits=0,optimizes=0,rollbacks=0,expungeDeletes=0,docsPending=0,adds=0,deletesById=0,deletesByQuery=0,errors=0,cumulative_adds=2,cumulative_deletesById=0,cumulative_deletesByQuery=1,cumulative_errors=0}
[junit4:junit4]   2> 1084 T1853 oejsh.ContextHandler.doStop stopped o.e.j.s.ServletContextHandler{/solr,null}
[junit4:junit4]   2> 1136 T1853 oasc.CoreContainer.shutdown Shutting down CoreContainer instance=9327517
[junit4:junit4]   2> 1136 T1853 oasc.SolrCore.close [collection1]  CLOSING SolrCore org.apache.solr.core.SolrCore@44322e91
[junit4:junit4]   2> 1137 T1853 oasc.SolrCore.closeSearcher [collection1] Closing main searcher on request.
[junit4:junit4]   2> 1137 T1853 oasu.DirectUpdateHandler2.close closing DirectUpdateHandler2{commits=1,autocommits=0,soft autocommits=0,optimizes=0,rollbacks=0,expungeDeletes=0,docsPending=0,adds=0,deletesById=0,deletesByQuery=0,errors=0,cumulative_adds=3,cumulative_deletesById=0,cumulative_deletesByQuery=1,cumulative_errors=0}
[junit4:junit4]   2> 1139 T1853 oejsh.ContextHandler.doStop stopped o.e.j.s.ServletContextHandler{/solr,null}
[junit4:junit4]   2> 1190 T1853 oas.SolrTestCaseJ4.tearDown ###Ending testDistribSearch
[junit4:junit4]   2> NOTE: reproduce with: ant test  -Dtestcase=DistributedQueryElevationComponentTest -Dtests.method=testDistribSearch -Dtests.seed=83EB1ADAA015C622 -Dtests.multiplier=3 -Dtests.slow=true -Dtests.locale=hr_HR -Dtests.timezone=Etc/GMT -Dtests.file.encoding=US-ASCII
[junit4:junit4]   2>
[junit4:junit4]    > (@AfterClass output)
[junit4:junit4]   2> 1229 T1853 oas.SolrTestCaseJ4.deleteCore ###deleteCore
[junit4:junit4]   2> NOTE: test params are: codec=Lucene40: {plow_t=PostingsFormat(name=MockRandom), text=PostingsFormat(name=MockRandom), id=Lucene40(minBlockSize=76 maxBlockSize=171), field_t=Lucene40(minBlockSize=76 maxBlockSize=171), int_i=PostingsFormat(name=MockRandom)}, sim=DefaultSimilarity, locale=hr_HR, timezone=Etc/GMT
[junit4:junit4]   2> NOTE: Linux 3.2.0-26-generic amd64/Oracle Corporation 1.8.0-ea (64-bit)/cpus=8,threads=1,free=157472672,total=323944448
[junit4:junit4]   2> NOTE: All tests run in this JVM: [TestNorwegianMinimalStemFilterFactory, DistanceFunctionTest, FullSolrCloudTest, IndexSchemaTest, UniqFieldsUpdateProcessorFactoryTest, TestIBSimilarityFactory, TestCJKBigramFilterFactory, TestDefaultSimilarityFactory, TestLMJelinekMercerSimilarityFactory, TestPropInjectDefaults, TestJapaneseTokenizerFactory, CloudStateUpdateTest, DocumentAnalysisRequestHandlerTest, TestRangeQuery, DocumentBuilderTest, TestLMDirichletSimilarityFactory, TestCharFilters, TestPersianNormalizationFilterFactory, CloudStateTest, TestBeiderMorseFilterFactory, FieldMutatingUpdateProcessorTest, TestSolrDeletionPolicy1, TestStressVersions, TestLuceneMatchVersion, CSVRequestHandlerTest, QueryEqualityTest, ResourceLoaderTest, NotRequiredUniqueKeyTest, BasicZkTest, SignatureUpdateProcessorFactoryTest, SolrCoreTest, TestRemoteStreaming, TestNGramFilters, TestArbitraryIndexDir, TestPatternReplaceFilterFactory, TestCollationField, SpellingQueryConverterTest, PrimUtilsTest, PeerSyncTest, TimeZoneUtilsTest, TestIndonesianStemFilterFactory, LengthFilterTest, ZkSolrClientTest, TestNumberUtils, TestSuggestSpellingConverter, DirectSolrConnectionTest, SortByFunctionTest, TestMultiCoreConfBootstrap, TestValueSourceCache, TestWikipediaTokenizerFactory, TestCzechStemFilterFactory, NoCacheHeaderTest, TestRealTimeGet, TestQuerySenderNoQuery, AlternateDirectoryTest, OverseerTest, TestCoreContainer, TestFastLRUCache, TestUtils, TestRussianFilters, TestCSVResponseWriter, TestWriterPerf, TestStopFilterFactory, TestDocumentBuilder, TestSolrJ, TestPortugueseLightStemFilterFactory, TestKeepFilterFactory, SuggesterFSTTest, TestGreekStemFilterFactory, TestTurkishLowerCaseFilterFactory, TestStressRecovery, TestSystemIdResolver, TestXIncludeConfig, SpellPossibilityIteratorTest, TestRTGBase, RecoveryZkTest, SpellCheckComponentTest, FullSolrCloudDistribCmdsTest, LeaderElectionIntegrationTest, ZkControllerTest, AutoCommitTest, TestPhoneticFilterFactory, TestHashPartitioner, TestRecovery, DirectUpdateHandlerTest, LukeRequestHandlerTest, TestSort, TestGroupingSearch, TestFiltering, QueryElevationComponentTest, TestJmxIntegration, TestIndexSearcher, TestTrie, PolyFieldTest, DistributedQueryElevationComponentTest]
[junit4:junit4]   2> 
[junit4:junit4] Completed on J1 in 1.24s, 1 test, 1 failure <<< FAILURES!

[...truncated 343 lines...]
BUILD FAILED
/mnt/ssd/jenkins/workspace/Lucene-Solr-4.x-Linux-Java8-64/checkout/build.xml:29: The following error occurred while executing this line:
/mnt/ssd/jenkins/workspace/Lucene-Solr-4.x-Linux-Java8-64/checkout/solr/build.xml:144: The following error occurred while executing this line:
/mnt/ssd/jenkins/workspace/Lucene-Solr-4.x-Linux-Java8-64/checkout/lucene/module-build.xml:62: The following error occurred while executing this line:
/mnt/ssd/jenkins/workspace/Lucene-Solr-4.x-Linux-Java8-64/checkout/lucene/common-build.xml:1094: The following error occurred while executing this line:
/mnt/ssd/jenkins/workspace/Lucene-Solr-4.x-Linux-Java8-64/checkout/lucene/common-build.xml:789: There were test failures: 304 suites, 1083 tests, 1 failure, 5 ignored

Total time: 18 minutes 30 seconds
Build step 'Execute shell' marked build as failure
Archiving artifacts
Recording test results
Email was triggered for: Failure
Sending email for trigger: Failure




Mime
View raw message