lucene-dev mailing list archives

Site index · List index
Message view « Date » · « Thread »
Top « Date » · « Thread »
From Policeman Jenkins Server <jenk...@sd-datasolutions.de>
Subject [JENKINS] Lucene-Solr-4.x-Linux-Java7-64 - Build # 552 - Failure!
Date Fri, 27 Jul 2012 09:34:15 GMT
Build: http://jenkins.sd-datasolutions.de/job/Lucene-Solr-4.x-Linux-Java7-64/552/

1 tests failed.
REGRESSION:  org.apache.solr.core.CoreContainerCoreInitFailuresTest.testFlowBadFromStart

Error Message:
reload exception doesn't mention bad prolog: El contenido no está permitido en el prólogo.

Stack Trace:
java.lang.AssertionError: reload exception doesn't mention bad prolog: El contenido no está
permitido en el prólogo.
	at __randomizedtesting.SeedInfo.seed([309F02A8311E5A1B:AA65C950D5E1D41F]:0)
	at org.junit.Assert.fail(Assert.java:93)
	at org.junit.Assert.assertTrue(Assert.java:43)
	at org.apache.solr.core.CoreContainerCoreInitFailuresTest.testFlowBadFromStart(CoreContainerCoreInitFailuresTest.java:255)
	at sun.reflect.NativeMethodAccessorImpl.invoke0(Native Method)
	at sun.reflect.NativeMethodAccessorImpl.invoke(NativeMethodAccessorImpl.java:57)
	at sun.reflect.DelegatingMethodAccessorImpl.invoke(DelegatingMethodAccessorImpl.java:43)
	at java.lang.reflect.Method.invoke(Method.java:601)
	at com.carrotsearch.randomizedtesting.RandomizedRunner.invoke(RandomizedRunner.java:1995)
	at com.carrotsearch.randomizedtesting.RandomizedRunner.access$1100(RandomizedRunner.java:132)
	at com.carrotsearch.randomizedtesting.RandomizedRunner$6.evaluate(RandomizedRunner.java:818)
	at com.carrotsearch.randomizedtesting.RandomizedRunner$7.evaluate(RandomizedRunner.java:877)
	at com.carrotsearch.randomizedtesting.RandomizedRunner$8.evaluate(RandomizedRunner.java:891)
	at com.carrotsearch.randomizedtesting.rules.SystemPropertiesRestoreRule$1.evaluate(SystemPropertiesRestoreRule.java:53)
	at org.apache.lucene.util.TestRuleSetupTeardownChained$1.evaluate(TestRuleSetupTeardownChained.java:50)
	at org.apache.lucene.util.TestRuleFieldCacheSanity$1.evaluate(TestRuleFieldCacheSanity.java:32)
	at org.apache.lucene.util.AbstractBeforeAfterRule$1.evaluate(AbstractBeforeAfterRule.java:45)
	at com.carrotsearch.randomizedtesting.rules.SystemPropertiesInvariantRule$1.evaluate(SystemPropertiesInvariantRule.java:55)
	at org.apache.lucene.util.TestRuleReportUncaughtExceptions$1.evaluate(TestRuleReportUncaughtExceptions.java:68)
	at org.apache.lucene.util.TestRuleThreadAndTestName$1.evaluate(TestRuleThreadAndTestName.java:48)
	at org.apache.lucene.util.TestRuleIgnoreAfterMaxFailures$1.evaluate(TestRuleIgnoreAfterMaxFailures.java:70)
	at org.apache.lucene.util.TestRuleMarkFailure$1.evaluate(TestRuleMarkFailure.java:48)
	at com.carrotsearch.randomizedtesting.RandomizedRunner.runSingleTest(RandomizedRunner.java:825)
	at com.carrotsearch.randomizedtesting.RandomizedRunner.access$700(RandomizedRunner.java:132)
	at com.carrotsearch.randomizedtesting.RandomizedRunner$3$1.run(RandomizedRunner.java:671)
	at com.carrotsearch.randomizedtesting.RandomizedRunner$3.evaluate(RandomizedRunner.java:697)
	at com.carrotsearch.randomizedtesting.RandomizedRunner$4.evaluate(RandomizedRunner.java:736)
	at com.carrotsearch.randomizedtesting.RandomizedRunner$5.evaluate(RandomizedRunner.java:747)
	at com.carrotsearch.randomizedtesting.rules.SystemPropertiesRestoreRule$1.evaluate(SystemPropertiesRestoreRule.java:53)
	at org.apache.lucene.util.AbstractBeforeAfterRule$1.evaluate(AbstractBeforeAfterRule.java:45)
	at org.apache.lucene.util.TestRuleReportUncaughtExceptions$1.evaluate(TestRuleReportUncaughtExceptions.java:68)
	at org.apache.lucene.util.TestRuleStoreClassName$1.evaluate(TestRuleStoreClassName.java:38)
	at com.carrotsearch.randomizedtesting.rules.SystemPropertiesInvariantRule$1.evaluate(SystemPropertiesInvariantRule.java:55)
	at org.apache.lucene.util.TestRuleNoInstanceHooksOverrides$1.evaluate(TestRuleNoInstanceHooksOverrides.java:53)
	at org.apache.lucene.util.TestRuleNoStaticHooksShadowing$1.evaluate(TestRuleNoStaticHooksShadowing.java:52)
	at org.apache.lucene.util.TestRuleAssertionsRequired$1.evaluate(TestRuleAssertionsRequired.java:36)
	at org.apache.lucene.util.TestRuleMarkFailure$1.evaluate(TestRuleMarkFailure.java:48)
	at org.apache.lucene.util.TestRuleIgnoreAfterMaxFailures$1.evaluate(TestRuleIgnoreAfterMaxFailures.java:70)
	at org.apache.lucene.util.TestRuleIgnoreTestSuites$1.evaluate(TestRuleIgnoreTestSuites.java:55)
	at com.carrotsearch.randomizedtesting.RandomizedRunner.runSuite(RandomizedRunner.java:605)
	at com.carrotsearch.randomizedtesting.RandomizedRunner.access$400(RandomizedRunner.java:132)
	at com.carrotsearch.randomizedtesting.RandomizedRunner$2.run(RandomizedRunner.java:551)




Build Log:
[...truncated 7315 lines...]
[junit4:junit4] Suite: org.apache.solr.core.CoreContainerCoreInitFailuresTest
[junit4:junit4] FAILURE 0.31s J0 | CoreContainerCoreInitFailuresTest.testFlowBadFromStart
[junit4:junit4]    > Throwable #1: java.lang.AssertionError: reload exception doesn't mention
bad prolog: El contenido no está permitido en el prólogo.
[junit4:junit4]    > 	at __randomizedtesting.SeedInfo.seed([309F02A8311E5A1B:AA65C950D5E1D41F]:0)
[junit4:junit4]    > 	at org.junit.Assert.fail(Assert.java:93)
[junit4:junit4]    > 	at org.junit.Assert.assertTrue(Assert.java:43)
[junit4:junit4]    > 	at org.apache.solr.core.CoreContainerCoreInitFailuresTest.testFlowBadFromStart(CoreContainerCoreInitFailuresTest.java:255)
[junit4:junit4]    > 	at sun.reflect.NativeMethodAccessorImpl.invoke0(Native Method)
[junit4:junit4]    > 	at sun.reflect.NativeMethodAccessorImpl.invoke(NativeMethodAccessorImpl.java:57)
[junit4:junit4]    > 	at sun.reflect.DelegatingMethodAccessorImpl.invoke(DelegatingMethodAccessorImpl.java:43)
[junit4:junit4]    > 	at java.lang.reflect.Method.invoke(Method.java:601)
[junit4:junit4]    > 	at com.carrotsearch.randomizedtesting.RandomizedRunner.invoke(RandomizedRunner.java:1995)
[junit4:junit4]    > 	at com.carrotsearch.randomizedtesting.RandomizedRunner.access$1100(RandomizedRunner.java:132)
[junit4:junit4]    > 	at com.carrotsearch.randomizedtesting.RandomizedRunner$6.evaluate(RandomizedRunner.java:818)
[junit4:junit4]    > 	at com.carrotsearch.randomizedtesting.RandomizedRunner$7.evaluate(RandomizedRunner.java:877)
[junit4:junit4]    > 	at com.carrotsearch.randomizedtesting.RandomizedRunner$8.evaluate(RandomizedRunner.java:891)
[junit4:junit4]    > 	at com.carrotsearch.randomizedtesting.rules.SystemPropertiesRestoreRule$1.evaluate(SystemPropertiesRestoreRule.java:53)
[junit4:junit4]    > 	at org.apache.lucene.util.TestRuleSetupTeardownChained$1.evaluate(TestRuleSetupTeardownChained.java:50)
[junit4:junit4]    > 	at org.apache.lucene.util.TestRuleFieldCacheSanity$1.evaluate(TestRuleFieldCacheSanity.java:32)
[junit4:junit4]    > 	at org.apache.lucene.util.AbstractBeforeAfterRule$1.evaluate(AbstractBeforeAfterRule.java:45)
[junit4:junit4]    > 	at com.carrotsearch.randomizedtesting.rules.SystemPropertiesInvariantRule$1.evaluate(SystemPropertiesInvariantRule.java:55)
[junit4:junit4]    > 	at org.apache.lucene.util.TestRuleReportUncaughtExceptions$1.evaluate(TestRuleReportUncaughtExceptions.java:68)
[junit4:junit4]    > 	at org.apache.lucene.util.TestRuleThreadAndTestName$1.evaluate(TestRuleThreadAndTestName.java:48)
[junit4:junit4]    > 	at org.apache.lucene.util.TestRuleIgnoreAfterMaxFailures$1.evaluate(TestRuleIgnoreAfterMaxFailures.java:70)
[junit4:junit4]    > 	at org.apache.lucene.util.TestRuleMarkFailure$1.evaluate(TestRuleMarkFailure.java:48)
[junit4:junit4]    > 	at com.carrotsearch.randomizedtesting.RandomizedRunner.runSingleTest(RandomizedRunner.java:825)
[junit4:junit4]    > 	at com.carrotsearch.randomizedtesting.RandomizedRunner.access$700(RandomizedRunner.java:132)
[junit4:junit4]    > 	at com.carrotsearch.randomizedtesting.RandomizedRunner$3$1.run(RandomizedRunner.java:671)
[junit4:junit4]    > 	at com.carrotsearch.randomizedtesting.RandomizedRunner$3.evaluate(RandomizedRunner.java:697)
[junit4:junit4]    > 	at com.carrotsearch.randomizedtesting.RandomizedRunner$4.evaluate(RandomizedRunner.java:736)
[junit4:junit4]    > 	at com.carrotsearch.randomizedtesting.RandomizedRunner$5.evaluate(RandomizedRunner.java:747)
[junit4:junit4]    > 	at com.carrotsearch.randomizedtesting.rules.SystemPropertiesRestoreRule$1.evaluate(SystemPropertiesRestoreRule.java:53)
[junit4:junit4]    > 	at org.apache.lucene.util.AbstractBeforeAfterRule$1.evaluate(AbstractBeforeAfterRule.java:45)
[junit4:junit4]    > 	at org.apache.lucene.util.TestRuleReportUncaughtExceptions$1.evaluate(TestRuleReportUncaughtExceptions.java:68)
[junit4:junit4]    > 	at org.apache.lucene.util.TestRuleStoreClassName$1.evaluate(TestRuleStoreClassName.java:38)
[junit4:junit4]    > 	at com.carrotsearch.randomizedtesting.rules.SystemPropertiesInvariantRule$1.evaluate(SystemPropertiesInvariantRule.java:55)
[junit4:junit4]    > 	at org.apache.lucene.util.TestRuleNoInstanceHooksOverrides$1.evaluate(TestRuleNoInstanceHooksOverrides.java:53)
[junit4:junit4]    > 	at org.apache.lucene.util.TestRuleNoStaticHooksShadowing$1.evaluate(TestRuleNoStaticHooksShadowing.java:52)
[junit4:junit4]    > 	at org.apache.lucene.util.TestRuleAssertionsRequired$1.evaluate(TestRuleAssertionsRequired.java:36)
[junit4:junit4]    > 	at org.apache.lucene.util.TestRuleMarkFailure$1.evaluate(TestRuleMarkFailure.java:48)
[junit4:junit4]    > 	at org.apache.lucene.util.TestRuleIgnoreAfterMaxFailures$1.evaluate(TestRuleIgnoreAfterMaxFailures.java:70)
[junit4:junit4]    > 	at org.apache.lucene.util.TestRuleIgnoreTestSuites$1.evaluate(TestRuleIgnoreTestSuites.java:55)
[junit4:junit4]    > 	at com.carrotsearch.randomizedtesting.RandomizedRunner.runSuite(RandomizedRunner.java:605)
[junit4:junit4]    > 	at com.carrotsearch.randomizedtesting.RandomizedRunner.access$400(RandomizedRunner.java:132)
[junit4:junit4]    > 	at com.carrotsearch.randomizedtesting.RandomizedRunner$2.run(RandomizedRunner.java:551)
[junit4:junit4]    > 
[junit4:junit4]   2> 3 T1570 oas.SolrTestCaseJ4.setUp ###Starting testFlowBadFromStart
[junit4:junit4]   2> 3 T1570 oasc.CoreContainer.<init> New CoreContainer 1793104756
[junit4:junit4]   2> 5 T1570 oasc.CoreContainer.load Loading CoreContainer using Solr Home:
'/mnt/ssd/jenkins/workspace/Lucene-Solr-4.x-Linux-Java7-64/checkout/solr/build/solr-core/test/J0/./org.apache.solr.core.CoreContainerCoreInitFailuresTest_bad_flow'
[junit4:junit4]   2> 5 T1570 oasc.SolrResourceLoader.<init> new SolrResourceLoader
for directory: '/mnt/ssd/jenkins/workspace/Lucene-Solr-4.x-Linux-Java7-64/checkout/solr/build/solr-core/test/J0/./org.apache.solr.core.CoreContainerCoreInitFailuresTest_bad_flow/'
[junit4:junit4]   2> 15 T1570 oasc.CoreContainer.load Registering Log Listener
[junit4:junit4]   2> 24 T1570 oasc.CoreContainer.create Creating SolrCore 'col_ok' using
instanceDir: /mnt/ssd/jenkins/workspace/Lucene-Solr-4.x-Linux-Java7-64/checkout/solr/build/solr-core/test/J0/./org.apache.solr.core.CoreContainerCoreInitFailuresTest_bad_flow/col_ok
[junit4:junit4]   2> 24 T1570 oasc.SolrResourceLoader.<init> new SolrResourceLoader
for directory: '/mnt/ssd/jenkins/workspace/Lucene-Solr-4.x-Linux-Java7-64/checkout/solr/build/solr-core/test/J0/./org.apache.solr.core.CoreContainerCoreInitFailuresTest_bad_flow/col_ok/'
[junit4:junit4]   2> 42 T1570 oasc.SolrConfig.<init> Using Lucene MatchVersion: LUCENE_40
[junit4:junit4]   2> 67 T1570 oasc.SolrConfig.<init> Loaded SolrConfig: solrconfig.xml
[junit4:junit4]   2> 68 T1570 oass.IndexSchema.readSchema Reading Solr Schema
[junit4:junit4]   2> 69 T1570 oass.IndexSchema.readSchema Schema name=minimal
[junit4:junit4]   2> 76 T1570 oass.IndexSchema.readSchema WARNING no uniqueKey specified
in schema.
[junit4:junit4]   2> 77 T1570 oasc.SolrCore.<init> [col_ok] Opening new SolrCore
at /mnt/ssd/jenkins/workspace/Lucene-Solr-4.x-Linux-Java7-64/checkout/solr/build/solr-core/test/J0/./org.apache.solr.core.CoreContainerCoreInitFailuresTest_bad_flow/col_ok/,
dataDir=/mnt/ssd/jenkins/workspace/Lucene-Solr-4.x-Linux-Java7-64/checkout/solr/build/solr-core/test/J0/./org.apache.solr.core.CoreContainerCoreInitFailuresTest_bad_flow/col_ok/data/
[junit4:junit4]   2> 77 T1570 oasc.SolrCore.<init> JMX monitoring not detected for
core: col_ok
[junit4:junit4]   2> 78 T1570 oasc.SolrCore.getNewIndexDir WARNING New index directory
detected: old=null new=/mnt/ssd/jenkins/workspace/Lucene-Solr-4.x-Linux-Java7-64/checkout/solr/build/solr-core/test/J0/./org.apache.solr.core.CoreContainerCoreInitFailuresTest_bad_flow/col_ok/data/index/
[junit4:junit4]   2> 78 T1570 oasc.SolrCore.initIndex WARNING [col_ok] Solr index directory
'/mnt/ssd/jenkins/workspace/Lucene-Solr-4.x-Linux-Java7-64/checkout/solr/build/solr-core/test/J0/./org.apache.solr.core.CoreContainerCoreInitFailuresTest_bad_flow/col_ok/data/index'
doesn't exist. Creating new index...
[junit4:junit4]   2> 79 T1570 oasc.SolrDeletionPolicy.onCommit SolrDeletionPolicy.onCommit:
commits:num=1
[junit4:junit4]   2> 		commit{dir=MockDirWrapper(org.apache.lucene.store.RAMDirectory@51852696
lockFactory=org.apache.lucene.store.NativeFSLockFactory@1534642f),segFN=segments_1,generation=1,filenames=[segments_1]
[junit4:junit4]   2> 80 T1570 oasc.SolrDeletionPolicy.updateCommits newest commit = 1
[junit4:junit4]   2> 80 T1570 oasc.RequestHandlers.initHandlersFromConfig created standard:
solr.StandardRequestHandler
[junit4:junit4]   2> 82 T1570 oass.SolrIndexSearcher.<init> Opening Searcher@4d40bf1d
main
[junit4:junit4]   2> 82 T1570 oass.SolrIndexSearcher.getIndexDir WARNING WARNING: Directory
impl does not support setting indexDir: org.apache.lucene.store.MockDirectoryWrapper
[junit4:junit4]   2> 83 T1570 oasu.CommitTracker.<init> Hard AutoCommit: disabled
[junit4:junit4]   2> 83 T1570 oasu.CommitTracker.<init> Soft AutoCommit: disabled
[junit4:junit4]   2> 83 T1570 oashc.HttpShardHandlerFactory.getParameter Setting socketTimeout
to: 0
[junit4:junit4]   2> 83 T1570 oashc.HttpShardHandlerFactory.getParameter Setting urlScheme
to: http://
[junit4:junit4]   2> 83 T1570 oashc.HttpShardHandlerFactory.getParameter Setting connTimeout
to: 0
[junit4:junit4]   2> 84 T1570 oashc.HttpShardHandlerFactory.getParameter Setting maxConnectionsPerHost
to: 20
[junit4:junit4]   2> 84 T1570 oashc.HttpShardHandlerFactory.getParameter Setting corePoolSize
to: 0
[junit4:junit4]   2> 84 T1570 oashc.HttpShardHandlerFactory.getParameter Setting maximumPoolSize
to: 2147483647
[junit4:junit4]   2> 84 T1570 oashc.HttpShardHandlerFactory.getParameter Setting maxThreadIdleTime
to: 5
[junit4:junit4]   2> 84 T1570 oashc.HttpShardHandlerFactory.getParameter Setting sizeOfQueue
to: -1
[junit4:junit4]   2> 84 T1570 oashc.HttpShardHandlerFactory.getParameter Setting fairnessPolicy
to: false
[junit4:junit4]   2> 85 T1570 oascsi.HttpClientUtil.createClient Creating new http client,
config:maxConnectionsPerHost=20&maxConnections=10000&socketTimeout=0&connTimeout=0&retry=false
[junit4:junit4]   2> 87 T1571 oasc.SolrCore.registerSearcher [col_ok] Registered new searcher
Searcher@4d40bf1d main{StandardDirectoryReader(segments_1:1)}
[junit4:junit4]   2> 86 T1570 oasc.CoreContainer.register registering core: col_ok
[junit4:junit4]   2> 88 T1570 oasc.CoreContainer.create Creating SolrCore 'col_bad' using
instanceDir: /mnt/ssd/jenkins/workspace/Lucene-Solr-4.x-Linux-Java7-64/checkout/solr/build/solr-core/test/J0/./org.apache.solr.core.CoreContainerCoreInitFailuresTest_bad_flow/col_bad
[junit4:junit4]   2> 88 T1570 oasc.SolrResourceLoader.<init> new SolrResourceLoader
for directory: '/mnt/ssd/jenkins/workspace/Lucene-Solr-4.x-Linux-Java7-64/checkout/solr/build/solr-core/test/J0/./org.apache.solr.core.CoreContainerCoreInitFailuresTest_bad_flow/col_bad/'
[junit4:junit4]   2> 106 T1570 oasc.SolrConfig.<init> Using Lucene MatchVersion:
LUCENE_40
[junit4:junit4]   2> 131 T1570 oasc.SolrConfig.<init> Loaded SolrConfig: solrconfig.xml
[junit4:junit4]   2> 131 T1570 oass.IndexSchema.readSchema Reading Solr Schema
[junit4:junit4]   2> 133 T1570 oass.IndexSchema.readSchema Schema name=minimal
[junit4:junit4]   2> 140 T1570 oass.IndexSchema.readSchema WARNING no uniqueKey specified
in schema.
[junit4:junit4]   2> 141 T1570 oasc.SolrCore.<init> [col_bad] Opening new SolrCore
at /mnt/ssd/jenkins/workspace/Lucene-Solr-4.x-Linux-Java7-64/checkout/solr/build/solr-core/test/J0/./org.apache.solr.core.CoreContainerCoreInitFailuresTest_bad_flow/col_bad/,
dataDir=/mnt/ssd/jenkins/workspace/Lucene-Solr-4.x-Linux-Java7-64/checkout/solr/build/solr-core/test/J0/./org.apache.solr.core.CoreContainerCoreInitFailuresTest_bad_flow/col_bad/data/
[junit4:junit4]   2> 141 T1570 oasc.SolrCore.<init> JMX monitoring not detected for
core: col_bad
[junit4:junit4]   2> 141 T1570 oasc.SolrCore.getNewIndexDir WARNING New index directory
detected: old=null new=/mnt/ssd/jenkins/workspace/Lucene-Solr-4.x-Linux-Java7-64/checkout/solr/build/solr-core/test/J0/./org.apache.solr.core.CoreContainerCoreInitFailuresTest_bad_flow/col_bad/data/index/
[junit4:junit4]   2> 142 T1570 oasc.SolrCore.initIndex WARNING [col_bad] Solr index directory
'/mnt/ssd/jenkins/workspace/Lucene-Solr-4.x-Linux-Java7-64/checkout/solr/build/solr-core/test/J0/./org.apache.solr.core.CoreContainerCoreInitFailuresTest_bad_flow/col_bad/data/index'
doesn't exist. Creating new index...
[junit4:junit4]   2> 144 T1570 oasc.SolrException.log Ignoring exception matching \QDummyMergePolicy\E
[junit4:junit4]   2> 144 T1570 oasc.CoreContainer.create Creating SolrCore 'col_bad' using
instanceDir: /mnt/ssd/jenkins/workspace/Lucene-Solr-4.x-Linux-Java7-64/checkout/solr/build/solr-core/test/J0/./org.apache.solr.core.CoreContainerCoreInitFailuresTest_bad_flow/col_bad
[junit4:junit4]   2> 145 T1570 oasc.SolrResourceLoader.<init> new SolrResourceLoader
for directory: '/mnt/ssd/jenkins/workspace/Lucene-Solr-4.x-Linux-Java7-64/checkout/solr/build/solr-core/test/J0/./org.apache.solr.core.CoreContainerCoreInitFailuresTest_bad_flow/col_bad/'
[junit4:junit4]   2> 163 T1570 oasc.SolrConfig.<init> Using Lucene MatchVersion:
LUCENE_40
[junit4:junit4]   2> 188 T1570 oasc.SolrConfig.<init> Loaded SolrConfig: solrconfig.xml
[junit4:junit4]   2> 188 T1570 oass.IndexSchema.readSchema Reading Solr Schema
[junit4:junit4]   2> 190 T1570 oass.IndexSchema.readSchema Schema name=minimal
[junit4:junit4]   2> 196 T1570 oass.IndexSchema.readSchema WARNING no uniqueKey specified
in schema.
[junit4:junit4]   2> 197 T1570 oasc.SolrCore.<init> [col_bad] Opening new SolrCore
at /mnt/ssd/jenkins/workspace/Lucene-Solr-4.x-Linux-Java7-64/checkout/solr/build/solr-core/test/J0/./org.apache.solr.core.CoreContainerCoreInitFailuresTest_bad_flow/col_bad/,
dataDir=/mnt/ssd/jenkins/workspace/Lucene-Solr-4.x-Linux-Java7-64/checkout/solr/build/solr-core/test/J0/./org.apache.solr.core.CoreContainerCoreInitFailuresTest_bad_flow/col_bad/data/
[junit4:junit4]   2> 197 T1570 oasc.SolrCore.<init> JMX monitoring not detected for
core: col_bad
[junit4:junit4]   2> 198 T1570 oasc.SolrCore.getNewIndexDir WARNING New index directory
detected: old=null new=/mnt/ssd/jenkins/workspace/Lucene-Solr-4.x-Linux-Java7-64/checkout/solr/build/solr-core/test/J0/./org.apache.solr.core.CoreContainerCoreInitFailuresTest_bad_flow/col_bad/data/index/
[junit4:junit4]   2> 198 T1570 oasc.SolrCore.initIndex WARNING [col_bad] Solr index directory
'/mnt/ssd/jenkins/workspace/Lucene-Solr-4.x-Linux-Java7-64/checkout/solr/build/solr-core/test/J0/./org.apache.solr.core.CoreContainerCoreInitFailuresTest_bad_flow/col_bad/data/index'
doesn't exist. Creating new index...
[junit4:junit4]   2> 199 T1570 oasc.SolrDeletionPolicy.onCommit SolrDeletionPolicy.onCommit:
commits:num=1
[junit4:junit4]   2> 		commit{dir=MockDirWrapper(org.apache.lucene.store.RAMDirectory@56bfe13a
lockFactory=org.apache.lucene.store.NativeFSLockFactory@158f5880),segFN=segments_1,generation=1,filenames=[segments_1]
[junit4:junit4]   2> 200 T1570 oasc.SolrDeletionPolicy.updateCommits newest commit = 1
[junit4:junit4]   2> 200 T1570 oasc.RequestHandlers.initHandlersFromConfig created standard:
solr.StandardRequestHandler
[junit4:junit4]   2> 202 T1570 oass.SolrIndexSearcher.<init> Opening Searcher@7fa68329
main
[junit4:junit4]   2> 202 T1570 oass.SolrIndexSearcher.getIndexDir WARNING WARNING: Directory
impl does not support setting indexDir: org.apache.lucene.store.MockDirectoryWrapper
[junit4:junit4]   2> 202 T1570 oasu.CommitTracker.<init> Hard AutoCommit: disabled
[junit4:junit4]   2> 203 T1570 oasu.CommitTracker.<init> Soft AutoCommit: disabled
[junit4:junit4]   2> 203 T1570 oasc.CoreContainer.register registering core: col_bad
[junit4:junit4]   2> 203 T1572 oasc.SolrCore.registerSearcher [col_bad] Registered new
searcher Searcher@7fa68329 main{StandardDirectoryReader(segments_1:1)}
[junit4:junit4]   2> 203 T1570 oasc.CoreContainer.create Creating SolrCore 'bogus' using
instanceDir: /mnt/ssd/jenkins/workspace/Lucene-Solr-4.x-Linux-Java7-64/checkout/solr/build/solr-core/test/J0/./org.apache.solr.core.CoreContainerCoreInitFailuresTest_bad_flow/bogus_path
[junit4:junit4]   2> 203 T1570 oasc.SolrResourceLoader.<init> new SolrResourceLoader
for directory: '/mnt/ssd/jenkins/workspace/Lucene-Solr-4.x-Linux-Java7-64/checkout/solr/build/solr-core/test/J0/./org.apache.solr.core.CoreContainerCoreInitFailuresTest_bad_flow/bogus_path/'
[junit4:junit4]   2> 209 T1570 oasc.CoreContainer.register registering core: bogus
[junit4:junit4]   2> 209 T1570 oasc.CoreContainer.reload Reloading SolrCore 'col_bad' using
instanceDir: /mnt/ssd/jenkins/workspace/Lucene-Solr-4.x-Linux-Java7-64/checkout/solr/build/solr-core/test/J0/./org.apache.solr.core.CoreContainerCoreInitFailuresTest_bad_flow/col_bad
[junit4:junit4]   2> 209 T1570 oasc.SolrResourceLoader.<init> new SolrResourceLoader
for directory: '/mnt/ssd/jenkins/workspace/Lucene-Solr-4.x-Linux-Java7-64/checkout/solr/build/solr-core/test/J0/./org.apache.solr.core.CoreContainerCoreInitFailuresTest_bad_flow/col_bad/'
[junit4:junit4]   2> 219 T1570 oasc.SolrException.log SEVERE Exception during parsing file:
solrconfig.xml:org.xml.sax.SAXParseException; systemId: solrres:/solrconfig.xml; lineNumber:
1; columnNumber: 1; El contenido no est? permitido en el pr?logo.
[junit4:junit4]   2> 		at com.sun.org.apache.xerces.internal.util.ErrorHandlerWrapper.createSAXParseException(ErrorHandlerWrapper.java:198)
[junit4:junit4]   2> 		at com.sun.org.apache.xerces.internal.util.ErrorHandlerWrapper.fatalError(ErrorHandlerWrapper.java:177)
[junit4:junit4]   2> 		at com.sun.org.apache.xerces.internal.impl.XMLErrorReporter.reportError(XMLErrorReporter.java:441)
[junit4:junit4]   2> 		at com.sun.org.apache.xerces.internal.impl.XMLErrorReporter.reportError(XMLErrorReporter.java:368)
[junit4:junit4]   2> 		at com.sun.org.apache.xerces.internal.impl.XMLScanner.reportFatalError(XMLScanner.java:1388)
[junit4:junit4]   2> 		at com.sun.org.apache.xerces.internal.impl.XMLDocumentScannerImpl$PrologDriver.next(XMLDocumentScannerImpl.java:996)
[junit4:junit4]   2> 		at com.sun.org.apache.xerces.internal.impl.XMLDocumentScannerImpl.next(XMLDocumentScannerImpl.java:607)
[junit4:junit4]   2> 		at com.sun.org.apache.xerces.internal.impl.XMLNSDocumentScannerImpl.next(XMLNSDocumentScannerImpl.java:116)
[junit4:junit4]   2> 		at com.sun.org.apache.xerces.internal.impl.XMLDocumentFragmentScannerImpl.scanDocument(XMLDocumentFragmentScannerImpl.java:488)
[junit4:junit4]   2> 		at com.sun.org.apache.xerces.internal.parsers.XML11Configuration.parse(XML11Configuration.java:835)
[junit4:junit4]   2> 		at com.sun.org.apache.xerces.internal.parsers.XML11Configuration.parse(XML11Configuration.java:764)
[junit4:junit4]   2> 		at com.sun.org.apache.xerces.internal.parsers.XMLParser.parse(XMLParser.java:123)
[junit4:junit4]   2> 		at com.sun.org.apache.xerces.internal.parsers.DOMParser.parse(DOMParser.java:237)
[junit4:junit4]   2> 		at com.sun.org.apache.xerces.internal.jaxp.DocumentBuilderImpl.parse(DocumentBuilderImpl.java:300)
[junit4:junit4]   2> 		at org.apache.solr.core.Config.<init>(Config.java:129)
[junit4:junit4]   2> 		at org.apache.solr.core.Config.<init>(Config.java:78)
[junit4:junit4]   2> 		at org.apache.solr.core.SolrConfig.<init>(SolrConfig.java:117)
[junit4:junit4]   2> 		at org.apache.solr.core.SolrCore.reload(SolrCore.java:364)
[junit4:junit4]   2> 		at org.apache.solr.core.CoreContainer.reload(CoreContainer.java:1015)
[junit4:junit4]   2> 		at org.apache.solr.core.CoreContainerCoreInitFailuresTest.testFlowBadFromStart(CoreContainerCoreInitFailuresTest.java:250)
[junit4:junit4]   2> 		at sun.reflect.NativeMethodAccessorImpl.invoke0(Native Method)
[junit4:junit4]   2> 		at sun.reflect.NativeMethodAccessorImpl.invoke(NativeMethodAccessorImpl.java:57)
[junit4:junit4]   2> 		at sun.reflect.DelegatingMethodAccessorImpl.invoke(DelegatingMethodAccessorImpl.java:43)
[junit4:junit4]   2> 		at java.lang.reflect.Method.invoke(Method.java:601)
[junit4:junit4]   2> 		at com.carrotsearch.randomizedtesting.RandomizedRunner.invoke(RandomizedRunner.java:1995)
[junit4:junit4]   2> 		at com.carrotsearch.randomizedtesting.RandomizedRunner.access$1100(RandomizedRunner.java:132)
[junit4:junit4]   2> 		at com.carrotsearch.randomizedtesting.RandomizedRunner$6.evaluate(RandomizedRunner.java:818)
[junit4:junit4]   2> 		at com.carrotsearch.randomizedtesting.RandomizedRunner$7.evaluate(RandomizedRunner.java:877)
[junit4:junit4]   2> 		at com.carrotsearch.randomizedtesting.RandomizedRunner$8.evaluate(RandomizedRunner.java:891)
[junit4:junit4]   2> 		at com.carrotsearch.randomizedtesting.rules.SystemPropertiesRestoreRule$1.evaluate(SystemPropertiesRestoreRule.java:53)
[junit4:junit4]   2> 		at org.apache.lucene.util.TestRuleSetupTeardownChained$1.evaluate(TestRuleSetupTeardownChained.java:50)
[junit4:junit4]   2> 		at org.apache.lucene.util.TestRuleFieldCacheSanity$1.evaluate(TestRuleFieldCacheSanity.java:32)
[junit4:junit4]   2> 		at org.apache.lucene.util.AbstractBeforeAfterRule$1.evaluate(AbstractBeforeAfterRule.java:45)
[junit4:junit4]   2> 		at com.carrotsearch.randomizedtesting.rules.SystemPropertiesInvariantRule$1.evaluate(SystemPropertiesInvariantRule.java:55)
[junit4:junit4]   2> 		at org.apache.lucene.util.TestRuleReportUncaughtExceptions$1.evaluate(TestRuleReportUncaughtExceptions.java:68)
[junit4:junit4]   2> 		at org.apache.lucene.util.TestRuleThreadAndTestName$1.evaluate(TestRuleThreadAndTestName.java:48)
[junit4:junit4]   2> 		at org.apache.lucene.util.TestRuleIgnoreAfterMaxFailures$1.evaluate(TestRuleIgnoreAfterMaxFailures.java:70)
[junit4:junit4]   2> 		at org.apache.lucene.util.TestRuleMarkFailure$1.evaluate(TestRuleMarkFailure.java:48)
[junit4:junit4]   2> 		at com.carrotsearch.randomizedtesting.RandomizedRunner.runSingleTest(RandomizedRunner.java:825)
[junit4:junit4]   2> 		at com.carrotsearch.randomizedtesting.RandomizedRunner.access$700(RandomizedRunner.java:132)
[junit4:junit4]   2> 		at com.carrotsearch.randomizedtesting.RandomizedRunner$3$1.run(RandomizedRunner.java:671)
[junit4:junit4]   2> 		at com.carrotsearch.randomizedtesting.RandomizedRunner$3.evaluate(RandomizedRunner.java:697)
[junit4:junit4]   2> 		at com.carrotsearch.randomizedtesting.RandomizedRunner$4.evaluate(RandomizedRunner.java:736)
[junit4:junit4]   2> 		at com.carrotsearch.randomizedtesting.RandomizedRunner$5.evaluate(RandomizedRunner.java:747)
[junit4:junit4]   2> 		at com.carrotsearch.randomizedtesting.rules.SystemPropertiesRestoreRule$1.evaluate(SystemPropertiesRestoreRule.java:53)
[junit4:junit4]   2> 		at org.apache.lucene.util.AbstractBeforeAfterRule$1.evaluate(AbstractBeforeAfterRule.java:45)
[junit4:junit4]   2> 		at org.apache.lucene.util.TestRuleReportUncaughtExceptions$1.evaluate(TestRuleReportUncaughtExceptions.java:68)
[junit4:junit4]   2> 		at org.apache.lucene.util.TestRuleStoreClassName$1.evaluate(TestRuleStoreClassName.java:38)
[junit4:junit4]   2> 		at com.carrotsearch.randomizedtesting.rules.SystemPropertiesInvariantRule$1.evaluate(SystemPropertiesInvariantRule.java:55)
[junit4:junit4]   2> 		at org.apache.lucene.util.TestRuleNoInstanceHooksOverrides$1.evaluate(TestRuleNoInstanceHooksOverrides.java:53)
[junit4:junit4]   2> 		at org.apache.lucene.util.TestRuleNoStaticHooksShadowing$1.evaluate(TestRuleNoStaticHooksShadowing.java:52)
[junit4:junit4]   2> 		at org.apache.lucene.util.TestRuleAssertionsRequired$1.evaluate(TestRuleAssertionsRequired.java:36)
[junit4:junit4]   2> 		at org.apache.lucene.util.TestRuleMarkFailure$1.evaluate(TestRuleMarkFailure.java:48)
[junit4:junit4]   2> 		at org.apache.lucene.util.TestRuleIgnoreAfterMaxFailures$1.evaluate(TestRuleIgnoreAfterMaxFailures.java:70)
[junit4:junit4]   2> 		at org.apache.lucene.util.TestRuleIgnoreTestSuites$1.evaluate(TestRuleIgnoreTestSuites.java:55)
[junit4:junit4]   2> 		at com.carrotsearch.randomizedtesting.RandomizedRunner.runSuite(RandomizedRunner.java:605)
[junit4:junit4]   2> 		at com.carrotsearch.randomizedtesting.RandomizedRunner.access$400(RandomizedRunner.java:132)
[junit4:junit4]   2> 		at com.carrotsearch.randomizedtesting.RandomizedRunner$2.run(RandomizedRunner.java:551)
[junit4:junit4]   2> 	
[junit4:junit4]   2> 220 T1570 oasc.CoreContainer.shutdown Shutting down CoreContainer
instance=1793104756
[junit4:junit4]   2> 220 T1570 oasc.SolrCore.close [col_bad]  CLOSING SolrCore org.apache.solr.core.SolrCore@4e73e204
[junit4:junit4]   2> 220 T1570 oasc.SolrCore.closeSearcher [col_bad] Closing main searcher
on request.
[junit4:junit4]   2> 221 T1570 oasu.DirectUpdateHandler2.close closing DirectUpdateHandler2{commits=0,autocommits=0,soft
autocommits=0,optimizes=0,rollbacks=0,expungeDeletes=0,docsPending=0,adds=0,deletesById=0,deletesByQuery=0,errors=0,cumulative_adds=0,cumulative_deletesById=0,cumulative_deletesByQuery=0,cumulative_errors=0}
[junit4:junit4]   2> 221 T1570 oasc.SolrCore.close [bogus]  CLOSING SolrCore org.apache.solr.core.SolrCore@76099d6f
[junit4:junit4]   2> 221 T1570 oasc.SolrCore.closeSearcher [bogus] Closing main searcher
on request.
[junit4:junit4]   2> 221 T1570 oasu.DirectUpdateHandler2.close closing DirectUpdateHandler2{commits=0,autocommits=0,soft
autocommits=0,optimizes=0,rollbacks=0,expungeDeletes=0,docsPending=0,adds=0,deletesById=0,deletesByQuery=0,errors=0,cumulative_adds=0,cumulative_deletesById=0,cumulative_deletesByQuery=0,cumulative_errors=0}
[junit4:junit4]   2> 223 T1570 oas.SolrTestCaseJ4.tearDown ###Ending testFlowBadFromStart
[junit4:junit4]   2> NOTE: reproduce with: ant test  -Dtestcase=CoreContainerCoreInitFailuresTest
-Dtests.method=testFlowBadFromStart -Dtests.seed=309F02A8311E5A1B -Dtests.multiplier=3 -Dtests.slow=true
-Dtests.locale=es_AR -Dtests.timezone=Etc/GMT-3 -Dtests.file.encoding=US-ASCII
[junit4:junit4]   2>
[junit4:junit4]    > (@AfterClass output)
[junit4:junit4]   2> 351 T1570 oas.SolrTestCaseJ4.deleteCore ###deleteCore
[junit4:junit4]   2> NOTE: test params are: codec=Asserting, sim=RandomSimilarityProvider(queryNorm=true,coord=false):
{}, locale=es_AR, timezone=Etc/GMT-3
[junit4:junit4]   2> NOTE: Linux 3.2.0-26-generic amd64/Oracle Corporation 1.7.0_05 (64-bit)/cpus=8,threads=1,free=164019496,total=457179136
[junit4:junit4]   2> NOTE: All tests run in this JVM: [TestCoreContainer, DistributedSpellCheckComponentTest,
StandardRequestHandlerTest, SolrCoreTest, TestNumberUtils, TestQuerySenderNoQuery, BasicDistributedZkTest,
LeaderElectionIntegrationTest, SortByFunctionTest, SpellPossibilityIteratorTest, UniqFieldsUpdateProcessorFactoryTest,
TestIndexSearcher, TestSearchPerf, TestJmxIntegration, TestIBSimilarityFactory, CurrencyFieldTest,
DistanceFunctionTest, SpatialFilterTest, TestDistributedSearch, MinimalSchemaTest, IndexSchemaRuntimeFieldTest,
CopyFieldTest, PreAnalyzedFieldTest, HighlighterConfigTest, CoreContainerCoreInitFailuresTest]
[junit4:junit4]   2> 
[junit4:junit4] Completed on J0 in 0.36s, 2 tests, 1 failure <<< FAILURES!

[...truncated 500 lines...]
BUILD FAILED
/mnt/ssd/jenkins/workspace/Lucene-Solr-4.x-Linux-Java7-64/checkout/build.xml:29: The following
error occurred while executing this line:
/mnt/ssd/jenkins/workspace/Lucene-Solr-4.x-Linux-Java7-64/checkout/solr/build.xml:144: The
following error occurred while executing this line:
/mnt/ssd/jenkins/workspace/Lucene-Solr-4.x-Linux-Java7-64/checkout/lucene/module-build.xml:62:
The following error occurred while executing this line:
/mnt/ssd/jenkins/workspace/Lucene-Solr-4.x-Linux-Java7-64/checkout/lucene/common-build.xml:1094:
The following error occurred while executing this line:
/mnt/ssd/jenkins/workspace/Lucene-Solr-4.x-Linux-Java7-64/checkout/lucene/common-build.xml:789:
There were test failures: 223 suites, 901 tests, 1 failure, 6 ignored (1 assumption)

Total time: 20 minutes 37 seconds
Build step 'Execute shell' marked build as failure
Archiving artifacts
Recording test results
Email was triggered for: Failure
Sending email for trigger: Failure




Mime
View raw message