lucene-dev mailing list archives

Site index · List index
Message view « Date » · « Thread »
Top « Date » · « Thread »
From Apache Jenkins Server <jenk...@builds.apache.org>
Subject [JENKINS] Lucene-Solr-tests-only-trunk-java7 - Build # 2854 - Failure
Date Mon, 02 Jul 2012 00:23:50 GMT
Build: https://builds.apache.org/job/Lucene-Solr-tests-only-trunk-java7/2854/

1 tests failed.
FAILED:  org.apache.solr.cloud.ChaosMonkeySafeLeaderTest.testDistribSearch

Error Message:
Timeout occured while waiting response from server at: http://localhost:20092/solr/collection1

Stack Trace:
org.apache.solr.client.solrj.SolrServerException: Timeout occured while waiting response from
server at: http://localhost:20092/solr/collection1
	at __randomizedtesting.SeedInfo.seed([91658FF2F43B698D:108301EA836409B1]:0)
	at org.apache.solr.client.solrj.impl.HttpSolrServer.request(HttpSolrServer.java:413)
	at org.apache.solr.client.solrj.impl.HttpSolrServer.request(HttpSolrServer.java:182)
	at org.apache.solr.client.solrj.request.QueryRequest.process(QueryRequest.java:90)
	at org.apache.solr.client.solrj.SolrServer.query(SolrServer.java:324)
	at org.apache.solr.cloud.FullSolrCloudTest.checkShardConsistency(FullSolrCloudTest.java:1107)
	at org.apache.solr.cloud.ChaosMonkeySafeLeaderTest.doTest(ChaosMonkeySafeLeaderTest.java:114)
	at org.apache.solr.BaseDistributedSearchTestCase.testDistribSearch(BaseDistributedSearchTestCase.java:680)
	at sun.reflect.NativeMethodAccessorImpl.invoke0(Native Method)
	at sun.reflect.NativeMethodAccessorImpl.invoke(NativeMethodAccessorImpl.java:57)
	at sun.reflect.DelegatingMethodAccessorImpl.invoke(DelegatingMethodAccessorImpl.java:43)
	at java.lang.reflect.Method.invoke(Method.java:601)
	at com.carrotsearch.randomizedtesting.RandomizedRunner.invoke(RandomizedRunner.java:1969)
	at com.carrotsearch.randomizedtesting.RandomizedRunner.access$1100(RandomizedRunner.java:132)
	at com.carrotsearch.randomizedtesting.RandomizedRunner$6.evaluate(RandomizedRunner.java:814)
	at com.carrotsearch.randomizedtesting.RandomizedRunner$7.evaluate(RandomizedRunner.java:875)
	at com.carrotsearch.randomizedtesting.RandomizedRunner$8.evaluate(RandomizedRunner.java:889)
	at com.carrotsearch.randomizedtesting.rules.SystemPropertiesRestoreRule$1.evaluate(SystemPropertiesRestoreRule.java:53)
	at org.apache.lucene.util.TestRuleSetupTeardownChained$1.evaluate(TestRuleSetupTeardownChained.java:50)
	at org.apache.lucene.util.TestRuleFieldCacheSanity$1.evaluate(TestRuleFieldCacheSanity.java:32)
	at org.apache.lucene.util.AbstractBeforeAfterRule$1.evaluate(AbstractBeforeAfterRule.java:45)
	at com.carrotsearch.randomizedtesting.rules.SystemPropertiesInvariantRule$1.evaluate(SystemPropertiesInvariantRule.java:55)
	at org.apache.lucene.util.TestRuleReportUncaughtExceptions$1.evaluate(TestRuleReportUncaughtExceptions.java:68)
	at org.apache.lucene.util.TestRuleThreadAndTestName$1.evaluate(TestRuleThreadAndTestName.java:48)
	at org.apache.lucene.util.TestRuleIgnoreAfterMaxFailures$1.evaluate(TestRuleIgnoreAfterMaxFailures.java:70)
	at org.apache.lucene.util.TestRuleMarkFailure$1.evaluate(TestRuleMarkFailure.java:48)
	at com.carrotsearch.randomizedtesting.RandomizedRunner.runSingleTest(RandomizedRunner.java:821)
	at com.carrotsearch.randomizedtesting.RandomizedRunner.access$700(RandomizedRunner.java:132)
	at com.carrotsearch.randomizedtesting.RandomizedRunner$3$1.run(RandomizedRunner.java:669)
	at com.carrotsearch.randomizedtesting.RandomizedRunner$3.evaluate(RandomizedRunner.java:695)
	at com.carrotsearch.randomizedtesting.RandomizedRunner$4.evaluate(RandomizedRunner.java:734)
	at com.carrotsearch.randomizedtesting.RandomizedRunner$5.evaluate(RandomizedRunner.java:745)
	at com.carrotsearch.randomizedtesting.rules.SystemPropertiesRestoreRule$1.evaluate(SystemPropertiesRestoreRule.java:53)
	at org.apache.lucene.util.AbstractBeforeAfterRule$1.evaluate(AbstractBeforeAfterRule.java:45)
	at org.apache.lucene.util.TestRuleReportUncaughtExceptions$1.evaluate(TestRuleReportUncaughtExceptions.java:68)
	at org.apache.lucene.util.TestRuleStoreClassName$1.evaluate(TestRuleStoreClassName.java:38)
	at org.apache.lucene.util.TestRuleIcuHack$1.evaluate(TestRuleIcuHack.java:51)
	at com.carrotsearch.randomizedtesting.rules.SystemPropertiesInvariantRule$1.evaluate(SystemPropertiesInvariantRule.java:55)
	at org.apache.lucene.util.TestRuleNoInstanceHooksOverrides$1.evaluate(TestRuleNoInstanceHooksOverrides.java:53)
	at org.apache.lucene.util.TestRuleNoStaticHooksShadowing$1.evaluate(TestRuleNoStaticHooksShadowing.java:52)
	at org.apache.lucene.util.TestRuleAssertionsRequired$1.evaluate(TestRuleAssertionsRequired.java:36)
	at org.apache.lucene.util.TestRuleMarkFailure$1.evaluate(TestRuleMarkFailure.java:48)
	at org.apache.lucene.util.TestRuleIgnoreAfterMaxFailures$1.evaluate(TestRuleIgnoreAfterMaxFailures.java:70)
	at org.apache.lucene.util.TestRuleIgnoreTestSuites$1.evaluate(TestRuleIgnoreTestSuites.java:55)
	at com.carrotsearch.randomizedtesting.RandomizedRunner.runSuite(RandomizedRunner.java:605)
	at com.carrotsearch.randomizedtesting.RandomizedRunner.access$400(RandomizedRunner.java:132)
	at com.carrotsearch.randomizedtesting.RandomizedRunner$2.run(RandomizedRunner.java:551)
Caused by: java.net.SocketTimeoutException: Read timed out
	at java.net.SocketInputStream.socketRead0(Native Method)
	at java.net.SocketInputStream.read(SocketInputStream.java:150)
	at java.net.SocketInputStream.read(SocketInputStream.java:121)
	at org.apache.http.impl.io.AbstractSessionInputBuffer.fillBuffer(AbstractSessionInputBuffer.java:149)
	at org.apache.http.impl.io.SocketInputBuffer.fillBuffer(SocketInputBuffer.java:111)
	at org.apache.http.impl.io.AbstractSessionInputBuffer.readLine(AbstractSessionInputBuffer.java:264)
	at org.apache.http.impl.conn.DefaultResponseParser.parseHead(DefaultResponseParser.java:98)
	at org.apache.http.impl.io.AbstractMessageParser.parse(AbstractMessageParser.java:252)
	at org.apache.http.impl.AbstractHttpClientConnection.receiveResponseHeader(AbstractHttpClientConnection.java:282)
	at org.apache.http.impl.conn.DefaultClientConnection.receiveResponseHeader(DefaultClientConnection.java:247)
	at org.apache.http.impl.conn.AbstractClientConnAdapter.receiveResponseHeader(AbstractClientConnAdapter.java:216)
	at org.apache.http.protocol.HttpRequestExecutor.doReceiveResponse(HttpRequestExecutor.java:298)
	at org.apache.http.protocol.HttpRequestExecutor.execute(HttpRequestExecutor.java:125)
	at org.apache.http.impl.client.DefaultRequestDirector.tryExecute(DefaultRequestDirector.java:647)
	at org.apache.http.impl.client.DefaultRequestDirector.execute(DefaultRequestDirector.java:464)
	at org.apache.http.impl.client.AbstractHttpClient.execute(AbstractHttpClient.java:820)
	at org.apache.http.impl.client.AbstractHttpClient.execute(AbstractHttpClient.java:754)
	at org.apache.http.impl.client.AbstractHttpClient.execute(AbstractHttpClient.java:732)
	at org.apache.solr.client.solrj.impl.HttpSolrServer.request(HttpSolrServer.java:353)
	... 45 more




Build Log:
[...truncated 49369 lines...]
   [junit4]   2> 135452 T1397 oaz.ZooKeeper.close Session: 0x138450ec7f90014 closed
   [junit4]   2> 135452 T1397 oejsh.ContextHandler.doStop stopped o.e.j.s.ServletContextHandler{/solr,null}
   [junit4]   2> 135505 T1397 oasc.CoreContainer.shutdown Shutting down CoreContainer instance=1293318625
   [junit4]   2> 135505 T1397 oasc.RecoveryStrategy.close WARNING Stopping recovery for
core collection1 zkNodeName=127.0.0.1:30412_solr_collection1
   [junit4]   2> 135505 T1397 oasc.SolrCore.close [collection1]  CLOSING SolrCore org.apache.solr.core.SolrCore@474ef943
   [junit4]   2> 135507 T1397 oasc.SolrCore.closeSearcher [collection1] Closing main searcher
on request.
   [junit4]   2> 135508 T1397 oasu.DirectUpdateHandler2.close closing DirectUpdateHandler2{commits=2,autocommits=0,soft
autocommits=0,optimizes=0,rollbacks=0,expungeDeletes=0,docsPending=0,adds=0,deletesById=0,deletesByQuery=0,errors=0,cumulative_adds=472,cumulative_deletesById=232,cumulative_deletesByQuery=0,cumulative_errors=0}
   [junit4]   2> 135508 T1397 oasc.RecoveryStrategy.close WARNING Stopping recovery for
core collection1 zkNodeName=127.0.0.1:30412_solr_collection1
   [junit4]   2> 135567 T1757 oaz.ClientCnxn$SendThread.run Client session timed out, have
not heard from server in 13401ms for sessionid 0x138450ec7f9001c, closing socket connection
and attempting reconnect
   [junit4]   2> 135609 T1661 oaz.ClientCnxn$EventThread.run EventThread shut down
   [junit4]   2> 135609 T1397 oaz.ZooKeeper.close Session: 0x138450ec7f90015 closed
   [junit4]   2> 135609 T1397 oejsh.ContextHandler.doStop stopped o.e.j.s.ServletContextHandler{/solr,null}
   [junit4]   2> 135652 T1674 oaz.ClientCnxn$SendThread.run Client session timed out, have
not heard from server in 13033ms for sessionid 0x138450ec7f90016, closing socket connection
and attempting reconnect
   [junit4]   2> 135662 T1397 oasc.CoreContainer.shutdown Shutting down CoreContainer instance=186984733
   [junit4]   2> 135662 T1397 oasc.RecoveryStrategy.close WARNING Stopping recovery for
core collection1 zkNodeName=127.0.0.1:59228_solr_collection1
   [junit4]   2> 135662 T1397 oasc.SolrCore.close [collection1]  CLOSING SolrCore org.apache.solr.core.SolrCore@7165dcc2
   [junit4]   2> 135664 T1397 oasc.SolrCore.closeSearcher [collection1] Closing main searcher
on request.
   [junit4]   2> 135665 T1397 oasu.DirectUpdateHandler2.close closing DirectUpdateHandler2{commits=2,autocommits=0,soft
autocommits=0,optimizes=0,rollbacks=0,expungeDeletes=0,docsPending=0,adds=0,deletesById=0,deletesByQuery=0,errors=0,cumulative_adds=480,cumulative_deletesById=236,cumulative_deletesByQuery=0,cumulative_errors=0}
   [junit4]   2> 135665 T1397 oasc.RecoveryStrategy.close WARNING Stopping recovery for
core collection1 zkNodeName=127.0.0.1:59228_solr_collection1
   [junit4]   2> 135753 T1675 oaz.ClientCnxn$EventThread.run EventThread shut down
   [junit4]   2> 135753 T1397 oaz.ZooKeeper.close Session: 0x138450ec7f90016 closed
   [junit4]   2> 135753 T1397 oejsh.ContextHandler.doStop stopped o.e.j.s.ServletContextHandler{/solr,null}
   [junit4]   2> 135805 T1397 oasc.CoreContainer.shutdown Shutting down CoreContainer instance=608151488
   [junit4]   2> 135805 T1397 oasc.RecoveryStrategy.close WARNING Stopping recovery for
core collection1 zkNodeName=127.0.0.1:39528_solr_collection1
   [junit4]   2> 135806 T1397 oasc.SolrCore.close [collection1]  CLOSING SolrCore org.apache.solr.core.SolrCore@3582a33
   [junit4]   2> 135808 T1397 oasc.SolrCore.closeSearcher [collection1] Closing main searcher
on request.
   [junit4]   2> 135808 T1397 oasu.DirectUpdateHandler2.close closing DirectUpdateHandler2{commits=3,autocommits=0,soft
autocommits=0,optimizes=0,rollbacks=0,expungeDeletes=0,docsPending=0,adds=0,deletesById=0,deletesByQuery=0,errors=0,cumulative_adds=460,cumulative_deletesById=225,cumulative_deletesByQuery=0,cumulative_errors=0}
   [junit4]   2> 135810 T1397 oasc.RecoveryStrategy.close WARNING Stopping recovery for
core collection1 zkNodeName=127.0.0.1:39528_solr_collection1
   [junit4]   2> 135912 T1688 oaz.ClientCnxn$EventThread.run EventThread shut down
   [junit4]   2> 135912 T1397 oaz.ZooKeeper.close Session: 0x138450ec7f90017 closed
   [junit4]   2> 135912 T1397 oejsh.ContextHandler.doStop stopped o.e.j.s.ServletContextHandler{/solr,null}
   [junit4]   2> 135965 T1397 oasc.CoreContainer.shutdown Shutting down CoreContainer instance=685703314
   [junit4]   2> 135965 T1397 oasc.RecoveryStrategy.close WARNING Stopping recovery for
core collection1 zkNodeName=127.0.0.1:17609_solr_collection1
   [junit4]   2> 135965 T1397 oasc.SolrCore.close [collection1]  CLOSING SolrCore org.apache.solr.core.SolrCore@4e76c067
   [junit4]   2> 135968 T1397 oasc.SolrCore.closeSearcher [collection1] Closing main searcher
on request.
   [junit4]   2> 135968 T1397 oasu.DirectUpdateHandler2.close closing DirectUpdateHandler2{commits=3,autocommits=0,soft
autocommits=0,optimizes=0,rollbacks=0,expungeDeletes=0,docsPending=0,adds=0,deletesById=0,deletesByQuery=0,errors=0,cumulative_adds=513,cumulative_deletesById=247,cumulative_deletesByQuery=0,cumulative_errors=0}
   [junit4]   2> 135969 T1397 oasc.RecoveryStrategy.close WARNING Stopping recovery for
core collection1 zkNodeName=127.0.0.1:17609_solr_collection1
   [junit4]   2> 136071 T1702 oaz.ClientCnxn$EventThread.run EventThread shut down
   [junit4]   2> 136071 T1397 oaz.ZooKeeper.close Session: 0x138450ec7f90018 closed
   [junit4]   2> 136071 T1397 oejsh.ContextHandler.doStop stopped o.e.j.s.ServletContextHandler{/solr,null}
   [junit4]   2> 136124 T1397 oasc.CoreContainer.shutdown Shutting down CoreContainer instance=430284318
   [junit4]   2> 136125 T1397 oasc.RecoveryStrategy.close WARNING Stopping recovery for
core collection1 zkNodeName=127.0.0.1:23893_solr_collection1
   [junit4]   2> 136125 T1397 oasc.SolrCore.close [collection1]  CLOSING SolrCore org.apache.solr.core.SolrCore@75a2c4b6
   [junit4]   2> 136128 T1397 oasc.SolrCore.closeSearcher [collection1] Closing main searcher
on request.
   [junit4]   2> 136128 T1397 oasu.DirectUpdateHandler2.close closing DirectUpdateHandler2{commits=3,autocommits=0,soft
autocommits=0,optimizes=0,rollbacks=0,expungeDeletes=0,docsPending=0,adds=0,deletesById=0,deletesByQuery=0,errors=0,cumulative_adds=481,cumulative_deletesById=219,cumulative_deletesByQuery=0,cumulative_errors=0}
   [junit4]   2> 136146 T1729 oaz.ClientCnxn$SendThread.run Client session timed out, have
not heard from server in 13197ms for sessionid 0x138450ec7f9001a, closing socket connection
and attempting reconnect
   [junit4]   2> 136189 T1397 C140 P23893 oasc.SolrDeletionPolicy.onCommit SolrDeletionPolicy.onCommit:
commits:num=2
   [junit4]   2> 		commit{dir=/usr/home/hudson/hudson-slave/workspace/Lucene-Solr-tests-only-trunk-java7/checkout/solr/build/solr-core/test/J0/org.apache.solr.cloud.ChaosMonkeySafeLeaderTest-1341188392947/jetty23/index.20120701212039845,segFN=segments_4,generation=4,filenames=[_1h_Lucene40_0.tim,
_1i_Lucene40_0.frq, _1h.fnm, _1d_nrm.cfe, _1h_Lucene40_0.tip, _1c.fdx, _1f.fnm, _1j.fdt, _1h_nrm.cfe,
_1g_Lucene40_0.tim, _1e.si, _1g_nrm.cfe, _1d_Lucene40_0.frq, _1d_nrm.cfs, _1g_Lucene40_0.tip,
_1c.fdt, _1j.fdx, _1f_Lucene40_0.tim, _1f_Lucene40_0.tip, _1g_Lucene40_0.frq, _1d_1.del, _1i.fdt,
_1d.fnm, _1d.si, _1f.fdx, _1f.si, _1d_Lucene40_0.prx, _1i.fdx, _1e.fnm, _1g.fdt, _1c_Lucene40_0.prx,
_1i.fnm, _1c_1.del, _1f_2.del, _1j.si, _1j_Lucene40_0.tip, _1i_Lucene40_0.prx, _1j_Lucene40_0.tim,
_1c_Lucene40_0.frq, _1h_1.del, _1h.si, _1e_Lucene40_0.tip, _1j_Lucene40_0.frq, _1g.si, _1i_Lucene40_0.tip,
_1h.fdx, _1g_nrm.cfs, _1h_nrm.cfs, _1e_Lucene40_0.tim, _1i_Lucene40_0.tim, _1g.fdx, _1c_Lucene40_0.tim,
_1f_nrm.cfs, _1h.fdt, _1c_Lucene40_0.tip, _1f_Lucene40_0.frq, _1e_Lucene40_0.frq, _1g_1.del,
_1j_nrm.cfs, _1c_nrm.cfe, _1c.fnm, _1h_Lucene40_0.frq, _1e_nrm.cfe, _1f_Lucene40_0.prx, _1i_nrm.cfs,
_1g.fnm, _1j.fnm, _1d.fdx, _1e_nrm.cfs, _1c_nrm.cfs, _1d.fdt, _1i_nrm.cfe, _1e.fdx, _1j_Lucene40_0.prx,
_1f.fdt, _1e.fdt, _1e_1.del, _1g_Lucene40_0.prx, _1e_Lucene40_0.prx, _1h_Lucene40_0.prx, _1i_1.del,
_1d_Lucene40_0.tip, _1f_nrm.cfe, _1d_Lucene40_0.tim, _1i.si, _1c.si, _1j_nrm.cfe, segments_4]
   [junit4]   2> 		commit{dir=/usr/home/hudson/hudson-slave/workspace/Lucene-Solr-tests-only-trunk-java7/checkout/solr/build/solr-core/test/J0/org.apache.solr.cloud.ChaosMonkeySafeLeaderTest-1341188392947/jetty23/index.20120701212039845,segFN=segments_5,generation=5,filenames=[_1k_Lucene40_0.frq,
_1k_Lucene40_0.tim, _1k.fnm, _1k_Lucene40_0.prx, _1k.si, _1k_nrm.cfe, _1k.fdx, _1k_nrm.cfs,
segments_5, _1k_Lucene40_0.tip, _1k.fdt]
   [junit4]   2> 136190 T1397 C140 P23893 oasc.SolrDeletionPolicy.updateCommits newest
commit = 5
   [junit4]   2> 136208 T1397 oasc.RecoveryStrategy.close WARNING Stopping recovery for
core collection1 zkNodeName=127.0.0.1:23893_solr_collection1
   [junit4]   2> 136218 T1743 oaz.ClientCnxn$SendThread.run Client session timed out, have
not heard from server in 13384ms for sessionid 0x138450ec7f9001b, closing socket connection
and attempting reconnect
   [junit4]   2> 136309 T1716 oaz.ClientCnxn$EventThread.run EventThread shut down
   [junit4]   2> 136309 T1397 oaz.ZooKeeper.close Session: 0x138450ec7f90019 closed
   [junit4]   2> 136310 T1397 oejsh.ContextHandler.doStop stopped o.e.j.s.ServletContextHandler{/solr,null}
   [junit4]   2> 136362 T1397 oasc.CoreContainer.shutdown Shutting down CoreContainer instance=756118213
   [junit4]   2> 136362 T1397 oasc.RecoveryStrategy.close WARNING Stopping recovery for
core collection1 zkNodeName=127.0.0.1:62637_solr_collection1
   [junit4]   2> 136362 T1397 oasc.SolrCore.close [collection1]  CLOSING SolrCore org.apache.solr.core.SolrCore@7e827b5a
   [junit4]   2> 136365 T1397 oasc.SolrCore.closeSearcher [collection1] Closing main searcher
on request.
   [junit4]   2> 136365 T1397 oasu.DirectUpdateHandler2.close closing DirectUpdateHandler2{commits=3,autocommits=0,soft
autocommits=0,optimizes=0,rollbacks=0,expungeDeletes=0,docsPending=0,adds=0,deletesById=0,deletesByQuery=0,errors=0,cumulative_adds=456,cumulative_deletesById=221,cumulative_deletesByQuery=0,cumulative_errors=0}
   [junit4]   2> 136367 T1397 oasc.RecoveryStrategy.close WARNING Stopping recovery for
core collection1 zkNodeName=127.0.0.1:62637_solr_collection1
   [junit4]   2> 137094 T1757 oaz.ClientCnxn$SendThread.startConnect Opening socket connection
to server localhost/127.0.0.1:24163
   [junit4]   2> 137496 T1743 oaz.ClientCnxn$SendThread.startConnect Opening socket connection
to server localhost/127.0.0.1:24163
   [junit4]   2> 137538 T1729 oaz.ClientCnxn$SendThread.startConnect Opening socket connection
to server localhost/127.0.0.1:24163
   [junit4]   2> 148349 T1730 oaz.ClientCnxn$EventThread.run EventThread shut down
   [junit4]   2> 148349 T1397 oaz.ZooKeeper.close Session: 0x138450ec7f9001a closed
   [junit4]   2> 148350 T1397 oejsh.ContextHandler.doStop stopped o.e.j.s.ServletContextHandler{/solr,null}
   [junit4]   2> 148404 T1397 oasc.CoreContainer.shutdown Shutting down CoreContainer instance=1573078733
   [junit4]   2> 148404 T1397 oasc.RecoveryStrategy.close WARNING Stopping recovery for
core collection1 zkNodeName=127.0.0.1:52175_solr_collection1
   [junit4]   2> 148404 T1397 oasc.SolrCore.close [collection1]  CLOSING SolrCore org.apache.solr.core.SolrCore@a85d129
   [junit4]   2> 148406 T1397 oasc.SolrCore.closeSearcher [collection1] Closing main searcher
on request.
   [junit4]   2> 148406 T1397 oasu.DirectUpdateHandler2.close closing DirectUpdateHandler2{commits=3,autocommits=0,soft
autocommits=0,optimizes=0,rollbacks=0,expungeDeletes=0,docsPending=0,adds=0,deletesById=0,deletesByQuery=0,errors=0,cumulative_adds=491,cumulative_deletesById=232,cumulative_deletesByQuery=0,cumulative_errors=0}
   [junit4]   2> 148426 T1397 C142 P52175 oasc.SolrDeletionPolicy.onCommit SolrDeletionPolicy.onCommit:
commits:num=2
   [junit4]   2> 		commit{dir=/usr/home/hudson/hudson-slave/workspace/Lucene-Solr-tests-only-trunk-java7/checkout/solr/build/solr-core/test/J0/org.apache.solr.cloud.ChaosMonkeySafeLeaderTest-1341188392947/jetty25/index.20120701212042615,segFN=segments_4,generation=4,filenames=[_1h_Lucene40_0.tim,
_1i_Lucene40_0.frq, _1h.fnm, _1d_nrm.cfe, _1h_Lucene40_0.tip, _1c.fdx, _1f.fnm, _1j.fdt, _1h_nrm.cfe,
_1g_Lucene40_0.tim, _1e.si, _1g_nrm.cfe, _1d_Lucene40_0.frq, _1d_nrm.cfs, _1g_Lucene40_0.tip,
_1c.fdt, _1j.fdx, _1f_Lucene40_0.tim, _1f_Lucene40_0.tip, _1g_Lucene40_0.frq, _1i.fdt, _1d.fnm,
_1d.si, _1f.fdx, _1f.si, _1d_Lucene40_0.prx, _1i.fdx, _1e.fnm, _1g.fdt, _1c_Lucene40_0.prx,
_1i.fnm, _1c_1.del, _1j.si, _1j_Lucene40_0.tip, _1i_Lucene40_0.prx, _1j_Lucene40_0.tim, _1e_2.del,
_1c_Lucene40_0.frq, _1h_1.del, _1h.si, _1e_Lucene40_0.tip, _1j_Lucene40_0.frq, _1g.si, _1i_Lucene40_0.tip,
_1h.fdx, _1g_nrm.cfs, _1h_nrm.cfs, _1e_Lucene40_0.tim, _1i_Lucene40_0.tim, _1g.fdx, _1c_Lucene40_0.tim,
_1f_nrm.cfs, _1h.fdt, _1d_2.del, _1c_Lucene40_0.tip, _1f_Lucene40_0.frq, _1f_1.del, _1e_Lucene40_0.frq,
_1g_1.del, _1j_nrm.cfs, _1c_nrm.cfe, _1c.fnm, _1h_Lucene40_0.frq, _1e_nrm.cfe, _1f_Lucene40_0.prx,
_1i_nrm.cfs, _1g.fnm, _1j.fnm, _1d.fdx, _1e_nrm.cfs, _1c_nrm.cfs, _1d.fdt, _1i_nrm.cfe, _1e.fdx,
_1j_Lucene40_0.prx, _1f.fdt, _1e.fdt, _1g_Lucene40_0.prx, _1e_Lucene40_0.prx, _1h_Lucene40_0.prx,
_1i_1.del, _1d_Lucene40_0.tip, _1f_nrm.cfe, _1d_Lucene40_0.tim, _1i.si, _1c.si, _1j_nrm.cfe,
segments_4]
   [junit4]   2> 		commit{dir=/usr/home/hudson/hudson-slave/workspace/Lucene-Solr-tests-only-trunk-java7/checkout/solr/build/solr-core/test/J0/org.apache.solr.cloud.ChaosMonkeySafeLeaderTest-1341188392947/jetty25/index.20120701212042615,segFN=segments_5,generation=5,filenames=[_1k_Lucene40_0.frq,
_1k_Lucene40_0.tim, _1k.fnm, _1k_Lucene40_0.prx, _1k.si, _1k_nrm.cfe, _1k.fdx, _1k_nrm.cfs,
segments_5, _1k_Lucene40_0.tip, _1k.fdt]
   [junit4]   2> 148427 T1397 C142 P52175 oasc.SolrDeletionPolicy.updateCommits newest
commit = 5
   [junit4]   2> 148437 T1397 oasc.RecoveryStrategy.close WARNING Stopping recovery for
core collection1 zkNodeName=127.0.0.1:52175_solr_collection1
   [junit4]   2> 148539 T1744 oaz.ClientCnxn$EventThread.run EventThread shut down
   [junit4]   2> 148539 T1397 oaz.ZooKeeper.close Session: 0x138450ec7f9001b closed
   [junit4]   2> 148539 T1397 oejsh.ContextHandler.doStop stopped o.e.j.s.ServletContextHandler{/solr,null}
   [junit4]   2> 148592 T1397 oasc.CoreContainer.shutdown Shutting down CoreContainer instance=1249969121
   [junit4]   2> 148592 T1397 oasc.RecoveryStrategy.close WARNING Stopping recovery for
core collection1 zkNodeName=127.0.0.1:52179_solr_collection1
   [junit4]   2> 148593 T1397 oasc.SolrCore.close [collection1]  CLOSING SolrCore org.apache.solr.core.SolrCore@261b3850
   [junit4]   2> 148596 T1397 oasc.SolrCore.closeSearcher [collection1] Closing main searcher
on request.
   [junit4]   2> 148596 T1397 oasu.DirectUpdateHandler2.close closing DirectUpdateHandler2{commits=3,autocommits=0,soft
autocommits=0,optimizes=0,rollbacks=0,expungeDeletes=0,docsPending=0,adds=0,deletesById=0,deletesByQuery=0,errors=0,cumulative_adds=501,cumulative_deletesById=235,cumulative_deletesByQuery=0,cumulative_errors=0}
   [junit4]   2> 148597 T1397 oasc.RecoveryStrategy.close WARNING Stopping recovery for
core collection1 zkNodeName=127.0.0.1:52179_solr_collection1
   [junit4]   2> 148699 T1758 oaz.ClientCnxn$EventThread.run EventThread shut down
   [junit4]   2> 148699 T1397 oaz.ZooKeeper.close Session: 0x138450ec7f9001c closed
   [junit4]   2> 148699 T1397 oejsh.ContextHandler.doStop stopped o.e.j.s.ServletContextHandler{/solr,null}
   [junit4]   2> 148928 T1397 oas.SolrTestCaseJ4.tearDown ###Ending testDistribSearch
   [junit4]   1> I ran for 33.029sec. I stopped 0 and I started 0. I also expired 0 and
caused 0 connection losses
   [junit4]   2> NOTE: reproduce with: ant test  -Dtestcase=ChaosMonkeySafeLeaderTest -Dtests.method=testDistribSearch
-Dtests.seed=91658FF2F43B698D -Dtests.multiplier=3 -Dtests.slow=true -Dtests.locale=vi_VN
-Dtests.timezone=America/Catamarca -Dargs="-Dfile.encoding=US-ASCII"
   [junit4]   1> 
   [junit4]   2>
   [junit4]    > (@AfterClass output)
   [junit4]   2> 148963 T1397 oas.SolrTestCaseJ4.deleteCore ###deleteCore
   [junit4]   2> NOTE: test params are: codec=Lucene40: {}, sim=RandomSimilarityProvider(queryNorm=true,coord=true):
{}, locale=vi_VN, timezone=America/Catamarca
   [junit4]   2> NOTE: FreeBSD 9.0-RELEASE amd64/Oracle Corporation 1.7.0_04 (64-bit)/cpus=16,threads=2,free=151196352,total=508559360
   [junit4]   2> NOTE: All tests run in this JVM: [CommonGramsQueryFilterFactoryTest, DateFieldTest,
TestDelimitedPayloadTokenFilterFactory, FastVectorHighlighterTest, DistributedQueryElevationComponentTest,
StatsComponentTest, BasicFunctionalityTest, TestJoin, SuggesterTSTTest, TestFrenchLightStemFilterFactory,
SOLR749Test, TestDistributedGrouping, NumericFieldsTest, SimpleFacetsTest, PluginInfoTest,
TestSolrQueryParser, TestUpdate, TestPhraseSuggestions, SolrInfoMBeanTest, TestFoldingMultitermQuery,
FullSolrCloudDistribCmdsTest, TestDistributedSearch, ZkNodePropsTest, TestGalicianStemFilterFactory,
TestThaiWordFilterFactory, JSONWriterTest, TestIrishLowerCaseFilterFactory, DoubleMetaphoneFilterFactoryTest,
TestSolrCoreProperties, QueryElevationComponentTest, TestPHPSerializedResponseWriter, IndexBasedSpellCheckerTest,
PrimitiveFieldTypeTest, TestBinaryField, LeaderElectionIntegrationTest, TestRemoveDuplicatesTokenFilterFactory,
SolrCmdDistributorTest, TestExtendedDismaxParser, TestGermanLightStemFilterFactory, TestJmxIntegration,
TestFaceting, TestJapaneseKatakanaStemFilterFactory, TestHyphenationCompoundWordTokenFilterFactory,
TestLatvianStemFilterFactory, XmlUpdateRequestHandlerTest, TestPatternTokenizerFactory, DateMathParserTest,
TestJapaneseBaseFormFilterFactory, TestDictionaryCompoundWordTokenFilterFactory, TestPhoneticFilterFactory,
PingRequestHandlerTest, TestBM25SimilarityFactory, EchoParamsTest, TestSurroundQueryParser,
HighlighterTest, DisMaxRequestHandlerTest, TestTrimFilterFactory, ConvertedLegacyTest, TestRandomFaceting,
TestQueryUtils, TestReversedWildcardFilterFactory, TestLFUCache, TestIndexingPerformance,
CurrencyFieldTest, TestSynonymFilterFactory, DirectUpdateHandlerOptimizeTest, TestFrenchMinimalStemFilterFactory,
TestFinnishLightStemFilterFactory, SolrIndexConfigTest, SuggesterWFSTTest, ShowFileRequestHandlerTest,
TestHashPartitioner, TestCSVLoader, TestMappingCharFilterFactory, LukeRequestHandlerTest,
AutoCommitTest, TestTypeTokenFilterFactory, TermsComponentTest, TestPatternReplaceCharFilterFactory,
UpdateRequestProcessorFactoryTest, TestMergePolicyConfig, DirectSolrSpellCheckerTest, TestPerFieldSimilarity,
TestItalianLightStemFilterFactory, TestArabicFilters, SystemInfoHandlerTest, TestDFRSimilarityFactory,
TestPortugueseMinimalStemFilterFactory, TestCodecSupport, DirectUpdateHandlerTest, SolrCoreCheckLockOnStartupTest,
TestFunctionQuery, TestSwedishLightStemFilterFactory, TestCapitalizationFilterFactory, TestGreekLowerCaseFilterFactory,
MinimalSchemaTest, TestSearchPerf, TestHTMLStripCharFilterFactory, TestNorwegianLightStemFilterFactory,
SolrRequestParserTest, RecoveryZkTest, DefaultValueUpdateProcessorTest, OutputWriterTest,
RequestHandlersTest, BasicZkTest, WordBreakSolrSpellCheckerTest, TestCoreContainer, TestFiltering,
CoreAdminHandlerTest, TestRemoteStreaming, CacheHeaderTest, TestWordDelimiterFilterFactory,
PolyFieldTest, SpatialFilterTest, MoreLikeThisHandlerTest, DocumentBuilderTest, TestPseudoReturnFields,
IndexSchemaTest, BinaryUpdateRequestHandlerTest, DocumentAnalysisRequestHandlerTest, RequiredFieldsTest,
CopyFieldTest, UniqFieldsUpdateProcessorFactoryTest, SuggesterTest, TestPropInject, BadComponentTest,
TestQuerySenderListener, TestQuerySenderNoQuery, IndexReaderFactoryTest, TestKStemFilterFactory,
LegacyHTMLStripCharFilterTest, TestIBSimilarityFactory, TestFastLRUCache, PrimUtilsTest, TestMultiWordSynonyms,
OpenExchangeRatesOrgProviderTest, TestCzechStemFilterFactory, FileUtilsTest, TestPortugueseStemFilterFactory,
CloudStateTest, TestStandardFactories, TestSuggestSpellingConverter, TestPersianNormalizationFilterFactory,
TestBadConfig, TestGalicianMinimalStemFilterFactory, TestJapanesePartOfSpeechStopFilterFactory,
DOMUtilTest, CommonGramsFilterFactoryTest, TestElisionFilterFactory, TestIndonesianStemFilterFactory,
TestBrazilianStemFilterFactory, TestSpanishLightStemFilterFactory, ChaosMonkeySafeLeaderTest]
   [junit4]   2> 
   [junit4] Completed on J0 in 148.97s, 1 test, 1 error <<< FAILURES!
[...truncated 70 lines...]

[...truncated 49540 lines...]

[...truncated 49540 lines...]

[...truncated 49540 lines...]

[...truncated 49540 lines...]

[...truncated 49540 lines...]



Mime
View raw message