lucene-dev mailing list archives

Site index · List index
Message view « Date » · « Thread »
Top « Date » · « Thread »
From Policeman Jenkins Server <jenk...@sd-datasolutions.de>
Subject [JENKINS] Lucene-Solr-4.x-Linux-Java6-64 - Build # 516 - Failure!
Date Tue, 17 Jul 2012 19:20:11 GMT
Build: http://jenkins.sd-datasolutions.de/job/Lucene-Solr-4.x-Linux-Java6-64/516/

1 tests failed.
REGRESSION:  org.apache.lucene.search.grouping.DistinctValuesCollectorTest.testRandom

Error Message:
testRandom(org.apache.lucene.search.grouping.DistinctValuesCollectorTest): Insane FieldCache
usage(s) found expected:<0> but was:<3>

Stack Trace:
java.lang.AssertionError: testRandom(org.apache.lucene.search.grouping.DistinctValuesCollectorTest):
Insane FieldCache usage(s) found expected:<0> but was:<3>
	at __randomizedtesting.SeedInfo.seed([63AF6546D770137A:11E340496610A509]:0)
	at org.junit.Assert.fail(Assert.java:93)
	at org.junit.Assert.failNotEquals(Assert.java:647)
	at org.junit.Assert.assertEquals(Assert.java:128)
	at org.junit.Assert.assertEquals(Assert.java:472)
	at org.apache.lucene.util.LuceneTestCase.assertSaneFieldCaches(LuceneTestCase.java:516)
	at org.apache.lucene.util.TestRuleFieldCacheSanity$1.evaluate(TestRuleFieldCacheSanity.java:48)
	at org.apache.lucene.util.AbstractBeforeAfterRule$1.evaluate(AbstractBeforeAfterRule.java:45)
	at com.carrotsearch.randomizedtesting.rules.SystemPropertiesInvariantRule$1.evaluate(SystemPropertiesInvariantRule.java:55)
	at org.apache.lucene.util.TestRuleReportUncaughtExceptions$1.evaluate(TestRuleReportUncaughtExceptions.java:68)
	at org.apache.lucene.util.TestRuleThreadAndTestName$1.evaluate(TestRuleThreadAndTestName.java:48)
	at org.apache.lucene.util.TestRuleIgnoreAfterMaxFailures$1.evaluate(TestRuleIgnoreAfterMaxFailures.java:70)
	at org.apache.lucene.util.TestRuleMarkFailure$1.evaluate(TestRuleMarkFailure.java:48)
	at com.carrotsearch.randomizedtesting.RandomizedRunner.runSingleTest(RandomizedRunner.java:825)
	at com.carrotsearch.randomizedtesting.RandomizedRunner.access$700(RandomizedRunner.java:132)
	at com.carrotsearch.randomizedtesting.RandomizedRunner$3$1.run(RandomizedRunner.java:671)
	at com.carrotsearch.randomizedtesting.RandomizedRunner$3.evaluate(RandomizedRunner.java:697)
	at com.carrotsearch.randomizedtesting.RandomizedRunner$4.evaluate(RandomizedRunner.java:736)
	at com.carrotsearch.randomizedtesting.RandomizedRunner$5.evaluate(RandomizedRunner.java:747)
	at org.apache.lucene.util.AbstractBeforeAfterRule$1.evaluate(AbstractBeforeAfterRule.java:45)
	at org.apache.lucene.util.TestRuleReportUncaughtExceptions$1.evaluate(TestRuleReportUncaughtExceptions.java:68)
	at org.apache.lucene.util.TestRuleStoreClassName$1.evaluate(TestRuleStoreClassName.java:38)
	at org.apache.lucene.util.TestRuleIcuHack$1.evaluate(TestRuleIcuHack.java:51)
	at com.carrotsearch.randomizedtesting.rules.SystemPropertiesInvariantRule$1.evaluate(SystemPropertiesInvariantRule.java:55)
	at org.apache.lucene.util.TestRuleNoInstanceHooksOverrides$1.evaluate(TestRuleNoInstanceHooksOverrides.java:53)
	at org.apache.lucene.util.TestRuleNoStaticHooksShadowing$1.evaluate(TestRuleNoStaticHooksShadowing.java:52)
	at org.apache.lucene.util.TestRuleAssertionsRequired$1.evaluate(TestRuleAssertionsRequired.java:36)
	at org.apache.lucene.util.TestRuleMarkFailure$1.evaluate(TestRuleMarkFailure.java:48)
	at org.apache.lucene.util.TestRuleIgnoreAfterMaxFailures$1.evaluate(TestRuleIgnoreAfterMaxFailures.java:70)
	at org.apache.lucene.util.TestRuleIgnoreTestSuites$1.evaluate(TestRuleIgnoreTestSuites.java:55)
	at com.carrotsearch.randomizedtesting.RandomizedRunner.runSuite(RandomizedRunner.java:605)
	at com.carrotsearch.randomizedtesting.RandomizedRunner.access$400(RandomizedRunner.java:132)
	at com.carrotsearch.randomizedtesting.RandomizedRunner$2.run(RandomizedRunner.java:551)




Build Log:
[...truncated 13687 lines...]
[junit4:junit4] Suite: org.apache.lucene.search.grouping.DistinctValuesCollectorTest
[junit4:junit4] FAILURE 6.00s J0 | DistinctValuesCollectorTest.testRandom
[junit4:junit4]    > Throwable #1: java.lang.AssertionError: testRandom(org.apache.lucene.search.grouping.DistinctValuesCollectorTest):
Insane FieldCache usage(s) found expected:<0> but was:<3>
[junit4:junit4]    > 	at __randomizedtesting.SeedInfo.seed([63AF6546D770137A:11E340496610A509]:0)
[junit4:junit4]    > 	at org.junit.Assert.fail(Assert.java:93)
[junit4:junit4]    > 	at org.junit.Assert.failNotEquals(Assert.java:647)
[junit4:junit4]    > 	at org.junit.Assert.assertEquals(Assert.java:128)
[junit4:junit4]    > 	at org.junit.Assert.assertEquals(Assert.java:472)
[junit4:junit4]    > 	at org.apache.lucene.util.LuceneTestCase.assertSaneFieldCaches(LuceneTestCase.java:516)
[junit4:junit4]    > 	at org.apache.lucene.util.TestRuleFieldCacheSanity$1.evaluate(TestRuleFieldCacheSanity.java:48)
[junit4:junit4]    > 	at org.apache.lucene.util.AbstractBeforeAfterRule$1.evaluate(AbstractBeforeAfterRule.java:45)
[junit4:junit4]    > 	at com.carrotsearch.randomizedtesting.rules.SystemPropertiesInvariantRule$1.evaluate(SystemPropertiesInvariantRule.java:55)
[junit4:junit4]    > 	at org.apache.lucene.util.TestRuleReportUncaughtExceptions$1.evaluate(TestRuleReportUncaughtExceptions.java:68)
[junit4:junit4]    > 	at org.apache.lucene.util.TestRuleThreadAndTestName$1.evaluate(TestRuleThreadAndTestName.java:48)
[junit4:junit4]    > 	at org.apache.lucene.util.TestRuleIgnoreAfterMaxFailures$1.evaluate(TestRuleIgnoreAfterMaxFailures.java:70)
[junit4:junit4]    > 	at org.apache.lucene.util.TestRuleMarkFailure$1.evaluate(TestRuleMarkFailure.java:48)
[junit4:junit4]    > 	at com.carrotsearch.randomizedtesting.RandomizedRunner.runSingleTest(RandomizedRunner.java:825)
[junit4:junit4]    > 	at com.carrotsearch.randomizedtesting.RandomizedRunner.access$700(RandomizedRunner.java:132)
[junit4:junit4]    > 	at com.carrotsearch.randomizedtesting.RandomizedRunner$3$1.run(RandomizedRunner.java:671)
[junit4:junit4]    > 	at com.carrotsearch.randomizedtesting.RandomizedRunner$3.evaluate(RandomizedRunner.java:697)
[junit4:junit4]    > 	at com.carrotsearch.randomizedtesting.RandomizedRunner$4.evaluate(RandomizedRunner.java:736)
[junit4:junit4]    > 	at com.carrotsearch.randomizedtesting.RandomizedRunner$5.evaluate(RandomizedRunner.java:747)
[junit4:junit4]    > 	at org.apache.lucene.util.AbstractBeforeAfterRule$1.evaluate(AbstractBeforeAfterRule.java:45)
[junit4:junit4]    > 	at org.apache.lucene.util.TestRuleReportUncaughtExceptions$1.evaluate(TestRuleReportUncaughtExceptions.java:68)
[junit4:junit4]    > 	at org.apache.lucene.util.TestRuleStoreClassName$1.evaluate(TestRuleStoreClassName.java:38)
[junit4:junit4]    > 	at org.apache.lucene.util.TestRuleIcuHack$1.evaluate(TestRuleIcuHack.java:51)
[junit4:junit4]    > 	at com.carrotsearch.randomizedtesting.rules.SystemPropertiesInvariantRule$1.evaluate(SystemPropertiesInvariantRule.java:55)
[junit4:junit4]    > 	at org.apache.lucene.util.TestRuleNoInstanceHooksOverrides$1.evaluate(TestRuleNoInstanceHooksOverrides.java:53)
[junit4:junit4]    > 	at org.apache.lucene.util.TestRuleNoStaticHooksShadowing$1.evaluate(TestRuleNoStaticHooksShadowing.java:52)
[junit4:junit4]    > 	at org.apache.lucene.util.TestRuleAssertionsRequired$1.evaluate(TestRuleAssertionsRequired.java:36)
[junit4:junit4]    > 	at org.apache.lucene.util.TestRuleMarkFailure$1.evaluate(TestRuleMarkFailure.java:48)
[junit4:junit4]    > 	at org.apache.lucene.util.TestRuleIgnoreAfterMaxFailures$1.evaluate(TestRuleIgnoreAfterMaxFailures.java:70)
[junit4:junit4]    > 	at org.apache.lucene.util.TestRuleIgnoreTestSuites$1.evaluate(TestRuleIgnoreTestSuites.java:55)
[junit4:junit4]    > 	at com.carrotsearch.randomizedtesting.RandomizedRunner.runSuite(RandomizedRunner.java:605)
[junit4:junit4]    > 	at com.carrotsearch.randomizedtesting.RandomizedRunner.access$400(RandomizedRunner.java:132)
[junit4:junit4]    > 	at com.carrotsearch.randomizedtesting.RandomizedRunner$2.run(RandomizedRunner.java:551)
[junit4:junit4]    > 
[junit4:junit4]   2> *** BEGIN testRandom(org.apache.lucene.search.grouping.DistinctValuesCollectorTest):
Insane FieldCache usage(s) ***
[junit4:junit4]   2> SUBREADER: Found caches for descendants of StandardDirectoryReader(segments_6:159:nrt
_1a(4.0.0.1):C1928 _1y(4.0.0.1):C960 _1z(4.0.0.1):c43 _20(4.0.0.1):c32 _21(4.0.0.1):c15 _22(4.0.0.1):c43
_23(4.0.0.1):c43 _24(4.0.0.1):c43 _25(4.0.0.1):c43 _26(4.0.0.1):c14)+author
[junit4:junit4]   2> 	'StandardDirectoryReader(segments_6:159:nrt _1a(4.0.0.1):C1928 _1y(4.0.0.1):C960
_1z(4.0.0.1):c43 _20(4.0.0.1):c32 _21(4.0.0.1):c15 _22(4.0.0.1):c43 _23(4.0.0.1):c43 _24(4.0.0.1):c43
_25(4.0.0.1):c43 _26(4.0.0.1):c14)'=>'author',class org.apache.lucene.search.FieldCache$DocTermsIndex,0.5=>org.apache.lucene.search.FieldCacheImpl$DocTermsIndexImpl#2123207658
(size =~ 27.4 KB)
[junit4:junit4]   2> 	'SegmentCoreReader(owner=_1y(4.0.0.1):C960)'=>'author',class org.apache.lucene.search.FieldCache$DocTermsIndex,0.5=>org.apache.lucene.search.FieldCacheImpl$DocTermsIndexImpl#394399946
(size =~ 19.6 KB)
[junit4:junit4]   2> 	'SegmentCoreReader(owner=_23(4.0.0.1):c43)'=>'author',class org.apache.lucene.search.FieldCache$DocTermsIndex,0.5=>org.apache.lucene.search.FieldCacheImpl$DocTermsIndexImpl#1781789391
(size =~ 1.7 KB)
[junit4:junit4]   2> 	'SegmentCoreReader(owner=_26(4.0.0.1):c14)'=>'author',class org.apache.lucene.search.FieldCache$DocTermsIndex,0.5=>org.apache.lucene.search.FieldCacheImpl$DocTermsIndexImpl#1984326869
(size =~ 544 bytes)
[junit4:junit4]   2> 	'SegmentCoreReader(owner=_22(4.0.0.1):c43)'=>'author',class org.apache.lucene.search.FieldCache$DocTermsIndex,0.5=>org.apache.lucene.search.FieldCacheImpl$DocTermsIndexImpl#520082442
(size =~ 1.7 KB)
[junit4:junit4]   2> 	'SegmentCoreReader(owner=_25(4.0.0.1):c43)'=>'author',class org.apache.lucene.search.FieldCache$DocTermsIndex,0.5=>org.apache.lucene.search.FieldCacheImpl$DocTermsIndexImpl#1052989544
(size =~ 1.9 KB)
[junit4:junit4]   2> 	'SegmentCoreReader(owner=_1z(4.0.0.1):c43)'=>'author',class org.apache.lucene.search.FieldCache$DocTermsIndex,0.5=>org.apache.lucene.search.FieldCacheImpl$DocTermsIndexImpl#1149589687
(size =~ 1.6 KB)
[junit4:junit4]   2> 	'SegmentCoreReader(owner=_20(4.0.0.1):c32)'=>'author',class org.apache.lucene.search.FieldCache$DocTermsIndex,0.5=>org.apache.lucene.search.FieldCacheImpl$DocTermsIndexImpl#182506538
(size =~ 1.2 KB)
[junit4:junit4]   2> 	'SegmentCoreReader(owner=_1a(4.0.0.1):C1928)'=>'author',class
org.apache.lucene.search.FieldCache$DocTermsIndex,0.5=>org.apache.lucene.search.FieldCacheImpl$DocTermsIndexImpl#1578131290
(size =~ 24.8 KB)
[junit4:junit4]   2> 	'SegmentCoreReader(owner=_21(4.0.0.1):c15)'=>'author',class org.apache.lucene.search.FieldCache$DocTermsIndex,0.5=>org.apache.lucene.search.FieldCacheImpl$DocTermsIndexImpl#632414455
(size =~ 696 bytes)
[junit4:junit4]   2> 	'SegmentCoreReader(owner=_24(4.0.0.1):c43)'=>'author',class org.apache.lucene.search.FieldCache$DocTermsIndex,0.5=>org.apache.lucene.search.FieldCacheImpl$DocTermsIndexImpl#574615923
(size =~ 1.6 KB)
[junit4:junit4]   2> 
[junit4:junit4]   2> SUBREADER: Found caches for descendants of StandardDirectoryReader(segments_6:159:nrt
_1a(4.0.0.1):C1928 _1y(4.0.0.1):C960 _1z(4.0.0.1):c43 _20(4.0.0.1):c32 _21(4.0.0.1):c15 _22(4.0.0.1):c43
_23(4.0.0.1):c43 _24(4.0.0.1):c43 _25(4.0.0.1):c43 _26(4.0.0.1):c14)+publisher
[junit4:junit4]   2> 	'StandardDirectoryReader(segments_6:159:nrt _1a(4.0.0.1):C1928 _1y(4.0.0.1):C960
_1z(4.0.0.1):c43 _20(4.0.0.1):c32 _21(4.0.0.1):c15 _22(4.0.0.1):c43 _23(4.0.0.1):c43 _24(4.0.0.1):c43
_25(4.0.0.1):c43 _26(4.0.0.1):c14)'=>'publisher',class org.apache.lucene.search.FieldCache$DocTermsIndex,0.5=>org.apache.lucene.search.FieldCacheImpl$DocTermsIndexImpl#477933748
(size =~ 14.4 KB)
[junit4:junit4]   2> 	'SegmentCoreReader(owner=_26(4.0.0.1):c14)'=>'publisher',class
org.apache.lucene.search.FieldCache$DocTermsIndex,0.5=>org.apache.lucene.search.FieldCacheImpl$DocTermsIndexImpl#1337309348
(size =~ 648 bytes)
[junit4:junit4]   2> 	'SegmentCoreReader(owner=_1y(4.0.0.1):C960)'=>'publisher',class
org.apache.lucene.search.FieldCache$DocTermsIndex,0.5=>org.apache.lucene.search.FieldCacheImpl$DocTermsIndexImpl#1258960347
(size =~ 11.2 KB)
[junit4:junit4]   2> 	'SegmentCoreReader(owner=_23(4.0.0.1):c43)'=>'publisher',class
org.apache.lucene.search.FieldCache$DocTermsIndex,0.5=>org.apache.lucene.search.FieldCacheImpl$DocTermsIndexImpl#655160929
(size =~ 1.7 KB)
[junit4:junit4]   2> 	'SegmentCoreReader(owner=_25(4.0.0.1):c43)'=>'publisher',class
org.apache.lucene.search.FieldCache$DocTermsIndex,0.5=>org.apache.lucene.search.FieldCacheImpl$DocTermsIndexImpl#1008915696
(size =~ 1.4 KB)
[junit4:junit4]   2> 	'SegmentCoreReader(owner=_24(4.0.0.1):c43)'=>'publisher',class
org.apache.lucene.search.FieldCache$DocTermsIndex,0.5=>org.apache.lucene.search.FieldCacheImpl$DocTermsIndexImpl#602626663
(size =~ 1.9 KB)
[junit4:junit4]   2> 	'SegmentCoreReader(owner=_21(4.0.0.1):c15)'=>'publisher',class
org.apache.lucene.search.FieldCache$DocTermsIndex,0.5=>org.apache.lucene.search.FieldCacheImpl$DocTermsIndexImpl#1654386234
(size =~ 864 bytes)
[junit4:junit4]   2> 	'SegmentCoreReader(owner=_20(4.0.0.1):c32)'=>'publisher',class
org.apache.lucene.search.FieldCache$DocTermsIndex,0.5=>org.apache.lucene.search.FieldCacheImpl$DocTermsIndexImpl#1967563673
(size =~ 1.3 KB)
[junit4:junit4]   2> 	'SegmentCoreReader(owner=_1a(4.0.0.1):C1928)'=>'publisher',class
org.apache.lucene.search.FieldCache$DocTermsIndex,0.5=>org.apache.lucene.search.FieldCacheImpl$DocTermsIndexImpl#250649917
(size =~ 13 KB)
[junit4:junit4]   2> 	'SegmentCoreReader(owner=_1z(4.0.0.1):c43)'=>'publisher',class
org.apache.lucene.search.FieldCache$DocTermsIndex,0.5=>org.apache.lucene.search.FieldCacheImpl$DocTermsIndexImpl#1495278007
(size =~ 1.4 KB)
[junit4:junit4]   2> 	'SegmentCoreReader(owner=_22(4.0.0.1):c43)'=>'publisher',class
org.apache.lucene.search.FieldCache$DocTermsIndex,0.5=>org.apache.lucene.search.FieldCacheImpl$DocTermsIndexImpl#1510547280
(size =~ 1.4 KB)
[junit4:junit4]   2> 
[junit4:junit4]   2> SUBREADER: Found caches for descendants of StandardDirectoryReader(segments_6:159:nrt
_1a(4.0.0.1):C1928 _1y(4.0.0.1):C960 _1z(4.0.0.1):c43 _20(4.0.0.1):c32 _21(4.0.0.1):c15 _22(4.0.0.1):c43
_23(4.0.0.1):c43 _24(4.0.0.1):c43 _25(4.0.0.1):c43 _26(4.0.0.1):c14)+id
[junit4:junit4]   2> 	'StandardDirectoryReader(segments_6:159:nrt _1a(4.0.0.1):C1928 _1y(4.0.0.1):C960
_1z(4.0.0.1):c43 _20(4.0.0.1):c32 _21(4.0.0.1):c15 _22(4.0.0.1):c43 _23(4.0.0.1):c43 _24(4.0.0.1):c43
_25(4.0.0.1):c43 _26(4.0.0.1):c14)'=>'id',class org.apache.lucene.search.FieldCache$DocTermsIndex,0.5=>org.apache.lucene.search.FieldCacheImpl$DocTermsIndexImpl#524890385
(size =~ 43.5 KB)
[junit4:junit4]   2> 	'SegmentCoreReader(owner=_21(4.0.0.1):c15)'=>'id',class org.apache.lucene.search.FieldCache$DocTermsIndex,0.5=>org.apache.lucene.search.FieldCacheImpl$DocTermsIndexImpl#1335237548
(size =~ 384 bytes)
[junit4:junit4]   2> 	'SegmentCoreReader(owner=_25(4.0.0.1):c43)'=>'id',class org.apache.lucene.search.FieldCache$DocTermsIndex,0.5=>org.apache.lucene.search.FieldCacheImpl$DocTermsIndexImpl#1405304013
(size =~ 744 bytes)
[junit4:junit4]   2> 	'SegmentCoreReader(owner=_23(4.0.0.1):c43)'=>'id',class org.apache.lucene.search.FieldCache$DocTermsIndex,0.5=>org.apache.lucene.search.FieldCacheImpl$DocTermsIndexImpl#674902259
(size =~ 744 bytes)
[junit4:junit4]   2> 	'SegmentCoreReader(owner=_1z(4.0.0.1):c43)'=>'id',class org.apache.lucene.search.FieldCache$DocTermsIndex,0.5=>org.apache.lucene.search.FieldCacheImpl$DocTermsIndexImpl#1893291636
(size =~ 744 bytes)
[junit4:junit4]   2> 	'SegmentCoreReader(owner=_20(4.0.0.1):c32)'=>'id',class org.apache.lucene.search.FieldCache$DocTermsIndex,0.5=>org.apache.lucene.search.FieldCacheImpl$DocTermsIndexImpl#997165968
(size =~ 608 bytes)
[junit4:junit4]   2> 	'SegmentCoreReader(owner=_24(4.0.0.1):c43)'=>'id',class org.apache.lucene.search.FieldCache$DocTermsIndex,0.5=>org.apache.lucene.search.FieldCacheImpl$DocTermsIndexImpl#509407427
(size =~ 744 bytes)
[junit4:junit4]   2> 	'SegmentCoreReader(owner=_1a(4.0.0.1):C1928)'=>'id',class org.apache.lucene.search.FieldCache$DocTermsIndex,0.5=>org.apache.lucene.search.FieldCacheImpl$DocTermsIndexImpl#1592026602
(size =~ 26.6 KB)
[junit4:junit4]   2> 	'SegmentCoreReader(owner=_26(4.0.0.1):c14)'=>'id',class org.apache.lucene.search.FieldCache$DocTermsIndex,0.5=>org.apache.lucene.search.FieldCacheImpl$DocTermsIndexImpl#538717823
(size =~ 376 bytes)
[junit4:junit4]   2> 	'SegmentCoreReader(owner=_1y(4.0.0.1):C960)'=>'id',class org.apache.lucene.search.FieldCache$DocTermsIndex,0.5=>org.apache.lucene.search.FieldCacheImpl$DocTermsIndexImpl#1734982295
(size =~ 12.7 KB)
[junit4:junit4]   2> 	'SegmentCoreReader(owner=_22(4.0.0.1):c43)'=>'id',class org.apache.lucene.search.FieldCache$DocTermsIndex,0.5=>org.apache.lucene.search.FieldCacheImpl$DocTermsIndexImpl#322703754
(size =~ 744 bytes)
[junit4:junit4]   2> 
[junit4:junit4]   2> *** END testRandom(org.apache.lucene.search.grouping.DistinctValuesCollectorTest):
Insane FieldCache usage(s) ***
[junit4:junit4]   2> NOTE: reproduce with: ant test  -Dtestcase=DistinctValuesCollectorTest
-Dtests.method=testRandom -Dtests.seed=63AF6546D770137A -Dtests.multiplier=3 -Dtests.slow=true
-Dtests.locale=it_CH -Dtests.timezone=America/Lima -Dtests.file.encoding=UTF-8
[junit4:junit4]   2>
[junit4:junit4]    > (@AfterClass output)
[junit4:junit4]   2> NOTE: test params are: codec=Lucene40: {id=Pulsing40(freqCutoff=8
minBlockSize=95 maxBlockSize=210), content=Pulsing40(freqCutoff=11 minBlockSize=95 maxBlockSize=210),
author=Pulsing40(freqCutoff=8 minBlockSize=95 maxBlockSize=210), publisher=PostingsFormat(name=Asserting)},
sim=DefaultSimilarity, locale=it_CH, timezone=America/Lima
[junit4:junit4]   2> NOTE: Linux 3.2.0-26-generic amd64/Sun Microsystems Inc. 1.6.0_33
(64-bit)/cpus=8,threads=1,free=140795736,total=195887104
[junit4:junit4]   2> NOTE: All tests run in this JVM: [TestGrouping, DistinctValuesCollectorTest]
[junit4:junit4]   2> 
[junit4:junit4] Completed on J0 in 6.08s, 2 tests, 1 failure <<< FAILURES!

[...truncated 5 lines...]
BUILD FAILED
/mnt/ssd/jenkins/workspace/Lucene-Solr-4.x-Linux-Java6-64/checkout/build.xml:29: The following
error occurred while executing this line:
/mnt/ssd/jenkins/workspace/Lucene-Solr-4.x-Linux-Java6-64/checkout/lucene/build.xml:508: The
following error occurred while executing this line:
/mnt/ssd/jenkins/workspace/Lucene-Solr-4.x-Linux-Java6-64/checkout/lucene/common-build.xml:1495:
The following error occurred while executing this line:
/mnt/ssd/jenkins/workspace/Lucene-Solr-4.x-Linux-Java6-64/checkout/lucene/module-build.xml:62:
The following error occurred while executing this line:
/mnt/ssd/jenkins/workspace/Lucene-Solr-4.x-Linux-Java6-64/checkout/lucene/common-build.xml:1093:
The following error occurred while executing this line:
/mnt/ssd/jenkins/workspace/Lucene-Solr-4.x-Linux-Java6-64/checkout/lucene/common-build.xml:788:
There were test failures: 6 suites, 10 tests, 1 failure

Total time: 11 minutes 45 seconds
Build step 'Execute shell' marked build as failure
Archiving artifacts
Recording test results
Email was triggered for: Failure
Sending email for trigger: Failure




Mime
View raw message