lucene-dev mailing list archives

Site index · List index
Message view « Date » · « Thread »
Top « Date » · « Thread »
From Policeman Jenkins Server <jenk...@sd-datasolutions.de>
Subject [JENKINS] Lucene-Solr-trunk-Linux-Java8-64 - Build # 13 - Still Failing!
Date Wed, 11 Jul 2012 20:48:02 GMT
Build: http://jenkins.sd-datasolutions.de/job/Lucene-Solr-trunk-Linux-Java8-64/13/

1 tests failed.
REGRESSION:  org.apache.solr.handler.component.DistributedQueryElevationComponentTest.testDistribSearch

Error Message:
Index: 18, Size: 18

Stack Trace:
java.lang.IndexOutOfBoundsException: Index: 18, Size: 18
	at __randomizedtesting.SeedInfo.seed([7C6EFDDEBEDA7C2F:FD8873C6C9851C13]:0)
	at java.util.ArrayList.rangeCheck(ArrayList.java:603)
	at java.util.ArrayList.get(ArrayList.java:381)
	at org.apache.solr.common.util.NamedList.getName(NamedList.java:127)
	at org.apache.solr.BaseDistributedSearchTestCase.compare(BaseDistributedSearchTestCase.java:466)
	at org.apache.solr.BaseDistributedSearchTestCase.compare(BaseDistributedSearchTestCase.java:612)
	at org.apache.solr.BaseDistributedSearchTestCase.compare(BaseDistributedSearchTestCase.java:500)
	at org.apache.solr.BaseDistributedSearchTestCase.compare(BaseDistributedSearchTestCase.java:612)
	at org.apache.solr.BaseDistributedSearchTestCase.compare(BaseDistributedSearchTestCase.java:500)
	at org.apache.solr.BaseDistributedSearchTestCase.compareResponses(BaseDistributedSearchTestCase.java:667)
	at org.apache.solr.BaseDistributedSearchTestCase.query(BaseDistributedSearchTestCase.java:392)
	at org.apache.solr.handler.component.DistributedQueryElevationComponentTest.doTest(DistributedQueryElevationComponentTest.java:81)
	at org.apache.solr.BaseDistributedSearchTestCase.testDistribSearch(BaseDistributedSearchTestCase.java:679)
	at sun.reflect.NativeMethodAccessorImpl.invoke0(Native Method)
	at sun.reflect.NativeMethodAccessorImpl.invoke(NativeMethodAccessorImpl.java:57)
	at sun.reflect.DelegatingMethodAccessorImpl.invoke(DelegatingMethodAccessorImpl.java:43)
	at java.lang.reflect.Method.invoke(Method.java:474)
	at com.carrotsearch.randomizedtesting.RandomizedRunner.invoke(RandomizedRunner.java:1995)
	at com.carrotsearch.randomizedtesting.RandomizedRunner.access$1100(RandomizedRunner.java:132)
	at com.carrotsearch.randomizedtesting.RandomizedRunner$6.evaluate(RandomizedRunner.java:818)
	at com.carrotsearch.randomizedtesting.RandomizedRunner$7.evaluate(RandomizedRunner.java:877)
	at com.carrotsearch.randomizedtesting.RandomizedRunner$8.evaluate(RandomizedRunner.java:891)
	at com.carrotsearch.randomizedtesting.rules.SystemPropertiesRestoreRule$1.evaluate(SystemPropertiesRestoreRule.java:53)
	at org.apache.lucene.util.TestRuleSetupTeardownChained$1.evaluate(TestRuleSetupTeardownChained.java:50)
	at org.apache.lucene.util.TestRuleFieldCacheSanity$1.evaluate(TestRuleFieldCacheSanity.java:32)
	at org.apache.lucene.util.AbstractBeforeAfterRule$1.evaluate(AbstractBeforeAfterRule.java:45)
	at com.carrotsearch.randomizedtesting.rules.SystemPropertiesInvariantRule$1.evaluate(SystemPropertiesInvariantRule.java:55)
	at org.apache.lucene.util.TestRuleReportUncaughtExceptions$1.evaluate(TestRuleReportUncaughtExceptions.java:68)
	at org.apache.lucene.util.TestRuleThreadAndTestName$1.evaluate(TestRuleThreadAndTestName.java:48)
	at org.apache.lucene.util.TestRuleIgnoreAfterMaxFailures$1.evaluate(TestRuleIgnoreAfterMaxFailures.java:70)
	at org.apache.lucene.util.TestRuleMarkFailure$1.evaluate(TestRuleMarkFailure.java:48)
	at com.carrotsearch.randomizedtesting.RandomizedRunner.runSingleTest(RandomizedRunner.java:825)
	at com.carrotsearch.randomizedtesting.RandomizedRunner.access$700(RandomizedRunner.java:132)
	at com.carrotsearch.randomizedtesting.RandomizedRunner$3$1.run(RandomizedRunner.java:671)
	at com.carrotsearch.randomizedtesting.RandomizedRunner$3.evaluate(RandomizedRunner.java:697)
	at com.carrotsearch.randomizedtesting.RandomizedRunner$4.evaluate(RandomizedRunner.java:736)
	at com.carrotsearch.randomizedtesting.RandomizedRunner$5.evaluate(RandomizedRunner.java:747)
	at com.carrotsearch.randomizedtesting.rules.SystemPropertiesRestoreRule$1.evaluate(SystemPropertiesRestoreRule.java:53)
	at org.apache.lucene.util.AbstractBeforeAfterRule$1.evaluate(AbstractBeforeAfterRule.java:45)
	at org.apache.lucene.util.TestRuleReportUncaughtExceptions$1.evaluate(TestRuleReportUncaughtExceptions.java:68)
	at org.apache.lucene.util.TestRuleStoreClassName$1.evaluate(TestRuleStoreClassName.java:38)
	at org.apache.lucene.util.TestRuleIcuHack$1.evaluate(TestRuleIcuHack.java:51)
	at com.carrotsearch.randomizedtesting.rules.SystemPropertiesInvariantRule$1.evaluate(SystemPropertiesInvariantRule.java:55)
	at org.apache.lucene.util.TestRuleNoInstanceHooksOverrides$1.evaluate(TestRuleNoInstanceHooksOverrides.java:53)
	at org.apache.lucene.util.TestRuleNoStaticHooksShadowing$1.evaluate(TestRuleNoStaticHooksShadowing.java:52)
	at org.apache.lucene.util.TestRuleAssertionsRequired$1.evaluate(TestRuleAssertionsRequired.java:36)
	at org.apache.lucene.util.TestRuleMarkFailure$1.evaluate(TestRuleMarkFailure.java:48)
	at org.apache.lucene.util.TestRuleIgnoreAfterMaxFailures$1.evaluate(TestRuleIgnoreAfterMaxFailures.java:70)
	at org.apache.lucene.util.TestRuleIgnoreTestSuites$1.evaluate(TestRuleIgnoreTestSuites.java:55)
	at com.carrotsearch.randomizedtesting.RandomizedRunner.runSuite(RandomizedRunner.java:605)
	at com.carrotsearch.randomizedtesting.RandomizedRunner.access$400(RandomizedRunner.java:132)
	at com.carrotsearch.randomizedtesting.RandomizedRunner$2.run(RandomizedRunner.java:551)




Build Log:
[...truncated 11125 lines...]
[junit4:junit4] Suite: org.apache.solr.handler.component.DistributedQueryElevationComponentTest
[junit4:junit4] ERROR   1.28s J0 | DistributedQueryElevationComponentTest.testDistribSearch
[junit4:junit4]    > Throwable #1: java.lang.IndexOutOfBoundsException: Index: 18, Size: 18
[junit4:junit4]    > 	at __randomizedtesting.SeedInfo.seed([7C6EFDDEBEDA7C2F:FD8873C6C9851C13]:0)
[junit4:junit4]    > 	at java.util.ArrayList.rangeCheck(ArrayList.java:603)
[junit4:junit4]    > 	at java.util.ArrayList.get(ArrayList.java:381)
[junit4:junit4]    > 	at org.apache.solr.common.util.NamedList.getName(NamedList.java:127)
[junit4:junit4]    > 	at org.apache.solr.BaseDistributedSearchTestCase.compare(BaseDistributedSearchTestCase.java:466)
[junit4:junit4]    > 	at org.apache.solr.BaseDistributedSearchTestCase.compare(BaseDistributedSearchTestCase.java:612)
[junit4:junit4]    > 	at org.apache.solr.BaseDistributedSearchTestCase.compare(BaseDistributedSearchTestCase.java:500)
[junit4:junit4]    > 	at org.apache.solr.BaseDistributedSearchTestCase.compare(BaseDistributedSearchTestCase.java:612)
[junit4:junit4]    > 	at org.apache.solr.BaseDistributedSearchTestCase.compare(BaseDistributedSearchTestCase.java:500)
[junit4:junit4]    > 	at org.apache.solr.BaseDistributedSearchTestCase.compareResponses(BaseDistributedSearchTestCase.java:667)
[junit4:junit4]    > 	at org.apache.solr.BaseDistributedSearchTestCase.query(BaseDistributedSearchTestCase.java:392)
[junit4:junit4]    > 	at org.apache.solr.handler.component.DistributedQueryElevationComponentTest.doTest(DistributedQueryElevationComponentTest.java:81)
[junit4:junit4]    > 	at org.apache.solr.BaseDistributedSearchTestCase.testDistribSearch(BaseDistributedSearchTestCase.java:679)
[junit4:junit4]    > 	at sun.reflect.NativeMethodAccessorImpl.invoke0(Native Method)
[junit4:junit4]    > 	at sun.reflect.NativeMethodAccessorImpl.invoke(NativeMethodAccessorImpl.java:57)
[junit4:junit4]    > 	at sun.reflect.DelegatingMethodAccessorImpl.invoke(DelegatingMethodAccessorImpl.java:43)
[junit4:junit4]    > 	at java.lang.reflect.Method.invoke(Method.java:474)
[junit4:junit4]    > 	at com.carrotsearch.randomizedtesting.RandomizedRunner.invoke(RandomizedRunner.java:1995)
[junit4:junit4]    > 	at com.carrotsearch.randomizedtesting.RandomizedRunner.access$1100(RandomizedRunner.java:132)
[junit4:junit4]    > 	at com.carrotsearch.randomizedtesting.RandomizedRunner$6.evaluate(RandomizedRunner.java:818)
[junit4:junit4]    > 	at com.carrotsearch.randomizedtesting.RandomizedRunner$7.evaluate(RandomizedRunner.java:877)
[junit4:junit4]    > 	at com.carrotsearch.randomizedtesting.RandomizedRunner$8.evaluate(RandomizedRunner.java:891)
[junit4:junit4]    > 	at com.carrotsearch.randomizedtesting.rules.SystemPropertiesRestoreRule$1.evaluate(SystemPropertiesRestoreRule.java:53)
[junit4:junit4]    > 	at org.apache.lucene.util.TestRuleSetupTeardownChained$1.evaluate(TestRuleSetupTeardownChained.java:50)
[junit4:junit4]    > 	at org.apache.lucene.util.TestRuleFieldCacheSanity$1.evaluate(TestRuleFieldCacheSanity.java:32)
[junit4:junit4]    > 	at org.apache.lucene.util.AbstractBeforeAfterRule$1.evaluate(AbstractBeforeAfterRule.java:45)
[junit4:junit4]    > 	at com.carrotsearch.randomizedtesting.rules.SystemPropertiesInvariantRule$1.evaluate(SystemPropertiesInvariantRule.java:55)
[junit4:junit4]    > 	at org.apache.lucene.util.TestRuleReportUncaughtExceptions$1.evaluate(TestRuleReportUncaughtExceptions.java:68)
[junit4:junit4]    > 	at org.apache.lucene.util.TestRuleThreadAndTestName$1.evaluate(TestRuleThreadAndTestName.java:48)
[junit4:junit4]    > 	at org.apache.lucene.util.TestRuleIgnoreAfterMaxFailures$1.evaluate(TestRuleIgnoreAfterMaxFailures.java:70)
[junit4:junit4]    > 	at org.apache.lucene.util.TestRuleMarkFailure$1.evaluate(TestRuleMarkFailure.java:48)
[junit4:junit4]    > 	at com.carrotsearch.randomizedtesting.RandomizedRunner.runSingleTest(RandomizedRunner.java:825)
[junit4:junit4]    > 	at com.carrotsearch.randomizedtesting.RandomizedRunner.access$700(RandomizedRunner.java:132)
[junit4:junit4]    > 	at com.carrotsearch.randomizedtesting.RandomizedRunner$3$1.run(RandomizedRunner.java:671)
[junit4:junit4]    > 	at com.carrotsearch.randomizedtesting.RandomizedRunner$3.evaluate(RandomizedRunner.java:697)
[junit4:junit4]    > 	at com.carrotsearch.randomizedtesting.RandomizedRunner$4.evaluate(RandomizedRunner.java:736)
[junit4:junit4]    > 	at com.carrotsearch.randomizedtesting.RandomizedRunner$5.evaluate(RandomizedRunner.java:747)
[junit4:junit4]    > 	at com.carrotsearch.randomizedtesting.rules.SystemPropertiesRestoreRule$1.evaluate(SystemPropertiesRestoreRule.java:53)
[junit4:junit4]    > 	at org.apache.lucene.util.AbstractBeforeAfterRule$1.evaluate(AbstractBeforeAfterRule.java:45)
[junit4:junit4]    > 	at org.apache.lucene.util.TestRuleReportUncaughtExceptions$1.evaluate(TestRuleReportUncaughtExceptions.java:68)
[junit4:junit4]    > 	at org.apache.lucene.util.TestRuleStoreClassName$1.evaluate(TestRuleStoreClassName.java:38)
[junit4:junit4]    > 	at org.apache.lucene.util.TestRuleIcuHack$1.evaluate(TestRuleIcuHack.java:51)
[junit4:junit4]    > 	at com.carrotsearch.randomizedtesting.rules.SystemPropertiesInvariantRule$1.evaluate(SystemPropertiesInvariantRule.java:55)
[junit4:junit4]    > 	at org.apache.lucene.util.TestRuleNoInstanceHooksOverrides$1.evaluate(TestRuleNoInstanceHooksOverrides.java:53)
[junit4:junit4]    > 	at org.apache.lucene.util.TestRuleNoStaticHooksShadowing$1.evaluate(TestRuleNoStaticHooksShadowing.java:52)
[junit4:junit4]    > 	at org.apache.lucene.util.TestRuleAssertionsRequired$1.evaluate(TestRuleAssertionsRequired.java:36)
[junit4:junit4]    > 	at org.apache.lucene.util.TestRuleMarkFailure$1.evaluate(TestRuleMarkFailure.java:48)
[junit4:junit4]    > 	at org.apache.lucene.util.TestRuleIgnoreAfterMaxFailures$1.evaluate(TestRuleIgnoreAfterMaxFailures.java:70)
[junit4:junit4]    > 	at org.apache.lucene.util.TestRuleIgnoreTestSuites$1.evaluate(TestRuleIgnoreTestSuites.java:55)
[junit4:junit4]    > 	at com.carrotsearch.randomizedtesting.RandomizedRunner.runSuite(RandomizedRunner.java:605)
[junit4:junit4]    > 	at com.carrotsearch.randomizedtesting.RandomizedRunner.access$400(RandomizedRunner.java:132)
[junit4:junit4]    > 	at com.carrotsearch.randomizedtesting.RandomizedRunner$2.run(RandomizedRunner.java:551)
[junit4:junit4]    > 
[junit4:junit4]   2> 2 T1967 oas.SolrTestCaseJ4.setUp ###Starting testDistribSearch
[junit4:junit4]   2> 2 T1967 oejs.Server.doStart jetty-8.1.2.v20120308
[junit4:junit4]   2> 3 T1967 oejs.AbstractConnector.doStart Started SocketConnector@0.0.0.0:44606
[junit4:junit4]   2> 4 T1967 oasc.SolrResourceLoader.locateSolrHome JNDI not configured for solr (NoInitialContextEx)
[junit4:junit4]   2> 5 T1967 oasc.SolrResourceLoader.locateSolrHome using system property solr.solr.home: /mnt/ssd/jenkins/workspace/Lucene-Solr-trunk-Linux-Java8-64/checkout/solr/build/solr-core/test-files/solr
[junit4:junit4]   2> 5 T1967 oasc.SolrResourceLoader.<init> new SolrResourceLoader for deduced Solr Home: '/mnt/ssd/jenkins/workspace/Lucene-Solr-trunk-Linux-Java8-64/checkout/solr/build/solr-core/test-files/solr/'
[junit4:junit4]   2> 7 T1967 oass.SolrDispatchFilter.init SolrDispatchFilter.init()
[junit4:junit4]   2> 8 T1967 oasc.SolrResourceLoader.locateSolrHome JNDI not configured for solr (NoInitialContextEx)
[junit4:junit4]   2> 8 T1967 oasc.SolrResourceLoader.locateSolrHome using system property solr.solr.home: /mnt/ssd/jenkins/workspace/Lucene-Solr-trunk-Linux-Java8-64/checkout/solr/build/solr-core/test-files/solr
[junit4:junit4]   2> 8 T1967 oasc.CoreContainer$Initializer.initialize looking for solr.xml: /mnt/ssd/jenkins/workspace/Lucene-Solr-trunk-Linux-Java8-64/checkout/solr/build/solr-core/test-files/solr/solr.xml
[junit4:junit4]   2> 8 T1967 oasc.CoreContainer.<init> New CoreContainer 1472252220
[junit4:junit4]   2> 8 T1967 oasc.CoreContainer.load Loading CoreContainer using Solr Home: '/mnt/ssd/jenkins/workspace/Lucene-Solr-trunk-Linux-Java8-64/checkout/solr/build/solr-core/test-files/solr/'
[junit4:junit4]   2> 9 T1967 oasc.SolrResourceLoader.<init> new SolrResourceLoader for directory: '/mnt/ssd/jenkins/workspace/Lucene-Solr-trunk-Linux-Java8-64/checkout/solr/build/solr-core/test-files/solr/'
[junit4:junit4]   2> 14 T1967 oasc.CoreContainer.load Registering Log Listener
[junit4:junit4]   2> 21 T1967 oashc.HttpShardHandlerFactory.getParameter Setting socketTimeout to: 0
[junit4:junit4]   2> 21 T1967 oashc.HttpShardHandlerFactory.getParameter Setting urlScheme to: http://
[junit4:junit4]   2> 21 T1967 oashc.HttpShardHandlerFactory.getParameter Setting connTimeout to: 0
[junit4:junit4]   2> 21 T1967 oashc.HttpShardHandlerFactory.getParameter Setting maxConnectionsPerHost to: 20
[junit4:junit4]   2> 22 T1967 oashc.HttpShardHandlerFactory.getParameter Setting corePoolSize to: 0
[junit4:junit4]   2> 22 T1967 oashc.HttpShardHandlerFactory.getParameter Setting maximumPoolSize to: 2147483647
[junit4:junit4]   2> 22 T1967 oashc.HttpShardHandlerFactory.getParameter Setting maxThreadIdleTime to: 5
[junit4:junit4]   2> 22 T1967 oashc.HttpShardHandlerFactory.getParameter Setting sizeOfQueue to: -1
[junit4:junit4]   2> 22 T1967 oashc.HttpShardHandlerFactory.getParameter Setting fairnessPolicy to: false
[junit4:junit4]   2> 23 T1967 oascsi.HttpClientUtil.createClient Creating new http client, config:maxConnectionsPerHost=20&maxConnections=10000&socketTimeout=0&connTimeout=0&retry=false
[junit4:junit4]   2> 27 T1967 oasc.CoreContainer.create Creating SolrCore 'collection1' using instanceDir: /mnt/ssd/jenkins/workspace/Lucene-Solr-trunk-Linux-Java8-64/checkout/solr/build/solr-core/test-files/solr/collection1
[junit4:junit4]   2> 27 T1967 oasc.SolrResourceLoader.<init> new SolrResourceLoader for directory: '/mnt/ssd/jenkins/workspace/Lucene-Solr-trunk-Linux-Java8-64/checkout/solr/build/solr-core/test-files/solr/collection1/'
[junit4:junit4]   2> 28 T1967 oasc.SolrResourceLoader.replaceClassLoader Adding 'file:/mnt/ssd/jenkins/workspace/Lucene-Solr-trunk-Linux-Java8-64/checkout/solr/build/solr-core/test-files/solr/collection1/lib/README' to classloader
[junit4:junit4]   2> 28 T1967 oasc.SolrResourceLoader.replaceClassLoader Adding 'file:/mnt/ssd/jenkins/workspace/Lucene-Solr-trunk-Linux-Java8-64/checkout/solr/build/solr-core/test-files/solr/collection1/lib/classes/' to classloader
[junit4:junit4]   2> 43 T1967 oasc.SolrConfig.<init> Using Lucene MatchVersion: LUCENE_50
[junit4:junit4]   2> 72 T1967 oasc.SolrConfig.<init> Loaded SolrConfig: solrconfig-elevate.xml
[junit4:junit4]   2> 72 T1967 oass.IndexSchema.readSchema Reading Solr Schema
[junit4:junit4]   2> 75 T1967 oass.IndexSchema.readSchema Schema name=example
[junit4:junit4]   2> 224 T1967 oass.IndexSchema.readSchema default search field in schema is text
[junit4:junit4]   2> 226 T1967 oass.IndexSchema.readSchema unique key field: id
[junit4:junit4]   2> 227 T1967 oasc.SolrCore.<init> [collection1] Opening new SolrCore at /mnt/ssd/jenkins/workspace/Lucene-Solr-trunk-Linux-Java8-64/checkout/solr/build/solr-core/test-files/solr/collection1/, dataDir=./org.apache.solr.handler.component.DistributedQueryElevationComponentTest-1342039637840/control/data/
[junit4:junit4]   2> 228 T1967 oasc.JmxMonitoredMap.<init> JMX monitoring is enabled. Adding Solr mbeans to JMX Server: com.sun.jmx.mbeanserver.JmxMBeanServer@924c71f
[junit4:junit4]   2> 228 T1967 oasc.SolrCore.getNewIndexDir WARNING New index directory detected: old=null new=./org.apache.solr.handler.component.DistributedQueryElevationComponentTest-1342039637840/control/data/index/
[junit4:junit4]   2> 228 T1967 oasc.SolrCore.initIndex WARNING [collection1] Solr index directory './org.apache.solr.handler.component.DistributedQueryElevationComponentTest-1342039637840/control/data/index' doesn't exist. Creating new index...
[junit4:junit4]   2> 229 T1967 oasc.SolrDeletionPolicy.onCommit SolrDeletionPolicy.onCommit: commits:num=1
[junit4:junit4]   2> 		commit{dir=MockDirWrapper(org.apache.lucene.store.RAMDirectory@14992dec lockFactory=org.apache.lucene.store.SingleInstanceLockFactory@3e99527e),segFN=segments_1,generation=1,filenames=[segments_1]
[junit4:junit4]   2> 229 T1967 oasc.SolrDeletionPolicy.updateCommits newest commit = 1
[junit4:junit4]   2> 230 T1967 oasc.RequestHandlers.initHandlersFromConfig created /update: solr.UpdateRequestHandler
[junit4:junit4]   2> 231 T1967 oasc.RequestHandlers.initHandlersFromConfig created /elevate: org.apache.solr.handler.component.SearchHandler
[junit4:junit4]   2> 231 T1967 oasc.RequestHandlers.initHandlersFromConfig created /dataElevate: org.apache.solr.handler.component.SearchHandler
[junit4:junit4]   2> 231 T1967 oashl.XMLLoader.init xsltCacheLifetimeSeconds=60
[junit4:junit4]   2> 232 T1967 oasc.RequestHandlers.initHandlersFromConfig WARNING no default request handler is registered (either '/select' or 'standard')
[junit4:junit4]   2> 232 T1967 oasc.SolrCore.initDeprecatedSupport WARNING solrconfig.xml uses deprecated <admin/gettableFiles>, Please update your config to use the ShowFileRequestHandler.
[junit4:junit4]   2> 233 T1967 oasc.SolrCore.initDeprecatedSupport WARNING adding ShowFileRequestHandler with hidden files: [SCHEMA_CODEC.XML, STEMDICT.TXT, STOPTYPES-1.TXT, SYNONYMS.TXT, SOLRCONFIG-MASTER1-KEEPONEBACKUP.XML, SCHEMA-BM25.XML, SCHEMA-MINIMAL.XML, SOLRCONFIG-SLAVE.XML, SCHEMA-NUMERIC.XML, WDFTYPES.TXT, STOPWORDSWRONGENCODING.TXT, SCHEMA-SPELLCHECKER.XML, SOLRCONFIG-SLAVE1.XML, SCHEMA11.XML, SOLRCONFIG-DELPOLICY2.XML, SOLRCONFIG-SIMPLELOCK.XML, SOLRCONFIG_PERF.XML, SCHEMA.XML, SCHEMA-DFR.XML, SOLRCONFIG-NOCACHE.XML, SOLRCONFIG-DELPOLICY1.XML, STOP-SNOWBALL.TXT, SOLRCONFIG-TRANSFORMERS.XML, SOLRCONFIG-PROPINJECT-INDEXDEFAULT.XML, BAD-SCHEMA-NONTEXT-ANALYZER.XML, SOLRCONFIG-QUERYSENDER.XML, SCHEMA-STOP-KEEP.XML, BAD_SOLRCONFIG.XML, SCHEMA-LUCENEMATCHVERSION.XML, XSLT, STOPWORDS.TXT, BAD-SCHEMA-NOT-INDEXED-BUT-TF.XML, SCHEMA-REQUIRED-FIELDS.XML, BAD-SCHEMA-SIM-GLOBAL-VS-FT-MISMATCH.XML, SCHEMA-CHARFILTERS.XML, SOLRCONFIG-CACHING.XML, SOLRCONFIG-QUERYSENDER-NOQUERY.XML, SOLRCONFIG-XINCLUDE.XML, BAD-SCHEMA-CODEC-GLOBAL-VS-FT-MISMATCH.XML, SCHEMA-LMDIRICHLET.XML, SOLRCONFIG-SPELLCHECKER.XML, BAD-SCHEMA-EXTERNAL-FILEFIELD.XML, PROTWORDS.TXT, SOLRCONFIG-SPELLCHECKCOMPONENT.XML, BAD-SCHEMA-DUP-FIELD.XML, DA_COMPOUNDDICTIONARY.TXT, COMPOUNDDICTIONARY.TXT, HYPHENATION.DTD, SCHEMA-COPYFIELD-TEST.XML, HUNSPELL-TEST.DIC, SCHEMA-LMJELINEKMERCER.XML, BAD-MP-SOLRCONFIG.XML, BAD-SCHEMA-UNIQUEKEY-USES-DEFAULT.XML, SOLRCONFIG-HIGHLIGHT.XML, STOP-2.TXT, CURRENCY.XML, HUNSPELL-TEST.AFF, SCHEMA-REPLICATION2.XML, SCHEMA-FOLDING.XML, BAD-SCHEMA-DUP-DYNAMICFIELD.XML, SOLRCONFIG-REQHANDLER.INCL, SOLRCONFIG-PHRASESUGGEST.XML, SOLRCONFIG-NATIVELOCK.XML, SOLRCONFIG-LAZYWRITER.XML, SOLRCONFIG-ELEVATE.XML, SOLRCONFIG-MERGEPOLICY.XML, SOLRCONFIG-FUNCTIONQUERY.XML, MAPPING-ISOLATIN1ACCENT.TXT, SOLRCONFIG_CODEC.XML, SOLRCONFIG-SOLR-749.XML, SOLRCONFIG-UPDATE-PROCESSOR-CHAINS.XML, SCHEMA-IB.XML, SOLRCONFIG-TLOG.XML, SCHEMA-COLLATE.XML, OPEN-EXCHANGE-RATES.JSON, SCHEMA15.XML, SOLRCONFIG-MASTER2.XML, STOP-1.TXT, SOLRCONFIG-ALTDIRECTORY.XML, FRENCHARTICLES.TXT, SOLRCONFIG-TERMINDEX.XML, SCHEMA-NOT-REQUIRED-UNIQUE-KEY.XML, SCHEMA-TFIDF.XML, PHRASESUGGEST.TXT, SCHEMASURROUND.XML, SCHEMA-SIM.XML, KEEP-1.TXT, BAD-SCHEMA-OMIT-TF-BUT-NOT-POS.XML, SOLRCONFIG-REPEATER.XML, SOLRCONFIG-BASIC.XML, SCHEMA-PHRASESUGGEST.XML, SOLRCONFIG-ENABLEPLUGIN.XML, SCHEMA12.XML, SOLRCONFIG-MASTER1.XML, STOPTYPES-2.TXT, SCHEMA-REVERSED.XML, STOPWITHBOM.TXT, BAD-SCHEMA-UNIQUEKEY-IS-COPYFIELD-DEST.XML, SCHEMA-BINARYFIELD.XML, BAD-SCHEMA-DUP-FIELDTYPE.XML, SCHEMA-TRIE.XML, BAD-SCHEMA-NOT-INDEXED-BUT-NORMS.XML, SOLRCONFIG-MASTER.XML, OLD_SYNONYMS.TXT, KEEP-2.TXT, BAD-SCHEMA-NOT-INDEXED-BUT-POS.XML, SOLRCONFIG-MASTER3.XML, DA_UTF8.XML, SOLRCONFIG-PROPINJECT.XML, SOLRCONFIG-SOLCOREPROPERTIES.XML, SCHEMA-REPLICATION1.XML, ELEVATE.XML]
[junit4:junit4]   2> 235 T1967 oass.SolrIndexSearcher.<init> Opening Searcher@7cafc385 main
[junit4:junit4]   2> 235 T1967 oass.SolrIndexSearcher.getIndexDir WARNING WARNING: Directory impl does not support setting indexDir: org.apache.lucene.store.MockDirectoryWrapper
[junit4:junit4]   2> 235 T1967 oasu.CommitTracker.<init> Hard AutoCommit: disabled
[junit4:junit4]   2> 235 T1967 oasu.CommitTracker.<init> Soft AutoCommit: disabled
[junit4:junit4]   2> 236 T1967 oashc.QueryElevationComponent.inform Loading QueryElevation from: /mnt/ssd/jenkins/workspace/Lucene-Solr-trunk-Linux-Java8-64/checkout/solr/build/solr-core/test-files/solr/collection1/conf/elevate.xml
[junit4:junit4]   2> 240 T1967 oashc.QueryElevationComponent.inform Loading QueryElevation from: /mnt/ssd/jenkins/workspace/Lucene-Solr-trunk-Linux-Java8-64/checkout/solr/build/solr-core/test-files/solr/collection1/conf/elevate.xml
[junit4:junit4]   2> 246 T1967 oasc.CoreContainer.register registering core: collection1
[junit4:junit4]   2> 246 T1967 oass.SolrDispatchFilter.init user.dir=/mnt/ssd/jenkins/workspace/Lucene-Solr-trunk-Linux-Java8-64/checkout/solr/build/solr-core/test/J0
[junit4:junit4]   2> 247 T1967 oass.SolrDispatchFilter.init SolrDispatchFilter.init() done
[junit4:junit4]   2> 247 T1967 oascsi.HttpClientUtil.createClient Creating new http client, config:maxConnections=128&maxConnectionsPerHost=32&followRedirects=false
[junit4:junit4]   2> 250 T1977 oasc.SolrCore.registerSearcher [collection1] Registered new searcher Searcher@7cafc385 main{StandardDirectoryReader(segments_1:1)}
[junit4:junit4]   2> 251 T1967 oejs.Server.doStart jetty-8.1.2.v20120308
[junit4:junit4]   2> 252 T1967 oejs.AbstractConnector.doStart Started SocketConnector@0.0.0.0:38604
[junit4:junit4]   2> 253 T1967 oasc.SolrResourceLoader.locateSolrHome JNDI not configured for solr (NoInitialContextEx)
[junit4:junit4]   2> 253 T1967 oasc.SolrResourceLoader.locateSolrHome using system property solr.solr.home: /mnt/ssd/jenkins/workspace/Lucene-Solr-trunk-Linux-Java8-64/checkout/solr/build/solr-core/test-files/solr
[junit4:junit4]   2> 253 T1967 oasc.SolrResourceLoader.<init> new SolrResourceLoader for deduced Solr Home: '/mnt/ssd/jenkins/workspace/Lucene-Solr-trunk-Linux-Java8-64/checkout/solr/build/solr-core/test-files/solr/'
[junit4:junit4]   2> 256 T1967 oass.SolrDispatchFilter.init SolrDispatchFilter.init()
[junit4:junit4]   2> 257 T1967 oasc.SolrResourceLoader.locateSolrHome JNDI not configured for solr (NoInitialContextEx)
[junit4:junit4]   2> 257 T1967 oasc.SolrResourceLoader.locateSolrHome using system property solr.solr.home: /mnt/ssd/jenkins/workspace/Lucene-Solr-trunk-Linux-Java8-64/checkout/solr/build/solr-core/test-files/solr
[junit4:junit4]   2> 257 T1967 oasc.CoreContainer$Initializer.initialize looking for solr.xml: /mnt/ssd/jenkins/workspace/Lucene-Solr-trunk-Linux-Java8-64/checkout/solr/build/solr-core/test-files/solr/solr.xml
[junit4:junit4]   2> 257 T1967 oasc.CoreContainer.<init> New CoreContainer 1724726520
[junit4:junit4]   2> 257 T1967 oasc.CoreContainer.load Loading CoreContainer using Solr Home: '/mnt/ssd/jenkins/workspace/Lucene-Solr-trunk-Linux-Java8-64/checkout/solr/build/solr-core/test-files/solr/'
[junit4:junit4]   2> 258 T1967 oasc.SolrResourceLoader.<init> new SolrResourceLoader for directory: '/mnt/ssd/jenkins/workspace/Lucene-Solr-trunk-Linux-Java8-64/checkout/solr/build/solr-core/test-files/solr/'
[junit4:junit4]   2> 263 T1967 oasc.CoreContainer.load Registering Log Listener
[junit4:junit4]   2> 270 T1967 oashc.HttpShardHandlerFactory.getParameter Setting socketTimeout to: 0
[junit4:junit4]   2> 270 T1967 oashc.HttpShardHandlerFactory.getParameter Setting urlScheme to: http://
[junit4:junit4]   2> 270 T1967 oashc.HttpShardHandlerFactory.getParameter Setting connTimeout to: 0
[junit4:junit4]   2> 270 T1967 oashc.HttpShardHandlerFactory.getParameter Setting maxConnectionsPerHost to: 20
[junit4:junit4]   2> 271 T1967 oashc.HttpShardHandlerFactory.getParameter Setting corePoolSize to: 0
[junit4:junit4]   2> 271 T1967 oashc.HttpShardHandlerFactory.getParameter Setting maximumPoolSize to: 2147483647
[junit4:junit4]   2> 271 T1967 oashc.HttpShardHandlerFactory.getParameter Setting maxThreadIdleTime to: 5
[junit4:junit4]   2> 271 T1967 oashc.HttpShardHandlerFactory.getParameter Setting sizeOfQueue to: -1
[junit4:junit4]   2> 271 T1967 oashc.HttpShardHandlerFactory.getParameter Setting fairnessPolicy to: false
[junit4:junit4]   2> 271 T1967 oascsi.HttpClientUtil.createClient Creating new http client, config:maxConnectionsPerHost=20&maxConnections=10000&socketTimeout=0&connTimeout=0&retry=false
[junit4:junit4]   2> 275 T1967 oasc.CoreContainer.create Creating SolrCore 'collection1' using instanceDir: /mnt/ssd/jenkins/workspace/Lucene-Solr-trunk-Linux-Java8-64/checkout/solr/build/solr-core/test-files/solr/collection1
[junit4:junit4]   2> 275 T1967 oasc.SolrResourceLoader.<init> new SolrResourceLoader for directory: '/mnt/ssd/jenkins/workspace/Lucene-Solr-trunk-Linux-Java8-64/checkout/solr/build/solr-core/test-files/solr/collection1/'
[junit4:junit4]   2> 276 T1967 oasc.SolrResourceLoader.replaceClassLoader Adding 'file:/mnt/ssd/jenkins/workspace/Lucene-Solr-trunk-Linux-Java8-64/checkout/solr/build/solr-core/test-files/solr/collection1/lib/README' to classloader
[junit4:junit4]   2> 276 T1967 oasc.SolrResourceLoader.replaceClassLoader Adding 'file:/mnt/ssd/jenkins/workspace/Lucene-Solr-trunk-Linux-Java8-64/checkout/solr/build/solr-core/test-files/solr/collection1/lib/classes/' to classloader
[junit4:junit4]   2> 287 T1967 oasc.SolrConfig.<init> Using Lucene MatchVersion: LUCENE_50
[junit4:junit4]   2> 316 T1967 oasc.SolrConfig.<init> Loaded SolrConfig: solrconfig-elevate.xml
[junit4:junit4]   2> 316 T1967 oass.IndexSchema.readSchema Reading Solr Schema
[junit4:junit4]   2> 319 T1967 oass.IndexSchema.readSchema Schema name=example
[junit4:junit4]   2> 442 T1967 oass.IndexSchema.readSchema default search field in schema is text
[junit4:junit4]   2> 443 T1967 oass.IndexSchema.readSchema unique key field: id
[junit4:junit4]   2> 445 T1967 oasc.SolrCore.<init> [collection1] Opening new SolrCore at /mnt/ssd/jenkins/workspace/Lucene-Solr-trunk-Linux-Java8-64/checkout/solr/build/solr-core/test-files/solr/collection1/, dataDir=./org.apache.solr.handler.component.DistributedQueryElevationComponentTest-1342039637840/shard0/data/
[junit4:junit4]   2> 446 T1967 oasc.JmxMonitoredMap.<init> JMX monitoring is enabled. Adding Solr mbeans to JMX Server: com.sun.jmx.mbeanserver.JmxMBeanServer@924c71f
[junit4:junit4]   2> 446 T1967 oasc.SolrCore.getNewIndexDir WARNING New index directory detected: old=null new=./org.apache.solr.handler.component.DistributedQueryElevationComponentTest-1342039637840/shard0/data/index/
[junit4:junit4]   2> 447 T1967 oasc.SolrCore.initIndex WARNING [collection1] Solr index directory './org.apache.solr.handler.component.DistributedQueryElevationComponentTest-1342039637840/shard0/data/index' doesn't exist. Creating new index...
[junit4:junit4]   2> 448 T1967 oasc.SolrDeletionPolicy.onCommit SolrDeletionPolicy.onCommit: commits:num=1
[junit4:junit4]   2> 		commit{dir=MockDirWrapper(org.apache.lucene.store.RAMDirectory@1aab16d9 lockFactory=org.apache.lucene.store.SingleInstanceLockFactory@b25b176),segFN=segments_1,generation=1,filenames=[segments_1]
[junit4:junit4]   2> 448 T1967 oasc.SolrDeletionPolicy.updateCommits newest commit = 1
[junit4:junit4]   2> 449 T1967 oasc.RequestHandlers.initHandlersFromConfig created /update: solr.UpdateRequestHandler
[junit4:junit4]   2> 449 T1967 oasc.RequestHandlers.initHandlersFromConfig created /elevate: org.apache.solr.handler.component.SearchHandler
[junit4:junit4]   2> 450 T1967 oasc.RequestHandlers.initHandlersFromConfig created /dataElevate: org.apache.solr.handler.component.SearchHandler
[junit4:junit4]   2> 450 T1967 oashl.XMLLoader.init xsltCacheLifetimeSeconds=60
[junit4:junit4]   2> 450 T1967 oasc.RequestHandlers.initHandlersFromConfig WARNING no default request handler is registered (either '/select' or 'standard')
[junit4:junit4]   2> 452 T1967 oasc.SolrCore.initDeprecatedSupport WARNING solrconfig.xml uses deprecated <admin/gettableFiles>, Please update your config to use the ShowFileRequestHandler.
[junit4:junit4]   2> 452 T1967 oasc.SolrCore.initDeprecatedSupport WARNING adding ShowFileRequestHandler with hidden files: [SCHEMA_CODEC.XML, STEMDICT.TXT, STOPTYPES-1.TXT, SYNONYMS.TXT, SOLRCONFIG-MASTER1-KEEPONEBACKUP.XML, SCHEMA-BM25.XML, SCHEMA-MINIMAL.XML, SOLRCONFIG-SLAVE.XML, SCHEMA-NUMERIC.XML, WDFTYPES.TXT, STOPWORDSWRONGENCODING.TXT, SCHEMA-SPELLCHECKER.XML, SOLRCONFIG-SLAVE1.XML, SCHEMA11.XML, SOLRCONFIG-DELPOLICY2.XML, SOLRCONFIG-SIMPLELOCK.XML, SOLRCONFIG_PERF.XML, SCHEMA.XML, SCHEMA-DFR.XML, SOLRCONFIG-NOCACHE.XML, SOLRCONFIG-DELPOLICY1.XML, STOP-SNOWBALL.TXT, SOLRCONFIG-TRANSFORMERS.XML, SOLRCONFIG-PROPINJECT-INDEXDEFAULT.XML, BAD-SCHEMA-NONTEXT-ANALYZER.XML, SOLRCONFIG-QUERYSENDER.XML, SCHEMA-STOP-KEEP.XML, BAD_SOLRCONFIG.XML, SCHEMA-LUCENEMATCHVERSION.XML, XSLT, STOPWORDS.TXT, BAD-SCHEMA-NOT-INDEXED-BUT-TF.XML, SCHEMA-REQUIRED-FIELDS.XML, BAD-SCHEMA-SIM-GLOBAL-VS-FT-MISMATCH.XML, SCHEMA-CHARFILTERS.XML, SOLRCONFIG-CACHING.XML, SOLRCONFIG-QUERYSENDER-NOQUERY.XML, SOLRCONFIG-XINCLUDE.XML, BAD-SCHEMA-CODEC-GLOBAL-VS-FT-MISMATCH.XML, SCHEMA-LMDIRICHLET.XML, SOLRCONFIG-SPELLCHECKER.XML, BAD-SCHEMA-EXTERNAL-FILEFIELD.XML, PROTWORDS.TXT, SOLRCONFIG-SPELLCHECKCOMPONENT.XML, BAD-SCHEMA-DUP-FIELD.XML, DA_COMPOUNDDICTIONARY.TXT, COMPOUNDDICTIONARY.TXT, HYPHENATION.DTD, SCHEMA-COPYFIELD-TEST.XML, HUNSPELL-TEST.DIC, SCHEMA-LMJELINEKMERCER.XML, BAD-MP-SOLRCONFIG.XML, BAD-SCHEMA-UNIQUEKEY-USES-DEFAULT.XML, SOLRCONFIG-HIGHLIGHT.XML, STOP-2.TXT, CURRENCY.XML, HUNSPELL-TEST.AFF, SCHEMA-REPLICATION2.XML, SCHEMA-FOLDING.XML, BAD-SCHEMA-DUP-DYNAMICFIELD.XML, SOLRCONFIG-REQHANDLER.INCL, SOLRCONFIG-PHRASESUGGEST.XML, SOLRCONFIG-NATIVELOCK.XML, SOLRCONFIG-LAZYWRITER.XML, SOLRCONFIG-ELEVATE.XML, SOLRCONFIG-MERGEPOLICY.XML, SOLRCONFIG-FUNCTIONQUERY.XML, MAPPING-ISOLATIN1ACCENT.TXT, SOLRCONFIG_CODEC.XML, SOLRCONFIG-SOLR-749.XML, SOLRCONFIG-UPDATE-PROCESSOR-CHAINS.XML, SCHEMA-IB.XML, SOLRCONFIG-TLOG.XML, SCHEMA-COLLATE.XML, OPEN-EXCHANGE-RATES.JSON, SCHEMA15.XML, SOLRCONFIG-MASTER2.XML, STOP-1.TXT, SOLRCONFIG-ALTDIRECTORY.XML, FRENCHARTICLES.TXT, SOLRCONFIG-TERMINDEX.XML, SCHEMA-NOT-REQUIRED-UNIQUE-KEY.XML, SCHEMA-TFIDF.XML, PHRASESUGGEST.TXT, SCHEMASURROUND.XML, SCHEMA-SIM.XML, KEEP-1.TXT, BAD-SCHEMA-OMIT-TF-BUT-NOT-POS.XML, SOLRCONFIG-REPEATER.XML, SOLRCONFIG-BASIC.XML, SCHEMA-PHRASESUGGEST.XML, SOLRCONFIG-ENABLEPLUGIN.XML, SCHEMA12.XML, SOLRCONFIG-MASTER1.XML, STOPTYPES-2.TXT, SCHEMA-REVERSED.XML, STOPWITHBOM.TXT, BAD-SCHEMA-UNIQUEKEY-IS-COPYFIELD-DEST.XML, SCHEMA-BINARYFIELD.XML, BAD-SCHEMA-DUP-FIELDTYPE.XML, SCHEMA-TRIE.XML, BAD-SCHEMA-NOT-INDEXED-BUT-NORMS.XML, SOLRCONFIG-MASTER.XML, OLD_SYNONYMS.TXT, KEEP-2.TXT, BAD-SCHEMA-NOT-INDEXED-BUT-POS.XML, SOLRCONFIG-MASTER3.XML, DA_UTF8.XML, SOLRCONFIG-PROPINJECT.XML, SOLRCONFIG-SOLCOREPROPERTIES.XML, SCHEMA-REPLICATION1.XML, ELEVATE.XML]
[junit4:junit4]   2> 454 T1967 oass.SolrIndexSearcher.<init> Opening Searcher@51035da9 main
[junit4:junit4]   2> 454 T1967 oass.SolrIndexSearcher.getIndexDir WARNING WARNING: Directory impl does not support setting indexDir: org.apache.lucene.store.MockDirectoryWrapper
[junit4:junit4]   2> 454 T1967 oasu.CommitTracker.<init> Hard AutoCommit: disabled
[junit4:junit4]   2> 455 T1967 oasu.CommitTracker.<init> Soft AutoCommit: disabled
[junit4:junit4]   2> 455 T1967 oashc.QueryElevationComponent.inform Loading QueryElevation from: /mnt/ssd/jenkins/workspace/Lucene-Solr-trunk-Linux-Java8-64/checkout/solr/build/solr-core/test-files/solr/collection1/conf/elevate.xml
[junit4:junit4]   2> 460 T1967 oashc.QueryElevationComponent.inform Loading QueryElevation from: /mnt/ssd/jenkins/workspace/Lucene-Solr-trunk-Linux-Java8-64/checkout/solr/build/solr-core/test-files/solr/collection1/conf/elevate.xml
[junit4:junit4]   2> 465 T1987 oasc.SolrCore.registerSearcher [collection1] Registered new searcher Searcher@51035da9 main{StandardDirectoryReader(segments_1:1)}
[junit4:junit4]   2> 465 T1967 oasc.CoreContainer.register registering core: collection1
[junit4:junit4]   2> 465 T1967 oass.SolrDispatchFilter.init user.dir=/mnt/ssd/jenkins/workspace/Lucene-Solr-trunk-Linux-Java8-64/checkout/solr/build/solr-core/test/J0
[junit4:junit4]   2> 465 T1967 oass.SolrDispatchFilter.init SolrDispatchFilter.init() done
[junit4:junit4]   2> 465 T1967 oascsi.HttpClientUtil.createClient Creating new http client, config:maxConnections=128&maxConnectionsPerHost=32&followRedirects=false
[junit4:junit4]   2> 467 T1967 oejs.Server.doStart jetty-8.1.2.v20120308
[junit4:junit4]   2> 468 T1967 oejs.AbstractConnector.doStart Started SocketConnector@0.0.0.0:44656
[junit4:junit4]   2> 469 T1967 oasc.SolrResourceLoader.locateSolrHome JNDI not configured for solr (NoInitialContextEx)
[junit4:junit4]   2> 470 T1967 oasc.SolrResourceLoader.locateSolrHome using system property solr.solr.home: /mnt/ssd/jenkins/workspace/Lucene-Solr-trunk-Linux-Java8-64/checkout/solr/build/solr-core/test-files/solr
[junit4:junit4]   2> 470 T1967 oasc.SolrResourceLoader.<init> new SolrResourceLoader for deduced Solr Home: '/mnt/ssd/jenkins/workspace/Lucene-Solr-trunk-Linux-Java8-64/checkout/solr/build/solr-core/test-files/solr/'
[junit4:junit4]   2> 472 T1967 oass.SolrDispatchFilter.init SolrDispatchFilter.init()
[junit4:junit4]   2> 472 T1967 oasc.SolrResourceLoader.locateSolrHome JNDI not configured for solr (NoInitialContextEx)
[junit4:junit4]   2> 472 T1967 oasc.SolrResourceLoader.locateSolrHome using system property solr.solr.home: /mnt/ssd/jenkins/workspace/Lucene-Solr-trunk-Linux-Java8-64/checkout/solr/build/solr-core/test-files/solr
[junit4:junit4]   2> 473 T1967 oasc.CoreContainer$Initializer.initialize looking for solr.xml: /mnt/ssd/jenkins/workspace/Lucene-Solr-trunk-Linux-Java8-64/checkout/solr/build/solr-core/test-files/solr/solr.xml
[junit4:junit4]   2> 473 T1967 oasc.CoreContainer.<init> New CoreContainer 2054956012
[junit4:junit4]   2> 473 T1967 oasc.CoreContainer.load Loading CoreContainer using Solr Home: '/mnt/ssd/jenkins/workspace/Lucene-Solr-trunk-Linux-Java8-64/checkout/solr/build/solr-core/test-files/solr/'
[junit4:junit4]   2> 473 T1967 oasc.SolrResourceLoader.<init> new SolrResourceLoader for directory: '/mnt/ssd/jenkins/workspace/Lucene-Solr-trunk-Linux-Java8-64/checkout/solr/build/solr-core/test-files/solr/'
[junit4:junit4]   2> 479 T1967 oasc.CoreContainer.load Registering Log Listener
[junit4:junit4]   2> 488 T1967 oashc.HttpShardHandlerFactory.getParameter Setting socketTimeout to: 0
[junit4:junit4]   2> 488 T1967 oashc.HttpShardHandlerFactory.getParameter Setting urlScheme to: http://
[junit4:junit4]   2> 488 T1967 oashc.HttpShardHandlerFactory.getParameter Setting connTimeout to: 0
[junit4:junit4]   2> 489 T1967 oashc.HttpShardHandlerFactory.getParameter Setting maxConnectionsPerHost to: 20
[junit4:junit4]   2> 489 T1967 oashc.HttpShardHandlerFactory.getParameter Setting corePoolSize to: 0
[junit4:junit4]   2> 489 T1967 oashc.HttpShardHandlerFactory.getParameter Setting maximumPoolSize to: 2147483647
[junit4:junit4]   2> 489 T1967 oashc.HttpShardHandlerFactory.getParameter Setting maxThreadIdleTime to: 5
[junit4:junit4]   2> 490 T1967 oashc.HttpShardHandlerFactory.getParameter Setting sizeOfQueue to: -1
[junit4:junit4]   2> 490 T1967 oashc.HttpShardHandlerFactory.getParameter Setting fairnessPolicy to: false
[junit4:junit4]   2> 490 T1967 oascsi.HttpClientUtil.createClient Creating new http client, config:maxConnectionsPerHost=20&maxConnections=10000&socketTimeout=0&connTimeout=0&retry=false
[junit4:junit4]   2> 495 T1967 oasc.CoreContainer.create Creating SolrCore 'collection1' using instanceDir: /mnt/ssd/jenkins/workspace/Lucene-Solr-trunk-Linux-Java8-64/checkout/solr/build/solr-core/test-files/solr/collection1
[junit4:junit4]   2> 495 T1967 oasc.SolrResourceLoader.<init> new SolrResourceLoader for directory: '/mnt/ssd/jenkins/workspace/Lucene-Solr-trunk-Linux-Java8-64/checkout/solr/build/solr-core/test-files/solr/collection1/'
[junit4:junit4]   2> 495 T1967 oasc.SolrResourceLoader.replaceClassLoader Adding 'file:/mnt/ssd/jenkins/workspace/Lucene-Solr-trunk-Linux-Java8-64/checkout/solr/build/solr-core/test-files/solr/collection1/lib/README' to classloader
[junit4:junit4]   2> 495 T1967 oasc.SolrResourceLoader.replaceClassLoader Adding 'file:/mnt/ssd/jenkins/workspace/Lucene-Solr-trunk-Linux-Java8-64/checkout/solr/build/solr-core/test-files/solr/collection1/lib/classes/' to classloader
[junit4:junit4]   2> 508 T1967 oasc.SolrConfig.<init> Using Lucene MatchVersion: LUCENE_50
[junit4:junit4]   2> 537 T1967 oasc.SolrConfig.<init> Loaded SolrConfig: solrconfig-elevate.xml
[junit4:junit4]   2> 537 T1967 oass.IndexSchema.readSchema Reading Solr Schema
[junit4:junit4]   2> 540 T1967 oass.IndexSchema.readSchema Schema name=example
[junit4:junit4]   2> 648 T1967 oass.IndexSchema.readSchema default search field in schema is text
[junit4:junit4]   2> 650 T1967 oass.IndexSchema.readSchema unique key field: id
[junit4:junit4]   2> 652 T1967 oasc.SolrCore.<init> [collection1] Opening new SolrCore at /mnt/ssd/jenkins/workspace/Lucene-Solr-trunk-Linux-Java8-64/checkout/solr/build/solr-core/test-files/solr/collection1/, dataDir=./org.apache.solr.handler.component.DistributedQueryElevationComponentTest-1342039637840/shard1/data/
[junit4:junit4]   2> 652 T1967 oasc.JmxMonitoredMap.<init> JMX monitoring is enabled. Adding Solr mbeans to JMX Server: com.sun.jmx.mbeanserver.JmxMBeanServer@924c71f
[junit4:junit4]   2> 652 T1967 oasc.SolrCore.getNewIndexDir WARNING New index directory detected: old=null new=./org.apache.solr.handler.component.DistributedQueryElevationComponentTest-1342039637840/shard1/data/index/
[junit4:junit4]   2> 653 T1967 oasc.SolrCore.initIndex WARNING [collection1] Solr index directory './org.apache.solr.handler.component.DistributedQueryElevationComponentTest-1342039637840/shard1/data/index' doesn't exist. Creating new index...
[junit4:junit4]   2> 654 T1967 oasc.SolrDeletionPolicy.onCommit SolrDeletionPolicy.onCommit: commits:num=1
[junit4:junit4]   2> 		commit{dir=MockDirWrapper(org.apache.lucene.store.RAMDirectory@7192da8d lockFactory=org.apache.lucene.store.SingleInstanceLockFactory@419221e0),segFN=segments_1,generation=1,filenames=[segments_1]
[junit4:junit4]   2> 654 T1967 oasc.SolrDeletionPolicy.updateCommits newest commit = 1
[junit4:junit4]   2> 655 T1967 oasc.RequestHandlers.initHandlersFromConfig created /update: solr.UpdateRequestHandler
[junit4:junit4]   2> 655 T1967 oasc.RequestHandlers.initHandlersFromConfig created /elevate: org.apache.solr.handler.component.SearchHandler
[junit4:junit4]   2> 656 T1967 oasc.RequestHandlers.initHandlersFromConfig created /dataElevate: org.apache.solr.handler.component.SearchHandler
[junit4:junit4]   2> 656 T1967 oashl.XMLLoader.init xsltCacheLifetimeSeconds=60
[junit4:junit4]   2> 656 T1967 oasc.RequestHandlers.initHandlersFromConfig WARNING no default request handler is registered (either '/select' or 'standard')
[junit4:junit4]   2> 657 T1967 oasc.SolrCore.initDeprecatedSupport WARNING solrconfig.xml uses deprecated <admin/gettableFiles>, Please update your config to use the ShowFileRequestHandler.
[junit4:junit4]   2> 658 T1967 oasc.SolrCore.initDeprecatedSupport WARNING adding ShowFileRequestHandler with hidden files: [SCHEMA_CODEC.XML, STEMDICT.TXT, STOPTYPES-1.TXT, SYNONYMS.TXT, SOLRCONFIG-MASTER1-KEEPONEBACKUP.XML, SCHEMA-BM25.XML, SCHEMA-MINIMAL.XML, SOLRCONFIG-SLAVE.XML, SCHEMA-NUMERIC.XML, WDFTYPES.TXT, STOPWORDSWRONGENCODING.TXT, SCHEMA-SPELLCHECKER.XML, SOLRCONFIG-SLAVE1.XML, SCHEMA11.XML, SOLRCONFIG-DELPOLICY2.XML, SOLRCONFIG-SIMPLELOCK.XML, SOLRCONFIG_PERF.XML, SCHEMA.XML, SCHEMA-DFR.XML, SOLRCONFIG-NOCACHE.XML, SOLRCONFIG-DELPOLICY1.XML, STOP-SNOWBALL.TXT, SOLRCONFIG-TRANSFORMERS.XML, SOLRCONFIG-PROPINJECT-INDEXDEFAULT.XML, BAD-SCHEMA-NONTEXT-ANALYZER.XML, SOLRCONFIG-QUERYSENDER.XML, SCHEMA-STOP-KEEP.XML, BAD_SOLRCONFIG.XML, SCHEMA-LUCENEMATCHVERSION.XML, XSLT, STOPWORDS.TXT, BAD-SCHEMA-NOT-INDEXED-BUT-TF.XML, SCHEMA-REQUIRED-FIELDS.XML, BAD-SCHEMA-SIM-GLOBAL-VS-FT-MISMATCH.XML, SCHEMA-CHARFILTERS.XML, SOLRCONFIG-CACHING.XML, SOLRCONFIG-QUERYSENDER-NOQUERY.XML, SOLRCONFIG-XINCLUDE.XML, BAD-SCHEMA-CODEC-GLOBAL-VS-FT-MISMATCH.XML, SCHEMA-LMDIRICHLET.XML, SOLRCONFIG-SPELLCHECKER.XML, BAD-SCHEMA-EXTERNAL-FILEFIELD.XML, PROTWORDS.TXT, SOLRCONFIG-SPELLCHECKCOMPONENT.XML, BAD-SCHEMA-DUP-FIELD.XML, DA_COMPOUNDDICTIONARY.TXT, COMPOUNDDICTIONARY.TXT, HYPHENATION.DTD, SCHEMA-COPYFIELD-TEST.XML, HUNSPELL-TEST.DIC, SCHEMA-LMJELINEKMERCER.XML, BAD-MP-SOLRCONFIG.XML, BAD-SCHEMA-UNIQUEKEY-USES-DEFAULT.XML, SOLRCONFIG-HIGHLIGHT.XML, STOP-2.TXT, CURRENCY.XML, HUNSPELL-TEST.AFF, SCHEMA-REPLICATION2.XML, SCHEMA-FOLDING.XML, BAD-SCHEMA-DUP-DYNAMICFIELD.XML, SOLRCONFIG-REQHANDLER.INCL, SOLRCONFIG-PHRASESUGGEST.XML, SOLRCONFIG-NATIVELOCK.XML, SOLRCONFIG-LAZYWRITER.XML, SOLRCONFIG-ELEVATE.XML, SOLRCONFIG-MERGEPOLICY.XML, SOLRCONFIG-FUNCTIONQUERY.XML, MAPPING-ISOLATIN1ACCENT.TXT, SOLRCONFIG_CODEC.XML, SOLRCONFIG-SOLR-749.XML, SOLRCONFIG-UPDATE-PROCESSOR-CHAINS.XML, SCHEMA-IB.XML, SOLRCONFIG-TLOG.XML, SCHEMA-COLLATE.XML, OPEN-EXCHANGE-RATES.JSON, SCHEMA15.XML, SOLRCONFIG-MASTER2.XML, STOP-1.TXT, SOLRCONFIG-ALTDIRECTORY.XML, FRENCHARTICLES.TXT, SOLRCONFIG-TERMINDEX.XML, SCHEMA-NOT-REQUIRED-UNIQUE-KEY.XML, SCHEMA-TFIDF.XML, PHRASESUGGEST.TXT, SCHEMASURROUND.XML, SCHEMA-SIM.XML, KEEP-1.TXT, BAD-SCHEMA-OMIT-TF-BUT-NOT-POS.XML, SOLRCONFIG-REPEATER.XML, SOLRCONFIG-BASIC.XML, SCHEMA-PHRASESUGGEST.XML, SOLRCONFIG-ENABLEPLUGIN.XML, SCHEMA12.XML, SOLRCONFIG-MASTER1.XML, STOPTYPES-2.TXT, SCHEMA-REVERSED.XML, STOPWITHBOM.TXT, BAD-SCHEMA-UNIQUEKEY-IS-COPYFIELD-DEST.XML, SCHEMA-BINARYFIELD.XML, BAD-SCHEMA-DUP-FIELDTYPE.XML, SCHEMA-TRIE.XML, BAD-SCHEMA-NOT-INDEXED-BUT-NORMS.XML, SOLRCONFIG-MASTER.XML, OLD_SYNONYMS.TXT, KEEP-2.TXT, BAD-SCHEMA-NOT-INDEXED-BUT-POS.XML, SOLRCONFIG-MASTER3.XML, DA_UTF8.XML, SOLRCONFIG-PROPINJECT.XML, SOLRCONFIG-SOLCOREPROPERTIES.XML, SCHEMA-REPLICATION1.XML, ELEVATE.XML]
[junit4:junit4]   2> 660 T1967 oass.SolrIndexSearcher.<init> Opening Searcher@13dc99a1 main
[junit4:junit4]   2> 660 T1967 oass.SolrIndexSearcher.getIndexDir WARNING WARNING: Directory impl does not support setting indexDir: org.apache.lucene.store.MockDirectoryWrapper
[junit4:junit4]   2> 661 T1967 oasu.CommitTracker.<init> Hard AutoCommit: disabled
[junit4:junit4]   2> 661 T1967 oasu.CommitTracker.<init> Soft AutoCommit: disabled
[junit4:junit4]   2> 661 T1967 oashc.QueryElevationComponent.inform Loading QueryElevation from: /mnt/ssd/jenkins/workspace/Lucene-Solr-trunk-Linux-Java8-64/checkout/solr/build/solr-core/test-files/solr/collection1/conf/elevate.xml
[junit4:junit4]   2> 667 T1967 oashc.QueryElevationComponent.inform Loading QueryElevation from: /mnt/ssd/jenkins/workspace/Lucene-Solr-trunk-Linux-Java8-64/checkout/solr/build/solr-core/test-files/solr/collection1/conf/elevate.xml
[junit4:junit4]   2> 674 T1997 oasc.SolrCore.registerSearcher [collection1] Registered new searcher Searcher@13dc99a1 main{StandardDirectoryReader(segments_1:1)}
[junit4:junit4]   2> 674 T1967 oasc.CoreContainer.register registering core: collection1
[junit4:junit4]   2> 675 T1967 oass.SolrDispatchFilter.init user.dir=/mnt/ssd/jenkins/workspace/Lucene-Solr-trunk-Linux-Java8-64/checkout/solr/build/solr-core/test/J0
[junit4:junit4]   2> 675 T1967 oass.SolrDispatchFilter.init SolrDispatchFilter.init() done
[junit4:junit4]   2> 675 T1967 oascsi.HttpClientUtil.createClient Creating new http client, config:maxConnections=128&maxConnectionsPerHost=32&followRedirects=false
[junit4:junit4]   2> 677 T1967 oejs.Server.doStart jetty-8.1.2.v20120308
[junit4:junit4]   2> 678 T1967 oejs.AbstractConnector.doStart Started SocketConnector@0.0.0.0:38575
[junit4:junit4]   2> 679 T1967 oasc.SolrResourceLoader.locateSolrHome JNDI not configured for solr (NoInitialContextEx)
[junit4:junit4]   2> 679 T1967 oasc.SolrResourceLoader.locateSolrHome using system property solr.solr.home: /mnt/ssd/jenkins/workspace/Lucene-Solr-trunk-Linux-Java8-64/checkout/solr/build/solr-core/test-files/solr
[junit4:junit4]   2> 680 T1967 oasc.SolrResourceLoader.<init> new SolrResourceLoader for deduced Solr Home: '/mnt/ssd/jenkins/workspace/Lucene-Solr-trunk-Linux-Java8-64/checkout/solr/build/solr-core/test-files/solr/'
[junit4:junit4]   2> 683 T1967 oass.SolrDispatchFilter.init SolrDispatchFilter.init()
[junit4:junit4]   2> 683 T1967 oasc.SolrResourceLoader.locateSolrHome JNDI not configured for solr (NoInitialContextEx)
[junit4:junit4]   2> 683 T1967 oasc.SolrResourceLoader.locateSolrHome using system property solr.solr.home: /mnt/ssd/jenkins/workspace/Lucene-Solr-trunk-Linux-Java8-64/checkout/solr/build/solr-core/test-files/solr
[junit4:junit4]   2> 683 T1967 oasc.CoreContainer$Initializer.initialize looking for solr.xml: /mnt/ssd/jenkins/workspace/Lucene-Solr-trunk-Linux-Java8-64/checkout/solr/build/solr-core/test-files/solr/solr.xml
[junit4:junit4]   2> 684 T1967 oasc.CoreContainer.<init> New CoreContainer 2122212849
[junit4:junit4]   2> 684 T1967 oasc.CoreContainer.load Loading CoreContainer using Solr Home: '/mnt/ssd/jenkins/workspace/Lucene-Solr-trunk-Linux-Java8-64/checkout/solr/build/solr-core/test-files/solr/'
[junit4:junit4]   2> 684 T1967 oasc.SolrResourceLoader.<init> new SolrResourceLoader for directory: '/mnt/ssd/jenkins/workspace/Lucene-Solr-trunk-Linux-Java8-64/checkout/solr/build/solr-core/test-files/solr/'
[junit4:junit4]   2> 689 T1967 oasc.CoreContainer.load Registering Log Listener
[junit4:junit4]   2> 696 T1967 oashc.HttpShardHandlerFactory.getParameter Setting socketTimeout to: 0
[junit4:junit4]   2> 696 T1967 oashc.HttpShardHandlerFactory.getParameter Setting urlScheme to: http://
[junit4:junit4]   2> 696 T1967 oashc.HttpShardHandlerFactory.getParameter Setting connTimeout to: 0
[junit4:junit4]   2> 697 T1967 oashc.HttpShardHandlerFactory.getParameter Setting maxConnectionsPerHost to: 20
[junit4:junit4]   2> 697 T1967 oashc.HttpShardHandlerFactory.getParameter Setting corePoolSize to: 0
[junit4:junit4]   2> 697 T1967 oashc.HttpShardHandlerFactory.getParameter Setting maximumPoolSize to: 2147483647
[junit4:junit4]   2> 697 T1967 oashc.HttpShardHandlerFactory.getParameter Setting maxThreadIdleTime to: 5
[junit4:junit4]   2> 697 T1967 oashc.HttpShardHandlerFactory.getParameter Setting sizeOfQueue to: -1
[junit4:junit4]   2> 698 T1967 oashc.HttpShardHandlerFactory.getParameter Setting fairnessPolicy to: false
[junit4:junit4]   2> 698 T1967 oascsi.HttpClientUtil.createClient Creating new http client, config:maxConnectionsPerHost=20&maxConnections=10000&socketTimeout=0&connTimeout=0&retry=false
[junit4:junit4]   2> 702 T1967 oasc.CoreContainer.create Creating SolrCore 'collection1' using instanceDir: /mnt/ssd/jenkins/workspace/Lucene-Solr-trunk-Linux-Java8-64/checkout/solr/build/solr-core/test-files/solr/collection1
[junit4:junit4]   2> 703 T1967 oasc.SolrResourceLoader.<init> new SolrResourceLoader for directory: '/mnt/ssd/jenkins/workspace/Lucene-Solr-trunk-Linux-Java8-64/checkout/solr/build/solr-core/test-files/solr/collection1/'
[junit4:junit4]   2> 703 T1967 oasc.SolrResourceLoader.replaceClassLoader Adding 'file:/mnt/ssd/jenkins/workspace/Lucene-Solr-trunk-Linux-Java8-64/checkout/solr/build/solr-core/test-files/solr/collection1/lib/README' to classloader
[junit4:junit4]   2> 704 T1967 oasc.SolrResourceLoader.replaceClassLoader Adding 'file:/mnt/ssd/jenkins/workspace/Lucene-Solr-trunk-Linux-Java8-64/checkout/solr/build/solr-core/test-files/solr/collection1/lib/classes/' to classloader
[junit4:junit4]   2> 719 T1967 oasc.SolrConfig.<init> Using Lucene MatchVersion: LUCENE_50
[junit4:junit4]   2> 751 T1967 oasc.SolrConfig.<init> Loaded SolrConfig: solrconfig-elevate.xml
[junit4:junit4]   2> 752 T1967 oass.IndexSchema.readSchema Reading Solr Schema
[junit4:junit4]   2> 755 T1967 oass.IndexSchema.readSchema Schema name=example
[junit4:junit4]   2> 875 T1967 oass.IndexSchema.readSchema default search field in schema is text
[junit4:junit4]   2> 876 T1967 oass.IndexSchema.readSchema unique key field: id
[junit4:junit4]   2> 878 T1967 oasc.SolrCore.<init> [collection1] Opening new SolrCore at /mnt/ssd/jenkins/workspace/Lucene-Solr-trunk-Linux-Java8-64/checkout/solr/build/solr-core/test-files/solr/collection1/, dataDir=./org.apache.solr.handler.component.DistributedQueryElevationComponentTest-1342039637840/shard2/data/
[junit4:junit4]   2> 878 T1967 oasc.JmxMonitoredMap.<init> JMX monitoring is enabled. Adding Solr mbeans to JMX Server: com.sun.jmx.mbeanserver.JmxMBeanServer@924c71f
[junit4:junit4]   2> 879 T1967 oasc.SolrCore.getNewIndexDir WARNING New index directory detected: old=null new=./org.apache.solr.handler.component.DistributedQueryElevationComponentTest-1342039637840/shard2/data/index/
[junit4:junit4]   2> 879 T1967 oasc.SolrCore.initIndex WARNING [collection1] Solr index directory './org.apache.solr.handler.component.DistributedQueryElevationComponentTest-1342039637840/shard2/data/index' doesn't exist. Creating new index...
[junit4:junit4]   2> 880 T1967 oasc.SolrDeletionPolicy.onCommit SolrDeletionPolicy.onCommit: commits:num=1
[junit4:junit4]   2> 		commit{dir=MockDirWrapper(org.apache.lucene.store.RAMDirectory@16d6b0e3 lockFactory=org.apache.lucene.store.SingleInstanceLockFactory@34f30343),segFN=segments_1,generation=1,filenames=[segments_1]
[junit4:junit4]   2> 880 T1967 oasc.SolrDeletionPolicy.updateCommits newest commit = 1
[junit4:junit4]   2> 881 T1967 oasc.RequestHandlers.initHandlersFromConfig created /update: solr.UpdateRequestHandler
[junit4:junit4]   2> 881 T1967 oasc.RequestHandlers.initHandlersFromConfig created /elevate: org.apache.solr.handler.component.SearchHandler
[junit4:junit4]   2> 881 T1967 oasc.RequestHandlers.initHandlersFromConfig created /dataElevate: org.apache.solr.handler.component.SearchHandler
[junit4:junit4]   2> 882 T1967 oashl.XMLLoader.init xsltCacheLifetimeSeconds=60
[junit4:junit4]   2> 882 T1967 oasc.RequestHandlers.initHandlersFromConfig WARNING no default request handler is registered (either '/select' or 'standard')
[junit4:junit4]   2> 883 T1967 oasc.SolrCore.initDeprecatedSupport WARNING solrconfig.xml uses deprecated <admin/gettableFiles>, Please update your config to use the ShowFileRequestHandler.
[junit4:junit4]   2> 883 T1967 oasc.SolrCore.initDeprecatedSupport WARNING adding ShowFileRequestHandler with hidden files: [SCHEMA_CODEC.XML, STEMDICT.TXT, STOPTYPES-1.TXT, SYNONYMS.TXT, SOLRCONFIG-MASTER1-KEEPONEBACKUP.XML, SCHEMA-BM25.XML, SCHEMA-MINIMAL.XML, SOLRCONFIG-SLAVE.XML, SCHEMA-NUMERIC.XML, WDFTYPES.TXT, STOPWORDSWRONGENCODING.TXT, SCHEMA-SPELLCHECKER.XML, SOLRCONFIG-SLAVE1.XML, SCHEMA11.XML, SOLRCONFIG-DELPOLICY2.XML, SOLRCONFIG-SIMPLELOCK.XML, SOLRCONFIG_PERF.XML, SCHEMA.XML, SCHEMA-DFR.XML, SOLRCONFIG-NOCACHE.XML, SOLRCONFIG-DELPOLICY1.XML, STOP-SNOWBALL.TXT, SOLRCONFIG-TRANSFORMERS.XML, SOLRCONFIG-PROPINJECT-INDEXDEFAULT.XML, BAD-SCHEMA-NONTEXT-ANALYZER.XML, SOLRCONFIG-QUERYSENDER.XML, SCHEMA-STOP-KEEP.XML, BAD_SOLRCONFIG.XML, SCHEMA-LUCENEMATCHVERSION.XML, XSLT, STOPWORDS.TXT, BAD-SCHEMA-NOT-INDEXED-BUT-TF.XML, SCHEMA-REQUIRED-FIELDS.XML, BAD-SCHEMA-SIM-GLOBAL-VS-FT-MISMATCH.XML, SCHEMA-CHARFILTERS.XML, SOLRCONFIG-CACHING.XML, SOLRCONFIG-QUERYSENDER-NOQUERY.XML, SOLRCONFIG-XINCLUDE.XML, BAD-SCHEMA-CODEC-GLOBAL-VS-FT-MISMATCH.XML, SCHEMA-LMDIRICHLET.XML, SOLRCONFIG-SPELLCHECKER.XML, BAD-SCHEMA-EXTERNAL-FILEFIELD.XML, PROTWORDS.TXT, SOLRCONFIG-SPELLCHECKCOMPONENT.XML, BAD-SCHEMA-DUP-FIELD.XML, DA_COMPOUNDDICTIONARY.TXT, COMPOUNDDICTIONARY.TXT, HYPHENATION.DTD, SCHEMA-COPYFIELD-TEST.XML, HUNSPELL-TEST.DIC, SCHEMA-LMJELINEKMERCER.XML, BAD-MP-SOLRCONFIG.XML, BAD-SCHEMA-UNIQUEKEY-USES-DEFAULT.XML, SOLRCONFIG-HIGHLIGHT.XML, STOP-2.TXT, CURRENCY.XML, HUNSPELL-TEST.AFF, SCHEMA-REPLICATION2.XML, SCHEMA-FOLDING.XML, BAD-SCHEMA-DUP-DYNAMICFIELD.XML, SOLRCONFIG-REQHANDLER.INCL, SOLRCONFIG-PHRASESUGGEST.XML, SOLRCONFIG-NATIVELOCK.XML, SOLRCONFIG-LAZYWRITER.XML, SOLRCONFIG-ELEVATE.XML, SOLRCONFIG-MERGEPOLICY.XML, SOLRCONFIG-FUNCTIONQUERY.XML, MAPPING-ISOLATIN1ACCENT.TXT, SOLRCONFIG_CODEC.XML, SOLRCONFIG-SOLR-749.XML, SOLRCONFIG-UPDATE-PROCESSOR-CHAINS.XML, SCHEMA-IB.XML, SOLRCONFIG-TLOG.XML, SCHEMA-COLLATE.XML, OPEN-EXCHANGE-RATES.JSON, SCHEMA15.XML, SOLRCONFIG-MASTER2.XML, STOP-1.TXT, SOLRCONFIG-ALTDIRECTORY.XML, FRENCHARTICLES.TXT, SOLRCONFIG-TERMINDEX.XML, SCHEMA-NOT-REQUIRED-UNIQUE-KEY.XML, SCHEMA-TFIDF.XML, PHRASESUGGEST.TXT, SCHEMASURROUND.XML, SCHEMA-SIM.XML, KEEP-1.TXT, BAD-SCHEMA-OMIT-TF-BUT-NOT-POS.XML, SOLRCONFIG-REPEATER.XML, SOLRCONFIG-BASIC.XML, SCHEMA-PHRASESUGGEST.XML, SOLRCONFIG-ENABLEPLUGIN.XML, SCHEMA12.XML, SOLRCONFIG-MASTER1.XML, STOPTYPES-2.TXT, SCHEMA-REVERSED.XML, STOPWITHBOM.TXT, BAD-SCHEMA-UNIQUEKEY-IS-COPYFIELD-DEST.XML, SCHEMA-BINARYFIELD.XML, BAD-SCHEMA-DUP-FIELDTYPE.XML, SCHEMA-TRIE.XML, BAD-SCHEMA-NOT-INDEXED-BUT-NORMS.XML, SOLRCONFIG-MASTER.XML, OLD_SYNONYMS.TXT, KEEP-2.TXT, BAD-SCHEMA-NOT-INDEXED-BUT-POS.XML, SOLRCONFIG-MASTER3.XML, DA_UTF8.XML, SOLRCONFIG-PROPINJECT.XML, SOLRCONFIG-SOLCOREPROPERTIES.XML, SCHEMA-REPLICATION1.XML, ELEVATE.XML]
[junit4:junit4]   2> 885 T1967 oass.SolrIndexSearcher.<init> Opening Searcher@16b8702c main
[junit4:junit4]   2> 885 T1967 oass.SolrIndexSearcher.getIndexDir WARNING WARNING: Directory impl does not support setting indexDir: org.apache.lucene.store.MockDirectoryWrapper
[junit4:junit4]   2> 886 T1967 oasu.CommitTracker.<init> Hard AutoCommit: disabled
[junit4:junit4]   2> 886 T1967 oasu.CommitTracker.<init> Soft AutoCommit: disabled
[junit4:junit4]   2> 886 T1967 oashc.QueryElevationComponent.inform Loading QueryElevation from: /mnt/ssd/jenkins/workspace/Lucene-Solr-trunk-Linux-Java8-64/checkout/solr/build/solr-core/test-files/solr/collection1/conf/elevate.xml
[junit4:junit4]   2> 892 T1967 oashc.QueryElevationComponent.inform Loading QueryElevation from: /mnt/ssd/jenkins/workspace/Lucene-Solr-trunk-Linux-Java8-64/checkout/solr/build/solr-core/test-files/solr/collection1/conf/elevate.xml
[junit4:junit4]   2> 899 T2007 oasc.SolrCore.registerSearcher [collection1] Registered new searcher Searcher@16b8702c main{StandardDirectoryReader(segments_1:1)}
[junit4:junit4]   2> 899 T1967 oasc.CoreContainer.register registering core: collection1
[junit4:junit4]   2> 899 T1967 oass.SolrDispatchFilter.init user.dir=/mnt/ssd/jenkins/workspace/Lucene-Solr-trunk-Linux-Java8-64/checkout/solr/build/solr-core/test/J0
[junit4:junit4]   2> 899 T1967 oass.SolrDispatchFilter.init SolrDispatchFilter.init() done
[junit4:junit4]   2> 899 T1967 oascsi.HttpClientUtil.createClient Creating new http client, config:maxConnections=128&maxConnectionsPerHost=32&followRedirects=false
[junit4:junit4]   2> ASYNC  NEW_CORE C100 name=collection1 org.apache.solr.core.SolrCore@2fc94fc
[junit4:junit4]   2> 904 T1970 C100 oasu.DirectUpdateHandler2.deleteAll [collection1] REMOVING ALL DOCUMENTS FROM INDEX
[junit4:junit4]   2> 906 T1970 C100 oasc.SolrDeletionPolicy.onInit SolrDeletionPolicy.onInit: commits:num=1
[junit4:junit4]   2> 		commit{dir=MockDirWrapper(org.apache.lucene.store.RAMDirectory@14992dec lockFactory=org.apache.lucene.store.SingleInstanceLockFactory@3e99527e),segFN=segments_1,generation=1,filenames=[segments_1]
[junit4:junit4]   2> 906 T1970 C100 oasc.SolrDeletionPolicy.updateCommits newest commit = 1
[junit4:junit4]   2> 906 T1970 C100 UPDATE [collection1] webapp=/solr path=/update params={version=2&wt=javabin} {deleteByQuery=*:*} 0 2
[junit4:junit4]   2> ASYNC  NEW_CORE C101 name=collection1 org.apache.solr.core.SolrCore@3a95386b
[junit4:junit4]   2> 911 T1980 C101 oasu.DirectUpdateHandler2.deleteAll [collection1] REMOVING ALL DOCUMENTS FROM INDEX
[junit4:junit4]   2> 912 T1980 C101 oasc.SolrDeletionPolicy.onInit SolrDeletionPolicy.onInit: commits:num=1
[junit4:junit4]   2> 		commit{dir=MockDirWrapper(org.apache.lucene.store.RAMDirectory@1aab16d9 lockFactory=org.apache.lucene.store.SingleInstanceLockFactory@b25b176),segFN=segments_1,generation=1,filenames=[segments_1]
[junit4:junit4]   2> 912 T1980 C101 oasc.SolrDeletionPolicy.updateCommits newest commit = 1
[junit4:junit4]   2> 913 T1980 C101 UPDATE [collection1] webapp=/solr path=/update params={version=2&wt=javabin} {deleteByQuery=*:*} 0 3
[junit4:junit4]   2> ASYNC  NEW_CORE C102 name=collection1 org.apache.solr.core.SolrCore@d4dd7cd
[junit4:junit4]   2> 915 T1990 C102 oasu.DirectUpdateHandler2.deleteAll [collection1] REMOVING ALL DOCUMENTS FROM INDEX
[junit4:junit4]   2> 916 T1990 C102 oasc.SolrDeletionPolicy.onInit SolrDeletionPolicy.onInit: commits:num=1
[junit4:junit4]   2> 		commit{dir=MockDirWrapper(org.apache.lucene.store.RAMDirectory@7192da8d lockFactory=org.apache.lucene.store.SingleInstanceLockFactory@419221e0),segFN=segments_1,generation=1,filenames=[segments_1]
[junit4:junit4]   2> 917 T1990 C102 oasc.SolrDeletionPolicy.updateCommits newest commit = 1
[junit4:junit4]   2> 917 T1990 C102 UPDATE [collection1] webapp=/solr path=/update params={version=2&wt=javabin} {deleteByQuery=*:*} 0 2
[junit4:junit4]   2> ASYNC  NEW_CORE C103 name=collection1 org.apache.solr.core.SolrCore@4bf45862
[junit4:junit4]   2> 920 T2000 C103 oasu.DirectUpdateHandler2.deleteAll [collection1] REMOVING ALL DOCUMENTS FROM INDEX
[junit4:junit4]   2> 921 T2000 C103 oasc.SolrDeletionPolicy.onInit SolrDeletionPolicy.onInit: commits:num=1
[junit4:junit4]   2> 		commit{dir=MockDirWrapper(org.apache.lucene.store.RAMDirectory@16d6b0e3 lockFactory=org.apache.lucene.store.SingleInstanceLockFactory@34f30343),segFN=segments_1,generation=1,filenames=[segments_1]
[junit4:junit4]   2> 922 T2000 C103 oasc.SolrDeletionPolicy.updateCommits newest commit = 1
[junit4:junit4]   2> 923 T2000 C103 UPDATE [collection1] webapp=/solr path=/update params={version=2&wt=javabin} {deleteByQuery=*:*} 0 3
[junit4:junit4]   2> 925 T1970 C100 UPDATE [collection1] webapp=/solr path=/update params={version=2&wt=javabin} {add=[1]} 0 1
[junit4:junit4]   2> 927 T1980 C101 UPDATE [collection1] webapp=/solr path=/update params={version=2&wt=javabin} {add=[1]} 0 0
[junit4:junit4]   2> 929 T1970 C100 UPDATE [collection1] webapp=/solr path=/update params={version=2&wt=javabin} {add=[2]} 0 0
[junit4:junit4]   2> 931 T1990 C102 UPDATE [collection1] webapp=/solr path=/update params={version=2&wt=javabin} {add=[2]} 0 0
[junit4:junit4]   2> 933 T1970 C100 UPDATE [collection1] webapp=/solr path=/update params={version=2&wt=javabin} {add=[3]} 0 0
[junit4:junit4]   2> 935 T2000 C103 UPDATE [collection1] webapp=/solr path=/update params={version=2&wt=javabin} {add=[3]} 0 0
[junit4:junit4]   2> 937 T1970 C100 UPDATE [collection1] webapp=/solr path=/update params={version=2&wt=javabin} {add=[4]} 0 0
[junit4:junit4]   2> 939 T1980 C101 UPDATE [collection1] webapp=/solr path=/update params={version=2&wt=javabin} {add=[4]} 0 0
[junit4:junit4]   2> 941 T1970 C100 UPDATE [collection1] webapp=/solr path=/update params={version=2&wt=javabin} {add=[5]} 0 0
[junit4:junit4]   2> 943 T1990 C102 UPDATE [collection1] webapp=/solr path=/update params={version=2&wt=javabin} {add=[5]} 0 0
[junit4:junit4]   2> 945 T1970 C100 UPDATE [collection1] webapp=/solr path=/update params={version=2&wt=javabin} {add=[6]} 0 0
[junit4:junit4]   2> 947 T2000 C103 UPDATE [collection1] webapp=/solr path=/update params={version=2&wt=javabin} {add=[6]} 0 1
[junit4:junit4]   2> 948 T1970 C100 UPDATE [collection1] webapp=/solr path=/update params={version=2&wt=javabin} {add=[7]} 0 0
[junit4:junit4]   2> 950 T2000 C103 UPDATE [collection1] webapp=/solr path=/update params={version=2&wt=javabin} {add=[7]} 0 0
[junit4:junit4]   2> 952 T1970 C100 oasu.DirectUpdateHandler2.commit start commit{flags=0,version=0,optimize=false,openSearcher=true,waitSearcher=true,expungeDeletes=false,softCommit=false}
[junit4:junit4]   2> 953 T1970 C100 oasc.SolrDeletionPolicy.onCommit SolrDeletionPolicy.onCommit: commits:num=2
[junit4:junit4]   2> 		commit{dir=MockDirWrapper(org.apache.lucene.store.RAMDirectory@14992dec lockFactory=org.apache.lucene.store.SingleInstanceLockFactory@3e99527e),segFN=segments_1,generation=1,filenames=[segments_1]
[junit4:junit4]   2> 		commit{dir=MockDirWrapper(org.apache.lucene.store.RAMDirectory@14992dec lockFactory=org.apache.lucene.store.SingleInstanceLockFactory@3e99527e),segFN=segments_2,generation=2,filenames=[_0_nrm.cfe, _0.fdt, _0_MockSep_0.doc, _0_MockSep_0.pos, _0.si, _0_Pulsing40_0.tip, _0_nrm.cfs, _0_MockSep_0.tib, _0_MockSep_0.skp, _0.fnm, _0_MockSep_0.frq, _0_Pulsing40_0.prx, _0_MockSep_0.pyl, _0_Pulsing40_0.frq, _0_Pulsing40_0.tim, _0_MockSep_0.tii, _0.fdx, segments_2]
[junit4:junit4]   2> 954 T1970 C100 oasc.SolrDeletionPolicy.updateCommits newest commit = 2
[junit4:junit4]   2> 954 T1970 C100 oass.SolrIndexSearcher.<init> Opening Searcher@40802dfb main
[junit4:junit4]   2> 955 T1970 C100 oass.SolrIndexSearcher.getIndexDir WARNING WARNING: Directory impl does not support setting indexDir: org.apache.lucene.store.MockDirectoryWrapper
[junit4:junit4]   2> 955 T1970 C100 oasu.DirectUpdateHandler2.commit end_commit_flush
[junit4:junit4]   2> 955 T1977 oasc.SolrCore.registerSearcher [collection1] Registered new searcher Searcher@40802dfb main{StandardDirectoryReader(segments_2:4 _0(5.0):C7)}
[junit4:junit4]   2> 955 T1970 C100 UPDATE [collection1] webapp=/solr path=/update params={wt=javabin&softCommit=false&waitSearcher=true&commit=true&version=2} {commit=} 0 3
[junit4:junit4]   2> 957 T1980 C101 oasu.DirectUpdateHandler2.commit start commit{flags=0,version=0,optimize=false,openSearcher=true,waitSearcher=true,expungeDeletes=false,softCommit=false}
[junit4:junit4]   2> 959 T1980 C101 oasc.SolrDeletionPolicy.onCommit SolrDeletionPolicy.onCommit: commits:num=2
[junit4:junit4]   2> 		commit{dir=MockDirWrapper(org.apache.lucene.store.RAMDirectory@1aab16d9 lockFactory=org.apache.lucene.store.SingleInstanceLockFactory@b25b176),segFN=segments_1,generation=1,filenames=[segments_1]
[junit4:junit4]   2> 		commit{dir=MockDirWrapper(org.apache.lucene.store.RAMDirectory@1aab16d9 lockFactory=org.apache.lucene.store.SingleInstanceLockFactory@b25b176),segFN=segments_2,generation=2,filenames=[_0_nrm.cfe, _0.fdt, _0_MockSep_0.doc, _0_MockSep_0.pos, _0.si, _0_Pulsing40_0.tip, _0_nrm.cfs, _0_MockSep_0.tib, _0_MockSep_0.skp, _0.fnm, _0_MockSep_0.frq, _0_Pulsing40_0.prx, _0_MockSep_0.pyl, _0_Pulsing40_0.frq, _0_Pulsing40_0.tim, _0_MockSep_0.tii, _0.fdx, segments_2]
[junit4:junit4]   2> 959 T1980 C101 oasc.SolrDeletionPolicy.updateCommits newest commit = 2
[junit4:junit4]   2> 960 T1980 C101 oass.SolrIndexSearcher.<init> Opening Searcher@3d38ee01 main
[junit4:junit4]   2> 960 T1980 C101 oass.SolrIndexSearcher.getIndexDir WARNING WARNING: Directory impl does not support setting indexDir: org.apache.lucene.store.MockDirectoryWrapper
[junit4:junit4]   2> 960 T1980 C101 oasu.DirectUpdateHandler2.commit end_commit_flush
[junit4:junit4]   2> 961 T1987 oasc.SolrCore.registerSearcher [collection1] Registered new searcher Searcher@3d38ee01 main{StandardDirectoryReader(segments_2:4 _0(5.0):C2)}
[junit4:junit4]   2> 961 T1980 C101 UPDATE [collection1] webapp=/solr path=/update params={wt=javabin&softCommit=false&waitSearcher=true&commit=true&version=2} {commit=} 0 4
[junit4:junit4]   2> 963 T1990 C102 oasu.DirectUpdateHandler2.commit start commit{flags=0,version=0,optimize=false,openSearcher=true,waitSearcher=true,expungeDeletes=false,softCommit=false}
[junit4:junit4]   2> 964 T1990 C102 oasc.SolrDeletionPolicy.onCommit SolrDeletionPolicy.onCommit: commits:num=2
[junit4:junit4]   2> 		commit{dir=MockDirWrapper(org.apache.lucene.store.RAMDirectory@7192da8d lockFactory=org.apache.lucene.store.SingleInstanceLockFactory@419221e0),segFN=segments_1,generation=1,filenames=[segments_1]
[junit4:junit4]   2> 		commit{dir=MockDirWrapper(org.apache.lucene.store.RAMDirectory@7192da8d lockFactory=org.apache.lucene.store.SingleInstanceLockFactory@419221e0),segFN=segments_2,generation=2,filenames=[_0_nrm.cfe, _0.fdt, _0_MockSep_0.doc, _0_MockSep_0.pos, _0.si, _0_Pulsing40_0.tip, _0_nrm.cfs, _0_MockSep_0.skp, _0_MockSep_0.tib, _0.fnm, _0_MockSep_0.frq, _0_Pulsing40_0.prx, _0_MockSep_0.pyl, _0_Pulsing40_0.frq, _0_Pulsing40_0.tim, _0_MockSep_0.tii, _0.fdx, segments_2]
[junit4:junit4]   2> 964 T1990 C102 oasc.SolrDeletionPolicy.updateCommits newest commit = 2
[junit4:junit4]   2> 964 T1990 C102 oass.SolrIndexSearcher.<init> Opening Searcher@2d50bbbe main
[junit4:junit4]   2> 965 T1990 C102 oass.SolrIndexSearcher.getIndexDir WARNING WARNING: Directory impl does not support setting indexDir: org.apache.lucene.store.MockDirectoryWrapper
[junit4:junit4]   2> 965 T1990 C102 oasu.DirectUpdateHandler2.commit end_commit_flush
[junit4:junit4]   2> 965 T1997 oasc.SolrCore.registerSearcher [collection1] Registered new searcher Searcher@2d50bbbe main{StandardDirectoryReader(segments_2:4 _0(5.0):C2)}
[junit4:junit4]   2> 965 T1990 C102 UPDATE [collection1] webapp=/solr path=/update params={wt=javabin&softCommit=false&waitSearcher=true&commit=true&version=2} {commit=} 0 2
[junit4:junit4]   2> 967 T2000 C103 oasu.DirectUpdateHandler2.commit start commit{flags=0,version=0,optimize=false,openSearcher=true,waitSearcher=true,expungeDeletes=false,softCommit=false}
[junit4:junit4]   2> 968 T2000 C103 oasc.SolrDeletionPolicy.onCommit SolrDeletionPolicy.onCommit: commits:num=2
[junit4:junit4]   2> 		commit{dir=MockDirWrapper(org.apache.lucene.store.RAMDirectory@16d6b0e3 lockFactory=org.apache.lucene.store.SingleInstanceLockFactory@34f30343),segFN=segments_1,generation=1,filenames=[segments_1]
[junit4:junit4]   2> 		commit{dir=MockDirWrapper(org.apache.lucene.store.RAMDirectory@16d6b0e3 lockFactory=org.apache.lucene.store.SingleInstanceLockFactory@34f30343),segFN=segments_2,generation=2,filenames=[_0_nrm.cfe, _0.fdt, _0_MockSep_0.doc, _0_MockSep_0.pos, _0.si, _0_Pulsing40_0.tip, _0_nrm.cfs, _0_MockSep_0.skp, _0_MockSep_0.tib, _0.fnm, _0_MockSep_0.frq, _0_Pulsing40_0.prx, _0_MockSep_0.pyl, _0_Pulsing40_0.frq, _0_Pulsing40_0.tim, _0_MockSep_0.tii, _0.fdx, segments_2]
[junit4:junit4]   2> 969 T2000 C103 oasc.SolrDeletionPolicy.updateCommits newest commit = 2
[junit4:junit4]   2> 970 T2000 C103 oass.SolrIndexSearcher.<init> Opening Searcher@1c5fe794 main
[junit4:junit4]   2> 970 T2000 C103 oass.SolrIndexSearcher.getIndexDir WARNING WARNING: Directory impl does not support setting indexDir: org.apache.lucene.store.MockDirectoryWrapper
[junit4:junit4]   2> 970 T2000 C103 oasu.DirectUpdateHandler2.commit end_commit_flush
[junit4:junit4]   2> 971 T2007 oasc.SolrCore.registerSearcher [collection1] Registered new searcher Searcher@1c5fe794 main{StandardDirectoryReader(segments_2:4 _0(5.0):C3)}
[junit4:junit4]   2> 971 T2000 C103 UPDATE [collection1] webapp=/solr path=/update params={wt=javabin&softCommit=false&waitSearcher=true&commit=true&version=2} {commit=} 0 4
[junit4:junit4]   2> 973 T1970 C100 REQ [collection1] webapp=/solr path=/elevate params={rows=500&version=2&q=*:*&fl=id,+score,+[elevated]&wt=javabin&shards.qt=/elevate&sort=id+desc&qt=/elevate&distrib=false} hits=7 status=0 QTime=0 
[junit4:junit4]   2> 978 T1991 C102 REQ [collection1] webapp=/solr path=/elevate params={rows=500&NOW=1342039638813&fl=id,score&start=0&sort=id+desc&distrib=false&isShard=true&version=2&q=*:*&wt=javabin&shard.url=[::1]:33332/solr|localhost:44656/solr&shards.qt=/elevate&fsv=true&qt=/elevate} hits=2 status=0 QTime=0 
[junit4:junit4]   2> 979 T2001 C103 REQ [collection1] webapp=/solr path=/elevate params={rows=500&NOW=1342039638813&fl=id,score&start=0&sort=id+desc&distrib=false&isShard=true&version=2&q=*:*&wt=javabin&shard.url=localhost:38575/solr|[::1]:33332/solr&shards.qt=/elevate&fsv=true&qt=/elevate} hits=3 status=0 QTime=0 
[junit4:junit4]   2> 981 T1981 C101 REQ [collection1] webapp=/solr path=/elevate params={rows=500&NOW=1342039638813&fl=id,score&start=0&sort=id+desc&distrib=false&isShard=true&version=2&q=*:*&wt=javabin&shard.url=[::1]:33332/solr|localhost:38604/solr&shards.qt=/elevate&fsv=true&qt=/elevate} hits=2 status=0 QTime=0 
[junit4:junit4]   2> 984 T1981 C101 REQ [collection1] webapp=/solr path=/elevate params={rows=500&NOW=1342039638813&fl=id,+score,+[elevated]&distrib=false&ids=4.0,1.0&isShard=true&version=2&q=*:*&wt=javabin&shard.url=[::1]:33332/solr|localhost:38604/solr&shards.qt=/elevate&qt=/elevate} status=0 QTime=1 
[junit4:junit4]   2> 984 T1991 C102 REQ [collection1] webapp=/solr path=/elevate params={rows=500&NOW=1342039638813&fl=id,+score,+[elevated]&distrib=false&ids=2.0,5.0&isShard=true&version=2&q=*:*&wt=javabin&shard.url=[::1]:33332/solr|localhost:44656/solr&shards.qt=/elevate&qt=/elevate} status=0 QTime=1 
[junit4:junit4]   2> 984 T2001 C103 REQ [collection1] webapp=/solr path=/elevate params={rows=500&NOW=1342039638813&fl=id,+score,+[elevated]&distrib=false&ids=3.0,7.0,6.0&isShard=true&version=2&q=*:*&wt=javabin&shard.url=localhost:38575/solr|[::1]:33332/solr&shards.qt=/elevate&qt=/elevate} status=0 QTime=1 
[junit4:junit4]   2> 984 T1990 C102 REQ [collection1] webapp=/solr path=/elevate params={rows=500&version=2&q=*:*&fl=id,+score,+[elevated]&wt=javabin&shards.qt=/elevate&sort=id+desc&qt=/elevate&shards=[::1]:33332/solr|localhost:38604/solr,[::1]:33332/solr|localhost:44656/solr,localhost:38575/solr|[::1]:33332/solr} status=0 QTime=9 
[junit4:junit4]   2> 985 T1967 oasc.CoreContainer.shutdown Shutting down CoreContainer instance=1472252220
[junit4:junit4]   2> 986 T1967 oasc.SolrCore.close [collection1]  CLOSING SolrCore org.apache.solr.core.SolrCore@2fc94fc
[junit4:junit4]   2> 987 T1967 oasc.SolrCore.closeSearcher [collection1] Closing main searcher on request.
[junit4:junit4]   2> 987 T1967 oasu.DirectUpdateHandler2.close closing DirectUpdateHandler2{commits=1,autocommits=0,soft autocommits=0,optimizes=0,rollbacks=0,expungeDeletes=0,docsPending=0,adds=0,deletesById=0,deletesByQuery=0,errors=0,cumulative_adds=7,cumulative_deletesById=0,cumulative_deletesByQuery=1,cumulative_errors=0}
[junit4:junit4]   2> 992 T1967 oejsh.ContextHandler.doStop stopped o.e.j.s.ServletContextHandler{/solr,null}
[junit4:junit4]   2> 1043 T1967 oasc.CoreContainer.shutdown Shutting down CoreContainer instance=1724726520
[junit4:junit4]   2> 1044 T1967 oasc.SolrCore.close [collection1]  CLOSING SolrCore org.apache.solr.core.SolrCore@3a95386b
[junit4:junit4]   2> 1045 T1967 oasc.SolrCore.closeSearcher [collection1] Closing main searcher on request.
[junit4:junit4]   2> 1045 T1967 oasu.DirectUpdateHandler2.close closing DirectUpdateHandler2{commits=1,autocommits=0,soft autocommits=0,optimizes=0,rollbacks=0,expungeDeletes=0,docsPending=0,adds=0,deletesById=0,deletesByQuery=0,errors=0,cumulative_adds=2,cumulative_deletesById=0,cumulative_deletesByQuery=1,cumulative_errors=0}
[junit4:junit4]   2> 1048 T1967 oejsh.ContextHandler.doStop stopped o.e.j.s.ServletContextHandler{/solr,null}
[junit4:junit4]   2> 1101 T1967 oasc.CoreContainer.shutdown Shutting down CoreContainer instance=2054956012
[junit4:junit4]   2> 1101 T1967 oasc.SolrCore.close [collection1]  CLOSING SolrCore org.apache.solr.core.SolrCore@d4dd7cd
[junit4:junit4]   2> 1102 T1967 oasc.SolrCore.closeSearcher [collection1] Closing main searcher on request.
[junit4:junit4]   2> 1102 T1967 oasu.DirectUpdateHandler2.close closing DirectUpdateHandler2{commits=1,autocommits=0,soft autocommits=0,optimizes=0,rollbacks=0,expungeDeletes=0,docsPending=0,adds=0,deletesById=0,deletesByQuery=0,errors=0,cumulative_adds=2,cumulative_deletesById=0,cumulative_deletesByQuery=1,cumulative_errors=0}
[junit4:junit4]   2> 1105 T1967 oejsh.ContextHandler.doStop stopped o.e.j.s.ServletContextHandler{/solr,null}
[junit4:junit4]   2> 1164 T1967 oasc.CoreContainer.shutdown Shutting down CoreContainer instance=2122212849
[junit4:junit4]   2> 1164 T1967 oasc.SolrCore.close [collection1]  CLOSING SolrCore org.apache.solr.core.SolrCore@4bf45862
[junit4:junit4]   2> 1165 T1967 oasc.SolrCore.closeSearcher [collection1] Closing main searcher on request.
[junit4:junit4]   2> 1165 T1967 oasu.DirectUpdateHandler2.close closing DirectUpdateHandler2{commits=1,autocommits=0,soft autocommits=0,optimizes=0,rollbacks=0,expungeDeletes=0,docsPending=0,adds=0,deletesById=0,deletesByQuery=0,errors=0,cumulative_adds=3,cumulative_deletesById=0,cumulative_deletesByQuery=1,cumulative_errors=0}
[junit4:junit4]   2> 1172 T1967 oejsh.ContextHandler.doStop stopped o.e.j.s.ServletContextHandler{/solr,null}
[junit4:junit4]   2> 1224 T1967 oas.SolrTestCaseJ4.tearDown ###Ending testDistribSearch
[junit4:junit4]   2> NOTE: reproduce with: ant test  -Dtestcase=DistributedQueryElevationComponentTest -Dtests.method=testDistribSearch -Dtests.seed=7C6EFDDEBEDA7C2F -Dtests.multiplier=3 -Dtests.slow=true -Dtests.locale=uk -Dtests.timezone=GMT -Dtests.file.encoding=US-ASCII
[junit4:junit4]   2>
[junit4:junit4]    > (@AfterClass output)
[junit4:junit4]   2> 1279 T1967 oas.SolrTestCaseJ4.deleteCore ###deleteCore
[junit4:junit4]   2> NOTE: test params are: codec=Lucene40: {text=Pulsing40(freqCutoff=8 minBlockSize=61 maxBlockSize=210), plow_t=PostingsFormat(name=MockSep), int_i=Pulsing40(freqCutoff=8 minBlockSize=61 maxBlockSize=210), id=PostingsFormat(name=MockSep), field_t=Pulsing40(freqCutoff=8 minBlockSize=61 maxBlockSize=210)}, sim=DefaultSimilarity, locale=uk, timezone=GMT
[junit4:junit4]   2> NOTE: Linux 3.2.0-26-generic amd64/Oracle Corporation 1.8.0-ea (64-bit)/cpus=8,threads=1,free=167799560,total=339279872
[junit4:junit4]   2> NOTE: All tests run in this JVM: [FullSolrCloudDistribCmdsTest, EchoParamsTest, TestFiltering, StatsComponentTest, ShowFileRequestHandlerTest, CommonGramsQueryFilterFactoryTest, SnowballPorterFilterFactoryTest, TestQuerySenderListener, SolrInfoMBeanTest, TestDistributedGrouping, TestCSVLoader, DirectSolrSpellCheckerTest, TestPortugueseMinimalStemFilterFactory, TestJapaneseBaseFormFilterFactory, TestGreekLowerCaseFilterFactory, PingRequestHandlerTest, TestItalianLightStemFilterFactory, MinimalSchemaTest, CoreAdminHandlerTest, TestCJKWidthFilterFactory, ZkNodePropsTest, TestExtendedDismaxParser, SolrIndexConfigTest, TestJapaneseIterationMarkCharFilterFactory, DirectUpdateHandlerOptimizeTest, TestArabicFilters, BinaryUpdateRequestHandlerTest, TestGermanLightStemFilterFactory, TestFrenchMinimalStemFilterFactory, SolrCoreCheckLockOnStartupTest, TestSurroundQueryParser, CurrencyFieldTest, DisMaxRequestHandlerTest, TestWordDelimiterFilterFactory, TestHashPartitioner, TestPerFieldSimilarity, TestStressVersions, RequiredFieldsTest, TermsComponentTest, FileUtilsTest, TestFinnishLightStemFilterFactory, LukeRequestHandlerTest, TestFoldingMultitermQuery, CopyFieldTest, TestPatternReplaceCharFilterFactory, LegacyHTMLStripCharFilterTest, TestTrimFilterFactory, TestIndexingPerformance, TestThaiWordFilterFactory, TestHyphenationCompoundWordTokenFilterFactory, TestCapitalizationFilterFactory, BasicFunctionalityTest, TestQueryUtils, DistributedSpellCheckComponentTest, IndexBasedSpellCheckerTest, FastVectorHighlighterTest, TestJoin, TestHTMLStripCharFilterFactory, TestPatternTokenizerFactory, TestSwedishLightStemFilterFactory, TestPHPSerializedResponseWriter, TestBrazilianStemFilterFactory, TestFunctionQuery, SOLR749Test, TestStemmerOverrideFilterFactory, TestLFUCache, SpatialFilterTest, TestFaceting, TestMergePolicyConfig, TestSolrCoreProperties, TestGermanStemFilterFactory, OverseerTest, RecoveryZkTest, TestRealTimeGet, CloudStateUpdateTest, TestDistributedSearch, SoftAutoCommitTest, TestPhoneticFilterFactory, ZkSolrClientTest, TestMultiCoreConfBootstrap, TestCoreContainer, TestSort, ConvertedLegacyTest, PeerSyncTest, QueryElevationComponentTest, TestJmxIntegration, HighlighterTest, DirectSolrConnectionTest, TestRemoteStreaming, MoreLikeThisHandlerTest, DistributedQueryElevationComponentTest]
[junit4:junit4]   2> 
[junit4:junit4] Completed on J0 in 1.29s, 1 test, 1 error <<< FAILURES!

[...truncated 331 lines...]
BUILD FAILED
/mnt/ssd/jenkins/workspace/Lucene-Solr-trunk-Linux-Java8-64/checkout/build.xml:29: The following error occurred while executing this line:
/mnt/ssd/jenkins/workspace/Lucene-Solr-trunk-Linux-Java8-64/checkout/solr/build.xml:144: The following error occurred while executing this line:
/mnt/ssd/jenkins/workspace/Lucene-Solr-trunk-Linux-Java8-64/checkout/lucene/module-build.xml:62: The following error occurred while executing this line:
/mnt/ssd/jenkins/workspace/Lucene-Solr-trunk-Linux-Java8-64/checkout/lucene/common-build.xml:1096: The following error occurred while executing this line:
/mnt/ssd/jenkins/workspace/Lucene-Solr-trunk-Linux-Java8-64/checkout/lucene/common-build.xml:793: There were test failures: 291 suites, 1031 tests, 1 error, 5 ignored

Total time: 21 minutes 0 seconds
Build step 'Execute shell' marked build as failure
Archiving artifacts
Recording test results
Email was triggered for: Failure
Sending email for trigger: Failure




Mime
View raw message