lucene-dev mailing list archives

Site index · List index
Message view « Date » · « Thread »
Top « Date » · « Thread »
From Apache Jenkins Server <jenk...@builds.apache.org>
Subject [JENKINS] Lucene-Solr-tests-only-trunk - Build # 14909 - Failure
Date Sat, 21 Jul 2012 15:16:34 GMT
Build: https://builds.apache.org/job/Lucene-Solr-tests-only-trunk/14909/

1 tests failed.
REGRESSION:  org.apache.solr.update.SoftAutoCommitTest.testSoftAndHardCommitMaxTimeDelete

Error Message:
soft529 wasn't fast enough

Stack Trace:
java.lang.AssertionError: soft529 wasn't fast enough
	at __randomizedtesting.SeedInfo.seed([8A45570A12305059:4D09EF9709989DE9]:0)
	at org.junit.Assert.fail(Assert.java:93)
	at org.junit.Assert.assertTrue(Assert.java:43)
	at org.junit.Assert.assertNotNull(Assert.java:526)
	at org.apache.solr.update.SoftAutoCommitTest.testSoftAndHardCommitMaxTimeDelete(SoftAutoCommitTest.java:230)
	at sun.reflect.NativeMethodAccessorImpl.invoke0(Native Method)
	at sun.reflect.NativeMethodAccessorImpl.invoke(NativeMethodAccessorImpl.java:57)
	at sun.reflect.DelegatingMethodAccessorImpl.invoke(DelegatingMethodAccessorImpl.java:43)
	at java.lang.reflect.Method.invoke(Method.java:616)
	at com.carrotsearch.randomizedtesting.RandomizedRunner.invoke(RandomizedRunner.java:1995)
	at com.carrotsearch.randomizedtesting.RandomizedRunner.access$1100(RandomizedRunner.java:132)
	at com.carrotsearch.randomizedtesting.RandomizedRunner$6.evaluate(RandomizedRunner.java:818)
	at com.carrotsearch.randomizedtesting.RandomizedRunner$7.evaluate(RandomizedRunner.java:877)
	at com.carrotsearch.randomizedtesting.RandomizedRunner$8.evaluate(RandomizedRunner.java:891)
	at com.carrotsearch.randomizedtesting.rules.SystemPropertiesRestoreRule$1.evaluate(SystemPropertiesRestoreRule.java:53)
	at org.apache.lucene.util.TestRuleSetupTeardownChained$1.evaluate(TestRuleSetupTeardownChained.java:50)
	at org.apache.lucene.util.TestRuleFieldCacheSanity$1.evaluate(TestRuleFieldCacheSanity.java:32)
	at org.apache.lucene.util.AbstractBeforeAfterRule$1.evaluate(AbstractBeforeAfterRule.java:45)
	at com.carrotsearch.randomizedtesting.rules.SystemPropertiesInvariantRule$1.evaluate(SystemPropertiesInvariantRule.java:55)
	at org.apache.lucene.util.TestRuleReportUncaughtExceptions$1.evaluate(TestRuleReportUncaughtExceptions.java:68)
	at org.apache.lucene.util.TestRuleThreadAndTestName$1.evaluate(TestRuleThreadAndTestName.java:48)
	at org.apache.lucene.util.TestRuleIgnoreAfterMaxFailures$1.evaluate(TestRuleIgnoreAfterMaxFailures.java:70)
	at org.apache.lucene.util.TestRuleMarkFailure$1.evaluate(TestRuleMarkFailure.java:48)
	at com.carrotsearch.randomizedtesting.RandomizedRunner.runSingleTest(RandomizedRunner.java:825)
	at com.carrotsearch.randomizedtesting.RandomizedRunner.access$700(RandomizedRunner.java:132)
	at com.carrotsearch.randomizedtesting.RandomizedRunner$3$1.run(RandomizedRunner.java:671)
	at com.carrotsearch.randomizedtesting.RandomizedRunner$3.evaluate(RandomizedRunner.java:697)
	at com.carrotsearch.randomizedtesting.RandomizedRunner$4.evaluate(RandomizedRunner.java:736)
	at com.carrotsearch.randomizedtesting.RandomizedRunner$5.evaluate(RandomizedRunner.java:747)
	at com.carrotsearch.randomizedtesting.rules.SystemPropertiesRestoreRule$1.evaluate(SystemPropertiesRestoreRule.java:53)
	at org.apache.lucene.util.AbstractBeforeAfterRule$1.evaluate(AbstractBeforeAfterRule.java:45)
	at org.apache.lucene.util.TestRuleReportUncaughtExceptions$1.evaluate(TestRuleReportUncaughtExceptions.java:68)
	at org.apache.lucene.util.TestRuleStoreClassName$1.evaluate(TestRuleStoreClassName.java:38)
	at org.apache.lucene.util.TestRuleIcuHack$1.evaluate(TestRuleIcuHack.java:51)
	at com.carrotsearch.randomizedtesting.rules.SystemPropertiesInvariantRule$1.evaluate(SystemPropertiesInvariantRule.java:55)
	at org.apache.lucene.util.TestRuleNoInstanceHooksOverrides$1.evaluate(TestRuleNoInstanceHooksOverrides.java:53)
	at org.apache.lucene.util.TestRuleNoStaticHooksShadowing$1.evaluate(TestRuleNoStaticHooksShadowing.java:52)
	at org.apache.lucene.util.TestRuleAssertionsRequired$1.evaluate(TestRuleAssertionsRequired.java:36)
	at org.apache.lucene.util.TestRuleMarkFailure$1.evaluate(TestRuleMarkFailure.java:48)
	at org.apache.lucene.util.TestRuleIgnoreAfterMaxFailures$1.evaluate(TestRuleIgnoreAfterMaxFailures.java:70)
	at org.apache.lucene.util.TestRuleIgnoreTestSuites$1.evaluate(TestRuleIgnoreTestSuites.java:55)
	at com.carrotsearch.randomizedtesting.RandomizedRunner.runSuite(RandomizedRunner.java:605)
	at com.carrotsearch.randomizedtesting.RandomizedRunner.access$400(RandomizedRunner.java:132)
	at com.carrotsearch.randomizedtesting.RandomizedRunner$2.run(RandomizedRunner.java:551)




Build Log:
[...truncated 9158 lines...]
[junit4:junit4]    > 	at sun.reflect.NativeMethodAccessorImpl.invoke(NativeMethodAccessorImpl.java:57)
[junit4:junit4]    > 	at sun.reflect.DelegatingMethodAccessorImpl.invoke(DelegatingMethodAccessorImpl.java:43)
[junit4:junit4]    > 	at java.lang.reflect.Method.invoke(Method.java:616)
[junit4:junit4]    > 	at com.carrotsearch.randomizedtesting.RandomizedRunner.invoke(RandomizedRunner.java:1995)
[junit4:junit4]    > 	at com.carrotsearch.randomizedtesting.RandomizedRunner.access$1100(RandomizedRunner.java:132)
[junit4:junit4]    > 	at com.carrotsearch.randomizedtesting.RandomizedRunner$6.evaluate(RandomizedRunner.java:818)
[junit4:junit4]    > 	at com.carrotsearch.randomizedtesting.RandomizedRunner$7.evaluate(RandomizedRunner.java:877)
[junit4:junit4]    > 	at com.carrotsearch.randomizedtesting.RandomizedRunner$8.evaluate(RandomizedRunner.java:891)
[junit4:junit4]    > 	at com.carrotsearch.randomizedtesting.rules.SystemPropertiesRestoreRule$1.evaluate(SystemPropertiesRestoreRule.java:53)
[junit4:junit4]    > 	at org.apache.lucene.util.TestRuleSetupTeardownChained$1.evaluate(TestRuleSetupTeardownChained.java:50)
[junit4:junit4]    > 	at org.apache.lucene.util.TestRuleFieldCacheSanity$1.evaluate(TestRuleFieldCacheSanity.java:32)
[junit4:junit4]    > 	at org.apache.lucene.util.AbstractBeforeAfterRule$1.evaluate(AbstractBeforeAfterRule.java:45)
[junit4:junit4]    > 	at com.carrotsearch.randomizedtesting.rules.SystemPropertiesInvariantRule$1.evaluate(SystemPropertiesInvariantRule.java:55)
[junit4:junit4]    > 	at org.apache.lucene.util.TestRuleReportUncaughtExceptions$1.evaluate(TestRuleReportUncaughtExceptions.java:68)
[junit4:junit4]    > 	at org.apache.lucene.util.TestRuleThreadAndTestName$1.evaluate(TestRuleThreadAndTestName.java:48)
[junit4:junit4]    > 	at org.apache.lucene.util.TestRuleIgnoreAfterMaxFailures$1.evaluate(TestRuleIgnoreAfterMaxFailures.java:70)
[junit4:junit4]    > 	at org.apache.lucene.util.TestRuleMarkFailure$1.evaluate(TestRuleMarkFailure.java:48)
[junit4:junit4]    > 	at com.carrotsearch.randomizedtesting.RandomizedRunner.runSingleTest(RandomizedRunner.java:825)
[junit4:junit4]    > 	at com.carrotsearch.randomizedtesting.RandomizedRunner.access$700(RandomizedRunner.java:132)
[junit4:junit4]    > 	at com.carrotsearch.randomizedtesting.RandomizedRunner$3$1.run(RandomizedRunner.java:671)
[junit4:junit4]    > 	at com.carrotsearch.randomizedtesting.RandomizedRunner$3.evaluate(RandomizedRunner.java:697)
[junit4:junit4]    > 	at com.carrotsearch.randomizedtesting.RandomizedRunner$4.evaluate(RandomizedRunner.java:736)
[junit4:junit4]    > 	at com.carrotsearch.randomizedtesting.RandomizedRunner$5.evaluate(RandomizedRunner.java:747)
[junit4:junit4]    > 	at com.carrotsearch.randomizedtesting.rules.SystemPropertiesRestoreRule$1.evaluate(SystemPropertiesRestoreRule.java:53)
[junit4:junit4]    > 	at org.apache.lucene.util.AbstractBeforeAfterRule$1.evaluate(AbstractBeforeAfterRule.java:45)
[junit4:junit4]    > 	at org.apache.lucene.util.TestRuleReportUncaughtExceptions$1.evaluate(TestRuleReportUncaughtExceptions.java:68)
[junit4:junit4]    > 	at org.apache.lucene.util.TestRuleStoreClassName$1.evaluate(TestRuleStoreClassName.java:38)
[junit4:junit4]    > 	at org.apache.lucene.util.TestRuleIcuHack$1.evaluate(TestRuleIcuHack.java:51)
[junit4:junit4]    > 	at com.carrotsearch.randomizedtesting.rules.SystemPropertiesInvariantRule$1.evaluate(SystemPropertiesInvariantRule.java:55)
[junit4:junit4]    > 	at org.apache.lucene.util.TestRuleNoInstanceHooksOverrides$1.evaluate(TestRuleNoInstanceHooksOverrides.java:53)
[junit4:junit4]    > 	at org.apache.lucene.util.TestRuleNoStaticHooksShadowing$1.evaluate(TestRuleNoStaticHooksShadowing.java:52)
[junit4:junit4]    > 	at org.apache.lucene.util.TestRuleAssertionsRequired$1.evaluate(TestRuleAssertionsRequired.java:36)
[junit4:junit4]    > 	at org.apache.lucene.util.TestRuleMarkFailure$1.evaluate(TestRuleMarkFailure.java:48)
[junit4:junit4]    > 	at org.apache.lucene.util.TestRuleIgnoreAfterMaxFailures$1.evaluate(TestRuleIgnoreAfterMaxFailures.java:70)
[junit4:junit4]    > 	at org.apache.lucene.util.TestRuleIgnoreTestSuites$1.evaluate(TestRuleIgnoreTestSuites.java:55)
[junit4:junit4]    > 	at com.carrotsearch.randomizedtesting.RandomizedRunner.runSuite(RandomizedRunner.java:605)
[junit4:junit4]    > 	at com.carrotsearch.randomizedtesting.RandomizedRunner.access$400(RandomizedRunner.java:132)
[junit4:junit4]    > 	at com.carrotsearch.randomizedtesting.RandomizedRunner$2.run(RandomizedRunner.java:551)
[junit4:junit4]    > 
[junit4:junit4]   2> 6023 T459 oasu.AbstractSolrTestCase.setUp ####SETUP_START testSoftAndHardCommitMaxTimeDelete
[junit4:junit4]   2> 6023 T459 oasc.SolrResourceLoader.<init> new SolrResourceLoader
for directory: '/usr/home/hudson/hudson-slave/workspace/Lucene-Solr-tests-only-trunk/checkout/solr/build/solr-core/test-files/solr/collection1/'
[junit4:junit4]   2> 6024 T459 oasc.SolrResourceLoader.replaceClassLoader Adding 'file:/usr/home/hudson/hudson-slave/workspace/Lucene-Solr-tests-only-trunk/checkout/solr/build/solr-core/test-files/solr/collection1/lib/README'
to classloader
[junit4:junit4]   2> 6024 T459 oasc.SolrResourceLoader.replaceClassLoader Adding 'file:/usr/home/hudson/hudson-slave/workspace/Lucene-Solr-tests-only-trunk/checkout/solr/build/solr-core/test-files/solr/collection1/lib/classes/'
to classloader
[junit4:junit4]   2> 6053 T459 oasc.SolrConfig.<init> Using Lucene MatchVersion:
LUCENE_50
[junit4:junit4]   2> 6106 T459 oasc.SolrConfig.<init> Loaded SolrConfig: solrconfig.xml
[junit4:junit4]   2> 6106 T459 oass.IndexSchema.readSchema Reading Solr Schema
[junit4:junit4]   2> 6112 T459 oass.IndexSchema.readSchema Schema name=test
[junit4:junit4]   2> 6536 T459 oass.OpenExchangeRatesOrgProvider.init Initialized with
rates=open-exchange-rates.json, refreshInterval=1440.
[junit4:junit4]   2> 6542 T459 oass.IndexSchema.readSchema default search field in schema
is text
[junit4:junit4]   2> 6544 T459 oass.IndexSchema.readSchema unique key field: id
[junit4:junit4]   2> 6549 T459 oass.FileExchangeRateProvider.reload Reloading exchange
rates from file currency.xml
[junit4:junit4]   2> 6552 T459 oass.FileExchangeRateProvider.reload Reloading exchange
rates from file currency.xml
[junit4:junit4]   2> 6554 T459 oass.OpenExchangeRatesOrgProvider.reload Reloading exchange
rates from open-exchange-rates.json
[junit4:junit4]   2> 6554 T459 oass.OpenExchangeRatesOrgProvider.reload Reloading exchange
rates from open-exchange-rates.json
[junit4:junit4]   2> 6554 T459 oasc.SolrResourceLoader.locateSolrHome JNDI not configured
for solr (NoInitialContextEx)
[junit4:junit4]   2> 6555 T459 oasc.SolrResourceLoader.locateSolrHome using system property
solr.solr.home: /usr/home/hudson/hudson-slave/workspace/Lucene-Solr-tests-only-trunk/checkout/solr/build/solr-core/test-files/solr
[junit4:junit4]   2> 6555 T459 oasc.SolrResourceLoader.<init> new SolrResourceLoader
for directory: '/usr/home/hudson/hudson-slave/workspace/Lucene-Solr-tests-only-trunk/checkout/solr/build/solr-core/test-files/solr/'
[junit4:junit4]   2> 6555 T459 oasc.CoreContainer.<init> New CoreContainer 57001755
[junit4:junit4]   2> 6555 T459 oasc.SolrCore.<init> [collection1] Opening new SolrCore
at /usr/home/hudson/hudson-slave/workspace/Lucene-Solr-tests-only-trunk/checkout/solr/build/solr-core/test-files/solr/collection1/,
dataDir=/usr/home/hudson/hudson-slave/workspace/Lucene-Solr-tests-only-trunk/checkout/solr/build/solr-core/test/J1/./org.apache.solr.update.SoftAutoCommitTest-1342883272329/
[junit4:junit4]   2> 6555 T459 oasc.JmxMonitoredMap.<init> JMX monitoring is enabled.
Adding Solr mbeans to JMX Server: com.sun.jmx.mbeanserver.JmxMBeanServer@1a50ca0c
[junit4:junit4]   2> 6556 T459 oasc.SolrCore.getNewIndexDir WARNING New index directory
detected: old=null new=/usr/home/hudson/hudson-slave/workspace/Lucene-Solr-tests-only-trunk/checkout/solr/build/solr-core/test/J1/./org.apache.solr.update.SoftAutoCommitTest-1342883272329/index/
[junit4:junit4]   2> 6556 T459 oasc.SolrCore.initIndex WARNING [collection1] Solr index
directory '/usr/home/hudson/hudson-slave/workspace/Lucene-Solr-tests-only-trunk/checkout/solr/build/solr-core/test/J1/./org.apache.solr.update.SoftAutoCommitTest-1342883272329/index'
doesn't exist. Creating new index...
[junit4:junit4]   2> 6557 T459 oasc.SolrDeletionPolicy.onCommit SolrDeletionPolicy.onCommit:
commits:num=1
[junit4:junit4]   2> 		commit{dir=MockDirWrapper(org.apache.lucene.store.RAMDirectory@62f0f707
lockFactory=org.apache.lucene.store.SingleInstanceLockFactory@39addae4),segFN=segments_1,generation=1,filenames=[segments_1]
[junit4:junit4]   2> 6558 T459 oasc.SolrDeletionPolicy.updateCommits newest commit = 1
[junit4:junit4]   2> 6558 T459 oasc.SolrCore.initWriters created xml: solr.XMLResponseWriter
[junit4:junit4]   2> 6559 T459 oasup.UpdateRequestProcessorChain.init inserting DistributedUpdateProcessorFactory
into updateRequestProcessorChain "dedupe"
[junit4:junit4]   2> 6559 T459 oasup.UpdateRequestProcessorChain.init inserting DistributedUpdateProcessorFactory
into updateRequestProcessorChain "dedupe-allfields"
[junit4:junit4]   2> 6559 T459 oasup.UpdateRequestProcessorChain.init inserting DistributedUpdateProcessorFactory
into updateRequestProcessorChain "stored_sig"
[junit4:junit4]   2> 6560 T459 oasup.UpdateRequestProcessorChain.init inserting DistributedUpdateProcessorFactory
into updateRequestProcessorChain "uniq-fields"
[junit4:junit4]   2> 6560 T459 oasup.UpdateRequestProcessorChain.init inserting DistributedUpdateProcessorFactory
into updateRequestProcessorChain "distrib-dup-test-chain-implicit"
[junit4:junit4]   2> 6560 T459 oasc.RequestHandlers.initHandlersFromConfig adding lazy
requestHandler: solr.ReplicationHandler
[junit4:junit4]   2> 6560 T459 oasc.RequestHandlers.initHandlersFromConfig created /replication:
solr.ReplicationHandler
[junit4:junit4]   2> 6561 T459 oasc.RequestHandlers.initHandlersFromConfig created standard:
solr.StandardRequestHandler
[junit4:junit4]   2> 6561 T459 oasc.RequestHandlers.initHandlersFromConfig created /get:
solr.RealTimeGetHandler
[junit4:junit4]   2> 6561 T459 oasc.RequestHandlers.initHandlersFromConfig created dismax:
solr.SearchHandler
[junit4:junit4]   2> 6561 T459 oasc.RequestHandlers.initHandlersFromConfig created mock:
org.apache.solr.core.MockQuerySenderListenerReqHandler
[junit4:junit4]   2> 6562 T459 oasc.RequestHandlers.initHandlersFromConfig created /admin/:
org.apache.solr.handler.admin.AdminHandlers
[junit4:junit4]   2> 6562 T459 oasc.RequestHandlers.initHandlersFromConfig created defaults:
solr.StandardRequestHandler
[junit4:junit4]   2> 6562 T459 oasc.RequestHandlers.initHandlersFromConfig adding lazy
requestHandler: solr.StandardRequestHandler
[junit4:junit4]   2> 6562 T459 oasc.RequestHandlers.initHandlersFromConfig created lazy:
solr.StandardRequestHandler
[junit4:junit4]   2> 6562 T459 oasc.RequestHandlers.initHandlersFromConfig created /update:
solr.UpdateRequestHandler
[junit4:junit4]   2> 6563 T459 oasc.RequestHandlers.initHandlersFromConfig created /terms:
org.apache.solr.handler.component.SearchHandler
[junit4:junit4]   2> 6563 T459 oasc.RequestHandlers.initHandlersFromConfig created spellCheckCompRH:
org.apache.solr.handler.component.SearchHandler
[junit4:junit4]   2> 6563 T459 oasc.RequestHandlers.initHandlersFromConfig created spellCheckCompRH_Direct:
org.apache.solr.handler.component.SearchHandler
[junit4:junit4]   2> 6563 T459 oasc.RequestHandlers.initHandlersFromConfig created spellCheckWithWordbreak:
org.apache.solr.handler.component.SearchHandler
[junit4:junit4]   2> 6564 T459 oasc.RequestHandlers.initHandlersFromConfig created spellCheckWithWordbreak_Direct:
org.apache.solr.handler.component.SearchHandler
[junit4:junit4]   2> 6564 T459 oasc.RequestHandlers.initHandlersFromConfig created spellCheckCompRH1:
org.apache.solr.handler.component.SearchHandler
[junit4:junit4]   2> 6564 T459 oasc.RequestHandlers.initHandlersFromConfig created tvrh:
org.apache.solr.handler.component.SearchHandler
[junit4:junit4]   2> 6564 T459 oasc.RequestHandlers.initHandlersFromConfig created /mlt:
solr.MoreLikeThisHandler
[junit4:junit4]   2> 6564 T459 oasc.RequestHandlers.initHandlersFromConfig created /debug/dump:
solr.DumpRequestHandler
[junit4:junit4]   2> 6565 T459 oashl.XMLLoader.init xsltCacheLifetimeSeconds=60
[junit4:junit4]   2> 6566 T459 oasc.SolrCore.initDeprecatedSupport WARNING solrconfig.xml
uses deprecated <admin/gettableFiles>, Please update your config to use the ShowFileRequestHandler.
[junit4:junit4]   2> 6567 T459 oasc.SolrCore.initDeprecatedSupport WARNING adding ShowFileRequestHandler
with hidden files: [THROW.ERROR.ON.ADD.UPDATEPROCESSOR.JS, SOLRCONFIG-HIGHLIGHT.XML, SCHEMA-REQUIRED-FIELDS.XML,
TRIVIAL.UPDATEPROCESSOR1.JS, SCHEMA-MINIMAL.XML, BAD-SCHEMA-DUP-DYNAMICFIELD.XML, SCHEMA-REPLICATION2.XML,
SOLRCONFIG-CACHING.XML, SOLRCONFIG-REPEATER.XML, BAD-SCHEMA-NONTEXT-ANALYZER.XML, CURRENCY.XML,
SOLRCONFIG-MERGEPOLICY.XML, SOLRCONFIG-TLOG.XML, SOLRCONFIG-MASTER.XML, SCHEMA11.XML, SOLRCONFIG-BASIC.XML,
DA_COMPOUNDDICTIONARY.TXT, MISSLEADING.EXTENSION.UPDATEPROCESSOR.JS.TXT, SCHEMA-COPYFIELD-TEST.XML,
SOLRCONFIG-SLAVE.XML, ELEVATE.XML, SOLRCONFIG-PROPINJECT-INDEXDEFAULT.XML, TRIVIAL.UPDATEPROCESSOR0.JS,
BAD-SOLRCONFIG-BOGUS-SCRIPTENGINE-NAME.XML, SCHEMA-IB.XML, SCHEMA-CHARFILTERS.XML, SOLRCONFIG-QUERYSENDER.XML,
SCHEMA-REPLICATION1.XML, DA_UTF8.XML, CONDITIONAL.UPDATEPROCESSOR.JS, MISSING.FUNCTIONS.UPDATEPROCESSOR.JS,
HYPHENATION.DTD, SOLRCONFIG-ENABLEPLUGIN.XML, SCHEMA-PHRASESUGGEST.XML, STEMDICT.TXT, HUNSPELL-TEST.AFF,
STOPTYPES-1.TXT, STOPWORDSWRONGENCODING.TXT, SCHEMA-NUMERIC.XML, SOLRCONFIG-TRANSFORMERS.XML,
SOLRCONFIG-PROPINJECT.XML, BAD-SCHEMA-NOT-INDEXED-BUT-TF.XML, SOLRCONFIG-SIMPLELOCK.XML, WDFTYPES.TXT,
SCHEMA-REVERSED.XML, STOPTYPES-2.TXT, SOLRCONFIG-SPELLCHECKCOMPONENT.XML, SOLRCONFIG-PHRASESUGGEST.XML,
SCHEMA-DFR.XML, BAD-SCHEMA-NOT-INDEXED-BUT-POS.XML, KEEP-1.TXT, OPEN-EXCHANGE-RATES.JSON,
STOPWITHBOM.TXT, SOLRCONFIG-SPELLCHECKER.XML, SCHEMA-BINARYFIELD.XML, SOLRCONFIG-UPDATE-PROCESSOR-CHAINS.XML,
BAD-SCHEMA-OMIT-TF-BUT-NOT-POS.XML, BAD-SCHEMA-DUP-FIELDTYPE.XML, SOLRCONFIG-MASTER1.XML,
SYNONYMS.TXT, SCHEMA_CODEC.XML, SCHEMA.XML, SOLRCONFIG-SOLR-749.XML, SOLRCONFIG-MASTER1-KEEPONEBACKUP.XML,
SOLRCONFIG-FUNCTIONQUERY.XML, STOP-2.TXT, SCHEMA-LMDIRICHLET.XML, SOLRCONFIG-TERMINDEX.XML,
SOLRCONFIG-ELEVATE.XML, SCHEMA-FOLDING.XML, STOPWORDS.TXT, SCHEMA-STOP-KEEP.XML, BAD-SCHEMA-NOT-INDEXED-BUT-NORMS.XML,
SOLRCONFIG-SOLCOREPROPERTIES.XML, STOP-1.TXT, SOLRCONFIG-MASTER2.XML, SCHEMA-SPELLCHECKER.XML,
SOLRCONFIG-LAZYWRITER.XML, SCHEMA-LUCENEMATCHVERSION.XML, BAD-MP-SOLRCONFIG.XML, FRENCHARTICLES.TXT,
SCHEMA15.XML, SOLRCONFIG-REQHANDLER.INCL, SCHEMASURROUND.XML, SOLRCONFIG-MASTER3.XML, HUNSPELL-TEST.DIC,
SOLRCONFIG-XINCLUDE.XML, BAD-SCHEMA-CODEC-GLOBAL-VS-FT-MISMATCH.XML, SOLRCONFIG-SLAVE1.XML,
SOLRCONFIG-DELPOLICY1.XML, SCHEMA-SIM.XML, SCHEMA-COLLATE.XML, STOP-SNOWBALL.TXT, BAD-SCHEMA-SIM-GLOBAL-VS-FT-MISMATCH.XML,
PROTWORDS.TXT, SCHEMA-TRIE.XML, SOLRCONFIG_CODEC.XML, BAD-SOLRCONFIG-INVALID-SCRIPTFILE.XML,
SCHEMA-TFIDF.XML, SOLRCONFIG-SCRIPT-UPDATEPROCESSOR.XML, SCHEMA-LMJELINEKMERCER.XML, PHRASESUGGEST.TXT,
BAD-SOLRCONFIG-MISSING-SCRIPTFILE.XML, BAD-SCHEMA-UNIQUEKEY-USES-DEFAULT.XML, OLD_SYNONYMS.TXT,
SOLRCONFIG-DELPOLICY2.XML, XSLT, SOLRCONFIG-NATIVELOCK.XML, BAD-SCHEMA-DUP-FIELD.XML, SOLRCONFIG-NOCACHE.XML,
SCHEMA-BM25.XML, ADDFIELDS.UPDATEPROCESSOR.JS, SOLRCONFIG-ALTDIRECTORY.XML, SOLRCONFIG-QUERYSENDER-NOQUERY.XML,
COMPOUNDDICTIONARY.TXT, SOLRCONFIG_PERF.XML, SCHEMA-NOT-REQUIRED-UNIQUE-KEY.XML, KEEP-2.TXT,
BAD-SCHEMA-UNIQUEKEY-IS-COPYFIELD-DEST.XML, SCHEMA12.XML, MAPPING-ISOLATIN1ACCENT.TXT, BAD_SOLRCONFIG.XML,
BAD-SCHEMA-EXTERNAL-FILEFIELD.XML]
[junit4:junit4]   2> 6569 T459 oass.SolrIndexSearcher.<init> Opening Searcher@1f36db31
main
[junit4:junit4]   2> 6569 T459 oass.SolrIndexSearcher.getIndexDir WARNING WARNING: Directory
impl does not support setting indexDir: org.apache.lucene.store.MockDirectoryWrapper
[junit4:junit4]   2> 6569 T459 oasu.CommitTracker.<init> Hard AutoCommit: disabled
[junit4:junit4]   2> 6570 T459 oasu.CommitTracker.<init> Soft AutoCommit: disabled
[junit4:junit4]   2> 6570 T459 oashc.SpellCheckComponent.inform Initializing spell checkers
[junit4:junit4]   2> 6574 T459 oass.DirectSolrSpellChecker.init init: {name=direct,classname=DirectSolrSpellChecker,field=lowerfilt,minQueryLength=3}
[junit4:junit4]   2> 6607 T459 oashc.HttpShardHandlerFactory.getParameter Setting socketTimeout
to: 0
[junit4:junit4]   2> 6608 T459 oashc.HttpShardHandlerFactory.getParameter Setting urlScheme
to: http://
[junit4:junit4]   2> 6609 T459 oashc.HttpShardHandlerFactory.getParameter Setting connTimeout
to: 0
[junit4:junit4]   2> 6609 T459 oashc.HttpShardHandlerFactory.getParameter Setting maxConnectionsPerHost
to: 20
[junit4:junit4]   2> 6609 T459 oashc.HttpShardHandlerFactory.getParameter Setting corePoolSize
to: 0
[junit4:junit4]   2> 6609 T459 oashc.HttpShardHandlerFactory.getParameter Setting maximumPoolSize
to: 2147483647
[junit4:junit4]   2> 6609 T459 oashc.HttpShardHandlerFactory.getParameter Setting maxThreadIdleTime
to: 5
[junit4:junit4]   2> 6609 T459 oashc.HttpShardHandlerFactory.getParameter Setting sizeOfQueue
to: -1
[junit4:junit4]   2> 6609 T459 oashc.HttpShardHandlerFactory.getParameter Setting fairnessPolicy
to: false
[junit4:junit4]   2> 6610 T459 oascsi.HttpClientUtil.createClient Creating new http client,
config:maxConnectionsPerHost=20&maxConnections=10000&socketTimeout=0&connTimeout=0&retry=false
[junit4:junit4]   2> 6618 T463 oasc.SolrCore.registerSearcher [collection1] Registered
new searcher Searcher@1f36db31 main{StandardDirectoryReader(segments_1:1)}
[junit4:junit4]   2> 6619 T459 oasc.CoreContainer.register registering core: collection1
[junit4:junit4]   2> 6620 T459 oasu.AbstractSolrTestCase.setUp ####SETUP_END testSoftAndHardCommitMaxTimeDelete
[junit4:junit4]   2> ASYNC  NEW_CORE C30 name=collection1 org.apache.solr.core.SolrCore@ef2bf5b
[junit4:junit4]   2> 6623 T459 C30 oasc.SolrDeletionPolicy.onInit SolrDeletionPolicy.onInit:
commits:num=1
[junit4:junit4]   2> 		commit{dir=MockDirWrapper(org.apache.lucene.store.RAMDirectory@62f0f707
lockFactory=org.apache.lucene.store.SingleInstanceLockFactory@39addae4),segFN=segments_1,generation=1,filenames=[segments_1]
[junit4:junit4]   2> 6623 T459 C30 oasc.SolrDeletionPolicy.updateCommits newest commit
= 1
[junit4:junit4]   2> 6624 T459 C30 UPDATE [collection1] webapp=null path=null params={}
{add=[529]} 0 2
[junit4:junit4]   2> 6629 T459 C30 oasu.DirectUpdateHandler2.commit start commit{flags=0,version=0,optimize=false,openSearcher=true,waitSearcher=true,expungeDeletes=false,softCommit=false}
[junit4:junit4]   2> 6631 T459 C30 oasc.SolrDeletionPolicy.onCommit SolrDeletionPolicy.onCommit:
commits:num=2
[junit4:junit4]   2> 		commit{dir=MockDirWrapper(org.apache.lucene.store.RAMDirectory@62f0f707
lockFactory=org.apache.lucene.store.SingleInstanceLockFactory@39addae4),segFN=segments_1,generation=1,filenames=[segments_1]
[junit4:junit4]   2> 		commit{dir=MockDirWrapper(org.apache.lucene.store.RAMDirectory@62f0f707
lockFactory=org.apache.lucene.store.SingleInstanceLockFactory@39addae4),segFN=segments_2,generation=2,filenames=[_0_Asserting_0.tim,
_0_Asserting_0.tip, _0_MockSep_0.pos, _0_MockVariableIntBlock_0.doc, _0_MockVariableIntBlock_0.skp,
_0_NestedPulsing_0.tip, _0_NestedPulsing_0.tim, _0_Asserting_0.prx, _0_MockVariableIntBlock_0.pyl,
_0_MockVariableIntBlock_0.tib, _0_MockSep_0.skp, _0_MockVariableIntBlock_0.pos, _0_MockSep_0.doc,
_0.si, _0_MockVariableIntBlock_0.tii, _0.fnm, _0_NestedPulsing_0.frq, _0_nrm.cfs, _0_NestedPulsing_0.prx,
_0_MockSep_0.tib, _0_Asserting_0.frq, _0_nrm.cfe, _0_MockVariableIntBlock_0.frq, segments_2,
_0_MockSep_0.frq, _0.fdx, _0_MockSep_0.tii, _0_MockSep_0.pyl, _0.fdt]
[junit4:junit4]   2> 6632 T459 C30 oasc.SolrDeletionPolicy.updateCommits newest commit
= 2
[junit4:junit4]   2> 6633 T459 C30 oass.SolrIndexSearcher.<init> Opening Searcher@6c5c186
main
[junit4:junit4]   2> 6633 T459 C30 oass.SolrIndexSearcher.getIndexDir WARNING WARNING:
Directory impl does not support setting indexDir: org.apache.lucene.store.MockDirectoryWrapper
[junit4:junit4]   2> 6634 T459 C30 oasu.DirectUpdateHandler2.commit end_commit_flush
[junit4:junit4]   2> 6634 T463 oasc.SolrCore.registerSearcher [collection1] Registered
new searcher Searcher@6c5c186 main{StandardDirectoryReader(segments_2:3 _0(5.0):C1)}
[junit4:junit4]   2> 6637 T459 C30 UPDATE [collection1] webapp=null path=null params={}
{commit=} 0 8
[junit4:junit4]   2> 6640 T459 C30 UPDATE [collection1] webapp=null path=null params={}
{delete=[529]} 0 0
[junit4:junit4]   2> 7684 T465 oasu.DirectUpdateHandler2.commit start commit{flags=0,version=0,optimize=false,openSearcher=true,waitSearcher=true,expungeDeletes=false,softCommit=true}
[junit4:junit4]   2> 7684 T459 oasu.AbstractSolrTestCase.tearDown ####TEARDOWN_START testSoftAndHardCommitMaxTimeDelete
[junit4:junit4]   2> 7685 T459 oasc.CoreContainer.shutdown Shutting down CoreContainer
instance=57001755
[junit4:junit4]   2> 7685 T459 oasc.SolrCore.close [collection1]  CLOSING SolrCore org.apache.solr.core.SolrCore@ef2bf5b
[junit4:junit4]   2> 7687 T465 oass.SolrIndexSearcher.<init> Opening Searcher@6140a9b7
main
[junit4:junit4]   2> 7687 T465 oass.SolrIndexSearcher.getIndexDir WARNING WARNING: Directory
impl does not support setting indexDir: org.apache.lucene.store.MockDirectoryWrapper
[junit4:junit4]   2> 7687 T465 oasu.DirectUpdateHandler2.commit end_commit_flush
[junit4:junit4]   2> 7688 T463 oasc.SolrCore.registerSearcher [collection1] Registered
new searcher Searcher@6140a9b7 main{StandardDirectoryReader(segments_2:5:nrt)}
[junit4:junit4]   2> 7688 T459 oasc.SolrCore.closeSearcher [collection1] Closing main searcher
on request.
[junit4:junit4]   2> 7689 T459 oasu.DirectUpdateHandler2.close closing DirectUpdateHandler2{commits=2,autocommit
maxTime=1200ms,autocommits=0,soft autocommit maxTime=500ms,soft autocommits=1,optimizes=0,rollbacks=0,expungeDeletes=0,docsPending=0,adds=0,deletesById=0,deletesByQuery=0,errors=0,cumulative_adds=1,cumulative_deletesById=1,cumulative_deletesByQuery=0,cumulative_errors=0}
[junit4:junit4]   2> 7689 T459 C30 oasc.SolrDeletionPolicy.onCommit SolrDeletionPolicy.onCommit:
commits:num=2
[junit4:junit4]   2> 		commit{dir=MockDirWrapper(org.apache.lucene.store.RAMDirectory@62f0f707
lockFactory=org.apache.lucene.store.SingleInstanceLockFactory@39addae4),segFN=segments_2,generation=2,filenames=[_0_Asserting_0.tim,
_0_Asserting_0.tip, _0_MockSep_0.pos, _0_MockVariableIntBlock_0.doc, _0_MockVariableIntBlock_0.skp,
_0_NestedPulsing_0.tip, _0_NestedPulsing_0.tim, _0_Asserting_0.prx, _0_MockVariableIntBlock_0.pyl,
_0_MockVariableIntBlock_0.tib, _0_MockSep_0.skp, _0_MockVariableIntBlock_0.pos, _0_MockSep_0.doc,
_0.si, _0_MockVariableIntBlock_0.tii, _0.fnm, _0_NestedPulsing_0.frq, _0_nrm.cfs, _0_NestedPulsing_0.prx,
_0_MockSep_0.tib, _0_Asserting_0.frq, _0_nrm.cfe, _0_MockVariableIntBlock_0.frq, segments_2,
_0_MockSep_0.frq, _0.fdx, _0_MockSep_0.tii, _0_MockSep_0.pyl, _0.fdt]
[junit4:junit4]   2> 		commit{dir=MockDirWrapper(org.apache.lucene.store.RAMDirectory@62f0f707
lockFactory=org.apache.lucene.store.SingleInstanceLockFactory@39addae4),segFN=segments_3,generation=3,filenames=[segments_3]
[junit4:junit4]   2> 7690 T459 C30 oasc.SolrDeletionPolicy.updateCommits newest commit
= 3
[junit4:junit4]   2> NOTE: reproduce with: ant test  -Dtestcase=SoftAutoCommitTest -Dtests.method=testSoftAndHardCommitMaxTimeDelete
-Dtests.seed=8A45570A12305059 -Dtests.multiplier=3 -Dtests.slow=true -Dtests.locale=hr_HR
-Dtests.timezone=Eire -Dtests.file.encoding=US-ASCII
[junit4:junit4]   2>
[junit4:junit4]    > (@AfterClass output)
[junit4:junit4]   2> NOTE: test params are: codec=Lucene40: {timestamp=MockVariableIntBlock(baseBlockSize=66),
range_facet_l=MockVariableIntBlock(baseBlockSize=66), id=PostingsFormat(name=NestedPulsing),
range_facet_sl=PostingsFormat(name=NestedPulsing), text=PostingsFormat(name=Asserting), range_facet_si=MockVariableIntBlock(baseBlockSize=66),
subject=MockVariableIntBlock(baseBlockSize=66), multiDefault=MockVariableIntBlock(baseBlockSize=66),
intDefault=PostingsFormat(name=MockSep)}, sim=RandomSimilarityProvider(queryNorm=false,coord=false):
{}, locale=hr_HR, timezone=Eire
[junit4:junit4]   2> NOTE: FreeBSD 9.0-RELEASE amd64/Sun Microsystems Inc. 1.6.0_32 (64-bit)/cpus=16,threads=1,free=17927720,total=166592512
[junit4:junit4]   2> NOTE: All tests run in this JVM: [TestPorterStemFilterFactory, TestShingleFilterFactory,
TestCSVResponseWriter, TestMultiWordSynonyms, FullSolrCloudTest, TestSystemIdResolver, XsltUpdateRequestHandlerTest,
TestBinaryResponseWriter, CircularListTest, TestIndonesianStemFilterFactory, StatelessScriptUpdateProcessorFactoryTest,
TestLMDirichletSimilarityFactory, TestRealTimeGet, TestTrie, TestCollationField, TestMultiCoreConfBootstrap,
TestConfig, SampleTest, TestNorwegianMinimalStemFilterFactory, TestUAX29URLEmailTokenizerFactory,
SpellPossibilityIteratorTest, TestJmxMonitoredMap, TestArbitraryIndexDir, SpellCheckCollatorTest,
CloudStateUpdateTest, TestPluginEnable, WordBreakSolrSpellCheckerTest, TestPortugueseLightStemFilterFactory,
SpellingQueryConverterTest, QueryParsingTest, TestHunspellStemFilterFactory, TestBeiderMorseFilterFactory,
PolyFieldTest, TestKeywordMarkerFilterFactory, TestRemoteStreaming, TestPseudoReturnFields,
TestDocSet, FieldMutatingUpdateProcessorTest, TestGreekStemFilterFactory, UpdateParamsTest,
SignatureUpdateProcessorFactoryTest, TestReverseStringFilterFactory, LengthFilterTest, AlternateDirectoryTest,
NotRequiredUniqueKeyTest, TestGermanNormalizationFilterFactory, TestPropInjectDefaults, TestQueryTypes,
TestNGramFilters, TestTurkishLowerCaseFilterFactory, TestPatternReplaceFilterFactory, DistanceFunctionTest,
UniqFieldsUpdateProcessorFactoryTest, HighlighterConfigTest, RAMDirectoryFactoryTest, TestGalicianMinimalStemFilterFactory,
SoftAutoCommitTest]
[junit4:junit4]   2> 
[junit4:junit4] Completed on J1 in 7.20s, 3 tests, 1 failure <<< FAILURES!
[...truncated 683 lines...]

[...truncated 9992 lines...]

[...truncated 9992 lines...]

[...truncated 9992 lines...]

[...truncated 9992 lines...]

[...truncated 9977 lines...]
BUILD FAILED
/usr/home/hudson/hudson-slave/workspace/Lucene-Solr-tests-only-trunk/checkout/build.xml:29:
The following error occurred while executing this line:
/usr/home/hudson/hudson-slave/workspace/Lucene-Solr-tests-only-trunk/checkout/solr/build.xml:144:
The following error occurred while executing this line:
/usr/home/hudson/hudson-slave/workspace/Lucene-Solr-tests-only-trunk/checkout/lucene/module-build.xml:62:
The following error occurred while executing this line:
/usr/home/hudson/hudson-slave/workspace/Lucene-Solr-tests-only-trunk/checkout/lucene/common-build.xml:1094:
The following error occurred while executing this line:
/usr/home/hudson/hudson-slave/workspace/Lucene-Solr-tests-only-trunk/checkout/lucene/common-build.xml:789:
There were test failures: 296 suites, 1052 tests, 1 failure, 5 ignored

Total time: 23 minutes 33 seconds
Build step 'Execute shell' marked build as failure
Archiving artifacts
Recording test results
Publishing Clover coverage report...
No Clover report will be published due to a Build Failure
Email was triggered for: Failure
Sending email for trigger: Failure



Mime
View raw message